##TITLE=31Pdec_IPACAT-34D
 CDCl3
  64 sc
 2.11.2023
##JCAMPDX= 6.0         $$ Bruker NMR JCAMP-DX V2.0
##DATA TYPE= NMR SPECTRUM
##DATA CLASS= NTUPLES
##ORIGIN= UXNMR, Bruker Analytische Messtechnik GmbH
##OWNER= root
$$ XWIN-NMR		Version 3.5
$$ Thu Nov  2 13:29:35 2023 Russian Standard Time (UT+4h)  she@DPX200
##.OBSERVE FREQUENCY= 81.013821
##.OBSERVE NUCLEUS= ^31P
##.ACQUISITION MODE= SIMULTANEOUS
##.ACQUISITION SCHEME= undefined
##.AVERAGES= 64
##.DIGITISER RES= 16
##SPECTROMETER/DATA SYSTEM= spect
##.PULSE SEQUENCE= zgpg30
##.SOLVENT NAME= DMSO
##.SHIFT REFERENCE= (INTERNAL, DMSO, 0, 248.564)
##AUDIT TRAIL= $$ (NUMBER, WHEN, WHO, WHERE, WHAT)
$$ ##TITLE= Audit trail, XWIN-NMR		Version 3.5
$$ ##JCAMPDX= 5.01
$$ ##ORIGIN= Bruker BioSpin GmbH
$$ ##OWNER= she
$$ F:/spectra/data/she/nmr/P31/1/pdata/1/auditp.txt
$$ ##AUDIT TRAIL=  $$ (NUMBER, WHEN, WHO, WHERE, WHAT)
(   1,<2023-11-02 13:28:00.93 +0400>,<she>,<DPX200>,
      <continue with go, POWCHK disabled, PULCHK disabled
       configuration hash MD5:
       00 E9 B6 7A A2 85 ED C7 34 08 36 98 17 FE 4E 26
       data hash MD5: 32K
       DA 50 F9 CF 57 EB 6E 6F 0C 2F 53 AD 08 C9 73 65>)
(   2,<2023-11-02 13:28:41.37 +0400>,<she>,<DPX200>,
      <Start of raw data processing
       efp BC_mod = 2 LB = 5 FT_mod = 6 PKNL = 1 PHC0 = -10658.94 PHC1 = 62.4902 SI = 64K 
       data hash MD5: 64K
       D6 62 9B 73 CF 84 D8 7E B3 33 21 03 85 51 2F 68>)
(   3,<2023-11-02 13:28:57.64 +0400>,<she>,<DPX200>,
      <pk PHC0 = 20.55245 PHC1 = 0 
       data hash MD5: 64K
       BD 5B 41 B4 91 8D 52 33 E4 40 6B 50 F2 7A B0 D0>)
(   4,<2023-11-02 13:29:00.56 +0400>,<she>,<DPX200>,
      <abs ABSG = 5 
       data hash MD5: 64K
       6E C4 F2 07 A8 70 00 71 47 B0 AD DC 42 9B F3 E0>)
$$ ##END=
$$ 
$$ hash MD5
$$ 38 12 55 09 03 8E AF 71 09 F3 A1 31 E4 6A 25 76
##$RELAX= 
##$RELAX= 
##$RELAX= 
##$RELAX= 
##$RELAX= 
##$RELAX= 
##$RELAX= 
##$RELAX= 
##$RELAX= 
$$ Bruker specific parameters
$$ --------------------------
##$DU= <F:/spectra>
##$EXPNO= 1
##$NAME= <P31>
##$PROCNO= 1
##$TYPE= <nmr>
##$USER= <she>
##$AMP= (0..31)
100 100 100 100 100 100 100 100 100 100 100 100 100 100 100 100 100 100 
100 100 100 100 100 100 100 100 100 100 100 100 100 100 
##$AQSEQ= 0
##$AQ_mod= 1
##$AUNM= <au_zg>
##$AUTOPOS= <>
##$BF1= 81.014009
##$BF2= 200.13
##$BF3= 200.13
##$BF4= 200.13
##$BF5= 200.13
##$BF6= 200.13
##$BF7= 200.13
##$BF8= 200.13
##$BYTORDA= 1
##$CFDGTYP= 0
##$CFRGTYP= 5
##$CHEMSTR= <none>
##$CNST= (0..31)
1 1 145 1 1 1 1 1 1 1 1 1 1 1 1 1 1 1 1 1 1 1 1 1 1 1 1 1 1 1 1 1 
##$CPDPRG= <waltz16>
##$CPDPRG1= <>
##$CPDPRG2= <waltz16>
##$CPDPRG3= <>
##$CPDPRG4= <mlev>
##$CPDPRG5= <mlev>
##$CPDPRG6= <mlev>
##$CPDPRG7= <mlev>
##$CPDPRG8= <mlev>
##$CPDPRGB= <>
##$CPDPRGT= <>
##$D= (0..31)
0 1 0 0 0 0 0 0 0 0 0 0.03 2e-05 3e-06 0 0 0 0 0 0 0 0 0 0 0 0 0 0 0 0 
0 0 
##$DATE= 1698917193
##$DBL= (0..7)
120 120 120 11 120 120 24 19 
##$DBP= (0..7)
150 150 150 150 150 150 150 150 
##$DBP07= 0
##$DBPNAM0= <>
##$DBPNAM1= <>
$$ [...]
##$SUBNAM3= <"">
##$SUBNAM4= <"">
##$SUBNAM5= <"">
##$SUBNAM6= <"">
##$SUBNAM7= <"">
##$SUBNAM8= <"">
##$SUBNAM9= <"">
##$SW= 501.771253377433
##$SWIBOX= (0..15)
0 1 3 0 0 0 0 0 0 0 0 0 0 0 0 0 
##$SW_h= 40650.406504065
##$TD= 32768
##$TD0= 1
##$TE= 0
##$TE2= 300
##$TE3= 300
##$TEG= 300
##$TL= (0..7)
0 120 53 12 22 120 120 120 
##$TP= (0..7)
150 150 150 150 150 150 150 150 
##$TP07= 0
##$TPNAME0= <>
##$TPNAME1= <>
##$TPNAME2= <>
##$TPNAME3= <>
##$TPNAME4= <>
##$TPNAME5= <>
##$TPNAME6= <>
##$TPNAME7= <>
##$TPOAL= (0..7)
0.5 0.5 0.5 0.5 0.5 0.5 0.5 0.5 
##$TPOFFS= (0..7)
0 0 0 0 0 0 0 0 
##$TUNHIN= 0
##$TUNHOUT= 0
##$TUNXOUT= 0
##$USERA1= <user>
##$USERA2= <user>
##$USERA3= <user>
##$USERA4= <user>
##$USERA5= <user>
##$V9= 5
##$VALIST= <valist>
##$VCLIST= <CCCCCCCCCCCCCCC>
##$VD= 0
##$VDLIST= <DDDDDDDDDDDDDDD>
##$VPLIST= <PPPPPPPPPPPPPPP>
##$VTLIST= <TTTTTTTTTTTTTTT>
##$WBST= 1024
##$WBSW= 4
##$XGAIN= (0..3)
0 0 0 0 
##$XL= 0
##$YL= 0
##$YMAX_a= 3957
##$YMIN_a= -2023
##$ZGOPTNS= <>
##$ZL1= 120
##$ZL2= 120
##$ZL3= 120
##$ZL4= 120
##$ABSF1= 248.5645
##$ABSF2= -253.2056
##$ABSG= 5
##$ABSL= 3
##$ALPHA= 0
##$AQORDER= 0
##$ASSFAC= 0
##$ASSFACI= 0
##$ASSFACX= 0
##$ASSWID= 0
##$AUNMP= <proc_1d>
##$AZFE= 0.1
##$AZFW= 0.5
##$BCFW= 0
##$BC_mod= 2
##$BYTORDP= 0
##$COROFFS= 0
##$CY= -3
##$DATMOD= 1
##$DC= 0
##$DFILT= <>
##$DTYPP= 0
##$F1P= 0
##$F2P= 0
##$FCOR= 1
##$FTSIZE= 65536
##$FT_mod= 6
##$GAMMA= 0
##$GB= 0
##$INTBC= 1
##$INTSCL= 6.047779e-11
##$ISEN= 30
##$LB= 5
##$LEV0= 0
##$LPBIN= 0
##$MAXI= 10000
##$MC2= 0
##$MEAN= 0
##$ME_mod= 0
##$MI= 50
##$NCOEF= 0
##$NC_proc= -8
##$NLEV= 6
##$NOISF1= 182.463
##$NOISF2= 159.3651
##$NSP= 0
##$NTH_PI= 0
##$NZP= 0
##$OFFSET= 248.5645
##$PC= 4
##$PHC0= -10638.39
##$PHC1= 62.4902
##$PH_mod= 1
##$PKNL= yes
##$PPARMOD= 0
##$PSCAL= 0
##$PSIGN= 0
##$REVERSE= no
##$SF= 81.0140089999694
##$SI= 65536
##$SIGF1= 159.3651
##$SIGF2= -187.1042
##$SINO= 113.3802
##$SIOLD= 16384
##$SREGLST= <1H.CDCl3>
##$SSB= 0
##$STSI= 65536
##$STSR= 0
##$SW_p= 40650.406504065
##$SYMM= 0
##$S_DEV= 0
##$TDeff= 32768
##$TDoff= 0
##$TI= <>
##$TILT= no
##$TM1= 0
##$TM2= 0
##$TOPLEV= 0
##$USERP1= <user>
##$USERP2= <user>
##$USERP3= <user>
##$USERP4= <user>
##$USERP5= <user>
##$WDW= 1
##$XDIM= 65536
##$YMAX_p= 302079072
##$YMIN_p= -12709091
$$ End of Bruker specific parameters
$$ ---------------------------------
##NTUPLES= NMR SPECTRUM
##VAR_NAME=  FREQUENCY,     SPECTRUM/REAL,   SPECTRUM/IMAG
##SYMBOL=    X,             R,               I
##VAR_TYPE=  INDEPENDENT,   DEPENDENT,       DEPENDENT
##VAR_FORM=  AFFN,          ASDF,            ASDF
##VAR_DIM=   65536,         65536,           65536
##UNITS=     HZ,            ARBITRARY UNITS, ARBITRARY UNITS
##FACTOR=    0.620285442955139, 1,           1
##FIRST=     20137.2065510682, 0,            0
##LAST=      -20513.1999529968, 0,           0
##MIN=       -20513.1999529968, -12709091,   0
##MAX=       20137.2065510682, 302079072,    0
$$ Real data points
##PAGE= N=1
##DATA TABLE= (X++(R..R)), XYDATA
$$ [...]
40317D576288J21876K79242L34151K60935J06941k6350m8626K4557Q6714Q8822
40307E804550J14692K55610M65349O05837N94193M35525J48187k53810p02680
40298G467453j073919j272358j297392j216338j093244r48058p76134o02418m93669
40289a306077m82279m90762l92464j62352Q7001K38822K82594K65147J99635P3952
40279a686783r7915k79315m26834m76805l83012k10796j14022j48047j78061o0269
40269d061859J53563L00494L39642L69101M34937M62842L88017K25227q673l04595
40259a701304n44732n16618j54094L13295N63046N04232L23932K39365K82122
40250f90756L19778K22766k360k04093k02237N5127M36792P35109Q21202P02598
$$ y = [4576288, 4698164, 4977406, 5311557, 5572492, 5679433, 5653083, 5604457, 5629014, 5715728, 5804550, 5919242, 6174852, 6640201, 7246038, 7840231, 8275756, 8423943, 8170133, 7467453, 6393534, 5121176, 3823784, 2607446, 1514202, 566144, -209990, -812408, -1306077, -1788356, -2279118, -2671582, -2833934, -2746933, -2508111, -2225517, -1960370, -1760735, -1686783, -1784698, -2064013, -2490847, -2967652, -3350664, -3561460, -3675482, -3823529, -4001590, -4061859, -3908296, -3607802, -3268160, -2899059, -2464122, -2001280, -1613263, -1388036, -1396709, -1701304, -2246036, -2762654, -2916748, -2603453, -2040407, -1536175, -1212243, -972878, -690756, -370978, -148212, -150572, -354665, -556902, -501775, -64983, 670126, 1491328, 2193926]
40240B193926M78048K73925J88497K30123K98552K66663R4480j61722m48764p70355
40230B643373j109991j350219j350512j116297q17084n88156l74763o1839K75188
40221c850300L89486J89806o1083J1514M93846J118491J560299J680138J489842
40212C022039J035774M05850k32446p06957r50283j000916r28038p92059o42295
40203g89331n00900l57305k01483m2403J15766K67604L54407K89927J02762p011
40193g67967J41158M70908P04603O79583N15680M12588L63048J79526k05589n82742
40183A910796o75444m52780j47665K5055P6545J36384K26448K40161J21654l6393
40173A424761r9341k7496J21853K69221L51370L34253K35643J10377j1703j36127
$$ y = [2193926, 2671974, 2945899, 3134396, 3364519, 3663071, 3929734, 4024214, 3862492, 3413728, 2643373, 1533382, 183163, -1167349, -2283646, -3100730, -3688886, -4063649, -4125488, -3850300, -3460814, -3271008, -3332091, -3320577, -2826731, -1708240, -147941, 1532197, 3022039, 4057813, 4463663, 4231217, 3524260, 2573977, 1573061, 645023, -147036, -789331, -1290231, -1647536, -1849019, -1891422, -1775656, -1508052, -1153645, -863718, -760956, -767967, -626809, -155901, 548702, 1228285, 1743965, 2156553, 2519601, 2699127, 2493538, 1910796, 1235352, 782572, 634907, 659962, 736507, 872891, 1099339, 1339500, 1461154, 1424761, 1325420, 1297924, 1419777, 1688998, 2040368, 2374621, 2610264, 2720641, 2708938, 2572811]
40163B572811k32274k16714o7195R3254J02225o7154k96977m74115n85459o70063
40153A58339p40156p61385o73741m43641j45561K9058o9200l56638n49522m21966
40143c974413O901N42152R86247J206767J127624P67555K82157j16080l14984
40134E13926l57813l43737l13600k49732j55565r3960j30522k47347l37602l09045
40124b024997j85102o8980j78J08908L54015O79946Q94866Q57614O19652L63198
40114A598942K22886J94410J98911J83607J34873L5277j27685l08012m20649m50050
40104A262510m90756o28324q16776r37521r46097q71034o85813l14080J87734
40095d240157N69980O18853L91636J29934j5214o3206m2102J05363M10626P83176
$$ y = [2572811, 2340537, 2123823, 2056628, 2149882, 2252107, 2184953, 1887976, 1413861, 828402, 158339, -581817, -1343202, -2016943, -2460584, -2606145, -2577087, -2646287, -3002925, -3552447, -3974413, -3967512, -3425360, -2439113, -1232346, -104722, 662833, 944990, 828910, 513926, 156113, -187624, -501224, -750956, -906521, -1000481, -1131003, -1378350, -1715952, -2024997, -2210099, -2279079, -2279257, -2170349, -1816334, -1136388, -241522, 616092, 1235744, 1598942, 1821828, 2016238, 2215149, 2398756, 2533629, 2568906, 2441221, 2133209, 1712560, 1262510, 771754, 143430, -673346, -1610867, -2556964, -3427998, -4113811, -4427891, -4240157, -3670177, -3051324, -2659688, -2529754, -2544968, -2608174, -2650276, -2544913, -2134287, -1351111]
40085a351111J096222J300191J387397J311474J038067O51155L10757Q1345j34516
40076E690981m54956q44531j114335j084758p34033k10780K59832M82207L64725
40067B354352k8269m67945o62684m61276Q741M37663N94986M82317K35932n1493
40057B442324l55635o13243o93449n19002j74093J50582L09488K82077J31823
40048I60872o2380k25300k84995k07372l6362J36834K65964L90152N61798P58406
40038B257617Q99081R28532Q41242O43335L63831J12374L9443J78568L69866L92749
40028G026638J50039l04113q51861j353908j652752j640002j333764q34623k24662
40019a019008M15862R23064J115465R92676P69381O39199N66407L80582L2443
$$ y = [-1351111, -254889, 1045302, 2432699, 3744173, 4782240, 5433395, 5744152, 5825497, 5690981, 5236025, 4391494, 3277159, 2192401, 1458368, 1247588, 1507420, 1989627, 2354352, 2326083, 1858138, 1195454, 734178, 742919, 1180582, 1775568, 2257885, 2493817, 2442324, 2086689, 1473446, 779997, 260995, 86902, 237484, 546972, 829049, 960872, 898492, 673192, 388197, 180825, 144463, 281297, 547261, 937413, 1499211, 2257617, 3156698, 4085230, 4926472, 5569807, 5933638, 6046012, 6085455, 6264023, 6633889, 7026638, 7176677, 6872564, 6020703, 4666795, 3014043, 1374041, 40277, -794346, -1019008, -603146, 319918, 1435383, 2428059, 3197440, 3836639, 4403046, 4783628, 4816071]
40010D816071l16143m40166k46343J50304M97666N82064L89682R6838j12669j91539
40000E225765j83993j12767K5698K03855L79839N44976O81077O96670M99159J34349
39990H094628k31872m94457p02097r41442j195229j364265j390164j306384j179136
39981g10418j025523p85707l74116K15287Q41989J282950J390155J190763Q43638
39972B869018N12812K62292K7994l15522q21550j375190j734374j678875j149110
39963c402505l05209N12936R56200R15226O20829M27525M76281O18411O56463
39954A476157N59606M15743K83234J74730J20106J46223K13986K51655K45816
39945C887256K39980K41093J78045k6859l56828o68751p66641n48605j09256L28286
$$ y = [4816071, 4499928, 4059762, 3813419, 3963723, 4461389, 5043453, 5433135, 5529973, 5417304, 5225765, 5041772, 4929005, 4954703, 5158558, 5538397, 6083373, 6764450, 7461120, 7960279, 8094628, 7862756, 7368299, 6666202, 5724760, 4529531, 3165266, 1775102, 468718, -710418, -1735941, -2521648, -2895764, -2680477, -1838488, -555538, 834617, 2025380, 2869018, 3381830, 3644122, 3672116, 3356594, 2535044, 1159854, -574520, -2253395, -3402505, -3707714, -3194778, -2238578, -1323352, -702523, -274998, 201283, 819694, 1476157, 2035763, 2451506, 2734740, 2909470, 3029576, 3175799, 3389785, 3641440, 3887256, 4127236, 4368329, 4546374, 4519515, 4162687, 3493936, 2727295, 2178690, 2069434, 2397720]
39935B397720N97844O73358N68417K48647k78671q47672j216681j273543j093228
39926b23809p98082m35074l820M58236Q50340J043676R47843N88501J24094k54765
39916B297140m50580m69510l53055j74732q0771k15106n49292q55645r12674p09957
39906b474182m20946k21349j78199k68764m29753n82309o57586o23571m86671
39897f343330k78191m7451J50553K75826L00526J89787p0617m02975o34105o13298
39887g473275l33185Q1582M80576P59064Q69486Q36248P65367P75545Q75496R27374
39877a435722P65092L57968j41349n01254n68183l58990m3600J56833J01164j77750
39867a845791m86198o09091m75573j85927J30449M39410P40816R40813R13129
$$ y = [2397720, 2995564, 3668922, 4237339, 4485986, 4207315, 3359643, 2142962, 869419, -223809, -1021891, -1456965, -1460785, -1002549, -152209, 891467, 1839310, 2427811, 2551905, 2297140, 1846560, 1377050, 1023995, 849263, 768492, 553386, 4094, -851551, -1764225, -2474182, -2895128, -3116477, -3294676, -3563440, -3993193, -4575502, -5233088, -5856659, -6343330, -6621521, -6668972, -6518419, -6242593, -5942067, -5752280, -5822897, -6225872, -6859977, -7473275, -7806460, -7724878, -7244302, -6485238, -5615752, -4779504, -4014137, -3238592, -2363096, -1435722, -670630, -312662, -454011, -955265, -1523448, -1882438, -1926038, -1769205, -1668041, -1845791, -2331989, -2941080, -3416653, -3602580, -3472131, -3032721, -2291905, -1351092, -437963]
39858d37963P17757O31099Q42039J170602J215055P82267P1580n77620r99084
39849C415732j205770j211436r95854o21314k42065M7359K82571M93314N76192
39840E38729L98396L145l81393n56000n11566l62234j91763j5458J62483L32507
39830e83154N03540O69205P44257O04677K23802k75386p31658j067562j271979
39821a184258j318887j177008q87385n62233k86235n4823J78717M27160O48920
39812d216032P69613P14523M64810J16237j46777j85928k8570J65518K60844K63957
39802a821805K97829M80175Q24026J233819J583155J796493J859879J765472J475821
39793I494864R67242K97696l99451r96927j430155j674405j712478j572808j387126
$$ y = [-437963, 279794, 910893, 1752932, 2923534, 4138589, 4920856, 4992436, 4414816, 3415732, 2209962, 998526, 2672, -618642, -860707, -813348, -530777, -37463, 538729, 937125, 940270, 558877, 2877, -508689, -870923, -1062686, -1078144, -915661, -583154, -79614, 589591, 1333848, 1938525, 2162327, 1886941, 1155283, 87721, -1184258, -2503145, -3680153, -4567538, -5129771, -5416006, -5470829, -5292112, -4864952, -4216032, -3446419, -2731896, -2267086, -2150849, -2297626, -2483554, -2512124, -2346606, -2085762, -1821805, -1523976, -1043801, -219775, 1014044, 2597199, 4393692, 6253571, 8019043, 9494864, 10462106, 10759802, 10360351, 9363424, 7933269, 6258864, 4546386, 2973578, 1586452]
39784A586452j339270j495388j688324j622211j131595l40036M39154R39484J077023
39775c574711R13821N74594K13588j8957n8258L3692J56313K97576N30555Q82750
39765d9037J256293J495588J501177J266763Q51012L48254j40170n41811q14101
39756E173968r09340p92814n36395l39322l66295n64009p12414o79159n64042
39747b89822n64557p54237j030459j224096j201041r04645l99741J12970M13342
39738e842286M50865L81923L74186M11385L63187K34460K37034N42773J024796
39729a821677J349297J324901J064159P73002M94630J56907k06835m35213m43097
39720B256074l25349k16860j49419j02796j02155j71849k49292k47394j87833
$$ y = [1586452, 247182, -1248206, -2936530, -4558741, -5690336, -6030372, -5591218, -4651734, -3574711, -2660890, -2086296, -1872708, -1891665, -1949923, -1916231, -1759918, -1462342, -931787, -49037, 1207256, 2702844, 4204021, 5470784, 6321796, 6670050, 6529880, 5988069, 5173968, 4264628, 3471814, 2935419, 2596097, 2229802, 1665793, 953379, 274220, -289822, -854379, -1608616, -2639075, -3863171, -5064212, -5968857, -6368598, -6255628, -5842286, -5391421, -5009498, -4635312, -4223927, -3860740, -3626280, -3389246, -2846473, -1821677, -472380, 852521, 1916680, 2689682, 3184312, 3341219, 3134384, 2699171, 2256074, 1930725, 1713865, 1564446, 1461650, 1359495, 1187646, 938354, 690960, 503127]
39711E03127j90677l29113n48664p18386p07783m40435L8652N37941Q40361Q84388
39701a30589P81854O50066M94315K80034M2638j39634k41704k95947l17603k85371
39691H38059k03585j40586j74719l00891m02795l45747j29195O0478k930l60345
39681a162256q12174j103245j140446j019872q81013p66549n99060k60963K84639
39672g460939R15106J393321J522590J277121Q01168L12844K376m8160R0373K45522
39662i48678K91796K55661K53102L38482M46199M68141L52880J37342q1046k05132
39652A308747k07765j47347r0427k5468J10881L21718N06648N51754M41354K63750
39642C033845J17736K2654q5473k68997m94366o34301n81098l51743p0982J28615
$$ y = [503127, 312450, -16663, -565327, -1283713, -1991496, -2431931, -2393279, -1855338, -1014977, -130589, 651265, 1301331, 1795646, 2075680, 2118318, 1978684, 1736980, 1441033, 1123430, 838059, 634474, 493888, 319169, 18278, -384517, -730264, -859459, -798981, -801911, -1162256, -1974430, -3077675, -4218121, -5237993, -6119006, -6885555, -7484615, -7745578, -7460939, -6545833, -5152512, -3629922, -2352801, -1551633, -1238789, -1236413, -1284573, -1194200, -948678, -656882, -401221, -148119, 190363, 636562, 1104703, 1457583, 1594925, 1513879, 1308747, 1100982, 953635, 863208, 837740, 948621, 1270339, 1776987, 2328741, 2770095, 3033845, 3151581, 3174235, 3088762, 2819765, 2325399, 1691098, 1110000, 758257, 687275, 815890]
39632H15890J71667M7523j80633l73276l84974j79782J30419L68170M06213K33677
39622A054894l9588k45635k77770j65662p091J56851L36394M71598M18611J15553
39612A818155l01906o23322p73144q40958r25441j005584r64804p11625k90108
39603d618737J09186K85907K18278Q5656P1497J95661L88140O40446R54942J179529
39593d89495J064769N58581n1011l69004k36011J81606N65000O58658M03021m0205
39583B245909m08918n55622n39566m77402l58325r1443K88868N75091N86151L55869
39573A620612P7341j05742k03851k88978l55608l24581j83754o2742j05616k90807
39563b23726m56045n05518m96956m91861m38906k99629j86149k19572k97806j82110
$$ y = [815890, 987557, 1035080, 854447, 481171, 96197, -83585, 46834, 415004, 821217, 1054894, 1015306, 769671, 491901, 326239, 319148, 475999, 812393, 1283991, 1702602, 1818155, 1516249, 892927, 119783, -721175, -1646616, -2652200, -3617004, -4328629, -4618737, -4509551, -4223644, -4005366, -3919710, -3848213, -3652552, -3264412, -2623966, -1669024, -489495, 575274, 1133855, 1082844, 713840, 477829, 659435, 1224435, 1883093, 2286114, 2245909, 1836991, 1281369, 741803, 264401, -93924, -185367, 103501, 678592, 1264743, 1620612, 1697953, 1592211, 1388360, 1099382, 743774, 419193, 235439, 172697, 67081, -223726, -679771, -1185289, -1682245, -2174106, -2613012, -2912641, -3098790, -3318362, -3616168, -3798278]
39553c798278J63779M79805N18148L20135J10130K8863P2532J98312L52263M33879
39543a120432L64159J95555O7515M9587R6767J49199J96587K41981K76150K99137
39533H16205L07464K60705J32297J003J3067K22805N26179P68859Q54576P31900
39523D635060L75758j35504n76214p02790m45545N0988N56021Q89183R68035P92514
39513F407506M07581j29155p32949j241753j439890j213377o93364j88322O6241
39504A242518Q2787M5253R2251K04328K83875K89034K53906K04634J21308Q552
39494B828446n0662J9854J60950K04425N2654k11094m12735m47718l32795j50397
39484A660928J5559J23257J96483K80392L41434K55302m4579m34776o93281p22442
$$ y = [-3798278, -3634499, -3154694, -2636546, -2316411, -2206281, -2177418, -2104886, -1906574, -1554311, -1120432, -756273, -560718, -493203, -443616, -346849, -197650, -1063, 240918, 517068, 816205, 1123669, 1384374, 1516671, 1517674, 1530741, 1753546, 2279725, 3048584, 3903160, 4635060, 5010818, 4875314, 4299100, 3596310, 3150765, 3201753, 3757774, 4646957, 5614992, 6407506, 6815087, 6685932, 5952983, 4711230, 3271340, 2057963, 1364599, 1176277, 1242518, 1325305, 1370558, 1462809, 1667137, 1951012, 2240046, 2493952, 2698586, 2819894, 2828446, 2777784, 2797638, 2958588, 3163013, 3215667, 3004573, 2591838, 2144120, 1811325, 1660928, 1676487, 1799744, 1996227, 2276619, 2618053, 2873355, 2828776, 2394000, 1700719, 978277]
39474I78277o15501m96701l71134j71249J03158L51799M69740M38441L20829J93110
39464A200769R9700P1905J55965L64160N80742N86859K60817k64187p17330r56848
39454A382552j038190j027519q83346n88128k75441r3042P433K00552M99718O61972
39444a153439M36405j49928p81851j080241q37418j39653O63382J167560J196009
39435f79174Q98797N54807K98134O9859k05418m76457o10880n35660l13836j01855
39425a101683k3168m7790R0K70727P12071J094888J222725J089548Q36208O07960
39415D661576M73901M22415L73479K16624j05479n36204r37000j167110j135579
39406B266623q43896m41425j92976k81316o11135q76491q60025o19157l52421
$$ y = [978277, 362776, -133925, -505059, -676308, -573150, -221351, 248389, 686830, 1007659, 1200769, 1300469, 1372374, 1528339, 1892499, 2473241, 3060100, 3320917, 3056730, 2339400, 1382552, 344362, -683157, -1566503, -2154631, -2430072, -2523114, -2515681, -2315129, -1815411, -1153439, -717034, -866962, -1648813, -2729054, -3566472, -3706125, -3042743, -1875183, -679174, 219623, 774430, 1072564, 1142423, 937005, 460548, -150332, -685992, -999828, -1101683, -1124851, -1172641, -1172551, -901824, -189753, 905135, 2127860, 3217408, 4053616, 4661576, 5135477, 5557892, 5931371, 6147995, 6042516, 5506312, 4569312, 3402202, 2266623, 1422727, 981302, 788326, 507010, -104125, -980616, -1840641, -2459798, -2812219]
39397b812219j53114L5771K64880M70643N40710M35313K25947M3207j5141L4164
39387i29839O7090r537j16853o3616K14582N29310O13756L95008L5341k63982
39377D71260m12073l91857j98051J16446M05695N39473N30882M87154M50373L65139
39367B364441K05122M6329k0087J3827R7416J83176K13569J07108j53647m37343
39357B619911n57325m77260l67506m22884o59107r18866j046315j009353q59125
39348c697830o26302l03157P6656L87392M85965L43283P8112j42420k12887j11355
39338c722543J25847M16322O63004Q19023Q92277Q57347O32868K28150j47920
39329G64375k63963j58410j18114l13210n74319o19791m03410j14111J04884K84915
$$ y = [-2812219, -2965333, -2929562, -2664682, -2194039, -1653329, -1218016, -992069, -948862, -964003, -929839, -862749, -872286, -989139, -1052755, -838173, -308863, 304893, 699901, 735242, 471260, 59187, -332670, -530721, -414275, -8580, 530893, 1061775, 1548929, 1999302, 2364441, 2569563, 2615892, 2595805, 2609632, 2707048, 2890224, 3103793, 3210901, 3057254, 2619911, 2062586, 1585326, 1217820, 794936, 135829, -783037, -1829352, -2838705, -3697830, -4324132, -4627289, -4550633, -4163241, -3677276, -3333993, -3255881, -3398301, -3611188, -3722543, -3596696, -3180374, -2517370, -1698347, -806070, 51277, 684145, 912295, 764375, 500412, 342002, 223888, -89322, -663641, -1283432, -1686842, -1800953, -1696069, -1411154]
39319a411154M79932O23181N98768L88707R4031j63999l41170m89651o79472q74672
39309a775499r13631o73973k46272J27354K86598K52826J12752p1972k06705j61011
39299c269533O5511K68572K62662J28466J07714K82533M95468N75132M89520K61167
39289c32788r1649m45658n62957l41553N983J69340R2149k6498m4712k8879p7234
39278a684456j55907j93414k28281l55738n75096p70679q19005o64513l31854
39269e778943P0898L89419N31759N33409M72807L55862J55198n5613j05767R6405
39259c334566M48812P59940R29296R79766R43622P94754N26010K43925J07408
39250B398967J47459K04396J07540j05032k23199j28060O4225J57864R7711k7532
$$ y = [-1411154, -931222, -308041, 290727, 679434, 773465, 609466, 268296, -221355, -900827, -1775499, -2689130, -3363103, -3609375, -3482021, -3195423, -2942597, -2829845, -2901817, -3108522, -3269533, -3204022, -2935450, -2672788, -2544322, -2436608, -2154075, -1658607, -1083475, -593955, -332788, -424437, -870095, -1433052, -1774605, -1768622, -1599282, -1507133, -1533631, -1578343, -1607222, -1684456, -1840363, -2033777, -2262058, -2617796, -3192892, -3963571, -4782576, -5447089, -5778943, -5708045, -5318626, -4786867, -4253458, -3780651, -3424789, -3269591, -3325204, -3430971, -3334566, -2885754, -2125814, -1196518, -216752, 726870, 1521624, 2047634, 2291559, 2398967, 2546426, 2750822, 2858362, 2753330, 2530131, 2402071, 2466296, 2624160, 2721871, 2694339]
39240B694339j27365j54988n6337J94610M89350O21088M90286K23302L8249K3577
39230D436111Q4718Q5008J312o2095l165J40914K04464N4136k81781o53425r07301
39219C098896r32427o75684k24843J58700K33023L6879j45986j24298p35K2421
39209A445946o1735p1154J06045L62111M90810M00681J82418k2276j94732m36964
39199B201150p65940r78826q34977l58098J68101N18893P03329P84323P03949
39190B141904M13474M1271k38930m33728o59593q91530r52211p53433m07778q6060
39180a826614J17448J71512Q9406m1183j10514r9545o0103J5180J88239M24076
39170a132098N70000N34506L82602K10399L7257j23813k15361k46713l43739n62342
$$ y = [2694339, 2566974, 2411986, 2355649, 2550259, 3039609, 3660697, 4150983, 4374285, 4412534, 4436111, 4520829, 4605837, 4607149, 4545054, 4541889, 4682803, 4887267, 4941403, 4659622, 4006197, 3098896, 2166469, 1490785, 1265942, 1424642, 1657665, 1694544, 1548558, 1424260, 1423525, 1445946, 1384211, 1313057, 1419102, 1781213, 2272023, 2672704, 2855122, 2832846, 2638114, 2201150, 1435210, 456384, -378593, -736691, -568590, -49697, 653632, 1437955, 2141904, 2555378, 2596649, 2357719, 1923991, 1264398, 372868, -579343, -1332776, -1740554, -1826614, -1709166, -1537654, -1448248, -1489431, -1599945, -1699490, -1759593, -1744413, -1556174, -1132098, -562098, -27592, 355010, 565409, 602666, 478853, 263492, 16779, -326960, -889302]
39160h89302p28663o08959k14196J87756L61253K98769J28076n1042j78046j66645
39150a860999O7220N00979R69018J253447J223772R13426M82706J02271j56854
39141C494986l48679n70906q32955r94915q67909l99416K63937R11078J408111
39132B063332J664262J546471R72523R6152p30823j244207j445171j463980j350671
39123A07888j076155o59239j89062K47518N87464P79703Q35992Q68912R89434
39114B492455J163296J236732J108505Q18383M66066J08267k46607n93725r07576
39105E645796j135120j207596j094751q60259o38998n49383o32632q48059j084132
39096b405134j192978j083359q02928m87930k14224O0204L82653O85178Q31256
$$ y = [-889302, -1617965, -2226924, -2441120, -2253364, -1892111, -1593342, -1465266, -1516308, -1694354, -1860999, -1793779, -1292800, -323782, 929665, 2153437, 3066863, 3549569, 3651840, 3494986, 3146307, 2575401, 1742446, 747531, -120378, -519794, -255857, 655221, 2063332, 3727594, 5274065, 6246588, 6342740, 5611917, 4367710, 2922539, 1458559, 107888, -968267, -1627506, -1816568, -1569050, -981586, -201883, 634109, 1503021, 2492455, 3655751, 4892483, 6000988, 6819371, 7285437, 7393704, 7147097, 6553372, 5645796, 4510676, 3303080, 2208329, 1348070, 709072, 159689, -472943, -1321002, -2405134, -3598112, -4681471, -5484399, -5972329, -6186553, -6126349, -5743696, -5058518, -4227262]
39087d227262P66335N64820L17276K8211l23846o54792p87669o33376l05427N39
39077e255191K05086L56261M80088N34866N31864N78592P21219Q27440P33178
39068b86597M67112K24805J29149J11937M3450j07969k76342l87278m01838l19087
39058h02658j84768p7607m9521q1679j13732j09768q9463j01887j66615k32561
39048b010259k12458q3995N9130R9118L9658K1453J77242M91281Q05744R44482
39038C31396Q35356N49421K39235K3117q2746j26341j47870j73473k43911l84438
39028H19746n48436o50039o59659o08067m85708k17201K09769O38636Q36407O96983
39018C2431L38329K0829k5303K41308O20695Q03317O22104J83146k79296o51672
$$ y = [-4227262, -3460927, -2896107, -2578831, -2550620, -2874466, -3529258, -4316927, -4950303, -5255730, -5255191, -5050105, -4693844, -4213756, -3678890, -3147026, -2568434, -1847215, -1019775, -286597, 180515, 405320, 534469, 646406, 689856, 581887, 305545, -81733, -483571, -802658, -987426, -1065033, -1114554, -1196233, -1309965, -1419733, -1509196, -1611083, -1777698, -2010259, -2222717, -2306712, -2247582, -2148464, -2108806, -2087353, -1910111, -1418830, -613086, 331396, 1166752, 1716173, 1955408, 1978525, 1895779, 1769438, 1621568, 1448095, 1204184, 819746, 271310, -378729, -1038388, -1646455, -2132163, -2349364, -2139595, -1500959, -664552, 32431, 370760, 391589, 366286, 607594, 1228289, 2031606, 2653710, 2836856, 2557560, 1905888]
39008A905888r94065j365850j679154j756214j492604r47314l13722J80524L99602
38999f062909L83433L02567L07376M29003O23156Q50132J061958J155611J031479
38990H1806P22439M13042K97519M35802P46381J085383J299042J246326Q50419
38981G178159J65585o13488j229584j491192j383591j080365q11764o82589o25589
38972e74418n41856m42644m03724m05949k97546N0325N71902J010380J098092
38963F4562P59217J70763l72041o72064p28000o40277m68489k05143J53524N57354
38953a380594R03517J067085R84161P49825N66340N15780M50177K19017n5594
38944D019714r8429J30343L47300K94766J0880l24242o37128r18142j071313r99211
$$ y = [1905888, 911823, -454027, -2133181, -3889395, -5381999, -6329313, -6643035, -6462511, -6062909, -5679476, -5376909, -5069533, -4640530, -4017374, -3167242, -2105284, -949673, 81806, 804245, 1217287, 1514806, 1950608, 2696989, 3782372, 5081414, 6327740, 7178159, 7343744, 6730256, 5500672, 4009480, 2625889, 1545524, 733760, 51171, -574418, -1116274, -1558918, -1962642, -2368591, -2666137, -2615812, -2043910, -1033530, 64562, 823779, 994542, 622501, -49563, -777563, -1417840, -1886329, -2091472, -1937948, -1380594, -477077, 590008, 1574169, 2323994, 2890334, 3406114, 3856291, 4075308, 4019714, 3921285, 4051628, 4398928, 4693694, 4704574, 4380332, 3743204, 2825062, 1753749, 754538]
38934G54538p81748o01675n11361m15888k73067j58642j07059j5177K37363O37627
38924a235089J031029J205710R96840M07570l35770r08119j100022r03112m38834
38915a279797J16105N73021Q25138R22672R79435J009654R41732P66819N40497
38906E395276K32302k67925r30812j505188j742631j616388j259998q08019l89177
38897b892560j53641j48926k12041j17057J81991N46789Q55189J086037J212494
38888C58275J138993P97822K53767l08498o66914o63969l24742J08553L48008
38879A041295L16983J92033J66861K40024K79096K22463J24335K2225j36585m01299
38869B067431p23835j018472j264724j466477j532624j317136q21294k54748J91350
$$ y = [754538, -27210, -628885, -1140246, -1556134, -1829201, -1987843, -2094902, -2110079, -1872716, -1235089, -204060, 1001650, 1998490, 2406060, 2070290, 1162171, 62149, -840963, -1279797, -1163692, -590671, 234467, 1157139, 2136574, 3146228, 4087960, 4854779, 5395276, 5627578, 5359653, 4428841, 2923653, 1181022, -435366, -1695364, -2503383, -2892560, -3046201, -3195127, -3407168, -3524225, -3342234, -2795445, -1940256, -854219, 358275, 1497268, 2295090, 2548857, 2240359, 1573445, 909476, 584734, 693287, 1041295, 1358278, 1550311, 1717172, 1957196, 2236292, 2458755, 2583090, 2605315, 2468730, 2067431, 1343596, 325124, -939600, -2406077, -3938701, -5255837, -6077131, -6331879, -6140529]
38860f140529N57448R85673J422299J602309J356282Q12990K56667j07998k05906
38851E39235m4874K66066N31661O26517O07703N89021N50390L74680M6104k96488
38841C790015n06681n48156m70007l51349k78031k92273l42619l44454l02131
38832C54314l08466m06731n13425n05186l46352j23842P693o8496l11507n05488
38822b727486m38686j31210J62164J89793r7625n61857r89115j169213r86917
38813f750152n31461o6186J85727K01745P8577j26825l85162n80422n37181j83412
38803h694752L86426J013267J558753J887634J886039J580814J180820R06014
38795A705015P83687O76149M97700L26966K84412L63192M23321L14776k6047n45578
$$ y = [-6140529, -5583081, -4597408, -3175109, -1572800, -216518, 596472, 853139, 745141, 539235, 494361, 760427, 1292088, 1918605, 2526308, 3115329, 3665719, 4040399, 4086503, 3790015, 3283334, 2735178, 2265171, 1913822, 1635791, 1343518, 1000899, 656445, 354314, 45848, -360883, -874308, -1379494, -1725846, -1849688, -1841995, -1910491, -2221998, -2727486, -3166172, -3297382, -3135218, -2945425, -3043050, -3604907, -4594022, -5763235, -6750152, -7281613, -7347799, -7162072, -6960327, -6881750, -7008575, -7393737, -7974159, -8511340, -8694752, -8308326, -7295059, -5736306, -3848672, -1962633, -381819, 799001, 1705015, 2488702, 3164851, 3662551, 3989517, 4273929, 4637121, 5060442, 5375218, 5349171, 4803593]
38785D803593j063045j317853j133807n89200J7705M12066N34682M91173L75810
38776B531124K01271k9088k47602l41974k44866k5968J01805o5877n03234r15625
38766D59966r90696o83472k10656J99389M69919O16453O50740N96704N25336N05513
38756B139196N43412N96205O14145N63252M64641M22866N28454O84092O15348
38747G171611J49288n56776j146073j389799j304240r87477m81482J62301P83986
38738B401339J168209J178581Q22915K41830l32412o77531p34099o50403o08945
38729B809484o04817m61203q8405L36485N15937L48946M8439p4741Q6078L63257
38719C279460N09858M19519J61922j37570m01756n94269o65270n58511k82886
$$ y = [4803593, 3740548, 2422695, 1288888, 699688, 717393, 1129459, 1664141, 2155314, 2531124, 2732395, 2703307, 2455705, 2113731, 1868865, 1842897, 1944702, 1878825, 1375591, 459966, -530730, -1214202, -1424858, -1225469, -755550, -139097, 511643, 1108347, 1633683, 2139196, 2682608, 3278813, 3892958, 4456210, 4920851, 5343717, 5872171, 6556263, 7171611, 7320899, 6764123, 5618050, 4228251, 2924011, 1936534, 1455052, 1617353, 2401339, 3569548, 4748129, 5571044, 5812874, 5480462, 4802931, 4068832, 3418429, 2809484, 2204667, 1743464, 1655059, 1991544, 2507481, 2856427, 2904866, 2830125, 2916203, 3279460, 3789318, 4208837, 4370759, 4233189, 3831433, 3237164, 2571894, 2013383, 1730497]
38710A730497N9033L52941N73960P61873Q96385Q72128O51583L82613K62208K89197
38700F832418K53881N001l60749o26688o93019o13643m73187l43317l24363m84281
38690C172053p14658p53159m27301J63776P48523J110187J172772R36573M43101
38681E851867j83024p39264j055121j100996r83255q40791p42817o66859n62294
38672a022554m28137l15088k48057j73871j5270K29968M69866O00249N89527M86514
38662A73147L69343K94755K77036K92700K95082K27038M1477k55896n75840p94216
38652C44626q62171q43126q03718o98006m29528l1749K91182L53905J83173k2482
38642b517894j00578n0146K4945L7629k0965r2720j04791l5246O5140J36775J89530
$$ y = [1730497, 1789530, 2142471, 2716431, 3478304, 4374689, 5246817, 5898400, 6281013, 6543221, 6832418, 7086299, 7091300, 6730551, 6103863, 5410844, 4797201, 4324014, 3980697, 3656334, 3172053, 2457395, 1704236, 1276935, 1440711, 2189234, 3299421, 4472193, 5408766, 5851867, 5668843, 4929579, 3874458, 2773462, 1790207, 949416, 206599, -460260, -1022554, -1450691, -1765779, -2013836, -2187707, -2202977, -1973009, -1503143, -902894, -313367, 173147, 542490, 837245, 1114281, 1406981, 1702063, 1929101, 1970578, 1714682, 1138842, 344626, -517545, -1360671, -2164389, -2862395, -3291923, -3323672, -3032490, -2678585, -2495412, -2517894, -2618472, -2668618, -2643673, -2606044, -2627009, -2719729, -2824520, -2859766, -2794626, -2657851, -2468321]
38631b468321K75921L84746M22973L42959K42174K71180M48086O15511N90985
38622A126214L27229p3679m51968o71130o56492m21045p5420K06573K66470N5049
38612c68199l03586n50336m70268r5561K91432M11876K49395K8953l7400P3834
38602g69860K60182M35623N62092O04790N37751L85102K00821M890k19662m63600
38592A538129o63981p52322p07440n58012l60941j84018p7409l4015J5589J43991
38582a640429L38697M61601L20877j59887q15740j320581j438300j188101p56533
38573f198396l10725M6012K12210J29784q8686j92014k4456L22932O34813P84996
38563d683530P84319O88827N44692L99110K98308K74252L51261N21029O76851
$$ y = [-2468321, -2192400, -1807654, -1384681, -1041722, -799548, -528368, -80282, 535229, 1126214, 1453443, 1379764, 927796, 256666, -399826, -820871, -896291, -689718, -423248, -368199, -671785, -1222121, -1692389, -1787950, -1496518, -1084642, -835247, -806294, -843694, -769860, -509678, -74055, 488037, 1092827, 1630578, 2015680, 2216501, 2221391, 2001729, 1538129, 874148, 121826, -585614, -1143626, -1504567, -1688585, -1765994, -1800009, -1784420, -1640429, -1301732, -840131, -519254, -679141, -1494881, -2815462, -4253762, -5441863, -6198396, -6509121, -6463109, -6250899, -6121115, -6209801, -6401815, -6426271, -6103339, -5468526, -4683530, -3899211, -3210384, -2665692, -2266582, -1968274, -1694022, -1342761, -821732, -144881]
38554a44881O43396L60235O524j47397k0315K01947K63329O7712k61425m85270
38544D83855m29464j32773J80389L25115L34486L58850M38770M91005M94577N32656
38534C077466O04713N44772K34617j90360m62367m62248k88298r7552L080o6203
38524B897620l38183o97464r02304q06097n27850l33465l67115n70130q47490
38515b492478j192424j574918j800389j628694j045943l04033L44297Q40385J203054
38506g651143J365309J272088J057524R48068R98764J071733J071802J038888
38498A173033R73030P40456K58843l27467p55384q65512o65884k68428J61005
38489D23692M73951O55536Q20344J029761J179971J135537Q95623N54160J85794
$$ y = [-144881, 498515, 858750, 865274, 717877, 697562, 899509, 1162838, 1230550, 969125, 483855, 54391, -78382, 102007, 427122, 761608, 1120458, 1559228, 2050233, 2544810, 3077466, 3682179, 4226951, 4461568, 4271208, 3808841, 3346593, 3058295, 2960743, 2963823, 2897620, 2559437, 1861973, 959669, 153572, -374278, -707743, -1074858, -1644988, -2492478, -3684902, -5259820, -7060209, -8688903, -9734846, -10038879, -9694582, -8854197, -7651143, -6285834, -5013746, -3956222, -3008154, -2009390, -937657, 134145, 1173033, 2146063, 2886519, 3145362, 2817895, 2062511, 1196999, 531115, 262687, 423692, 897643, 1553179, 2373523, 3403284, 4583255, 5718792, 6614415, 7168575, 7354369]
38480G354369j31380k73896j95197m3794k8683j89086m00553n64266o65625o85724
38470D176165o08498n15391n30232o50808p59992q16712q93656r88111r46880
38461b534115o69564k77725K2609J77413K83454L93524M27755K89441M327k88046
38451b170927m63303n03668m48211k86324K1275L96064O20143N54135L10054R9070
38441a871692k9527j54172k38774j32564J55937L84073L72406K27650J57597J91383
38431i37683K16081J92062J78824J96817K02303J78200J33575L0605j67505l67398
38421a44119l77346j19530K48145M69203M31112K55140J52860J99628K65769J93598
38411A574460P730j26562j38749j25524j55580j42635q921J44021J64775O5640
$$ y = [7354369, 7222989, 6949093, 6753896, 6710102, 6681419, 6492333, 6091780, 5527514, 4861889, 4176165, 3567667, 3052276, 2522044, 1871236, 1111244, 294532, -599124, -1587235, -2534115, -3203679, -3481404, -3458795, -3281382, -2997928, -2604404, -2176649, -1887208, -1882881, -2170927, -2634230, -3137898, -3586109, -3872433, -3851158, -3455094, -2834951, -2280816, -1970762, -1871692, -1901219, -2055391, -2294165, -2426729, -2270792, -1886719, -1514313, -1286663, -1129066, -937683, -721602, -529540, -350716, -153899, 48404, 226604, 360179, 390784, 223279, -144119, -521465, -640995, -392850, 76353, 507465, 762605, 915465, 1115093, 1380862, 1574460, 1582190, 1455628, 1316879, 1191355, 1035775, 893140, 884219, 1028240, 1193015, 1258655]
38401A258655n1849k20951n58179r81228j175248r25939l69627J54109M02243
38392b468014L42024J03928p9332P227L66746P51387R09387Q34421O90015N49601
38382B007390L44242N2620k02560k96981k45321j43896n1774P632k595q9045j66135
38371A213577j25310L5678K15853L33211L71787L16709J47285o8911j75373j00733
38361B163773K7861K7658j33641l64678o25712r30964j177460j143819p56537
38352b913519k51398N3723J01475J01291K18700L84607M46604M02501L89486M77439
38342e89091N73242N61097M68814M22186M57230M66221L51410J41555j06953m35432
38332B310279q84296j310865j466359j289952r93188p87420o44423m17184q8834
$$ y = [1258655, 1206806, 985855, 427676, -553552, -1728800, -2654739, -3024366, -2870257, -2468014, -2125990, -2022062, -2101394, -2094167, -1727421, -976034, -66647, 767774, 1457789, 2007390, 2351632, 2404252, 2201692, 1904711, 1659390, 1515494, 1463720, 1471352, 1468757, 1379712, 1213577, 1088267, 1123945, 1339798, 1673009, 2044796, 2361505, 2508790, 2439879, 2264506, 2163773, 2191634, 2219292, 2085651, 1720973, 1095261, 164297, -1013163, -2156982, -2913519, -3164917, -3111194, -3009719, -2908428, -2689728, -2305121, -1858517, -1456016, -1066530, -589091, -15849, 545248, 1014062, 1436248, 1893478, 2359699, 2711109, 2852664, 2745711, 2310279, 1425983, 115118, -1351241, -2641193, -3634381, -4421801, -5066224, -5483408, -5572242]
38323e572242K36192N29360Q68313J257894J541273J537459J206561O60106P2992
38314B337908l88301o11110n64384k79915J88152P50883J237651J428905J195372
38305E295161O15326n4627n33717o69915m82959q8539L96517Q60571J145908J081345
38295G565071O26910m0155o35706r71079j043845r70087q63363p52882n82708
38286B332156l06220N431J95707J99216J37601J84294L64969N39994N50318L34260
38276D537726n1596m58851p32021q41513r05883j017259j088544r63554o45723
38267b167218l13722j23878r5969j77502k99876l62646k88104j32231l9882m8042
38257d049070k9111J23520L44794M86707M75699L30008J10084p7354j07976L3813
$$ y = [-5572242, -5336050, -4806690, -3938377, -2680483, -1139210, 398249, 1604810, 2264916, 2337908, 1949607, 1338497, 774113, 494198, 682350, 1433233, 2670884, 4099789, 5295161, 5910487, 5855860, 5322143, 4652228, 4169269, 4080730, 4477247, 5337818, 6483726, 7565071, 8191981, 8151826, 7516120, 6545041, 5501196, 4531109, 3667746, 2914864, 2332156, 2025936, 2031367, 2227074, 2426290, 2563891, 2748185, 3113154, 3653148, 4203466, 4537726, 4486130, 4027279, 3295258, 2453745, 1547862, 530603, -557941, -1521495, -2167218, -2480940, -2604818, -2700787, -2878289, -3178165, -3540811, -3828915, -3961146, -4001028, -4049070, -4078181, -3954661, -3609867, -3123160, -2647461, -2317453, -2207369, -2284723, -2392699, -2358886]
38247b358886K05015K61595K28170K38475L44314M61131M79637L61924J48770
38238C70145n7694j33195k7176J73959L28382L80401L78021L70692L58943L47513
38228B489991L75427M58144N40263N36500L96541J16096k74200o88302r74484
38219B975976r89006p16511l02933N5308K50773K88746K16742R5186K1952Q1596
38209A977829K22828K79583K00194J74903M04358P86433R94789Q74900N97635
38200F513452L75435J97597n1387l60673o32289q52053j051690j154821j039548
38191A944023p52935n03107m06223l75057k98503j96004j20031k7250J34000K78892
38181c22195K64612J04256j4274M2394J87309K35256J45038O8553J57271L72895
$$ y = [-2358886, -2153871, -1892276, -1664106, -1425631, -1081317, -620186, -140549, 221375, 370145, 312451, 179256, 152080, 326039, 654421, 1034822, 1412843, 1783535, 2142478, 2489991, 2865418, 3323562, 3863825, 4400325, 4796866, 4912962, 4638762, 3950460, 2975976, 1986970, 1270459, 967526, 1022834, 1273607, 1562353, 1779095, 1874281, 1896233, 1977829, 2200657, 2480240, 2680434, 2855337, 3259695, 4046128, 5040917, 5915817, 6513452, 6888887, 7086484, 7035097, 6674424, 6042135, 5190082, 4138392, 2983571, 1944023, 1191088, 687981, 281758, -93299, -391802, -587806, -707837, -735087, -601087, -322195, -57583, 46673, 32399, 74793, 262102, 497358, 642396, 710949, 868220, 1241115]
38171A241115N16809M24356J13670k28611l82470k53180L8726K24085J05552k52562
38161A547490n78954o51787m73906k04811N485Q3578J4059j61845l49456m60928
38151a231075m63470l41020o0680L51937P38692R05605Q04991N57690K94370N1598
38141A608638j62594k95245l07218k57583k61425l73891n54752p29054q36277
38132b169401q27760o74332m09220j40243J4736Q022j33333l68595o69766r74245
38122f344137j155977j100541q12702m18055o0062J77406K71445K57732K39865
38113h945026L28795N30380P38774Q73161R67366J084280J202843J252213J210105
38104g57109J096069R03711O18094K81372l2202k98408n41679p69968r73498j165578
$$ y = [1241115, 1757924, 2182280, 2295950, 2067339, 1684869, 1431689, 1470415, 1694500, 1800052, 1547490, 968536, 316749, -157157, -361968, -356483, -272905, -258846, -420691, -770147, -1231075, -1694545, -2035565, -2096245, -1744308, -1005616, -100011, 704980, 1262670, 1557040, 1608638, 1446044, 1150799, 843581, 585998, 324573, -49318, -604070, -1333124, -2169401, -2997161, -3671493, -4080713, -4220956, -4206220, -4198198, -4331531, -4700126, -5369892, -6344137, -7500114, -8600655, -9413357, -9831412, -9891474, -9714068, -9442623, -9184891, -8945026, -8616231, -8085851, -7347077, -6473916, -5506550, -4422270, -3219427, -1967214, -757109, 338960, 1242671, 1860765, 2142137, 2109935, 1811527, 1269848, 499880, -473618, -1639196]
38094a639196j348955j452104j371434j070353n78086P0762P94729J387558J615202
38085c591877J424068R63401L97683j81757o44880p97219n80065j95477Q5265
38076c120858J83332K02600K36118K91087L51703L94048L54968J91076k7388j58363
38066a101677j26281K9376K07503K76060J01531l25811p92750j007549q84732
38057c624330o04943l60837j35375K02318O43650R71774R53292N69051N2163l02276
38047a635513l80771l06330k47168k14407j01011J21135L47403M96483O22241
38038a297938Q17468J065833J235428J175112P96262J40575n69460j015950j023458
38029A323872p11125l58188j39095l8195K0801O2022Q3703J11897J78415K76509
$$ y = [-1639196, -2988151, -4440255, -5811689, -6882042, -7460128, -7389366, -6594637, -5207079, -3591877, -2167809, -1204408, -806725, -988482, -1633362, -2430581, -3010646, -3206123, -3120858, -2937526, -2734926, -2498808, -2207721, -1856018, -1461970, -1107002, -915926, -943314, -1101677, -1227958, -1198582, -991079, -715019, -613488, -939299, -1732049, -2739598, -3624330, -4229273, -4590110, -4725485, -4523167, -3879517, -2907743, -1954451, -1385400, -1333237, -1635513, -2016284, -2322614, -2569782, -2784189, -2885200, -2764065, -2416662, -1920179, -1297938, -480470, 585363, 1820791, 2995903, 3792165, 3932740, 3363280, 2347330, 1323872, 612747, 254559, 115464, 77269, 98070, 160092, 243795, 355692, 534107, 810616]
38019H10616L68511M21769M22626L67327K48327N0041k27881n33657p74840q90919
38009B61920q94050q16704o55305m05349j12182J75866M72250P83712R89825R03510
37999G03493M96326j7828l85351n47413o21161p07098p96432q39070q06876o71884
37989d193294l97553n582L76015N84254N57786L90504K42462K09166K88765M49641
37979a497836O66589Q66068R04604O86731K89666j06457m05069o16927o92394
37970I4975m69061J13067Q20413J270714J262113Q93054L96727l8164k91882k93309
37960C758647o5528K33507L71248J74079l55968j016471j519646j696210j604408
37951a720750j420787j246657j058264q04305m69022m8481M43105R17679J233339
$$ y = [810616, 1179127, 1600896, 2023522, 2390849, 2639176, 2689217, 2461336, 1927679, 1152839, 261920, -632130, -1448834, -2104139, -2509488, -2621670, -2445804, -1973554, -1189842, -200017, 703493, 1199819, 1181991, 796640, 249227, -371934, -1079032, -1875464, -2714534, -3521410, -4193294, -4590847, -4596429, -4220414, -3636160, -3078374, -2687870, -2445408, -2236242, -1947477, -1497836, -831247, 34821, 939425, 1626156, 1915822, 1809365, 1404296, 787369, 94975, -374086, -261019, 559394, 1830108, 3092221, 3985275, 4382002, 4343838, 4051956, 3758647, 3693119, 3926626, 4297874, 4471953, 4115985, 3099514, 1579868, -116342, -1720750, -3141537, -4388194, -5446458, -6250763, -6719785, -6768266, -6325161, -5407482, -4174143]
37942d174143J302557J135621P74151K62482k81436o49903o82141m03728L206
37933b713334L47045N34125N86700N97020O27864O24453M63715J26522k22834
37924I71276l80101k98360j03101N4946J08465O0978o0595k15321l37553l44069
37914e43435j77224J24507L98405M51629K21541j73660n52013p99160q78594p81804
37904b709808n21894j43233L01887P54145J100762J192480R72785N57358J29903
37895A634385k09226m44822n57526n26758m04689k96676k51836k22615j32579
37886a412342M9492K68461L62141J41205l96893r50126j134813q59716l89334
37877d321925k1255J80707K91112L10698J86774k2595j53867j14955M3572K45754
$$ y = [-4174143, -2871586, -1735965, -961814, -699332, -980768, -1630671, -2312812, -2716540, -2713334, -2366289, -1832164, -1245464, -648444, -20580, 603873, 1067588, 1194110, 971276, 591175, 292815, 189714, 244660, 353125, 414103, 353508, 138187, -199366, -543435, -720659, -596152, -197747, 253882, 475423, 301763, -250250, -1049410, -1928004, -2709808, -3231702, -3374935, -3073048, -2318903, -1218141, -25661, 947124, 1504482, 1634385, 1425159, 980337, 422811, -103947, -508636, -805312, -1057148, -1279763, -1412342, -1362850, -1094389, -732248, -591043, -987936, -1938062, -3072875, -3932591, -4321925, -4343180, -4162473, -3871361, -3560663, -3373889, -3396484, -3550351, -3665306, -3621734, -3375980]
37867c375980M79686P25557Q73805P99587N08969J61265n8729p1996O5341K10416
37857C17921K11079J444l31335o04548p15665p53586q89579j156438j378714j330208
37847f629629r28730k89000L45219P06462O38788K25281k32301m30056k84993
37838f878959N2702L69371N42580N80140N79541O46100P98248R40897R54393Q06322
37828f08665N61155L00911O0565j76943m37807o80038p51677m94289O0808O48385
37818a517595R78053R54322O62812K31122k07066m96024n61312n18788n47821
37809a022297o45183o30184m22412j88579j47332l18271n33730o30717n61614
37800e100319l69439j38206L7543Q8679O046j43015k23501j08341J80817M24726
$$ y = [-3375980, -2896294, -2170737, -1296932, -497345, 11624, 172889, 114160, 42164, 107505, 317921, 529000, 530444, 199109, -405439, -1121104, -1874690, -2764269, -3920707, -5299421, -6629629, -7558359, -7847359, -7502140, -6795678, -6156890, -5931609, -6163910, -6593966, -6878959, -6826257, -6456886, -5914306, -5334166, -4754625, -4108525, -3310277, -2369380, -1414987, -608665, -47510, 253401, 313966, 137023, -300784, -980822, -1732499, -2226788, -2165980, -1517595, -539542, 414780, 1077592, 1308714, 1101648, 605624, 44312, -474476, -1022297, -1667480, -2297664, -2720076, -2908655, -3055987, -3374258, -3907988, -4538705, -5100319, -5469758, -5607964, -5570421, -5481742, -5475696, -5618711, -5842212, -5950553, -5769736, -5345010]
37790e345010L89143P6013k73395m30746l57936j36564J54138M32608N94808N95974
37780d300967N04865M07565L00606J41088m1500j54327j39224r691J82087L61927
37770b747571M41502L69985J84738j2324j25756j21176n4689n6742k19637m59443
37760b801113n46706l37188N4263L58002M08823K71132J40902J66853L41941N22438
37750a420653N60340M46865L19586L15706M37068N68360N99363N18001M14156
37741B758792M00231M92094N63967M67510K05501o1297j91926k03547k29562l94373
37731C807390p22856j093633j274529j100972o60451k34106l6584q3769k98260
37722a697770n94765q18099p66198m02954M7579L30945M10432M01368L73666L56196
$$ y = [-5345010, -4955867, -4879854, -5153249, -5583995, -5941931, -6078495, -5924357, -5491749, -4896941, -4300967, -3796102, -3388537, -3087931, -2946843, -2988343, -3142670, -3281894, -3291585, -3109498, -2747571, -2306069, -1936084, -1751346, -1763670, -1889426, -2010602, -2065291, -2122033, -2341670, -2801113, -3347819, -3685007, -3630744, -3272742, -2863919, -2592787, -2451885, -2285032, -1943091, -1420653, -860313, -413448, -93862, 221844, 658912, 1227272, 1826635, 2344636, 2758792, 3159023, 3651117, 4215084, 4682594, 4888095, 4826798, 4634872, 4431325, 4201763, 3807390, 3084534, 1990901, 716372, -384600, -1045051, -1279157, -1315741, -1399510, -1697770, -2292535, -3110634, -3876832, -4279786, -4232207, -3901262, -3490830, -3089462, -2715796, -2359600]
37712b359600M39438O87306R70772J052768Q54309N17960K04707n0363k63371
37703B053926m05357m40037l90170l16173k56570k07550j43526o1024j0009n0488
37693b26978j68410k89129l84159m72560m87775k82129J35911M93315N33703L33985
37683h14226J90436K44099L70412L91152K27518j22420n63931q52035p46406k80170
37673a955571K58956O52385R19515J130514J215474J057332O71051K01391j95379
37664C955668m24844m92133n08708n76962o30033m82192q7303L50936N92783O02456
37654B299668N06109L92528K50333N9868j45680l16693m41632n56619p00267q43387
37644E04228q83698p55103n23053l10132j45193L3232K33777L76199M24689M66237
$$ y = [-2359600, -1920162, -1232856, -262084, 790684, 1644993, 2162953, 2367660, 2317297, 2053926, 1648569, 1208532, 818362, 502189, 245619, 38069, -105457, -166481, -176490, -226978, -395388, -684517, -1068676, -1541236, -2029011, -2311140, -2175229, -1681914, -1148211, -814226, -623790, -379691, -9279, 381873, 609391, 486971, -76960, -928995, -1675401, -1955571, -1696615, -1044230, -124715, 1005799, 2221273, 3278605, 3949656, 4151047, 3955668, 3530824, 3038691, 2529983, 1953021, 1322988, 840796, 753493, 1104429, 1697212, 2299668, 2805777, 3198305, 3448638, 3508506, 3362826, 3046133, 2604501, 2047882, 1347615, 504228, -379470, -1134573, -1657626, -1967758, -2112951, -2079719, -1845942, -1469743, -1045054, -578817]
37634e78817O00782Q00453R19440Q27098N26310J55250j48448l94894o87825r93396
37624A025953j081523q04968l35806K4726J97222L22605M84633O39487P78306
37615A250635R23102R54891O87997J73017k86948m93922n36124n47574m99271
37606A625803l32503j04349J30200M20742P75393J046394J085482R10596O34947
37597F192705L47514J30370N4255P8647Q3874N2387P2171J41625J79346K62750
37587G595644N90127J106674J440231J361468J073036R00381R45879J194851J669451
37578A7877742K264857K702334K881636L049813L435765M012845M823484O165245
37570D7213721Q170782J0587287J3294060J6610604K0732753K5377590L0317643
$$ y = [-578817, 21965, 822418, 1741858, 2568956, 3095266, 3250516, 3102068, 2707174, 2019349, 1025953, -55570, -860538, -1196344, -1171618, -974396, -651791, -167158, 472329, 1250635, 2173737, 3128628, 3816625, 3989642, 3702694, 3208772, 2672648, 2125074, 1625803, 1293300, 1188951, 1319151, 1739893, 2515286, 3561680, 4647162, 5557758, 6192705, 6540219, 6670589, 6724844, 6803491, 6887365, 6939752, 7011923, 7153548, 7332894, 7595644, 8185771, 9292445, 10732676, 12094144, 13167180, 14067561, 15013440, 16208291, 17877742, 20142599, 22844933, 25726569, 28776382, 32212147, 36224992, 41048476, 47213721, 55384503, 65971790, 79265850, 95876454, 116609207, 141986797, 172304440]
37563A72304440L5247687L8083913L4453740K1173016Q16276j8758184l0552584
37556B52768304l3528084l1373279k7734674k3915601k0116644j6751037j4100366
37549H5248619j1917407r993628q501601p446817o376440n001176l646615k732966
37541B9631969k170726j618780j059710p62630q32420j087748j299684j334830
37533A9465441j135040p50592l74470k09836k91742m83131o13247n98211m85296
37524A4523876m01329m05219l98098k45618M3376L55094O37834Q87272R95611
37515A5992799Q00920L20493k19942o34438r21062j130391j246361j256766j201906
37506A0503346j085743q66938o06280m92719o31921r05262j107925j129853r50741
$$ y = [172304440, 207552127, 245636040, 280089780, 301262796, 302079072, 283320888, 252768304, 219240220, 187866941, 160132267, 136216666, 116100022, 99348985, 85248619, 73331212, 63337584, 54835983, 47389166, 41012726, 36011550, 32364935, 29631969, 27461243, 25842463, 24782753, 24020123, 23187703, 22099955, 20800271, 19465441, 18330401, 17579809, 17205339, 16995503, 16703761, 16220630, 15607383, 15009172, 14523876, 14122547, 13717328, 13319230, 13073612, 13116988, 13472082, 14109916, 14997188, 15992799, 16793719, 17114212, 16894270, 16259832, 15338770, 14208379, 12962018, 11705252, 10503346, 9417603, 8550665, 7944385, 7451666, 6819745, 5914483, 4806558, 3676705, 2725964]
37497B725964n96101j97554K5664k2552j94211k93036l18162m00309n61156o70921
37487e02374o24721m46778k15161K9497K79258N09998O56178O44680M97001L85124
37477A212702M75143O70189O38729K15132l22919n32912l21540j9297N6742n2418
37467B019551r6666L0926K03722K55010J48123m1318k32103l92669n16434n77169
37457H00973n38188m20310l30876l70996n07101n83241m83662k46783L309J94029
37447b482846L34460M49279N46254O37680P28875P73142O92976M69820J67090
37438B316730j57971n02934q30698r99335q88309n81263l09309j82078p9736J24949
37428b089954L36826L50898J54377j9870K3652J99240K45737M1088k44168l13778
$$ y = [2725964, 2129863, 1932309, 1957973, 1935421, 1741210, 1448174, 1130012, 729703, 168547, -502374, -1127095, -1573873, -1789034, -1759537, -1480279, -970281, -314103, 330577, 827578, 1212702, 1687845, 2358034, 2996763, 3211895, 2888976, 2356064, 2034524, 2015227, 2071969, 2019551, 1922885, 1953811, 2157533, 2412543, 2560666, 2519348, 2287245, 1894576, 1378142, 800973, 262785, -157525, -488401, -859397, -1366498, -1949739, -2433401, -2680184, -2676875, -2482846, -2148386, -1699107, -1152853, -515173, 213702, 986844, 1679820, 2149640, 2316730, 2158759, 1655825, 825127, -174208, -1062517, -1643780, -1953089, -2135167, -2214903, -2089954, -1753128, -1402230, -1247853, -1267723, -1244071, -1044831, -799094, -758006, -1002174, -1315952]
37418a315952n0180L54581N80690M94120K51535Q0202R275j14858l80567o83267
37408g74421q70256r19826r04958q37052o52995l72778j82668k80374o39526r82750
37398g417604j016781o71105r3258N30005J072905J429285J503985J311423J013143
37389b338002P85256O80711O58200O76335O88967O19128M50739L12327L47284
37380B880945M97072N19472K45946k54942p70092j104751j154634r43975o45011
37371g29970m61148m22763l65130j54724J44491L90611N63179P46356R59909J107162
37361A777973J090005R12749O65885M39519K51441N4500j62072k94563k23430
37352D512007l834J43410R3274j7430K5963K30654L97418L63013J30642k17419
$$ y = [-1315952, -1366132, -1011551, -430861, 63259, 314794, 394996, 404271, 289413, -91154, -774421, -1644677, -2564503, -3469461, -4306513, -4959508, -5332286, -5514954, -5795328, -6434854, -7417604, -8434385, -9105490, -9198748, -8668743, -7595838, -6166553, -4662568, -3351145, -2338002, -1552746, -872035, -213835, 462500, 1151467, 1770595, 2221334, 2533661, 2880945, 3378017, 3897489, 4143435, 3888493, 3118401, 2013650, 859016, -84959, -729970, -1191118, -1613881, -1979011, -2133735, -1989244, -1598633, -1035454, -289098, 670811, 1777973, 2867978, 3780727, 4446612, 4886131, 5137572, 5192072, 5030000, 4735437, 4512007, 4508173, 4651583, 4744857, 4727427, 4753390, 4984044, 5381462, 5744475, 5875117, 5657698]
37342E657698o09052r55591j135828j071601p90863l98249j4263K62465L94754
37333A339470M34893M73036N30509N27165L74071Q6701k05036l61291l58108l10673
37323B530737l45917m49107m84267l84207k50063k05201k12552j29328Q2897K96324
37313D49316L64783K58007N2670j25411j41415P1548M27012P29704Q41350P67565
37303C695129N79163L24515N7010j25709j51561p0577l0133j44375l95858o49076
37293C088528p50075o32955l45210K4954M09298P12772P65743M47157j14364n66737
37283C039111o41573l93269q9839O6389M4610j05087l12096m59378m25988k19191
37273E03689O49Q9721Q3387J33461K94013M23973L27205l0671m66830p35842p21696
$$ y = [5657698, 5048646, 4093055, 2957227, 1885626, 1094763, 696514, 682251, 944716, 1339470, 1774363, 2247399, 2777908, 3305073, 3679144, 3765845, 3560809, 3199518, 2841410, 2530737, 2184820, 1735713, 1251446, 867239, 617176, 411975, 199423, 70095, 152992, 449316, 814099, 1072106, 1124776, 999365, 857950, 929498, 1356510, 2086214, 2927564, 3695129, 4274292, 4598807, 4655817, 4530108, 4378547, 4307970, 4277837, 4133462, 3737604, 3088528, 2338453, 1705498, 1360288, 1385242, 1794540, 2507312, 3273055, 3720212, 3605848, 3039111, 2397538, 2004269, 1914430, 1980819, 2025429, 1920342, 1608246, 1148868, 722880, 503689, 504338, 594059, 677446, 810907, 1104920, 1528893, 1856098, 1825427, 1358597, 622755, -98941]
37262i8941m84551j62804J31535L40573M47967M71419M45321L90010L10452K24618
37252B015599J51927N4304j60436n20549q99199j107961j092288r84923r45739
37243c489265r90230j005196q95575o65623l71339n6114K46415M96137O77793
37234f052997Q22749R53837J029060R99486R11195Q65886Q64106P87437N93500
37225A774259M25939M18939M67548L47794M1181k33760l40171l91375n09604n78177
37215A422573l96369J424L42978M04497J69864k59378p52420j133773j235794
37206a436398j047300p35458m73138l03067j84744p9496N2988K52279M88985O65704
37196b799645P38768P69424Q00053P66226O18641M54342M00084M00079K60350
$$ y = [-98941, -583492, -746296, -614761, -274188, 173779, 645198, 1090519, 1480529, 1790981, 2015599, 2167526, 2221830, 2061394, 1540845, 641646, -466315, -1558603, -2543526, -3489265, -4479495, -5484691, -6380266, -7045889, -7417228, -7473342, -7226927, -6730790, -6052997, -5230248, -4276411, -3247351, -2247865, -1336670, -470784, 393322, 1180759, 1774259, 2200198, 2619137, 3086685, 3434479, 3475660, 3241900, 2901729, 2510354, 2000750, 1422573, 1026204, 1027628, 1370606, 1775103, 1944967, 1685589, 933169, -200604, -1436398, -2483698, -3219156, -3692294, -3995361, -4180105, -4259601, -4206613, -3954334, -3465349, -2799645, -2060877, -1291453, -491400, 274826, 893467, 1347809, 1747893, 2147972, 2408322]
37187B408322p2649l90131m34944j74969J82368M02157M10031L11036K70522L60414
37177C272157M88026M80881K59982p5295l36894m04306k91367r7699P3334J67687
37167C536506J97211K21482K97223M24038N30966N22181L51081N9249k62909n59472
37157E317556q42529j131877j374641j451207j273744q81756m46495j71740j48023
37148b404456k67181k93809o1767L84923Q47760J146709J215691J065465P31006
37139B364341K84719j41632l94263l68096n7130M28838Q91303J131138J054203
37130E193421P04836K12214k72868o10174p11179n90099l47607p4620K07543M90489
37120D201956O95110O94983M37561L2410k89912l33963j01374J90708K93410J56962
$$ y = [2408322, 2335673, 1945542, 1510598, 1335629, 1517997, 1920154, 2330185, 2641221, 2911743, 3272157, 3760183, 4241064, 4501046, 4425751, 4088857, 3684551, 3393184, 3295485, 3368819, 3536506, 3733717, 3955199, 4252422, 4676460, 5207426, 5729607, 6080688, 6139937, 5877028, 5317556, 4475027, 3343150, 1968509, 517302, -756442, -1638198, -2084693, -2256433, -2404456, -2671637, -2965446, -3027213, -2642290, -1794530, -647821, 567870, 1633335, 2364341, 2649060, 2507428, 2113165, 1745069, 1687939, 2116777, 3008080, 4139218, 5193421, 5898257, 6110471, 5837603, 5227429, 4516250, 3926151, 3578544, 3503924, 3711467, 4201956, 4897066, 5592049, 6029610, 6062020, 5772108, 5438145, 5336771, 5527479, 5820889, 5977851]
37110E977851m0789j04142k1479N3466l0604l03060o61501r26036r47022p30254
37100B266430m42357k44978j52444j06344j35844l26210o24839q02787o81026
37091a250399l32485P836J98040K94870M25278O15871P64929P50520N42148K12167
37081B228775j34637m08633n15212l55102Q0683O25891J023759J128420R89579
37072D663523P33732M19730M2589l68336p08995q56337p54624m68702j56412N1618
37062B597786J65126K96127M93651O56363O31576L62697q0772n66258r50161j115897
37052B490238j028349p51929l91522k8825K84679N31996P56316J009716J216809
37043D089129J163056P24677Q2475m00446n25396m12836l21033l97469o08414
$$ y = [5977851, 5937062, 5832920, 5811441, 5864907, 5834303, 5531243, 4869742, 3943706, 2996684, 2266430, 1824073, 1579095, 1426651, 1320307, 1184463, 858253, 233414, -569373, -1250399, -1582884, -1575048, -1377008, -1082138, -656860, -40989, 723940, 1474460, 2016608, 2228775, 2094138, 1685505, 1170293, 815191, 895874, 1521765, 2545524, 3673944, 4663523, 5397255, 5816985, 5859574, 5491238, 4782243, 3925906, 3171282, 2702580, 2546168, 2597786, 2762912, 3059039, 3552690, 4209053, 4840629, 5203326, 5122554, 4556296, 3606135, 2490238, 1461889, 709960, 318438, 289613, 574292, 1106288, 1862604, 2872320, 4089129, 5252185, 5976862, 6059337, 5658891, 5133495, 4720659, 4399626, 4002157, 3393743]
37034C393743q06291q27297o12852k96378j11432j59473l12507l79609l03469
37025d15565j43553M8713K32958L08585J78862q9655k77662k44823r6087o2238
37015e60465k44845n18840o56566n05342p8400M50126Q27153Q71069O09735K67512
37005D61137P9744J11186K64322M35619O01859P38932P29835M45011p3153n69768
36995C224724p75865o48037l96615k87007m22881o92178q72351p79638l73824
36986b023672K13319P41743J009038R91319Q49188P69581P92247Q04940P02291
36977D849994N07147L09933J25812j23754m72371p98847r04715p03676l07531
36968B481992Q3386L48040M81650M97608L67356R5187k03035l83966m45481n29542
$$ y = [3393743, 2587452, 1760155, 1147303, 850925, 739493, 580020, 267513, -112096, -415565, -559118, -510405, -277447, 31138, 210000, 120345, -157317, -402140, -498227, -560465, -805310, -1324150, -1980716, -2486058, -2564458, -2114332, -1287179, -416110, 193625, 461137, 540881, 652067, 916389, 1352008, 1953867, 2692799, 3422634, 3867645, 3794492, 3224724, 2448859, 1800822, 1404207, 1117200, 694319, 2141, -870210, -1649848, -2023672, -1810353, -1068610, -59572, 931747, 1780935, 2550516, 3342763, 4147703, 4849994, 5357141, 5667074, 5792886, 5669132, 5196761, 4397914, 3493199, 2789523, 2481992, 2565378, 2913418, 3395068, 3892676, 4260032, 4355219, 4152184, 3768218, 3322737, 2793195]
36958B793195p08313q25644o33928q7186N60793R67737R83323P23334M19230K28555
36948D421096J65660J63355J66060J57949J25349L3022j42806l76787o06611p65464
36938C340823p91641o44980l57134m6841J62936K42012K35388J68882L4443j24057
36928B219831j80553l7356K46873M71948M48190J44365k93321o68142q98448j057426
36918C95961j237721j403213j415374j185903p45849j78165M34290R77970J319943
36909c038061J413687J340407J187822R36582N33582L6431m00847o75981p97952
36900E35670q03172o99267n22333l77198l55136m32577m99625m87889m36563m21689
36890d499779m41731m01472k22528M3197K40269K60119J40376j046r4848j38824
$$ y = [2793195, 2084882, 1259238, 625310, 538124, 1098917, 2066654, 3049977, 3773311, 4192541, 4421096, 4586756, 4750111, 4916171, 5074120, 5199469, 5232491, 5089685, 4712898, 4106287, 3340823, 2549182, 1904202, 1547068, 1500227, 1663163, 1905175, 2140563, 2309445, 2343888, 2219831, 2039278, 2001922, 2248795, 2720743, 3168933, 3313298, 3019977, 2351835, 1453387, 395961, -841760, -2244973, -3660347, -4846250, -5592099, -5770264, -5335974, -4358004, -3038061, -1624374, -283967, 903855, 1840437, 2374019, 2410450, 2009603, 1333622, 535670, -267502, -966769, -1489102, -1866300, -2221436, -2654013, -3153638, -3641527, -4078090, -4499779, -4941510, -5342982, -5565510, -5522313, -5282044, -5021925, -4881549, -4882595, -4977443, -5116267]
36880e116267j08860P3569M43608Q90299J194707J184250Q53813L56305j04152
36871c32728l77074m01609j85868K10701O64262R86821R94936O26115J1662n68401
36861A628817q40360p13118l48675m5944l070j59858k73893j56062J70003N23771
36851b18389P46182Q12179Q02940Q10565Q69537R41401R38962P83358M74782J16447
36841G077964j55119k82635l25476l79138m70539n39738n05151l34342p6609J51506
36831D160723K43281K03804J51826J74679K10494J42482j8593j57803k71866n20341
36821D318686r74167j423523j574957j391191j096456q64379o54131l82282j01436
36812d143836Q2877J66542K09704K16191J66472J27067J92551L10273K85266J7242
$$ y = [-5116267, -5225127, -5151558, -4707950, -3817651, -2622944, -1438694, -584881, -228576, -332728, -709802, -1111411, -1297279, -1086578, -422316, 564505, 1559441, 2185556, 2197218, 1628817, 788457, 75339, -273336, -319280, -322350, -482208, -756101, -912163, -742160, -218389, 527793, 1339972, 2142912, 2953477, 3823014, 4764415, 5703377, 6486735, 6961517, 7077964, 6922845, 6640210, 6314734, 5935596, 5465057, 4925319, 4420168, 4085826, 4009217, 4160723, 4404004, 4607808, 4759634, 4934313, 5144807, 5287289, 5268696, 5110893, 4839027, 4318686, 3344519, 1920996, 346039, -1045152, -2141608, -3005987, -3660118, -4042400, -4143836, -4060959, -3894417, -3684713, -3468522, -3302050, -3174983, -2982432, -2672159, -2386893, -2369651]
36802b369651l42478n37237m73863k97922k25117l36402n19046n70216l69776
36793f041708J0657L64851N35856N42300N16647N43060N83263N46111L98178K11242
36783a789543J18263J96169L56462L81734J32209k90325o38427p63931o96911
36774b994300n03060j92211J85019M73004N49604M62913L36656K03145L6345j13742
36764a556627j67066j70913k58159m38184n78733o25539o80570p94671q39531
36755f109993p00528m69366k98623j51472J41080O09591J078006J355134J371755
36746c174416J143705P44637L43782J42544K04268M09395O07512P44495Q20117
36737A986039Q07797O66869L81610l8676n39584r85583j227813j251527j184840
$$ y = [-2369651, -2712129, -3249366, -3723229, -4021151, -4246268, -4582670, -5101716, -5671932, -6041708, -6031051, -5666200, -5130344, -4588044, -4071397, -3528337, -2945074, -2398963, -2000785, -1789543, -1671280, -1475111, -1118649, -736915, -604706, -895031, -1533458, -2297389, -2994300, -3497360, -3689571, -3504552, -3031548, -2481944, -2019031, -1682375, -1479230, -1442885, -1556627, -1723693, -1894606, -2152765, -2590949, -3169682, -3795221, -4475791, -5270462, -6109993, -6810521, -7279887, -7578510, -7729982, -7588902, -6979311, -5901305, -4546171, -3174416, -2030711, -1286074, -942292, -799748, -595480, -186085, 421427, 1165922, 1986039, 2793836, 3460705, 3842315, 3803639, 3264055, 2278472, 1050659, -200868, -1385708]
36728a385708j113948r64177o30316j61100K68185N27411N98186N03511K66969
36719b090987n2657l62094n94571p28493p38693n81911k59769J33430M56884O15846
36709d203015O06776M90563L40987K20237J83772K67739M38116N74363N68767
36700e11695M63771M32306N70312P44373P08940L66043j43928n99073q73128r44609
36690B13312q16413n05543r0053L09507O18629Q41853R93789J041093R49222P53759
36680D309155N27901K84212l2162m36144q43259j150305j327932j387074j299364
36671a354972j028300o32343k65968n6129j3382o7826j50171k29742l08702l83969
36661d491504l94524k43084O2696L20029K95689R014k50428k42792l0919J53070
$$ y = [-1385708, -2499656, -3463833, -4094149, -4255249, -3987064, -3459653, -2861467, -2357956, -2090987, -2143644, -2505738, -3100309, -3828802, -4567495, -5149406, -5409175, -5275745, -4818861, -4203015, -3596239, -3105676, -2764689, -2544452, -2360680, -2092941, -1654825, -1080462, -511695, -47924, 384382, 954694, 1699067, 2408007, 2774050, 2630122, 2031049, 1157921, 213312, -603101, -1108644, -1198697, -889190, -270561, 571292, 1565081, 2606174, 3555396, 4309155, 4837056, 5121268, 5089106, 4652962, 3809703, 2659398, 1331466, -55608, -1354972, -2383272, -3015615, -3281583, -3337712, -3351094, -3418920, -3569091, -3798833, -4107535, -4491504, -4886028, -5129112, -5066416, -4746387, -4450698, -4441684, -4692112, -4934904, -4965823, -4812753]
36651d812753K09921K39460L53955N41169P08383P63266O32501K87256j94717
36642a271559o25144q06578o53663k42548K26644N41036O18514N69562N84501
36633a059235P29477Q60769P58294L54716j62659m92642m91025k96820j53610
36624D7265j20015l2929K28208N41126O72146N32473K20952j21639l98068n52408
36614A017111o17281p42386j035464j365946j464870j251349r23105o71574m52968
36605g507832j38793K38345N39493P45947R66188J225510J390910J344377J140206
36596e5649R46512Q76092Q84386P86984L92982k92494r82093j312384j190199
36587E4137q78582o96593p00595p28127o83944o45920o75284o52109l97652Q3517
$$ y = [-4812753, -4602832, -4363372, -4009417, -3468248, -2759865, -1996599, -1364098, -1076842, -1271559, -1896703, -2703281, -3356944, -3599492, -3372848, -2831812, -2213298, -1643736, -1059235, -329758, 531011, 1289305, 1644021, 1481362, 988720, 497695, 200875, 47265, -72750, -105679, 122529, 663655, 1335801, 1868274, 2089226, 1967587, 1569519, 1017111, 399830, -342556, -1378020, -2743966, -4208836, -5460185, -6383290, -7054864, -7507832, -7646625, -7408280, -6868787, -6122840, -5156652, -3931142, -2540232, -1195855, -55649, 890863, 1766955, 2651341, 3438325, 3831307, 3538813, 2556720, 1244336, 54137, -824445, -1521038, -2221633, -2949760, -3633704, -4279624, -4954908, -5607017, -6004669, -5921152]
36577e921152N72556Q46477Q56458O99695M97548L41561K89773L35614L98630
36568a082840M09445L95473M25469M82745M73564L74177K83928K85142L18484
36559B365587K66590J19043k5198j08730j96216l85010o78159r68425j130534
36550g41052j119904r88556q05921n76668k72934N2903K64569L10563L37307N32641
36540c007052Q68810J105347J070155Q44213O24381M94634M12326L51348L39812
36531C103974L58792L04630R6303k23876n24886o97698p30294p18994q16123j103274
36521i51446j465086j622355j352462o84286J43310Q84231J398258J604030J444047
36512f01759R64194L64902j20359m02548n48381o30330o31202n04486k59722M8818
$$ y = [-5921152, -5348596, -4502119, -3645661, -2945966, -2448418, -2106857, -1817084, -1481470, -1082840, -673395, -277922, 147547, 630292, 1103856, 1478033, 1761961, 2047103, 2365587, 2632177, 2751220, 2726022, 2617292, 2421076, 2036066, 1357907, 389482, -741052, -1860956, -2849512, -3655433, -4232101, -4505035, -4452132, -4187563, -3877000, -3539693, -3007052, -2138242, -1032895, 37260, 881473, 1505854, 2000488, 2412814, 2764162, 3103974, 3462766, 3767396, 3863699, 3639823, 3114937, 2417239, 1686945, 967951, 151828, -951446, -2416532, -4038887, -5391349, -6075635, -5932325, -5048094, -3649836, -2045806, -601759, 362435, 727337, 606978, 204430, -343951, -974281, -1605483, -2109969, -2369691, -2320873]
36502b320873L68778O39249P72788P13575N14626L14562K26386K63778L59387
36493A852256M16457L48027J18657k18735n41902p38325p73447o92030n70502
36484g99544m67646m01691l60377l24983k70422j46188R6263M17742O66365P04688
36474h85793N59883L84581K63738J42583j6567r8575L8478L32212N28306M60006
36464A708852K37373R9606J27409J78031R7485p8348j70131n9357K00293M51061
36454B792274N47386M00704j0295o00192j169543j515615j580639j458031j241912
36445c835863r18142m37312J40169O25051Q32160P17864L98369N6820j70370k39663
36435b830917j58735O7581M15946P83859J018232J046522R48345Q59512Q25780
$$ y = [-2320873, -1952095, -1312846, -540058, 173517, 688143, 1002705, 1229091, 1492869, 1852256, 2268713, 2616740, 2735397, 2516662, 1974760, 1236435, 462988, -229042, -799544, -1267190, -1668881, -2029258, -2354241, -2624663, -2770851, -2674588, -2256846, -1590481, -885793, -325910, 58671, 322409, 464992, 448425, 349850, 388328, 720540, 1248846, 1708852, 1946225, 2045831, 2173240, 2351271, 2448756, 2370408, 2200277, 2140920, 2341213, 2792274, 3339660, 3740364, 3730069, 3129877, 1960334, 444719, -1135920, -2593951, -3835863, -4754005, -5191317, -5051148, -4426097, -3593937, -2876073, -2477704, -2420884, -2591254, -2830917, -2989652, -2922071, -2506125, -1722266, -704034, 342488, 1290833, 2150345, 2976125]
36426B976125P78825O24536L16482j23400n96611r49211j054046q84432m98539
36417E89729J0440N12745Q47470R16545P66936N25161K80989R7826O6311K04170
36407D818322L27537K02571j31008l56306k81256q3419k9123r5759n3081J77183
36397D495661M47842O25354O91428O11731L29090m6261k35306r9002J83789L62041
36387G366367M19782M99310O02876N44005J99932l09554p32935r20451r33804
36378F735528r55347j079563j180138j036822o34411k59750k08796m43359o44770
36369B92572n79349k87986P6229M35792P41876Q67801O88101K43012k62785o26252
36359A589011p66382p07742n18278k73564l2639J71191K99609K89190J17308j07860
$$ y = [2976125, 3754950, 4379486, 4695968, 4572568, 3975957, 3026746, 1972700, 1088268, 589729, 600169, 1112914, 1960384, 2876929, 3643865, 4169026, 4450015, 4547841, 4614152, 4818322, 5145859, 5348430, 5217422, 4861116, 4579860, 4496441, 4467318, 4371559, 4318478, 4495661, 4943503, 5568857, 6260285, 6872016, 7201106, 7154845, 6919539, 6820537, 7004326, 7366367, 7786149, 8285459, 8888335, 9432340, 9632272, 9322718, 8589783, 7669332, 6735528, 5780181, 4700618, 3520480, 2483658, 1849247, 1589497, 1380701, 937342, 292572, -286777, -574763, -498534, -62742, 679134, 1546935, 2235036, 2478048, 2215263, 1589011, 822629, 114887, -403391, -676955, -709594, -538403, -238794, 50396, 167704, 59844]
36349E9844j95446o7749J22450J38276o8495k82742k50006O2288M57902P21646
36339F97968P72186O31210L48956J8569k03871j99212k5999R4001k8282l68350
36329A737176p02990p97022n89868k28944P0425K09669K61463L53085N25347P18779
36319A557120Q57284Q99198Q29794O66819M79534L47959K82411K21982J28912
36310F271013M2124J0262Q532l9726j76774l72647n53492o39639n78647l84995
36300C586011j49123K4443R8731J11138J00481M8571r3205l25150n60037o80225
36290B161635o50428n66571n63936o70293p81604p99473p53630p45354p93473
36281d163127p98432o67910m20534j28241K00674O09791J056049J345386J271404
$$ y = [59844, -135602, -203351, -80901, 57375, -11120, -293862, -543868, -481580, -23678, 697968, 1470154, 2101364, 2450320, 2468889, 2265018, 2065806, 2039807, 2133808, 2105526, 1737176, 1034186, 237164, -352704, -581648, -511223, -301554, -40091, 312994, 838341, 1557120, 2414404, 3313602, 4143396, 4810215, 5289749, 5637708, 5920119, 6142101, 6271013, 6313137, 6323399, 6331931, 6292205, 6115431, 5742784, 5189292, 4549653, 3971006, 3586011, 3436888, 3461331, 3560062, 3671200, 3771681, 3820252, 3727047, 3401897, 2841860, 2161635, 1511207, 944636, 380700, -289593, -1071197, -1870670, -2624300, -3369654, -4163127, -4961559, -5629469, -6050003, -6178244, -5977570, -5367779, -4311730, -2966344, -1694940]
36272a694940Q26298K41135j99402l67300l21825j87086n2084L2440L7719k3798
36262a708843r5565j25823j06854n5637J4896Q7069J35503J63527K11692K92942
36252a187093L51826L43429L31629M34583O58844Q49020Q36565O06077K91613
36243C516493L7627j18082k51641m57123p11220q30570o26943j40700L39569N51952
36233A309362N18631M66475N27192O02246N16240K14225k10314o02053q23808
36224B518196q22266o70239n08377m12580l52847k86235k06994o9864K25653O71529
36214H5976J048033J124482R43541P73266P69148Q15555P36729N29499L05784
36205G132013J13509o8840k21177k89809k94723l25843m11047m53515l29728k7110
$$ y = [-1694940, -868642, -627507, -826909, -1194209, -1516034, -1703120, -1755204, -1722764, -1685045, -1708843, -1804408, -1930231, -2037085, -2092722, -2077826, -1990757, -1855254, -1691727, -1480035, -1187093, -835267, -491838, -160209, 274374, 933218, 1782238, 2618803, 3224880, 3516493, 3554120, 3436038, 3184397, 2727274, 2016054, 1185484, 558541, 417841, 757410, 1309362, 1827993, 2294468, 2821660, 3423906, 3940146, 4154371, 3944057, 3342004, 2518196, 1695930, 1025691, 517314, 104734, -248113, -534348, -741342, -811206, -585553, 85976, 1134009, 2258491, 3202032, 3975298, 4744446, 5560001, 6296730, 6826229, 7132013, 7245522, 7176682, 6955505, 6665696, 6370973, 6045130, 5634083, 5180568, 4850840, 4823730]
36195D823730L12677M69626L00392j27931n69493q05104q00184o36377l61989
36186B605347j3575K55063K29262j07465m64300m96629j59625K39221L36892N1797
36176B475988l46705m90153k69407L8349L9724l55616q28298r83814p33553k99318
36166a752803Q4817L63766N69140O62439N51973K33773j47138l88778l71701j20052
36156c14564K37302N43252O72884N74662K95465m1669l18007m87909n60715n37016
36146F3685m05380j99254p291R3433Q9138J8000m6216l794J95725M50114N51733
36135G99893M08280J71473P7853J96549L97870N22965M94539L04319K5871j53437
36125C246175n7148K54819M87273M21913J58784l5521n1554j512p679o4629j22153
$$ y = [4823730, 5136407, 5606033, 5906425, 5778494, 5209001, 4403897, 3603713, 2967336, 2605347, 2591772, 2846835, 3076097, 2968632, 2504332, 2007703, 1848078, 2087299, 2424191, 2475988, 2129283, 1639130, 1369723, 1408072, 1447796, 1092180, 263882, -719932, -1453485, -1752803, -1667986, -1304220, -735080, -72641, 479332, 713105, 565967, 177189, -194512, -314564, -77262, 465990, 1138874, 1713536, 2009001, 1967332, 1649325, 1161416, 600701, 63685, -341695, -540949, -548240, -454807, -365669, -347669, -393885, -397679, -201954, 248160, 799893, 1208173, 1379646, 1457499, 1654048, 2051918, 2574883, 3069422, 3373741, 3399612, 3246175, 3189027, 3443846, 3931119, 4353032, 4511816, 4476295, 4424741, 4423229, 4415550, 4350921, 4228768]
36114D228768j77758k31487k43728k12316k22288l31435m53322m58628l80361
36105A517445m07598o42454r50739j106294j014474p31705l38157R9049M65768
36096c109159O34920N97212M65762L07375O3043k88060n69704n43020j86784K67717
36086b360698N97146P81761R08045R82967R34206P38389M51909J33743j71104
36077B996364l69312l39895p3422K59426M34964L56914Q9491k39691n09710o11276
36067A993853m75678j35523K86649O77704R89896J185380J186517R41380N14434
36058G164612N3902l27701n98839p51134p62820o36439m23507j90837j230O6146
36048C592153n1518k95306m63416l74383m8326L23981N79943O92665O88947N57819
$$ y = [4228768, 4051010, 3819523, 3575795, 3363479, 3141191, 2809756, 2356434, 1897806, 1517445, 1109847, 467393, -483346, -1589640, -2604114, -3335819, -3673976, -3574927, -3109159, -2474239, -1877027, -1411265, -1103890, -1040847, -1328907, -1898611, -2441631, -2628415, -2360698, -1763552, -981791, -73746, 909221, 1843427, 2581816, 3033725, 3167468, 2996364, 2627052, 2287157, 2213735, 2473161, 2908125, 3265039, 3354530, 3114839, 2605129, 1993853, 1518175, 1382652, 1669301, 2347005, 3336901, 4522281, 5708798, 6650178, 7164612, 7218514, 6890813, 6291974, 5540840, 4778020, 4141581, 3718074, 3527237, 3526007, 3592153, 3540635, 3245329, 2781913, 2407530, 2359204, 2683185, 3263128, 3955793, 4644740, 5202559]
36038E202559L06473N6910j2434J42662L40771L20477j5814n13476r09346j039153
36028C879629r12496o45873l80815k45764l07341n02487o56177o32648m75326
36019h79298l55620l71013m25971l34000k0620L93267O97373P58660N88919K89741
36009C41438k1072k24088k01225R5913N61040R66223J124254J012999P33707L88296
35999D777485L4385k75570m81661n56821n22600m16452k72789j35748m8600j6677
35989B084952j5054m4715j39357k93218m27619m74720m64246m71255m96121m69013
35979a210366l81657l27955l52154l17437l3587M74038R15303J012961P81249
35970E60395M69225K66009J48183J9120r7642p3156J49904M57109O52532O29165
$$ y = [5202559, 5509032, 5565942, 5553508, 5696170, 6036941, 6357418, 6341604, 5828128, 4918782, 3879629, 2967133, 2321260, 1940445, 1694681, 1387340, 884853, 228676, -403972, -879298, -1234918, -1605931, -2031902, -2365902, -2386522, -1993255, -1295882, -537222, 51697, 341438, 320366, 96278, -104947, -9034, 552006, 1518229, 2642483, 3655482, 4389189, 4777485, 4811870, 4536300, 4054639, 3497818, 2975218, 2558766, 2285977, 2150229, 2101629, 2084952, 2069898, 2025183, 1885826, 1592608, 1164989, 690269, 226023, -245232, -741353, -1210366, -1592023, -1919978, -2272132, -2589569, -2623156, -2149118, -1233815, -220854, 560395, 1029620, 1295629, 1443812, 1462932, 1365290, 1292134, 1442038, 1899147, 2551679, 3180844]
35960C180844M45767K47528J21343L7553o9751k02002l15165m18266n82932q26137
35950A618782j029499j021173p30715k48776K44982N97983P56408P51727O24009
35941A563728L81731O8926j66751j73569J0247J50915O2738k10696n08640p53293
35931D25336r41182j012336q76833n69796k58892o7932K8902J26691K85268N14780
35921b345994P75191R59745R55060P55773M68912J94302l1777j72043j71610n0574
35911A336985P4321J20456J25348J50176J69035J20319J0038j02714j73810j71448
35901A658706p1878O5405Q3334j05878l73130m96820m20609k88603k31478k26772
35891d07723j93161j23797p6391r6228j93059l44218m84674n41876n19061n03547
$$ y = [3180844, 3626611, 3874139, 3995482, 4033035, 3963284, 3761282, 3446117, 3027851, 2444919, 1618782, 589283, -431890, -1162605, -1411381, -1166399, -568416, 187992, 939719, 1563728, 1945459, 2014385, 1847634, 1674065, 1684312, 1835227, 1897965, 1687269, 1178629, 425336, -515846, -1528182, -2405015, -2974811, -3233703, -3301635, -3272733, -3146042, -2860774, -2345994, -1570803, -611058, 344002, 1099775, 1568687, 1762989, 1731212, 1559169, 1387559, 1336985, 1411306, 1531762, 1657110, 1807286, 1976321, 2096640, 2106678, 2003964, 1830154, 1658706, 1586828, 1652233, 1735567, 1629689, 1256559, 759739, 339130, 50527, -180951, -407723, -600884, -724681, -801072, -897300, -1090359, -1434577, -1919251, -2461127, -2980188, -3483735]
35881c483735n53028o05930n42811l13513K5618L72103O40268P91331Q47936Q75000
35871a946761R15303R45992R14236P96365N97239L22475N327k50587l26326k13376
35861A759887l6228Q2964J35680J57687J03383j11603m40894o81893o74637m64316
35851a69970k10184M923J89544L16477L10504J86394Q9879J33091K52943L02994
35841A406595K42994J58882J09555L3659j63699m73677p66650r02224q35908o14090
35831a804563k86081J32230N77270Q67271Q12523M35496J5793j54268m5382J15182
35821F65471J03102r1223k87601k98752r0380J94065L53934L00015J14556n3055
35811I10132j23905j10001m5980M0022J03075R7035L5253o320K0082N4924k5475
$$ y = [-3483735, -4036763, -4642693, -5185504, -5499017, -5473399, -5101296, -4461028, -3669697, -2821761, -1946761, -1031458, -85466, 828770, 1625135, 2222374, 2544849, 2550176, 2299589, 1973263, 1759887, 1723659, 1806623, 1942303, 2099990, 2203373, 2091770, 1650876, 968983, 294346, -169970, -380154, -375231, -185687, 130790, 441294, 627688, 717567, 850658, 1103601, 1406595, 1649589, 1808471, 1918026, 1951685, 1787986, 1314309, 547659, -354565, -1190473, -1804563, -2090644, -1958414, -1381144, -513873, 298650, 734146, 749939, 595671, 550289, 665471, 768573, 677350, 389749, 90997, 617, 194682, 548616, 848631, 963187, 910132, 786227, 676226, 630246, 670268, 773343, 870378, 905631, 899311, 919393, 974317, 948842]
35800I48842k67683n43220o19506l68837Q7756M73471N92201M44867J48487j55100
35790G41278k96583j32416K82445O58051P45063O13550N30662N92933O43935N72176
35780D951094N08248O24831Q61038R65639P48616J95629n89880j419780k021225
35771D824210k153543j792632j153543n15190o5592J06187j0053l00829n38705
35762a599690n50181l84564k49328k60548l16122k48739m9271J23662J29173k7239
35752c432847k33473l52727k56515J14829O47111J066623J145941Q82472M35835
35743A7249m9414m80922p45968p46091n23237k51118p0978k023r068n5338o7697
35732b984605M1008K61858M82645O31194P38282Q14460P72698N59141K79946J02186
$$ y = [948842, 681159, 137939, -481567, -850404, -762648, -289177, 303024, 747891, 896378, 741278, 444695, 312279, 594724, 1252775, 1997838, 2611388, 3142050, 3734983, 4378918, 4951094, 5459342, 6084173, 6945211, 7910850, 8659466, 8855095, 8265215, 6845435, 4824210, 2670667, 878035, -275508, -790698, -856290, -750103, -760156, -1060985, -1599690, -2149871, -2534435, -2783763, -3044311, -3360433, -3609172, -3658443, -3534781, -3405608, -3432847, -3666320, -4019047, -4275562, -4160733, -3513622, -2446999, -1301058, -418586, 17249, -32165, -513087, -1259055, -2005146, -2528383, -2779501, -2850479, -2852502, -2861570, -2916908, -2984605, -2943597, -2681739, -2199094, -1567900, -829618, -15158, 757540, 1316681, 1596627, 1698813]
35722A698813P7462J32145J62721N9814k76989q16764j325489j538965j402843
35713c230095j061062o54000k49392O2913J74996J01403l091j4886N7828J74381
35703d641005L57027O33659R68292J299182J571148J688504J530414J088423N20663
35694E016307k732m45235q21214j043233r78225o48899k77896j03048j93565m39673
35684F2587o56278o89282m94175j64393J32689K80105K84918K37670K07764J77146
35674f21249Q0005q3726j99024j51129J3663J21686J04414J17598L40645O94571
35664D17454Q60802N98834p186o17419r01413p56469l60417n0695r1233m89850
35654a397592j024193j427908j531632j278374p22188n6764M45517O21907N40340
$$ y = [1698813, 1776275, 1908420, 2071141, 2130955, 1853966, 1037202, -288287, -1827252, -3230095, -4291157, -4945157, -5194549, -5131636, -4956640, -4855237, -4858328, -4873214, -4815386, -4641005, -4283978, -3650319, -2682027, -1382845, 188303, 1876807, 3407221, 4495644, 5016307, 5013575, 4568340, 3747126, 2703893, 1725668, 1076769, 798873, 695825, 502260, 62587, -593691, -1282973, -1777148, -1941541, -1808852, -1528747, -1243829, -1006159, -798395, -621249, -541244, -624970, -823994, -975123, -961460, -839774, -735360, -617762, -277117, 417454, 1278256, 1877090, 1869904, 1252485, 351072, -405397, -765814, -816509, -907742, -1397592, -2421785, -3849693, -5381325, -6659699, -7381887, -7438651, -6993134, -6371227, -5830887]
35645e830887L88051K65309J47530L2383L4128K77907P24115J139964J261101
35636a560399R92918M79728p739k76914l54414m47688p40894j186376j494386
35627d596164j369851p90129l8172N48394Q34538Q90964Q19727O69909N06584
35618b524200M41394N25286O68246P40693P34240P55232Q56388R35754Q38736
35609C971769N40133J93708o260n114P6007P9278l1651j62195k10712j63704p1246
35598D210013K5570J16072J88412J97016O5899k47479o50919r06533q13182m35300
35588A749569q1208m408j79596m13447n90013p12693p69874p01787n08610k79006
35578b491073q1335Q6897K16157K43835J41518l3352k19976m10686n68272n76389
$$ y = [-5830887, -5442836, -5177527, -5029997, -4997614, -4963486, -4685579, -3961464, -2821500, -1560399, -567481, -87753, -95492, -372406, -726820, -1174508, -1915402, -3101778, -4596164, -5966015, -6756144, -6794316, -6245922, -5411384, -4520420, -3700693, -3030784, -2524200, -2082806, -1557520, -889274, -148581, 585659, 1340891, 2197279, 3133033, 3971769, 4511902, 4705610, 4699350, 4694236, 4770243, 4849521, 4817870, 4655675, 4444963, 4281259, 4210013, 4235583, 4351655, 4540067, 4737083, 4802982, 4555503, 3904584, 2998051, 2184869, 1749569, 1668361, 1663953, 1484357, 1070910, 480897, -231796, -1001670, -1703457, -2212067, -2491073, -2572408, -2485511, -2269354, -2025519, -1884001, -1917353, -2137329, -2548015, -3116287, -3692676]
35568c692676l77913j12857O398l8941l9432J76904N28595P86731Q35248P45837
35558a182106O17167M35288J37259k41833n60842p13366p16405o30592m42427
35549c297857q6169M25927R44405J266281J265720R67528N32710J52324j00111
35540B070758l06839n49285p34961o65085k81573K45109P04792J031925J248267
35531B763108J316119J151330P46289J96138l81001q88312j240613j383130j321959
35522I57969j098858p55886l58832j2825K03219K90195K76769J72109L5943K2391
35512b67806K33358N52650P39620O82234M59366J77745j13796l41680m01733l07653
35502A412305k23628k60421l29666k89075j52375n0432l5657l6773K049K7264
$$ y = [-3692676, -4070589, -4183446, -4177048, -4215989, -4255421, -4078517, -3549922, -2763191, -1927943, -1182106, -564939, -129651, 7608, -234225, -795067, -1508433, -2224838, -2855430, -3297857, -3384026, -2958099, -2013694, -747413, 518307, 1485835, 2018545, 2170869, 2070758, 1763919, 1214634, 479673, -185412, -466985, -221876, 482916, 1514841, 2763108, 4079227, 5230557, 5976846, 6172984, 5791983, 4903671, 3663058, 2279928, 957969, -140889, -896775, -1255607, -1268432, -1065213, -775018, -498249, -326140, -290197, -267806, -34448, 518202, 1257822, 1940056, 2399422, 2577167, 2463371, 2121691, 1719958, 1412305, 1188677, 928256, 598590, 309515, 157140, 106708, 71051, 34278, 36327, 63591]
35492F3591n6956k66225m88931n58451m07422j65431n0854j34435k65913k71504
35482b602531j51575j7100R9301K62976M90675O79736O94076M70587O1888l59677
35472c71644n65749m38287r5562K12976L60323M42428O15915Q92485J118118J114765
35462C285768Q27192L76917l747j35781l9797Q7447O7977q3883j91412j19129
35452D071552N9288J15645q2287l83397m74459k18488J80993M03249L47132J71016
35442D190244M1049m0104j34889k13243j72933K2205K83406M66515M75369L17110
35432E234729Q0454j51728l76034o35351r14571j112705j138284r96995p62731
35423g73216m99407k44472l5735R8080J70460K23422K75367L08671L16295L36820
$$ y = [63591, 6635, -259590, -748521, -1306972, -1714394, -1879825, -1930679, -2065114, -2331027, -2602531, -2754106, -2771206, -2671905, -2408929, -1918254, -1238518, -544442, -73855, -11967, -371644, -937393, -1375680, -1471242, -1258266, -897943, -455515, 160400, 1052885, 2171003, 3285768, 4112960, 4489877, 4486130, 4350349, 4310552, 4397999, 4465976, 4382093, 4190681, 4071552, 4130840, 4246485, 4164198, 3780801, 3306342, 3087854, 3268847, 3672096, 4019228, 4190244, 4231293, 4191189, 4056300, 3843057, 3670124, 3692329, 3975735, 4442250, 4917619, 5234729, 5315183, 5163455, 4787421, 4152070, 3237499, 2124794, 986510, -10485, -773216, -1272623, -1517095, -1552830, -1454750, -1284290, -1060868, -785501, -476830, -160535, 176285]
35413A76285M20947N62350O73734O43134M19097M2092l96169q02770j093624j194077
35403e49001j072187p71671l87340n130L19543N34099N74045L99448M9899l42067
35393a250362o13328o77316n71101l68065n6193M26584J013155J452682J522172
35384H78228J255458Q83409N78132L44230J34431n1969k11804l72104n24556n96955
35374B316500n46733m34485l58334l53595l88985m15717l87180k81816j52804
35365a003149j16400k45643m98417p71711r83743j076959r99325p39849l56451
35356f791647O6538M61229P63401R16173R18305Q09451N83285K12269j82110l06405
35346b549511J2922N67294R44277R62000Q00394P02419O88711O12607L76020J9400
$$ y = [176285, 597232, 1159582, 1833316, 2476450, 2895547, 2937639, 2541470, 1738700, 645076, -549001, -1621188, -2392859, -2780199, -2785329, -2465786, -1931687, -1357642, -958194, -908295, -1250362, -1863690, -2541006, -3112107, -3480172, -3536365, -3109781, -2096626, -643944, 878228, 2133686, 3017095, 3595227, 3939457, 4073888, 4021919, 3810115, 3438011, 2913455, 2316500, 1769767, 1335282, 976948, 623353, 234368, -181349, -568529, -850345, -1003149, -1119549, -1365192, -1863609, -2635320, -3619063, -4696022, -5695347, -6435196, -6791647, -6725109, -6263880, -5500479, -4584306, -3666001, -2856550, -2273265, -2060996, -2243106, -2549511, -2536589, -1969295, -1025018, -63018, 737376, 1439795, 2128506, 2741113, 3117133, 3136533]
35336C136533l15687m45428k46392K07677O46747Q14772O68505L42844j8330l28553
35326D462688n10450m97310l09792o6161J20781K30242L00474L37686K87554J01435
35316D457147j74773l90357l97334j93065N1938J31583k2912l04343n42267o36770
35306A978847n98356m89183l34148q1337L41802R15024J474236J801902J782873
35297F791660J467496R92864M73429k4374m43204p24173q46115q51390q16776
35288F019417q00198q07090p87493o70040m36269j77615l8666o2806j18639l2372
35278B088229K13026M61622N65482N22559M25564L47251L15576L36490L76288
35269E652087L61828K62618J39941M8300p2604l10101n95844p28423o17192m08448
$$ y = [3136533, 2820846, 2375418, 2129026, 2336703, 2983450, 3798222, 4466727, 4809571, 4791241, 4462688, 3952238, 3454928, 3145136, 3078975, 3199756, 3429998, 3730472, 4068158, 4355712, 4457147, 4282374, 3892017, 3494683, 3301618, 3353556, 3485139, 3462227, 3157884, 2615617, 1978847, 1380491, 891308, 557160, 475823, 817625, 1732649, 3206885, 5008787, 6791660, 8259156, 9252020, 9725449, 9701075, 9257871, 8533698, 7687583, 6836193, 6019417, 5219219, 4412129, 3624636, 2954596, 2518327, 2340712, 2302046, 2239240, 2120601, 2088229, 2301255, 2762877, 3328359, 3850918, 4276482, 4623733, 4939309, 5275799, 5652087, 6013915, 6276533, 6416474, 6464774, 6392170, 6082069, 5486225, 4757802, 4140610, 3732162]
35259C732162l04071l23320l22168k04434k6117R9103J18906N0750p1280k26815
35249B522716m10971o21112q25561r48256r19973p57975n64638m26384l35888
35240c288042k32661r1874O1218K02800L24053L94457L70588K67928J75252J56204
35230a660077J76299J78950J92349K79324M02465M46290L90812L49327L74221
35221A129960L30333O7994l41408o63243p65910p10550n79765l50692N504L90104
35211a487673O27295O26150M54034K66584J80567J92019K08500J71263J19811
35202A358550J06217J01118O5282O7088K00035L88764M22352K18968p6295l09639
35192B542440m87321o38828o66239m85427k16014n6161k1077K9035J38694K15906
$$ y = [3732162, 3428091, 3104771, 2782603, 2578169, 2552052, 2651155, 2770061, 2820811, 2749531, 2522716, 2111745, 1490633, 665072, -283184, -1203157, -1961132, -2525770, -2952154, -3288042, -3520703, -3612577, -3551359, -3348559, -3024506, -2630049, -2259461, -1991533, -1816281, -1660077, -1483778, -1304828, -1112479, -833155, -430690, 15600, 406412, 755739, 1129960, 1460293, 1528287, 1186879, 523636, -242274, -952824, -1532589, -1883281, -1877777, -1487673, -860378, -234228, 219806, 486390, 666957, 858976, 1067476, 1238739, 1358550, 1464767, 1565885, 1631167, 1698255, 1898290, 2287054, 2709406, 2928374, 2852079, 2542440, 2055119, 1416291, 750052, 264625, 48611, -7550, -28627, 408, 139102, 355008]
35182C55008K41976L40127N82621Q72642J079561J165771J107182Q05267J87710
35173F737865o53402j488529k070189k206273j832047j110298l95131J2986P2097
35164b932921p1702k84669m98384o39865o47155n56020m67637m10762l15277j42147
35154f966539L7683J35109J62469K16672L64715N74097P47395Q15998Q07717Q14542
35144b290142Q76456R15587Q20385N79389K83447Q740k26838l74541l17280j3229
35134B61974L51465M57377J52457l68199p14923o32303j81257L55756P00809P36408
35124A119564N27252K51338Q3920Q1891J58545J94785J77092J93414K90224L84597
35114C462622L52596J72637o1031k48886l63027m16230m02023k90907p3193K00243
$$ y = [355008, 596984, 937111, 1519732, 2392374, 3471935, 4637706, 5744888, 6550155, 6737865, 6084463, 4595934, 2525745, 319472, -1512575, -2622873, -3018004, -3005018, -2932921, -3004623, -3289292, -3787676, -4427541, -5074696, -5630716, -6098353, -6509115, -6824392, -6966539, -6928856, -6793747, -6631278, -6414606, -6049891, -5475794, -4728399, -3912401, -3104684, -2290142, -1413686, -498099, 322286, 901675, 1185122, 1193862, 967024, 592483, 275203, 261974, 613439, 1070816, 1223273, 855074, 140151, -492152, -673409, -317653, 383156, 1119564, 1646816, 1898154, 1982074, 2063965, 2222510, 2417295, 2594387, 2787801, 3078025, 3462622, 3815218, 3987855, 3926824, 3677938, 3314911, 2898681, 2496658, 2205751, 2132558, 2332801]
35104B332801M08337M07131J42337k51553n02094m18025p8413K38378L45474L32833
35094B957206M14670O23961P51024O06683K51283j04358l40434m54874m05717
35085D299444j03572L95471Q35265R95211Q91193O54951L15921j51696o19708
35076G512480q30609o82995l75117j96162k46945m22621o00921p60759r33605
35067B462746j110090j220331j192976j030148q22900o78051o25693o05344n23715
35058e346502l00801J01139O10819J005464J037919O83385K16903k9806J9376
35049b002104J66001K14443J95068K80849N31184P85067Q27179O23461L42470
35040A963618J41008p278k14958m59170n65654m42494k37118j78768l01891m07932
$$ y = [2332801, 2741138, 3148269, 3290606, 3039053, 2536959, 2118934, 2040521, 2278899, 2624373, 2957206, 3371876, 3995837, 4746861, 5353544, 5604827, 5500469, 5160035, 4705161, 4299444, 4195872, 4591343, 5426608, 6421819, 7313012, 7967963, 8283884, 8132188, 7512480, 6681871, 5998876, 5623759, 5427597, 5180652, 4758031, 4157110, 3396351, 2462746, 1352656, 132325, -1060651, -2090799, -2913699, -3591750, -4217443, -4822787, -5346502, -5647303, -5546164, -4935345, -3929881, -2891962, -2208577, -1991674, -2021480, -2002104, -1836103, -1621660, -1426592, -1145743, -614559, 170508, 997687, 1621148, 1963618, 2104626, 2097348, 1882390, 1423220, 857566, 415072, 177954, -814, -302705, -710637]
35030g10637l05173k7670K04277K09451J3666j91045k39091j36370r160O6289
35020a125463J26876K04351K22212Q8423j38455k64022j57022J19157L84569M98347
35010d1027M21144J89303j13393l76042n01193m45792k36586K4980J77902R0359
35000h10345k06527m97734n61597l78779j24723M9506J73902L66389O32278Q26496
34990e31134Q16454O21364L57000Q3815k31759o05199r33219j040084q22970l48823
34980b634555J80004N55773O87926O23228M54445K23082o7478l55495m93340l59938
34970a186348O208M07780O21465N37575K12523j80590m72379o04356o16647n32909
34960a807678l14786K5423L31424M28247L32117K23242J79511N4036k92912p17801
$$ y = [-710637, -1015810, -1043480, -839203, -629752, -616086, -807131, -1046222, -1182592, -1191752, -1125463, -998587, -794236, -572024, -483601, -622056, -886078, -1043100, -923943, -539374, -41027, 380117, 569420, 456027, 79985, -421208, -867000, -1103586, -1078606, -900704, -810345, -1016872, -1514606, -2076203, -2454982, -2579705, -2530199, -2356297, -1989908, -1357630, -531134, 285320, 906684, 1263684, 1347499, 1115740, 510541, -422678, -1462762, -2285732, -2634555, -2454551, -1898778, -1210852, -587624, -133179, 89903, 22425, -333070, -826410, -1186348, -1180140, -772360, -150895, 386680, 599203, 418613, -53766, -658122, -1274769, -1807678, -2122464, -2097041, -1765617, -1337370, -1005253, -782011, -602500, -548464, -841376, -1559177]
34950a559177q75987n75986L6815O50685J050164J190914J122650R30657P19313
34941B690048N67290M76874L92797K66666P8640j83790n14260q42012j040920
34932A891333j020256q00130m80375j41260K08752N83154R25313J087663R39817
34923C194011N25509R3171q3621N4155L04444M06247K66605j6196k97772m95102
34913C951451n70387m93909k74682J305K19015L36037M12309N17109O16548N88025
34903E302821L67754N9194j52047j95906j85401k69341m65400o70043p76269p22030
34893B293332m81153j16332J74934K00943J1458j11570K5160K93676M21490L32617
34883C044555J90404J30682R7243j9206j98628l37779m15807n09863o44651p05408
$$ y = [-1559177, -2435164, -3011150, -2974335, -2323650, -1273486, -82572, 1040078, 1970735, 2690048, 3257338, 3734212, 4127009, 4393675, 4472315, 4288525, 3774265, 2932253, 1891333, 871077, 70947, -409428, -550688, -341936, 241218, 1166531, 2254194, 3194011, 3719520, 3812691, 3729070, 3783225, 4087669, 4493916, 4760521, 4744325, 4446553, 3951451, 3381064, 2887155, 2612473, 2613778, 2832793, 3168830, 3581139, 4098248, 4714796, 5302821, 5670575, 5729769, 5577722, 5381816, 5196415, 4927074, 4461674, 3791631, 3015362, 2293332, 1812179, 1695847, 1870781, 2071724, 2083182, 1971612, 1996772, 2290448, 2711938, 3044555, 3234959, 3365641, 3462884, 3443678, 3245050, 2907271, 2491464, 1981601, 1336950, 631542]
34873F31542n47986j77340K18263M23251L77418J97993L7247m9012q7450r2605
34863I31321m2267N4545J12347K5184k25792n16845o41646m66369o0021L43371
34853d86172N39496M99717L17985P6498j70995l36072l41199k51300k55944m56730
34843h64716p32271q71223p93247n86153l71390j97334l4513J86296N07034Q51476
34833b906041J026721Q93514N33677J80829j4907q3239r8868n4030Q3207K62395
34823a76742L86504M29149M54041N27886O57630Q00686Q94552Q86213P70302N88023
34813F218244L57772L8069l82004p79130r70597r11127p41130o07012n03199l42366
34803A377520j23347L6792L280k93052q14817j374909j677352j526899j027713
$$ y = [631542, 83556, -93784, 124479, 547730, 925148, 1123141, 1160388, 1111376, 1023926, 931321, 889054, 943599, 1055946, 1081130, 855338, 338493, -303153, -769522, -829543, -486172, 53324, 553041, 871026, 947524, 776529, 440457, 99258, -152042, -407986, -864716, -1596987, -2468210, -3261457, -3847610, -4219000, -4416334, -4450847, -4264551, -3757517, -2906041, -1879320, -985806, -452129, -271300, -286207, -369446, -468314, -522344, -439137, -176742, 209762, 638911, 1092952, 1620838, 2278468, 3079154, 3973706, 4859919, 5630221, 6218244, 6576016, 6614085, 6232081, 5452951, 4482354, 3571227, 2830097, 2223085, 1719886, 1377520, 1254173, 1290965, 1294245, 1001193, 186376, -1188533, -2865885, -4392784, -5420497]
34794e420497n00145j83857q6928j11599j97164k83057k49651j4763L49964O83636
34784f014061Q89092R56597Q81709O58211L47957P6733n6766l0506J23851L44022
34774a823161N63520P73053J021947J287693J393459J179642P55702M51294M68905
$$ y = [-5420497, -5920642, -6104499, -6191427, -6303026, -6500190, -6783247, -7032898, -7047661, -6697697, -6014061, -5124969, -4168372, -3286663, -2628452, -2280495, -2203762, -2260528, -2291034, -2167183, -1823161, -1259641, -486588, 535359, 1823052, 3216511, 4396153, 5151855, 5603149, 6072054]
$$ [...]
##END NTUPLES=NMR SPECTRUM
##END=
