##TITLE=31Pdec_IPACAT-34C
 CDCl3
  24 sc
 31.10.2023
##JCAMPDX= 6.0         $$ Bruker NMR JCAMP-DX V2.0
##DATA TYPE= NMR SPECTRUM
##DATA CLASS= NTUPLES
##ORIGIN= UXNMR, Bruker Analytische Messtechnik GmbH
##OWNER= root
$$ XWIN-NMR		Version 3.5
$$ Tue Oct 31 15:44:35 2023 Russian Standard Time (UT+4h)  she@DPX200
##.OBSERVE FREQUENCY= 81.013821
##.OBSERVE NUCLEUS= ^31P
##.ACQUISITION MODE= SIMULTANEOUS
##.ACQUISITION SCHEME= undefined
##.AVERAGES= 64
##.DIGITISER RES= 16
##SPECTROMETER/DATA SYSTEM= spect
##.PULSE SEQUENCE= zgpg30
##.SOLVENT NAME= CDCl3
##.SHIFT REFERENCE= (INTERNAL, CDCl3, 0, 248.564)
##AUDIT TRAIL= $$ (NUMBER, WHEN, WHO, WHERE, WHAT)
$$ ##TITLE= Audit trail, XWIN-NMR		Version 3.5
$$ ##JCAMPDX= 5.01
$$ ##ORIGIN= Bruker BioSpin GmbH
$$ ##OWNER= she
$$ F:/spectra/data/she/nmr/P31/1/pdata/1/auditp.txt
$$ ##AUDIT TRAIL=  $$ (NUMBER, WHEN, WHO, WHERE, WHAT)
(   1,<2023-10-31 15:43:24.75 +0400>,<she>,<DPX200>,
      <continue with go, POWCHK disabled, PULCHK disabled
       configuration hash MD5:
       00 E9 B6 7A A2 85 ED C7 34 08 36 98 17 FE 4E 26
       data hash MD5: 32K
       FB F7 48 02 0A 5C 8D CA 00 96 29 14 27 7D E5 3D>)
(   2,<2023-10-31 15:43:27.40 +0400>,<she>,<DPX200>,
      <Start of raw data processing
       efp BC_mod = 2 LB = 5 FT_mod = 6 PKNL = 1 PHC0 = -10676.28 PHC1 = 138.6902 SI = 64K 
       data hash MD5: 64K
       7F 85 FD 0A 50 45 0D 34 4B A5 E6 74 70 BD 73 0B>)
(   3,<2023-10-31 15:43:47.62 +0400>,<she>,<DPX200>,
      <pk PHC0 = -14.2118 PHC1 = 26.2 
       data hash MD5: 64K
       23 DB C1 D9 72 1F A1 38 BD DB AE 1F 06 0B 55 61>)
(   4,<2023-10-31 15:44:06.82 +0400>,<she>,<DPX200>,
      <pk PHC0 = -6.800001 PHC1 = 0 
       data hash MD5: 64K
       22 B2 00 49 BA 61 11 A7 04 A9 1E E2 12 28 EE B4>)
$$ ##END=
$$ 
$$ hash MD5
$$ A5 93 95 FA 48 95 88 82 0F D3 CF 63 2B EA DA 5C
##$RELAX= 
##$RELAX= 
##$RELAX= 
##$RELAX= 
##$RELAX= 
##$RELAX= 
##$RELAX= 
##$RELAX= 
##$RELAX= 
$$ Bruker specific parameters
$$ --------------------------
##$DU= <F:/spectra>
##$EXPNO= 1
##$NAME= <P31>
##$PROCNO= 1
##$TYPE= <nmr>
##$USER= <she>
##$AMP= (0..31)
100 100 100 100 100 100 100 100 100 100 100 100 100 100 100 100 100 100 
100 100 100 100 100 100 100 100 100 100 100 100 100 100 
##$AQSEQ= 0
##$AQ_mod= 1
##$AUNM= <au_zg>
##$AUTOPOS= <>
##$BF1= 81.014009
##$BF2= 200.13
##$BF3= 200.13
##$BF4= 200.13
##$BF5= 200.13
##$BF6= 200.13
##$BF7= 200.13
##$BF8= 200.13
##$BYTORDA= 1
##$CFDGTYP= 0
##$CFRGTYP= 5
##$CHEMSTR= <none>
##$CNST= (0..31)
1 1 145 1 1 1 1 1 1 1 1 1 1 1 1 1 1 1 1 1 1 1 1 1 1 1 1 1 1 1 1 1 
##$CPDPRG= <waltz16>
##$CPDPRG1= <>
##$CPDPRG2= <waltz16>
##$CPDPRG3= <>
##$CPDPRG4= <mlev>
##$CPDPRG5= <mlev>
##$CPDPRG6= <mlev>
##$CPDPRG7= <mlev>
##$CPDPRG8= <mlev>
##$CPDPRGB= <>
##$CPDPRGT= <>
##$D= (0..31)
0 1 0 0 0 0 0 0 0 0 0 0.03 2e-05 3e-06 0 0 0 0 0 0 0 0 0 0 0 0 0 0 0 0 
0 0 
##$DATE= 1698752505
##$DBL= (0..7)
120 120 120 11 120 120 24 19 
##$DBP= (0..7)
150 150 150 150 150 150 150 150 
##$DBP07= 0
##$DBPNAM0= <>
$$ [...]
##$SUBNAM2= <"">
##$SUBNAM3= <"">
##$SUBNAM4= <"">
##$SUBNAM5= <"">
##$SUBNAM6= <"">
##$SUBNAM7= <"">
##$SUBNAM8= <"">
##$SUBNAM9= <"">
##$SW= 501.771253377433
##$SWIBOX= (0..15)
0 1 3 0 0 0 0 0 0 0 0 0 0 0 0 0 
##$SW_h= 40650.406504065
##$TD= 32768
##$TD0= 1
##$TE= 0
##$TE2= 300
##$TE3= 300
##$TEG= 300
##$TL= (0..7)
0 120 53 12 22 120 120 120 
##$TP= (0..7)
150 150 150 150 150 150 150 150 
##$TP07= 0
##$TPNAME0= <>
##$TPNAME1= <>
##$TPNAME2= <>
##$TPNAME3= <>
##$TPNAME4= <>
##$TPNAME5= <>
##$TPNAME6= <>
##$TPNAME7= <>
##$TPOAL= (0..7)
0.5 0.5 0.5 0.5 0.5 0.5 0.5 0.5 
##$TPOFFS= (0..7)
0 0 0 0 0 0 0 0 
##$TUNHIN= 0
##$TUNHOUT= 0
##$TUNXOUT= 0
##$USERA1= <user>
##$USERA2= <user>
##$USERA3= <user>
##$USERA4= <user>
##$USERA5= <user>
##$V9= 5
##$VALIST= <valist>
##$VCLIST= <CCCCCCCCCCCCCCC>
##$VD= 0
##$VDLIST= <DDDDDDDDDDDDDDD>
##$VPLIST= <PPPPPPPPPPPPPPP>
##$VTLIST= <TTTTTTTTTTTTTTT>
##$WBST= 1024
##$WBSW= 4
##$XGAIN= (0..3)
0 0 0 0 
##$XL= 0
##$YL= 0
##$YMAX_a= 5088
##$YMIN_a= -1660
##$ZGOPTNS= <>
##$ZL1= 120
##$ZL2= 120
##$ZL3= 120
##$ZL4= 120
##$ABSF1= 0
##$ABSF2= 0
##$ABSG= 0
##$ABSL= 0
##$ALPHA= 0
##$AQORDER= 0
##$ASSFAC= 0
##$ASSFACI= 0
##$ASSFACX= 0
##$ASSWID= 0
##$AUNMP= <proc_1d>
##$AZFE= 0.1
##$AZFW= 0.5
##$BCFW= 0
##$BC_mod= 2
##$BYTORDP= 0
##$COROFFS= 0
##$CY= -3
##$DATMOD= 1
##$DC= 0
##$DFILT= <>
##$DTYPP= 0
##$F1P= 0
##$F2P= 0
##$FCOR= 1
##$FTSIZE= 65536
##$FT_mod= 6
##$GAMMA= 0
##$GB= 0
##$INTBC= 1
##$INTSCL= 6.047779e-11
##$ISEN= 30
##$LB= 5
##$LEV0= 0
##$LPBIN= 0
##$MAXI= 10000
##$MC2= 0
##$MEAN= 0
##$ME_mod= 0
##$MI= 50
##$NCOEF= 0
##$NC_proc= -9
##$NLEV= 6
##$NOISF1= 182.463
##$NOISF2= 159.3651
##$NSP= 0
##$NTH_PI= 0
##$NZP= 0
##$OFFSET= 248.5645
##$PC= 4
##$PHC0= -10697.29
##$PHC1= 164.8902
##$PH_mod= 1
##$PKNL= yes
##$PPARMOD= 0
##$PSCAL= 0
##$PSIGN= 0
##$REVERSE= no
##$SF= 81.0140089999694
##$SI= 65536
##$SIGF1= 159.3651
##$SIGF2= -187.1042
##$SINO= 113.3802
##$SIOLD= 16384
##$SREGLST= <1H.CDCl3>
##$SSB= 0
##$STSI= 65536
##$STSR= 0
##$SW_p= 40650.406504065
##$SYMM= 0
##$S_DEV= 0
##$TDeff= 32768
##$TDoff= 0
##$TI= <>
##$TILT= no
##$TM1= 0
##$TM2= 0
##$TOPLEV= 0
##$USERP1= <user>
##$USERP2= <user>
##$USERP3= <user>
##$USERP4= <user>
##$USERP5= <user>
##$WDW= 1
##$XDIM= 65536
##$YMAX_p= 356776045
##$YMIN_p= -24200317
$$ End of Bruker specific parameters
$$ ---------------------------------
##NTUPLES= NMR SPECTRUM
##VAR_NAME=  FREQUENCY,     SPECTRUM/REAL,   SPECTRUM/IMAG
##SYMBOL=    X,             R,               I
##VAR_TYPE=  INDEPENDENT,   DEPENDENT,       DEPENDENT
##VAR_FORM=  AFFN,          ASDF,            ASDF
##VAR_DIM=   65536,         65536,           65536
##UNITS=     HZ,            ARBITRARY UNITS, ARBITRARY UNITS
##FACTOR=    0.620285442955139, 1,           1
##FIRST=     20137.2065510682, 0,            0
##LAST=      -20513.1999529968, 0,           0
##MIN=       -20513.1999529968, -24200317,   0
##MAX=       20137.2065510682, 356776045,    0
$$ Real data points
##PAGE= N=1
##DATA TABLE= (X++(R..R)), XYDATA
$$ [...]
42177 3239279 2964574 2410874 1474071 240678 -806149 -1211196 -1052875 -793077 -659493
42168 -659493 -413278 212061 1034197 1509114 1200050 85425 -1478698 -2978622 -4010910
42159 -4010910 -4494733 -4634066 -4595306 -4242985 -3268072 -1545058 720830 3154664 5399115
42150 5399115 7175565 8351785 9052161 9601458 10227115 10807886 10970985 10452478 9357695
42141 9357695 8087299 7025351 6297255 5834011 5651663 5972112 6967319 8404803 9655946
42132 9655946 10095022 9457863 7872338 5710902 3463189 1566556 165735 -938775
42124 -938775 -1978395 -2851063 -3156788 -2597730 -1268897 432761 2083989 3404685 4279861
42115 4279861 4737965 4921167 5019711 5169848 5362050 5445603 5290597 4991969 4844832 5021212
42105 5021212 5305658 5270979 4727552 3896286 3124179 2551613 2098057 1619632 955823 -62050
42095 -62050 -1441973 -2850327 -3744923 -3778317 -3060377 -2048562 -1244834 -953401 -1161037
42086 -1161037 -1535565 -1587160 -952413 381013 2054308 3520874 4361595 4586481 4651416
42077 4651416 5050166 5832357 6624294 7163472 7636762 8327471 9048945 9189377 8358397
42068 8358397 6785391 4964766 3053802 801533 -1954456 -4872362 -7236690 -8442284
42060 -8442284 -8344785 -7256144 -5725449 -4303903 -3341834 -2831406 -2431297 -1771247 -809308
42051 -809308 162720 890773 1412538 1840983 2023503 1640009 643944 -597337 -1667795
42042 -1667795 -2424851 -2842980 -2721238 -1796078 -136211 1764239 3358816 4438125 5127973
42033 5127973 5589711 5772666 5427218 4358702 2731963 1134693 233963 251003 745566
42024 745566 962755 458159 -543930 -1340789 -1283053 -193193 1599619 3493525 4843511
42015 4843511 5112931 4072266 2028388 -177329 -1547202 -1436176 183723 2812768
42007 2812768 5723210 8303518 10285311 11686711 12529021 12681180 12042631 10770988 9172401
41998 9172401 7407771 5479896 3510797 1828874 687389 45959 -233514 -62795 846572
41989 846572 2629404 5018516 7452895 9401153 10627966 11234073 11469000 11502348 11390313
41980 11390313 11234767 11261729 11659815 12377892 13138196 13612237 13542997 12783806 11363106
41971 11363106 9538381 7697767 6147490 4993840 4200406 3690813 3382560 3175001 2931564
41962 2931564 2449547 1458474 -265085 -2691144 -5418120 -7792608 -9222549 -9487192 -8842426
41953 -8842426 -7837191 -6951863 -6328550 -5800851 -5147077 -4290196 -3294630 -2282310 -1435812
41944 -1435812 -1050115 -1480199 -2982396 -5599314 -9131322 -13075214 -16544458 -18451344
41936 -18451344 -18084875 -15658350 -12211592 -8892098 -6355106 -4802572 -4310789 -4835988
41928 -4835988 -5971297 -7038555 -7614984 -7870856 -8252671 -8867787 -9273502 -8871719 -7475833
41919 -7475833 -5513244 -3700581 -2491128 -1803390 -1278135 -752446 -406537 -465830 -882464
41910 -882464 -1368111 -1663641 -1717473 -1661871 -1685710 -1904196 -2301484 -2790247 -3294260 -3719901
41900 -3719901 -3909786 -3786739 -3565506 -3638771 -4139769 -4741589 -5018860 -4926184 -4808022 -5019901
41890 -5019901 -5651322 -6519298 -7281365 -7640563 -7635594 -7701794 -8250376 -9157495 -9815797 -9722094
41880 -9722094 -8897348 -7727705 -6550631 -5451242 -4337039 -3126272 -1902179 -872465
41872 -872465 -90374 741454 2004497 3637639 5010383 5414497 4633644 3043855 1310012
41863 1310012 21262 -598940 -842565 -1334754 -2520632 -4244939 -5834195 -6587728 -6248542
41854 -6248542 -5139843 -3901709 -2993643 -2382899 -1784251 -1209034 -1101461 -1815696 -3092095
41845 -3092095 -4210026 -4586726 -4103658 -2972241 -1524324 -127406 947912 1726926 2520790
41836 2520790 3626569 5044648 6478000 7531053 7906388 7528912 6588793 5475956 4638378
41827 4638378 4438991 5011156 6114723 7153573 7503924 6961052 5880302 4865499 4319735
41818 4319735 4245151 4359638 4332725 3943736 3106702 1843811 318234 -1110791 -1996482
41809 -1996482 -2104264 -1592061 -794354 166945 1449480 3155666 5050426 6672456 7636712
41800 7636712 7762655 7016877 5502783 3538814 1631863 253319 -413812 -529892 -421463
41791 -421463 -352722 -451590 -807725 -1553217 -2764142 -4268405 -5597784 -6186070 -5683417
41782 -5683417 -4183095 -2222181 -519103 422622 550617 146176 -477392 -1123925 -1655634
41773 -1655634 -1965485 -2074528 -2156689 -2384132 -2786275 -3275167 -3696779 -3788525 -3227267 -1915013
41763 -1915013 -218306 1218385 1951199 1987086 1608347 1094970 641742 377031 311244
41754 311244 299059 158613 -150376 -497343 -718484 -763743 -730401 -756995 -824738 -632493
41744 -632493 254097 2037272 4473854 7052349 9328041 11047682 12077843 12406469 12225314
41735 12225314 11856668 11547609 11437845 11720108 12613436 14046294 15534347 16589885 17207355
41726 17207355 17776739 18558795 19427953 20104803 20401364 20165881 19211439 17482331 15199404
41717 15199404 12705755 10233800 7924090 5967520 4551940 3684387 3195765 2907915
41709 2907915 2686270 2375182 1858032 1202839 587423 33111 -622579 -1400162 -1992788
41700 -1992788 -2081564 -1757052 -1447487 -1446706 -1678632 -1945404 -2231952 -2664374 -3281859 -3992199
41690 -3992199 -4730312 -5552420 -6549795 -7720800 -8936505 -9996449 -10731557 -11116596 -11300979
41681 -11300979 -11476268 -11664449 -11635041 -11044173 -9678412 -7631015 -5316443 -3293765 -1962289
41672 -1962289 -1353636 -1234697 -1403687 -1797307 -2283391 -2486263 -1963811 -546489 1559109
41663 1559109 3930966 6098094 7661330 8497338 8910001 9419657 10299630 11390516 12390001
41654 12390001 13185482 13842924 14439563 15056422 15825416 16800869 17801553 18491269 18581802
41645 18581802 17875648 16230595 13711526 10794984 8222436 6525055 5731332 5542293
41637 5542293 5684328 6055251 6643828 7413935 8258978 9041273 9684947 10205711 10609400
41628 10609400 10819847 10804663 10714869 10732349 10775620 10543697 9913956 9114370 8385881 7639084
41618 7639084 6620740 5310218 3953502 2775880 1894685 1509699 1902443 3092780 4660075
41609 4660075 6113309 7408409 8930703 10913105 12960356 14220436 14031811 12439508
41601 12439508 10177435 8198614 7129899 7009215 7443603 8030970 8680398 9557819 10767287
41592 10767287 12156974 13449304 14463186 15112364 15234981 14576189 13020737 10812875
41584 10812875 8517502 6772267 6016938 6302064 7236906 8158199 8479338 7974290 6776488
41575 6776488 5164619 3405018 1777279 624010 211852 463126 894046 961315 521461
41566 521461 -127634 -687115 -1205422 -1870139 -2555025 -2772179 -2098153 -539196 1485679
41557 1485679 3337689 4334722 4021718 2504483 472224 -1240883 -2125342 -2067667 -1180981
41548 -1180981 235467 1666834 2581057 2780365 2518656 2267827 2403399 3042170 4028188
41539 4028188 5019569 5663735 5772881 5389143 4750106 4203116 4037264 4278053 4664078
41530 4664078 4886404 4805814 4389217 3565161 2331463 988769 86257 55033 940880
41521 940880 2462062 4194435 5683310 6530447 6511180 5644457 4184764 2564995 1212447
41512 1212447 217665 -814061 -2380154 -4461000 -6410582 -7553780 -7808495 -7676884 -7752153
41503 -7752153 -8291779 -9089838 -9590874 -9232480 -7895277 -6042635 -4308016 -2956760 -1859969
41494 -1859969 -955142 -540022 -1023703 -2484788 -4562849 -6737973 -8647645 -10163751 -11260105
41485 -11260105 -11881640 -11971899 -11607123 -11022266 -10410894 -9681703 -8485130 -6556301 -4043840
41476 -4043840 -1481061 558207 1752336 2021887 1353263 -243537 -2588835 -5237069
41468 -5237069 -7602535 -9184590 -9689091 -9036567 -7354356 -4943147 -2172852 608744
41460 608744 3078943 4976576 6276891 7297304 8473952 9985619 11664695 13235601
41452 13235601 14478947 15162723 15054305 14164169 12858945 11580008 10517058 9672462 9144248
41443 9144248 9158810 9836027 11054559 12527231 13879405 14697237 14714884 14050559 13152904
41434 13152904 12432562 11983226 11651386 11256011 10698657 9987622 9258550 8712461 8460210
41425 8460210 8479698 8772716 9461292 10612954 12035206 13390882 14509849 15447583 16217201
41416 16217201 16627777 16490159 15857004 14889135 13532795 11540669 8894328 6060517 3681618
41407 3681618 2053466 1013569 295014 -166835 -308644 -176259 26575 100355 9132
41398 9132 -104941 -55303 192286 439823 431948 130611 -250443 -495997 -567094 -487663 -199155
41387 -199155 340647 1008876 1634062 2227238 2941469 3810314 4685663 5458974 6187927 6942266
41377 6942266 7664846 8288984 8902305 9688335 10756102 12101897 13668530 15327394 16824116
41368 16824116 17853093 18229712 17983312 17336088 16655056 16347224 16610182 17180521 17397387
41359 17397387 16637951 14754105 12121360 9334837 6898806 5112255 4057292 3584562
41351 3584562 3380514 3188100 3004103 3023716 3416720 4242146 5555682 7419944 9686572
41342 9686572 11869396 13410146 14092386 14104310 13703626 12938496 11730411 10129843 8427522
41333 8427522 7073469 6523603 7062906 8628629 10748494 12696850 13812960 13812432 12928999
41324 12928999 11783106 11005716 10850665 11093947 11282709 11084939 10450309 9522749 8463362
41315 8463362 7373083 6372347 5710025 5716525 6595957 8258811 10322254 12188843 13160649
41306 13160649 12734404 11029801 8878149 7270667 6659019 6857457 7497765 8307501 8960795
41297 8960795 9027833 8300761 6997205 5461332 3813544 2076899 491527 -562343 -919461
41288 -919461 -718075 -184476 476275 1028157 1291079 1317454 1294919 1246858 1022740 621255
41278 621255 292859 204366 191741 11405 -295822 -484848 -498355 -610650 -1168180 -2275605
41268 -2275605 -3710584 -5032700 -5771435 -5631643 -4618759 -2995784 -1142965 533257
41260 533257 1637090 1875493 1206929 -98860 -1584286 -2824063 -3571218 -3753474 -3408729
41251 -3408729 -2692899 -1938616 -1583896 -1910010 -2829182 -3986686 -5074441 -6003662 -6816345
41242 -6816345 -7547187 -8195194 -8734681 -9124085 -9395781 -9753708 -10429410 -11332245 -11948523
41233 -11948523 -11742781 -10651347 -9109388 -7657409 -6631541 -6163280 -6268601 -6852442 -7721857
41224 -7721857 -8668982 -9517346 -10108152 -10349710 -10317669 -10213634 -10158539 -10069699 -9761504 -9090919
41214 -9090919 -7981791 -6437077 -4642132 -2980239 -1794081 -1108574 -656392 -170498 392655
41205 392655 849207 895867 298529 -813464 -1812302 -1961660 -1100228 191584 1256407
41196 1256407 2067617 3076028 4450762 5763154 6461764 6403633 5819203 5015472 4327946
41187 4327946 4173281 4822836 6108185 7556451 8838464 9903670 10651875 10706920 9694991
41178 9694991 7691952 5299632 3307686 2299188 2463120 3629506 5425435 7410199
41170 7410199 9107299 10043229 9943127 8940718 7473969 5890133 4223215 2404642
41162 2404642 571583 -951179 -1910777 -2263561 -2117364 -1666062 -1157132 -799342 -677312
41153 -677312 -800634 -1175064 -1713885 -2131034 -2097274 -1542662 -683752 276296 1331802 2492898
41143 2492898 3560975 4218056 4280673 3773045 2831258 1679960 672370 181910 376621
41134 376621 1158150 2337128 3780839 5357107 6840296 7969621 8559973 8493115 7678287
41125 7678287 6165937 4303086 2632288 1557290 1175364 1464624 2472894 4141639
41117 4141639 6006480 7322642 7627728 7113976 6376730 5860216 5594858 5356244 4934438
41108 4934438 4288360 3601332 3235810 3518373 4453221 5625990 6406241 6278842 5088716
41099 5088716 3113378 933925 -886760 -2133360 -2976897 -3669536 -4232519 -4483820 -4327743
41090 -4327743 -3919263 -3510250 -3194991 -2867634 -2405861 -1816994 -1169581 -445955 433064
41081 433064 1403153 2143800 2257262 1583178 313937 -1196546 -2696893 -4092772 -5274158
41072 -5274158 -5957173 -5774630 -4589917 -2739129 -910543 293918 723206 628131 292959
41063 292959 -236125 -1066434 -2179675 -3307394 -4095906 -4372307 -4244205 -3969315 -3754717
41054 -3754717 -3649266 -3534749 -3157008 -2227605 -632675 1401164 3416592 5070648 6354202
41045 6354202 7443773 8388160 9005622 9073856 8575481 7773511 7082828 6835762 7111818
41036 7111818 7790583 8775751 10097551 11718723 13279659 14146981 13769578 12013619 9249027
41027 9249027 6205771 3662312 2056135 1287048 957483 841170 1051588 1747916 2817234
41018 2817234 3954042 4980204 5957364 6974358 7896101 8345941 7919534 6450306 4144173
41009 4144173 1500103 -923220 -2747446 -3915305 -4698977 -5555872 -6861187 -8677498
41001 -8677498 -10732568 -12577403 -13762947 -13986321 -13241899 -11866456 -10321020 -8858471
40993 -8858471 -7449366 -6030105 -4707051 -3658582 -2917974 -2296691 -1433734 100888 2572841
40984 2572841 5782814 9045146 11591765 13010554 13304256 12706497 11602617 10491336
40976 10491336 9736793 9300168 8873306 8312008 7803068 7598189 7762179 8221568 8834944
40967 8834944 9269195 9005168 7753915 5870058 4134121 3022988 2287378 1310517 -203625
40958 -203625 -1973175 -3477333 -4407478 -4789961 -4835937 -4803130 -4931441 -5320970 -5788426 -5933716
40948 -5933716 -5455362 -4406632 -3130296 -1998800 -1240995 -902086 -829383 -719337 -313068
40939 -313068 406153 1253052 2053544 2726985 3165266 3159283 2522286 1254999 -409253 -2047158
40929 -2047158 -3151231 -3375366 -2825838 -2059502 -1655005 -1748469 -2046156 -2300663 -2695243
40920 -2695243 -3674462 -5376132 -7290950 -8589636 -8846052 -8390485 -7889567 -7634403 -7334929
40911 -7334929 -6539808 -5057735 -2938992 -285335 2711370 5621171 7872852 9060960
40903 9060960 9123596 8282765 6921008 5467117 4219354 3191365 2189159 1079389 -51829
40894 -51829 -987927 -1544596 -1655245 -1435291 -1226232 -1434040 -2140074 -2866149 -2866366 -1754140
40884 -1754140 149065 2068700 3324079 3641748 3089033 1900106 435456 -813658
40876 -813658 -1388665 -1153330 -396693 436280 1141284 1836555 2632749 3304508 3402205 2697527
40866 2697527 1419366 -896 -1324231 -2548973 -3647728 -4447978 -4806053 -4732689 -4249169
40857 -4249169 -3252939 -1669904 347833 2536752 4766843 6969475 8843525 9898016
40849 9898016 9912232 9182182 8164268 7002221 5573409 3907247 2335686 1199315 540522
40840 540522 127306 -305278 -855127 -1410097 -1772499 -1864999 -1802273 -1727481 -1664451 -1661524 -2022166
40829 -2022166 -3163012 -5131582 -7373074 -9081819 -9764539 -9489705 -8763147 -8246860 -8404722
40820 -8404722 -9174387 -9999983 -10365908 -10316431 -10307290 -10546299 -10682171 -10237549 -9179529 -7906090
40810 -7906090 -6791789 -5966331 -5506113 -5573788 -6209653 -7090329 -7653378 -7484240 -6559753
40801 -6559753 -5183494 -3767560 -2631350 -1887193 -1470930 -1307652 -1433901 -1921795 -2736746
40792 -2736746 -3773695 -5021219 -6560975 -8356119 -10138781 -11571423 -12438212 -12613482
40784 -12613482 -11956334 -10399853 -8137047 -5582485 -3099430 -834886 1150782 2686470
40776 2686470 3526119 3600301 3200325 2874272 3087205 3924400 5097048 6221845 7067230
40767 7067230 7539244 7533588 6921843 5690500 4019021 2199001 511269 -846115 -1806554
40758 -1806554 -2440724 -2838488 -2948935 -2615038 -1832208 -917549 -330819 -310159 -697632 -1086551
40748 -1086551 -1109121 -648240 117563 847847 1285645 1433317 1500391 1684907 2007706 2311789
40738 2311789 2347836 1856553 660680 -1233092 -3615489 -6184560 -8659501 -10759591 -12126146
40729 -12126146 -12400351 -11475880 -9659839 -7523015 -5576189 -4091696 -3152409 -2719462 -2595057
40720 -2595057 -2444989 -2028517 -1435406 -996390 -899169 -947681 -770568 -247196 345064 624878
40710 624878 494584 192218 -17714 -152888 -506690 -1366143 -2727478 -4225052 -5318376
40701 -5318376 -5639945 -5265243 -4627656 -4089173 -3611795 -2943032 -2102249 -1533000 -1719891
40692 -1719891 -2769381 -4413477 -6260040 -7909342 -8978620 -9257484 -8842572 -7960792 -6670605
40683 -6670605 -4904166 -2803330 -807340 681454 1587099 2058894 2246674 2296751 2441525
40674 2441525 2919342 3822661 5108698 6703682 8492537 10239579 11624956 12379460 12373854
40665 12373854 11649679 10420202 8951881 7330625 5380814 2905967 -21472 -3069111
40657 -3069111 -5851974 -8017211 -9233638 -9335825 -8519181 -7223029 -5753895 -4144829
40649 -4144829 -2412835 -754262 668287 2006945 3578910 5416953 7107102 8128557
40641 8128557 8281441 7746924 6823460 5716541 4573506 3595861 3012467 2956241 3431502
40632 3431502 4378352 5664425 7004558 8051567 8718332 9366675 10532555 12414877 14654873
40623 14654873 16562317 17493440 17123388 15576940 13354275 10985618 8661537 6241858
40615 6241858 3613592 920483 -1560138 -3592182 -4975633 -5565310 -5447515 -4974564 -4475043
40606 -4475043 -4034695 -3705479 -3767489 -4486796 -5619387 -6434132 -6348943 -5405540 -4064427
40597 -4064427 -2720632 -1548447 -666449 -235657 -379101 -1100524 -2278523 -3670601 -4939212
40588 -4939212 -5764234 -5986580 -5659039 -4975391 -4139854 -3255724 -2324866 -1380426 -575763
40579 -575763 -25512 454466 1296447 2757807 4621517 6412496 7847170 8981011 10008253
40570 10008253 11074423 12236116 13399778 14236219 14279246 13182169 10841951 7337275
40562 7337275 2945520 -1725653 -5842895 -8795122 -10510596 -11243567 -11145407 -10195576 -8486612
40553 -8486612 -6372183 -4292755 -2578888 -1428623 -891489 -767744 -651238 -239792 386533
40544 386533 851736 821375 218845 -811159 -2031485 -3203198 -4141623 -4727896 -4858020
40535 -4858020 -4426343 -3441345 -2151552 -965901 -206794 38727 -123472 -454438 -593734
40526 -593734 -208769 697488 1695985 2307740 2453573 2395696 2272986 1919566 1215916 394472
40516 394472 -198725 -511807 -715130 -775983 -390511 572961 1779015 2716451 3132896 3035510
40506 3035510 2439489 1405727 300195 -301170 -142290 405289 698488 408633 -340928
40497 -340928 -1288144 -2258544 -3070863 -3435482 -3114331 -2143129 -781071 780991 2603364
40488 2603364 4851747 7471386 10011763 11799294 12369491 11840241 10894910 10322256 10470056
40479 10470056 11105426 11791330 12335940 12818968 13258488 13429110 13063137 12085713 10535305
40470 10535305 8376756 5598898 2471766 -517568 -3068681 -5249957 -7178393 -8672685
40462 -8672685 -9403988 -9327006 -8786185 -8192558 -7717433 -7283982 -6698038 -5750071 -4340154
40453 -4340154 -2600210 -817813 816876 2297717 3580716 4412106 4534175 4007258 3158899
40444 3158899 2202541 1056834 -399011 -2012133 -3391199 -4178709 -4199133 -3420329 -1940333
40435 -1940333 -50164 1813306 3279343 4201379 4606300 4589865 4352271 4263454 4714250
40426 4714250 5809514 7247369 8543016 9348156 9557780 9207510 8367428 7128219 5625277
40417 5625277 4047118 2597983 1379041 256387 -1086680 -2865184 -4967741 -7081749
40409 -7081749 -9005984 -10730579 -12226050 -13315956 -13836730 -13820438 -13444328 -12912725 -12510412
40400 -12510412 -12665868 -13724223 -15575671 -17629987 -19275272 -20362547 -21220057 -22223777
40392 -22223777 -23366695 -24200317 -24169335 -23052955 -21146785 -19039275 -17210943 -15828722
40384 -15828722 -14840547 -14147033 -13654676 -13264502 -12897500 -12501211 -11977279 -11140004 -9807602
40375 -9807602 -7906281 -5440796 -2449470 864331 3972697 6195224 7178683 7174288 6785214
40366 6785214 6504172 6543142 6961927 7737086 8682833 9481500 9898997 9915399 9627955 9152631
40356 9152631 8690721 8546269 8893199 9537950 10044911 10128300 9872066 9613931 9721849 10431932
40346 10431932 11698746 13116516 14127888 14457430 14318838 14135617 14108273 14105653 13883924
40337 13883924 13287120 12286190 10997217 9726900 8897493 8805906 9409390 10337252 11128468
40328 11128468 11531230 11646082 11765392 12023102 12230756 12128400 11766769 11526905 11733246
40319 11733246 12338215 13035897 13611118 14111066 14723502 15560046 16545993 17466738 18105480
40310 18105480 18343178 18135764 17454764 16339292 14996757 13726486 12671328 11709612 10638076
40301 10638076 9376798 7950542 6433644 5103528 4571367 5486927 7971044 11404818
40293 11404818 14829828 17515178 19186438 19909043 19879821 19238477 17945525 15861533 13025605
40284 13025605 9837055 6899285 4682272 3322342 2645254 2324108 2127529 2135006 2629139
40275 2629139 3631166 4610202 4856052 4158602 2944453 1716018 575221 -583307 -1629355
40266 -1629355 -2221412 -2241273 -1974686 -1781434 -1710133 -1517953 -986269 -112665 996997 2332150
40256 2332150 3983868 5910272 7742138 8938506 9213303 8771190 8060188 7321854 6440114
40247 6440114 5171791 3401584 1172081 -1393409 -4097467 -6633812 -8609242 -9623141
40239 -9623141 -9391981 -7936747 -5726705 -3553087 -2107605 -1602897 -1788487 -2305382 -2984479
40230 -2984479 -3817601 -4725139 -5455628 -5774018 -5728232 -5640857 -5770053 -6009096 -5990112 -5482088
40220 -5482088 -4640238 -3884940 -3590932 -3842763 -4368827 -4715249 -4621455 -4264355 -4009429 -3883732
40210 -3883732 -3457529 -2338641 -619500 1298631 3133644 4728274 5768670 5881791
40202 5881791 5105070 3987275 3070358 2449135 1964074 1610388 1520918 1663045 1818896
40193 1818896 1864041 1858656 1832493 1670155 1301656 888978 735722 1080569 2012675 3453161
40183 3453161 5093830 6438782 7095110 7085448 6805247 6640858 6674146 6748836 6704025 6454604
40173 6454604 5920621 5039465 3906687 2821229 2097327 1819206 1794887 1730643 1458273
40164 1458273 1088873 1027982 1760762 3439288 5615032 7486662 8508809 8725413 8490801
40155 8490801 8013334 7334198 6665856 6454993 6932917 7708197 7997997 7304549 5791459
40146 5791459 4010721 2398821 1101563 134611 -509454 -925349 -1240852 -1333504 -724314
40137 -724314 995506 3581629 6157056 7932000 8823869 9300178 9749194 10171001 10407276
40128 10407276 10435649 10366126 10305206 10338049 10552580 10945465 11313238 11336735 10826167 9887411
40118 9887411 8864876 8125950 7841063 7887645 7931664 7628118 6806457 5548237 4142891
40109 4142891 2921976 2013633 1199442 79655 -1529791 -3347548 -4785202 -5342145 -4869374
40100 -4869374 -3563802 -1822504 -87495 1295663 2182670 2643018 2872204 3054271 3236924
40091 3236924 3298799 3071371 2529180 1835817 1190592 701456 455836 607625 1237584 2140967
40081 2140967 2903561 3229827 3080886 2454235 1198584 -787276 -3227058 -5508567 -7116170
40072 -7116170 -7984249 -8432978 -8826977 -9309961 -9797869 -10154962 -10348379 -10432553 -10423812 -10278386
40062 -10278386 -10044056 -9963947 -10314985 -11119145 -12066915 -12734289 -12840784 -12339837 -11386213
40053 -11386213 -10269647 -9280925 -8510111 -7735113 -6535819 -4560402 -1762252 1513121
40045 1513121 4651122 7095766 8690142 9716576 10570774 11416624 12177605 12774677 13244344
40036 13244344 13628163 13874055 13913489 13770828 13527666 13205360 12734218 12031486 11087823
40027 11087823 10007633 9006412 8341555 8162207 8369476 8633398 8594228 8087078 7185826
40018 7185826 6044953 4754519 3415378 2321997 1896841 2286970 3076231 3593622 3583868
40009 3583868 3442515 3682224 4278913 4709521 4574580 3955216 3092693 1934173 220183
40000 220183 -2018803 -4263883 -5903060 -6747162 -7082545 -7271026 -7383578 -7199882 -6465746
39991 -6465746 -5134176 -3456827 -1910364 -956133 -738876 -990300 -1283110 -1377407 -1256627
39982 -1256627 -871182 -45232 1232849 2541607 3259852 3126722 2485789 1960658 1986460
39973 1986460 2666466 3906438 5513901 7202462 8667538 9735868 10391247 10629917 10365486
39964 10365486 9540818 8289055 6891266 5550115 4251157 2866935 1347791 -236851
39956 -236851 -1810117 -3356465 -4847582 -6141989 -7001191 -7208397 -6683358 -5533995 -4031302
39947 -4031302 -2497332 -1155623 -66004 811966 1541582 2210457 2924542 3707498 4438838
39938 4438838 4998928 5482939 6167973 7221161 8506367 9716487 10626868 11169921 11336042
39929 11336042 11091816 10367361 9042088 6950167 3991081 302172 -3667455 -7276315
39921 -7276315 -9959667 -11513786 -12205009 -12566259 -13000340 -13543500 -13993007 -14190881 -14128598
39912 -14128598 -13846081 -13358052 -12707551 -12014838 -11428358 -11053843 -10933384 -11032637 -11204523
39903 -11204523 -11192681 -10727399 -9662569 -8056319 -6147688 -4263622 -2744897 -1935815 -2149500
39894 -2149500 -3503814 -5744255 -8319656 -10708581 -12624269 -13878868 -14212715 -13449234
39886 -13449234 -11772436 -9651185 -7444323 -5208076 -2906124 -640305 1398236 3055750
39878 3055750 4186570 4633033 4415030 3923507 3797416 4546350 6248503 8496963 10572058
39869 10572058 11791962 11885246 11075069 9770452 8205694 6392865 4294371 1918397
39861 1918397 -649657 -3111828 -4885071 -5403404 -4612548 -3068861 -1475980 -185537
39853 -185537 847668 1794597 2770346 3819217 4889697 5787795 6261206 6204218 5765115
39844 5765115 5218727 4721801 4190948 3427781 2382500 1305846 645895 798456 1915831
39835 1915831 3841920 6144496 8282148 9906603 11065738 12047944 13009438 13818891 14244148
39826 14244148 14143534 13433798 12056251 10145852 8157978 6656303 5966700 6116923 7026198
39817 7026198 8544069 10275417 11585529 11968667 11403203 10278334 8998375 7694764
39809 7694764 6257372 4552103 2610523 675337 -910829 -1882366 -2151504 -1796192 -1031303
39800 -1031303 -193945 372868 553953 569372 761342 1272600 2002920 2847832 3821530 4865619
39790 4865619 5656803 5763784 5005739 3585730 1900335 316434 -900599 -1629882 -1972849
39781 -1972849 -2170091 -2291804 -2062752 -1157607 319411 1804984 2798875 3307811 3688708
39772 3688708 4161310 4615938 4833460 4690228 4103204 2973072 1371094 -263506 -1300205
39763 -1300205 -1391365 -739857 128328 799063 1135340 1094066 553514 -561275 -2021791
39754 -2021791 -3308304 -3990021 -4098742 -4074366 -4323178 -4852695 -5331774 -5446378 -5164520
39745 -5164520 -4717263 -4408788 -4438004 -4810706 -5358793 -5853595 -6124347 -6081132 -5681494 -4960259
39735 -4960259 -4079648 -3221421 -2365830 -1289976 97011 1492519 2420427 2678694 2416555
39726 2416555 1798679 822163 -458871 -1756680 -2799595 -3652343 -4599105 -5764985 -7024495
39717 -7024495 -8225222 -9273476 -9977508 -10039154 -9335779 -8099394 -6721370 -5465503 -4430088
39708 -4430088 -3652024 -3098197 -2596529 -1889881 -772515 816056 2704364 4411863 5303246
39699 5303246 5039880 3914769 2649844 1862722 1775842 2323324 3321101 4512434 5651046
39690 5651046 6664888 7656607 8674284 9566263 10128406 10310481 10202460 9900306 9483946
39681 9483946 9064204 8727512 8441001 8101142 7676486 7234097 6835799 6486506 6190782
39672 6190782 5991345 5931197 6006814 6125022 6041244 5410520 4089847 2454755 1252774
39663 1252774 976816 1422323 1974653 2284195 2525516 3039951 3936093 5101573 6397229
39654 6397229 7656205 8598726 8968434 8763671 8178559 7305764 6080741 4593065 3261441
39645 3261441 2501823 2288703 2252016 2241904 2618741 3842890 5826994 7820694 8981717
39636 8981717 9036087 8387961 7664093 7220357 7040301 6942304 6755166 6362520 5772912 5215325
39626 5215325 5020805 5270194 5617050 5590587 5066444 4353315 3857272 3786945 4158018 4883802
39616 4883802 5752403 6431110 6647154 6386119 5885385 5456178 5302347 5408887 5544262
39607 5544262 5453107 5138833 4917190 5115498 5741767 6487365 6988151 7029572 6614787 5992380
39597 5992380 5577961 5673507 6217559 6898489 7495118 7968905 8229568 8018735 7140061 5680134
39587 5680134 3894473 1981554 73382 -1683610 -3214497 -4597908 -5847842 -6629808
39579 -6629808 -6423971 -5054969 -2909279 -553160 1710074 3803893 5593710 6889717
39571 6889717 7698879 8222926 8496203 8176847 6879585 4727354 2473754 1008174 705731
39562 705731 1202178 1720709 1589602 530977 -1372138 -3830816 -6453078 -8808869 -10519641
39553 -10519641 -11342290 -11204873 -10231268 -8768279 -7317708 -6322394 -5953852 -6081570 -6393074
39544 -6393074 -6517768 -6143548 -5181425 -3845272 -2450383 -1078768 450352 2189102 3725135
39535 3725135 4384141 3801847 2254809 455278 -900865 -1417733 -1024262 92799 1534605
39526 1534605 2765311 3301143 2973332 2076776 1228460 990277 1543016 2649733 3872279
39517 3872279 4840081 5430614 5793702 6164125 6557381 6681023 6278291 5575176 5222412
39508 5222412 5661294 6615791 7357954 7486193 7340929 7625877 8697969 10251955 11594538
39499 11594538 12137022 11704501 10566475 9282332 8439208 8357216 8923075 9706772 10299605
39490 10299605 10581610 10684281 10745225 10769490 10738284 10763238 11027092 11548051 12052903 12135598
39480 12135598 11580914 10584563 9681125 9384516 9775037 10400003 10645595 10240279 9349024
39471 9349024 8206169 6838181 5253942 3733819 2686372 2268037 2403697 3196922 4983925
39462 4983925 7756930 10735113 12809097 13408277 12796715 11641507 10544330 9917342 9932779
39453 9932779 10418152 10995500 11466705 11916253 12336782 12357759 11542717 9842294 7587352
39444 7587352 5156878 2850767 966866 -302938 -1093277 -1760336 -2475481 -3061235 -3271096
39435 -3271096 -3089540 -2712335 -2369378 -2204003 -2161670 -1926239 -1139073 185548 1572130
39426 1572130 2516752 2895562 2852854 2488653 1915999 1525269 1826488 2878373 4055737
39417 4055737 4540784 3975508 2578347 806998 -871051 -1944686 -1912719 -596495 1619097
39408 1619097 3967433 5774142 6787019 7140042 7100204 6840320 6346132 5468889 4101711
39399 4101711 2363220 594784 -877460 -1983616 -2877446 -3673436 -4296609 -4648498 -4856246
39390 -4856246 -5213463 -5802696 -6255705 -6017430 -4875650 -3173487 -1522708 -433169 -222933
39381 -222933 -1026931 -2626167 -4347654 -5454736 -5771170 -5771910 -5977010 -6404030 -6687181 -6526007
39371 -6526007 -5841006 -4651147 -3060596 -1355104 61446 850570 828641 39641 -1080160
39362 -1080160 -1759828 -1425702 -205230 1269016 2484551 3248472 3407435 2848657 1907554
39353 1907554 1351692 1650283 2479045 3193362 3572712 3802484 3896532 3526204 2440204
39344 2440204 794852 -966043 -2374939 -3101952 -3094122 -2646110 -2208548 -2063098 -2227411
39335 -2227411 -2608257 -3094304 -3515747 -3669669 -3411244 -2634162 -1223947 804227 3159554
39326 3159554 5473578 7663032 9903260 12203816 14213548 15531657 16042551 15864627
39318 15864627 15170427 14205483 13299222 12605789 11874325 10681095 8927764 7005779 5470194
39309 5470194 4647397 4527341 4866242 5327920 5663083 5899723 6340173 7263182 8597020
39300 8597020 9930495 10839100 11125906 10749749 9682136 7982199 5944514 4002657 2487652
39291 2487652 1615085 1646952 2770131 4704490 6710121 8235506 9402943 10602331 11757465
39282 11757465 12359939 12224129 11846092 11875280 12468624 13293855 13948336 14207290 14046268
39273 14046268 13647075 13311266 13191066 13122176 12815478 12162748 11283982 10378096 9649230
39264 9649230 9287543 9342317 9608331 9758678 9620463 9267136 8851614 8400785 7754603 6670126
39254 6670126 5032764 3017114 985176 -844752 -2591067 -4514119 -6675686 -8859829
39246 -8859829 -10786290 -12309710 -13406162 -14029639 -14030136 -13257099 -11782205 -9957135 -8116142
39237 -8116142 -6230008 -4044499 -1644330 304125 1052212 446885 -989182 -2533450
39229 -2533450 -3675974 -4201822 -4136248 -3634713 -2755210 -1318941 854099 3553140 6167155
39220 6167155 8108349 9145766 9345523 8883331 8002528 7000932 6106090 5393199 4885769
39211 4885769 4675928 4872710 5468545 6315904 7221339 8045502 8755578 9410133 10055296
39202 10055296 10606375 10858435 10635778 9928716 8924673 7979374 7544831 7993129 9375116
39193 9375116 11300588 13071380 14010763 13818934 12756974 11505312 10754613 10847109 11732411
39184 11732411 13140760 14712545 16052278 16845055 17000483 16651925 16019426 15295610 14582322
39175 14582322 13836078 12941638 11974044 11323122 11357888 11960690 12584232 12801653 12608695
39166 12608695 12152071 11441266 10513775 9663772 9191167 8936405 8293935 6767765 4430037
39157 4430037 1822947 -498677 -2304139 -3640578 -4506842 -4613475 -3544676 -1203054
39149 -1203054 1954135 5153583 7741740 9432598 10325574 10791776 11189987 11506524 11323673
39140 11323673 10280571 8519017 6567892 4898879 3787887 3522835 4432547 6583058
39132 6583058 9587121 12799054 15619617 17635901 18681843 18890688 18585986 18029134 17337771
39123 17337771 16654151 16203405 16054104 15939024 15457835 14403856 12817300 10852319 8761249
39114 8761249 6921341 5642556 4896481 4360458 3759048 3063429 2362789 1698512 1097033
39105 1097033 647768 431713 397464 361833 113861 -480901 -1386433 -2346772 -3015894 -3254225
39095 -3254225 -3283671 -3452687 -3830452 -4110143 -3954099 -3383612 -2771887 -2467125 -2472913 -2514625
39085 -2514625 -2389737 -2220623 -2363688 -3091955 -4364615 -5859391 -7183329 -8082108 -8548578
39076 -8548578 -8804033 -9143856 -9714866 -10399375 -10921240 -11051556 -10685154 -9768536 -8290090
39067 -8290090 -6417355 -4550134 -3078254 -2047766 -1155316 -123460 974011 1790413
39059 1790413 2022637 1574731 494741 -1079570 -2867142 -4454899 -5488240 -5889002 -5893896
39050 -5893896 -5889202 -6161023 -6710189 -7275316 -7578952 -7547295 -7222486 -6502256 -5164191 -3256980
39040 -3256980 -1322719 -49070 258445 -255224 -1329321 -2739204 -4138443 -5077057 -5382948
39031 -5382948 -5399185 -5682480 -6522816 -7825387 -9303361 -10603434 -11343125 -11276821 -10482277
39022 -10482277 -9264374 -7869875 -6417304 -5084113 -4160271 -3813631 -3907840 -4145077 -4326943
39013 -4326943 -4409016 -4360689 -4062888 -3368195 -2286264 -1159013 -605093 -1126675 -2666528
39004 -2666528 -4591005 -6144027 -6876803 -6678644 -5597475 -3783048 -1520574 837498
38996 837498 2986694 4687034 5766969 6224604 6241089 5931683 5121944 3560397 1390551
38987 1390551 -742311 -2125097 -2420002 -1669250 -84109 1972674 3907844 5115191
38979 5115191 5453144 5443198 5864713 7116450 8985972 10978260 12744623 14170138 15209631
38970 15209631 15834577 16137422 16307532 16405745 16261985 15701014 14808329 13872800 13115350
38961 13115350 12585048 12292389 12311888 12712999 13446360 14301232 14941783 15062798 14649328
38952 14649328 14083134 13862990 14162707 14691723 14919979 14313761 12445091 9180459 4910397
38943 4910397 421085 -3625472 -7007239 -9690311 -11490394 -12215452 -12017922 -11316514 -10364952
38934 -10364952 -9130366 -7624415 -6102383 -4808164 -3701889 -2604127 -1506539 -578053
38926 -578053 96935 656812 1341296 2298292 3469567 4588075 5343036 5671944 5883309
38917 5883309 6376351 7221728 8121531 8806027 9341590 9955978 10645969 11094613 10987345
38908 10987345 10333993 9462603 8743439 8315964 8008199 7464438 6371201 4623045 2340304
38899 2340304 -207098 -2675610 -4733648 -6211167 -7237383 -8193030 -9446165 -11072439
38891 -11072439 -12790496 -14155503 -14857978 -14901597 -14510855 -13853284 -12882803 -11505116 -9859397
38882 -9859397 -8332060 -7267419 -6732224 -6561589 -6527573 -6447055 -6280411 -6213921 -6495653 -7028913
38872 -7028913 -7229389 -6501427 -4864488 -2956504 -1410845 -370263 394530 1091525 1724271
38863 1724271 2156827 2243495 1965471 1509747 1141632 954218 839639 744190 790301 1024113
38853 1024113 1188123 956775 368053 -152251 -200687 307895 1233193 2383168 3495400
38844 3495400 4216435 4314142 3922967 3460020 3264557 3395031 3794032 4509733 5587634
38835 5587634 6750439 7367418 6892343 5319044 3150331 986069 -765844 -1883587
38827 -1883587 -2306228 -2229982 -2096876 -2349221 -3203078 -4655071 -6566344 -8643369 -10453429
38818 -10453429 -11624174 -12039052 -11799720 -11079310 -10095862 -9131930 -8418413 -7982192 -7660576
38809 -7660576 -7216655 -6396259 -5008757 -3115864 -1077136 752129 2324779 3756435
38801 3756435 4961182 5679396 5877475 5869611 5952071 6112611 6199912 6177733 6048868 5686239
38791 5686239 4962530 4008848 3180202 2759214 2780232 3100500 3524250 3865513 3999331 3898677
38781 3898677 3619135 3294851 3168903 3504480 4323403 5260642 5803453 5697288 5066898
38772 5066898 4195376 3303787 2503336 1753133 761524 -926981 -3546494 -6768501 -9817319
38763 -9817319 -11958482 -12860922 -12546377 -11174285 -9039367 -6716707 -4925827 -4008933 -3568838
38754 -3568838 -2819244 -1373110 414355 1924674 2952789 3795998 4788351 5927456 6928912
38745 6928912 7461120 7285126 6345307 4886971 3450913 2611908 2627108 3298027 4142858
38736 4142858 4708919 4797206 4489227 4011442 3556596 3173482 2768066 2204171 1459538 734809
38726 734809 387421 690722 1616713 2843680 3957025 4642670 4766361 4393734 3787154
38717 3787154 3309436 3214500 3480282 3872874 4216222 4600079 5284755 6373957 7601416
38708 7601416 8474797 8623707 7979144 6640821 4658163 1999000 -1283253 -4877130 -8207555
38699 -8207555 -10648812 -11861270 -12002600 -11590373 -11115826 -10785606 -10583423 -10428022 -10172348
38690 -10172348 -9554475 -8340731 -6569717 -4572198 -2706825 -1111554 289020 1604867
38682 1604867 2846180 3926508 4758090 5337185 5725065 5939625 5903099 5532014 4849255
38673 4849255 3969345 3008219 2049653 1148092 295355 -564405 -1391062 -1957310 -2021092 -1589963
38663 -1589963 -914411 -232252 351192 727414 709940 209085 -591652 -1305836 -1546932 -1069370
38653 -1069370 139572 1814891 3565415 5178050 6709086 8211093 9485997 10221715
38645 10221715 10259660 9571890 8085766 5790159 3043877 560402 -1044489 -1631349 -1462329
38636 -1462329 -892098 -186238 507592 1149444 1719585 2052301 1811637 744824 -1033062
38627 -1033062 -3063974 -4856518 -6149706 -6921009 -7223689 -7054352 -6374457 -5254108 -3951926
38618 -3951926 -2761788 -1740280 -658812 701010 2249400 3660324 4698451 5370431
38610 5370431 5761608 5845217 5506782 4687666 3472798 2132759 1146011 1053208 2071160
38601 2071160 3769876 5225157 5600739 4635071 2652797 264750 -1886702 -3278600
38593 -3278600 -3684773 -3287959 -2491115 -1519047 -243444 1575161 3960883 6683701 9419797
38584 9419797 11810122 13427876 13900909 13181871 11667076 10023739 8908934 8762446 9668387
38575 9668387 11298658 13051114 14343145 14811316 14308124 12882156 10856220 8794291
38567 8794291 7187468 6112125 5241697 4184003 2777002 1150841 -337349 -1221801
38559 -1221801 -1151207 -123461 1521016 3372233 5164455 6697817 7669646 7746204 6848034
38550 6848034 5318424 3793902 2915842 3083832 4303863 6136935 7829368 8664483 8366432
38541 8366432 7265029 6087349 5531123 5907169 7032246 8374510 9345187 9581022 9056055
38532 9056055 7968934 6546271 4964367 3408673 2105380 1242815 898115 1053417 1596136
38523 1596136 2235347 2513361 2072797 963360 -380376 -1463461 -1956379 -1662795 -521453
38514 -521453 1187438 2775740 3553734 3387774 2775405 2374036 2563179 3428356 4914693
38505 4914693 6806541 8665241 10025974 10740616 11067971 11414876 12021532 12820869 13447998
38496 13447998 13382290 12275548 10292781 8079261 6291379 5178445 4651956 4626087 5096978
38487 5096978 5897417 6580530 6688813 6105553 5092623 4038825 3225720 2767771 2644723
38478 2644723 2725977 2791491 2596309 1990707 1041161 48510 -584775 -546253 268218 1727977
38468 1727977 3493433 5131598 6321228 6945525 6915173 5982370 3952240 1135481 -1636492
38459 -1636492 -3654936 -4921894 -5942630 -6991897 -7760338 -7720694 -6681937 -4950178 -3087610
38450 -3087610 -1590226 -700556 -399837 -521101 -852178 -1170193 -1317043 -1354808 -1572776
38441 -1572776 -2195387 -3102122 -3952573 -4539833 -4854277 -4832817 -4288910 -3178453 -1753674
38432 -1753674 -342826 879013 1796434 2197096 1894412 946902 -379821 -1835771 -3297396
38423 -3297396 -4741511 -6198763 -7623349 -8683867 -8806385 -7634962 -5432510 -2878813
38415 -2878813 -501123 1570968 3393534 5020691 6551624 8099781 9557845 10516665
38407 10516665 10553020 9575575 7896908 6106044 4893614 4754481 5610764 6762138 7409328
38398 7409328 7313245 6897181 6702188 6808866 6808847 6281675 5244342 4132868 3388428 3123518
38388 3123518 3199068 3510391 4039748 4614107 4761694 3942948 1950032 -898904 -3892014
38379 -3892014 -6266135 -7581171 -7897197 -7576417 -6877407 -5803878 -4388288 -2999768 -2203205
38370 -2203205 -2282541 -2959873 -3584843 -3586161 -2829277 -1655830 -568093 211933 874355 1667848
38360 1667848 2484937 2942658 2867019 2529335 2339514 2451505 2781188 3289546 4066266 5154946
38350 5154946 6455388 7841155 9265785 10690654 11970849 12872520 13188129 12841002 11956803
38341 11956803 10877992 10042308 9763458 10117433 11019270 12294880 13593497 14340525 13994560
38332 13994560 12440293 10064709 7428492 4950215 2911770 1572536 1074304 1250193
38324 1250193 1684166 2026936 2202748 2291283 2287611 2053753 1506996 826855 461166 901904
38314 901904 2388518 4735984 7373315 9563593 10744996 10865791 10451513 10225180 10534022
38305 10534022 11127133 11475091 11225350 10367104 9168574 8108580 7708194 8150962 9046797
38296 9046797 9755060 9979839 9918120 9853130 9845497 9917654 10321028 11399989 13224002 15449114
38286 15449114 17480723 18704118 18684729 17345582 15009571 12233617 9594579 7569259
38278 7569259 6411436 5987064 5820564 5481987 4940092 4462645 4247964 4303001 4629807
38269 4629807 5304504 6276620 7214751 7671322 7391633 6454650 5192314 4021378 3274315
38260 3274315 3066811 3269884 3626105 3944151 4237775 4695759 5485614 6568283 7734974
38251 7734974 8828872 9870564 10956107 12129499 13391940 14691563 15783726 16242004
38243 16242004 15839538 14903449 14083580 13726453 13629521 13416899 12928415 12150524 11022872
38234 11022872 9579571 8202369 7480501 7752035 8873873 10420312 11966448 13169222
38226 13169222 13760466 13628430 12896419 11818878 10539672 8958153 6873830 4307745
38218 4307745 1683957 -361592 -1406409 -1493192 -993355 -295491 371924 967279 1653321
38209 1653321 2757041 4535488 6893753 9393510 11575522 13217197 14280942 14767041
38201 14767041 14743115 14433523 14102920 13820003 13441665 12860618 12166107 11509348 10924082
38192 10924082 10402596 10089737 10225839 10828815 11534450 11869964 11697421 11346193 11307610
38183 11307610 11815529 12691016 13533028 14046359 14229015 14287833 14395642 14543106 14610218 14513903
38173 14513903 14227630 13704117 12904918 11966021 11264966 11227155 12035349 13517735 15260624
38164 15260624 16793096 17752664 18028888 17801088 17361453 16837835 16107834 14993283 13491545
38155 13491545 11820187 10339816 9476710 9567376 10581870 12005510 13160314 13719336 13843058
38146 13843058 13820118 13722741 13481203 13148292 12926648 12960684 13201426 13455254 13491762 13147670
38136 13147670 12425729 11479033 10420353 9170877 7576447 5640586 3555403 1550051
38128 1550051 -172308 -1398688 -1993128 -2044775 -1759317 -1139736 65047 1977031 4252588
38119 4252588 6241137 7441506 7773033 7517779 7098938 6840500 6837915 7080327 7694622
38110 7694622 8915290 10712938 12588150 13893150 14294022 13806886 12513897 10475994
38102 10475994 7906826 5220635 2833487 977870 -361938 -1500207 -2979079 -5183594
38094 -5183594 -7929912 -10582420 -12630607 -13996537 -14743622 -14723458 -13677898 -11548566 -8530152
38085 -8530152 -4943013 -1229539 2033521 4371929 5709856 6323438 6540661 6639474 6990063
38076 6990063 8018693 9873134 12249157 14698626 17050858 19398937 21704238 23573163
38068 23573163 24493073 24224264 22918531 20920528 18529759 15928676 13243360 10609140
38060 10609140 8169456 6008839 4085800 2275408 541099 -947974 -1960140 -2502820
38052 -2502820 -2914780 -3591228 -4638299 -5820082 -6769416 -7177670 -6861086 -5815014 -4268592
38043 -4268592 -2614412 -1214925 -252294 296558 623241 1006102 1643871 2504245 3366531
38034 3366531 4019203 4372739 4417577 4208342 3940006 3913042 4283965 4858812 5225845 5140012
38024 5140012 4779943 4625195 5037576 5868597 6431353 5923371 3988765 959051 -2365428
38015 -2365428 -5118110 -6667253 -6792154 -5771109 -4283181 -3090468 -2715006 -3330587 -4812663
38006 -4812663 -6773683 -8609064 -9699340 -9716222 -8770690 -7253785 -5523636 -3730479 -1912915
37997 -1912915 -206776 1124328 1919505 2341650 2780155 3510291 4487974 5465170 6232113
37988 6232113 6755884 7202065 7866517 8954650 10285159 11233661 11095174 9599674 7148231
37979 7148231 4622506 2929686 2524304 3165005 4126069 4774905 5042612 5389540 6381280
37970 6381280 8282715 10877199 13497379 15300041 15759442 15022719 13717856 12359351
37962 12359351 10995312 9434447 7659936 5879722 4237167 2657973 1053454 -420108
37954 -420108 -1403331 -1623001 -1100112 -122119 893821 1531323 1545081 1052196 523041 450173
37944 450173 965698 1793561 2542334 2998388 3202475 3362251 3666928 4051402 4147068 3640658
37934 3640658 2746516 2167216 2469007 3579070 4954292 6095506 6791542 7056769 7098875
37925 7098875 7311579 8045277 9288554 10675217 11829600 12612483 13042443 13125470 12821035
37916 12821035 12089727 10938769 9495786 8057897 6982324 6479258 6529208 6963190 7551448
37907 7551448 8079658 8501728 9031998 9928757 11113060 12096290 12337729 11613983 10077617
37898 10077617 8155693 6471428 5659524 6017104 7306967 8957090 10407178 11251872
37890 11251872 11245791 10395581 9029142 7603825 6398258 5455633 4791386 4528387 4810246
37881 4810246 5668638 6969227 8386908 9456984 9836903 9637491 9428362 9816487 11009982
37872 11009982 12770247 14661549 16259663 17229921 17407333 16867724 15830047 14430692
37864 14430692 12660596 10587803 8563630 7049092 6171446 5535939 4583153 3139558
37856 3139558 1573725 452624 151361 786842 2325465 4551851 6968354 8951893
37848 8951893 10169549 10823963 11425997 12317832 13403087 14267391 14516706 14057955 13129415
37839 13129415 12051965 10909345 9482923 7516814 4998697 2151745 -752921 -3470092
37831 -3470092 -5748927 -7415677 -8508761 -9164475 -9304943 -8606223 -6911771 -4567656 -2190027
37822 -2190027 -164126 1469977 2700743 3365137 3380046 3000248 2701510 2828295 3389783
37813 3389783 4112503 4603993 4532051 3802492 2652489 1558504 993637 1193826 2078006
37804 2078006 3357060 4730180 5995984 7011342 7621499 7686864 7146671 6029068 4489005
37795 4489005 2926427 1954988 2029530 3056346 4505632 5930852 7224708 8343813 9026102
37786 9026102 8976321 8238837 7233583 6469923 6311350 6894673 8068721 9393045 10327722
37777 10327722 10495253 9795576 8402748 6760852 5469727 4957192 5203034 5843342 6516631
37768 6516631 7045215 7380645 7555161 7694498 7944510 8353664 8885828 9485353 10000638
37759 10000638 10107091 9515677 8302336 6889011 5669733 4792220 4314225 4362558 5008105
37750 5008105 6094794 7301820 8311226 8867617 8800321 8113511 7011449 5753617 4509068
37741 4509068 3369145 2402049 1616613 946208 364057 -11321 20823 603519 1756953
37732 1756953 3361761 5146240 6780248 8098988 9224309 10394778 11667130 12795534
37724 12795534 13371832 13092623 11994351 10502707 9195812 8431812 8189364 8242408 8400419
37715 8400419 8568157 8716189 8908832 9297531 9993429 10990098 12262237 13827523 15576815
37706 15576815 17110765 17911703 17695787 16512029 14546164 11991116 9132201 6403489
37698 6403489 4258294 3011190 2768312 3339464 4144912 4399553 3658533 2268757 1207312
37689 1207312 1413286 3235585 6380990 10173307 13802928 16545437 18024834 18343373
37681 18343373 17859457 16816076 15282907 13449714 11761698 10606885 9984356 9665200
37673 9665200 9614703 10030202 10944958 12024436 12875608 13408108 13745879 13878355 13563877
37664 13563877 12567171 10889743 8783696 6640030 4858818 3701052 3162168 2976360
37656 2976360 2776307 2293621 1455019 318344 -1059590 -2642514 -4273434 -5590207 -6213935
37647 -6213935 -6057423 -5387530 -4581880 -3885722 -3355506 -2877868 -2219247 -1229024 -78431
37638 -78431 841917 1352357 1662868 2001919 2231472 2035235 1393918 646526 103753 -201954
37628 -201954 -389019 -550468 -731475 -891037 -821498 -270254 772158 2035261 3300273
37619 3300273 4644771 6265391 8173991 10180377 12069596 13651937 14711028 15089991
37611 15089991 14867306 14350595 13866088 13594229 13558972 13642748 13592446 13158790 12355707 11547354
37601 11547354 11175790 11369106 11838124 12141175 12000460 11370846 10313370 8937214 7495380
37592 7495380 6415136 6054620 6345543 6739857 6614748 5759837 4449815 3086638 1862071
37583 1862071 756084 -281323 -1237851 -2036035 -2509473 -2444472 -1785035 -779730 214049
37574 214049 1087975 2023212 3159621 4366824 5378349 5983127 6003016 5279570 3894060
37565 3894060 2337330 1289454 1225869 2279074 4320010 6958918 9539383 11411454
37557 11411454 12332683 12540806 12464057 12475020 12852060 13739840 15065440 16609849 18187280
37548 18187280 19649062 20753910 21245656 21125706 20714495 20406460 20477839 21096615 22280718
37539 22280718 23754252 25022938 25734759 25935982 25990749 26351711 27325394 28812750 30247391
37530 30247391 31012319 31001107 30656510 30531316 31056736 32671497 35807934 40689632 47442041
37521 47442041 56402378 67967945 82205428 99147090 119493911 144376504 174305717
37514 174305717 209026464 248169868 290156152 329145729 354592635 356776045 334126922
37507 334126922 294598799 249678027 207611688 171675634 142337169 119096523 100851038
37500 100851038 86242566 74309149 64532245 56434398 49628737 44087187 39818028 36366796
37492 36366796 33107459 29926814 27139601 24812252 22714167 20968585 20200322 20799711
37484 20799711 22355026 23988603 25024220 25236258 24739309 23839996 22845562 21847495 20715846
37475 20715846 19287274 17434566 15015158 12021485 8863825 6275789 4758639 4179822
37467 4179822 3986231 3738008 3404321 3242046 3433538 3769718 3695608 2812579 1397302
37458 1397302 312756 306768 1400583 2933212 4106336 4506690 4282433 3939905 3906222
37449 3906222 4171697 4323045 3928715 2885657 1428997 -110013 -1521974 -2758114 -3831117
37440 -3831117 -4721021 -5386189 -5814149 -5970970 -5696255 -4769823 -3165074 -1168894 817310
37431 817310 2527548 3834810 4642302 4923817 4813665 4516851 4160971 3840813 3725395
37422 3725395 3932910 4302059 4443916 4040877 2985508 1273291 -1021521 -3588716 -5865281
37413 -5865281 -7311865 -7683036 -7030214 -5572246 -3637377 -1626905 95599 1305181
37405 1305181 1915717 1946845 1526956 884804 295484 15455 197261 773536 1447679 1918680
37395 1918680 2158875 2416977 2949607 3814222 4885189 5927736 6629127 6715010 6159515
37386 6159515 5234311 4278302 3452081 2753608 2198182 1886895 1911288 2268400 2896520 3753399
37376 3753399 4802646 5898310 6732398 7009094 6730026 6232559 5852011 5583469 5171382
37367 5171382 4503410 3799995 3408429 3514734 4084801 4993624 6147858 7502228 8964235
37358 8964235 10276061 11062627 11089260 10436357 9332186 7889956 6182950 4542161 3518059
37349 3518059 3418138 4035472 4970872 6103062 7568584 9332825 10974251 11964601 12096865
37340 12096865 11602853 10895865 10233041 9594468 8801717 7665464 6029244 3823093 1224653
37331 1224653 -1269774 -3092502 -3984224 -4090164 -3727284 -3166659 -2581326 -1979116 -1119380
37322 -1119380 301541 2230102 4126247 5373521 5726379 5258120 4035420 2094937
37314 2094937 -268952 -2414550 -3671394 -3731970 -2782883 -1388233 -252183 84963 -499384
37305 -499384 -1698813 -3031546 -4143517 -4954083 -5610232 -6304216 -7042060 -7532615 -7351048
37296 -7351048 -6283095 -4522035 -2509348 -593307 1122658 2604756 3651770 3946956
37288 3946956 3385003 2280438 1181011 501328 392578 900101 2076161 3854334 5885089
37279 5885089 7583794 8362587 7869898 6147772 3658705 1103921 -920328 -2179662
37271 -2179662 -2770784 -2887054 -2627749 -1995639 -1040721 19387 884839 1445561 1923443
37262 1923443 2622951 3532155 4292031 4587544 4424945 3950285 3153370 1926840 371150
37253 371150 -1107363 -2020995 -2077728 -1312220 -71105 1148296 1975905 2359413 2499878
37244 2499878 2667559 3104197 3938178 4984587 5662096 5347354 3947491 2067148 575968
37235 575968 68932 697312 2291710 4487636 6841563 9038841 11040019 12929446 14582097
37226 14582097 15556241 15397144 14070026 12092313 10231867 9027879 8515906 8339619 8114090
37217 8114090 7731223 7383968 7336124 7670889 8244641 8847621 9349199 9658910 9623750 9097074
37207 9097074 8141313 7062801 6176965 5598379 5304753 5287371 5492138 5667337 5459001
37198 5459001 4706633 3520254 2024504 179751 -2032727 -4376681 -6504527 -8320615
37190 -8320615 -10034880 -11807588 -13465957 -14644181 -15098624 -14784346 -13715937 -11936770
37182 -11936770 -9657930 -7299789 -5311704 -3974202 -3353120 -3310421 -3500527 -3509954 -3180905
37173 -3180905 -2763875 -2600424 -2663277 -2569898 -2087130 -1458434 -1117524 -1171515 -1292344 -1083666
37163 -1083666 -453341 361517 1036769 1397721 1483980 1459145 1498477 1764680 2428644 3611984
37153 3611984 5269504 7177957 9083300 10840768 12399447 13686687 14537722 14754102
37145 14754102 14294821 13471017 12870814 12920447 13486981 14033208 14177311 13954169 13523405
37136 13523405 12873195 11952868 10870477 9703440 8231160 6139850 3500264 843952
37128 843952 -1246243 -2472954 -2816419 -2454479 -1746159 -1060857 -476747 248061 1337060
37119 1337060 2747923 4309838 5933689 7557158 9002391 10045268 10585887 10654530 10306711
37110 10306711 9619260 8753737 7914660 7228285 6696325 6241834 5772742 5257672 4786947
37101 4786947 4500170 4399241 4297940 4024986 3612775 3203316 2833754 2428219 1957212
37092 1957212 1463076 924264 243946 -550812 -1194962 -1380894 -1061931 -518348 -155799
37083 -155799 -296359 -1115679 -2617090 -4540740 -6343754 -7422791 -7445945 -6460830 -4718131
37074 -4718131 -2524370 -307451 1367907 2081493 1851420 1001071 -255828 -1938006 -4002352
37065 -4002352 -6127694 -7878278 -8932134 -9070702 -8146229 -6270124 -3952362 -1850917
37057 -1850917 -369656 399517 409473 -469833 -2271426 -4756758 -7494383 -10069083 -12211529
37048 -12211529 -13800150 -14769962 -14999849 -14328896 -12759396 -10617917 -8413908 -6520812
37040 -6520812 -5055019 -4041151 -3575883 -3782793 -4661805 -5989134 -7300087 -7999530 -7651857
37031 -7651857 -6278877 -4348150 -2421275 -812843 466185 1582989 2773817 4240279
37023 4240279 5989710 7746949 9099138 9792104 9913239 9798695 9747800 9794135 9747197
37014 9747197 9453084 8954221 8345199 7559062 6435914 4973676 3339704 1608547 -328090
37005 -328090 -2510589 -4754779 -6882995 -8932461 -10903240 -12409953 -12900747 -12293195 -11181186
36996 -11181186 -10306899 -9961250 -9960847 -10022699 -10006529 -9921447 -9904775 -10167653 -10776752 -11443932
36986 -11443932 -11657526 -11103808 -9924198 -8543001 -7306831 -6313791 -5493069 -4726895 -3884455
36977 -3884455 -2844665 -1604032 -386408 440746 669267 492329 384001 712205 1520179
36968 1520179 2685819 4151204 5858922 7528824 8695153 9053349 8710525 8067688 7528586
36959 7528586 7339684 7585500 8207748 9026644 9805313 10327398 10463462 10256244 9961028
36950 9961028 9895298 10169703 10621733 11054014 11432234 11762774 11893672 11592141 10753427 9376244
36940 9376244 7407571 4853733 2068358 -311764 -1845556 -2578035 -2806063 -2756320 -2606689
36931 -2606689 -2583055 -2749478 -2774716 -2169456 -791254 1037027 2888848 4523280 5817185
36922 5817185 6669342 7132745 7517570 8185981 9217165 10285326 10819252 10320985 8732327
36913 8732327 6639872 5027801 4636729 5492742 7063844 8793213 10388906 11696818
36905 11696818 12557098 12952116 13221995 13949228 15520435 17802174 20272704 22450201 24151474
36896 24151474 25365345 26002391 25872836 24876545 23127284 20913432 18636700 16766246
36888 16766246 15672881 15380606 15527343 15648700 15483778 14998068 14233008 13272264 12332486
36879 12332486 11751321 11805908 12541585 13774336 15256052 16871656 18692721 20787982 22949769
36870 22949769 24678644 25524116 25431903 24725448 23805315 22930390 22216011 21694732 21333666
36861 21333666 21052994 20757502 20342099 19709113 18830344 17746968 16445737 14803319 12771531
36852 12771531 10587220 8663646 7255675 6323273 5699898 5240515 4777226 4110864 3189105
36843 3189105 2242737 1668447 1807516 2840945 4764829 7358151 10247473 13125625 15895239
36834 15895239 18531201 20850778 22534779 23398393 23580709 23444313 23309624 23272004 23222130
36825 23222130 22999197 22498200 21628868 20240521 18197153 15556772 12607256 9682577
36817 9682577 6980750 4571954 2518939 954037 67925 -6617 596343 1387611 1805675
36808 1805675 1687447 1382698 1354405 1773096 2548821 3583525 4835505 6241364 7733490
36799 7733490 9264751 10685087 11699128 12139431 12235058 12431714 12969221 13765585 14605990
36790 14605990 15205419 15158043 14169046 12429290 10495504 8671470 6736562 4446952 2103654
36781 2103654 404493 -168600 342100 1540331 2926750 4026419 4507181 4293387 3551217
36772 3551217 2586331 1769756 1439942 1737520 2557638 3732496 5189452 6841842 8426437
36763 8426437 9610811 10228837 10281270 9763279 8682210 7248800 5844455 4702464 3756822
36754 3756822 2922459 2428869 2706153 3897463 5555398 6884037 7292544 6707034 5379824
36745 5379824 3514681 1201034 -1329331 -3594850 -5143626 -5844996 -5798758 -5074872 -3721319
36736 -3721319 -1954478 -100110 1694581 3494324 5242046 6564094 7048864 6633995
36728 6633995 5607557 4297361 2863746 1323994 -369820 -2272175 -4335810 -6335157
36720 -6335157 -8008166 -9339991 -10630790 -12180384 -13900541 -15294188 -15828179 -15292722
36712 -15292722 -13820708 -11683731 -9179445 -6663258 -4519926 -3018454 -2239304 -2134023
36704 -2134023 -2512222 -2917420 -2738219 -1713414 -303108 681056 887411 708550 705495
36695 705495 947864 1061797 757188 72926 -830988 -1852202 -2841228 -3520834 -3677644
36686 -3677644 -3368757 -2813943 -2117022 -1214170 -99818 1013036 1809661 2089210 1857091
36677 1857091 1340615 1012584 1454790 2926063 4981515 6685883 7353515 7051798 6353701
36668 6353701 5735029 5319436 5042002 4776344 4273954 3234802 1636330 -56051 -1142686
36659 -1142686 -1215090 -456345 536119 1221806 1469275 1496663 1517005 1530155 1491112 1533300
36649 1533300 1845154 2379046 2901071 3367434 4047787 5168791 6591166 7970290 9110266
36640 9110266 10003676 10618169 10843947 10649023 10129920 9375328 8391188 7199702 5918289
36631 5918289 4665786 3410908 1956811 105561 -2117819 -4374908 -6178605 -7203514
36623 -7203514 -7472446 -7308566 -7200535 -7675264 -9064996 -11186789 -13283952 -14452501 -14215226
36614 -14215226 -12732874 -10617681 -8672457 -7646637 -7879371 -8996761 -10082074 -10320384
36606 -10320384 -9537061 -8161179 -6776917 -5727003 -4998897 -4357639 -3616783 -2868225 -2454213
36597 -2454213 -2679293 -3546784 -4759727 -5920704 -6729702 -7087885 -7090030 -6895719 -6576737
36588 -6576737 -6110330 -5493904 -4753159 -3807614 -2477188 -753189 1017354 2366534 3101559
36579 3101559 3347462 3235647 2727321 1779594 512061 -900859 -2377355 -3808605 -4840212
36570 -4840212 -4956990 -3884065 -1880429 392233 2295751 3569887 4371084 5012176 5627526
36561 5627526 6043757 5963858 5278912 4210912 3184857 2575285 2514412 2853722 3292850
36552 3292850 3595219 3699517 3616352 3287510 2669794 1956980 1560248 1763663 2479491 3433340
36542 3433340 4492240 5657379 6790529 7568910 7800478 7662346 7519088 7546300 7589006
36533 7589006 7345999 6651342 5636848 4688201 4202857 4303902 4762174 5201438 5356730
36524 5356730 5138796 4543927 3611883 2482399 1415505 675377 338326 188775 -160569
36515 -160569 -966282 -2129463 -3279187 -4056480 -4278460 -3906196 -3043869 -2031676 -1360553
36506 -1360553 -1313901 -1735619 -2267226 -2754469 -3289754 -3928660 -4583092 -5218899 -5930689 -6663937
36496 -6663937 -6974953 -6255978 -4241934 -1253155 2040652 5045428 7472371 9262491
36488 9262491 10380000 10720625 10221467 9022958 7484828 6051152 5102972 4839164 5139148
36479 5139148 5513539 5348993 4365812 2859465 1464035 702133 747950 1461038 2468230
36470 2468230 3244718 3338371 2682814 1688287 972169 990161 1887290 3568505 5780353
36461 5780353 8123411 10091900 11208335 11203056 10150514 8482180 6816339 5663770 5228380
36452 5228380 5467311 6286488 7608794 9285240 11065226 12706313 14035941 14865404 14961010
36443 14961010 14234091 12935169 11557423 10539451 10095637 10245524 10851654 11627358 12257907
36434 12257907 12581786 12584918 12222559 11397408 10189888 8986913 8243584 8121625 8396318
36425 8396318 8660371 8579090 8033995 7118463 5996248 4766638 3534203 2587475 2327457
36416 2327457 2905526 4029547 5212433 6094037 6433134 5987949 4664359 2723821 608258
36407 608258 -1448108 -3453866 -5333465 -6800606 -7614249 -7759528 -7278211 -6087167 -4114346
36398 -4114346 -1562965 1027753 2957214 3661280 3052769 1675967 387933 -265068 -346903
36389 -346903 -204818 29425 532291 1488966 2816470 4141326 4980304 5001349 4206010
36380 4206010 2881826 1394717 66132 -829288 -1151664 -1059364 -944985 -1112249 -1614184
36371 -1614184 -2459560 -3790650 -5672700 -7788901 -9526338 -10386986 -10273641 -9460733 -8381608
36362 -8381608 -7355315 -6378234 -5198833 -3666051 -1949110 -370838 843482 1559376
36354 1559376 1667102 1256083 768286 717931 1221470 1937619 2421880 2357817 1502773 -295157
36344 -295157 -2902425 -5862370 -8618956 -10686044 -11649274 -11269372 -9723288 -7615157 -5641529
36335 -5641529 -4289316 -3791256 -4102303 -4792365 -5172784 -4750222 -3528000 -1821479 51445
36326 51445 1782096 2986717 3376669 2968296 1937976 320371 -1941000 -4639342 -7196275
36317 -7196275 -8994137 -9761254 -9667795 -9180844 -8818353 -8864743 -9216856 -9539720 -9565371 -9168966
36307 -9168966 -8234794 -6702719 -4870675 -3484848 -3308879 -4557240 -6772555 -9173692
36299 -9173692 -11048176 -11944812 -11754770 -10724190 -9282865 -7736454 -6132610 -4478072
36291 -4478072 -3044590 -2349063 -2764712 -4168004 -6009016 -7731933 -9094096 -10064609 -10485412
36282 -10485412 -9972890 -8251558 -5552806 -2575844 -9992 1858342 3069978 3674229
36274 3674229 3640040 3058618 2276280 1749780 1817309 2593947 3925738 5330543 6101626
36265 6101626 5697317 4133757 1967574 -125324 -1755628 -2893983 -3672267 -4158396 -4293477
36256 -4293477 -4031545 -3520487 -3065447 -2862276 -2838741 -2820028 -2742055 -2582201 -2208192 -1529156
36246 -1529156 -754235 -220617 113642 773696 2228151 4393327 6761492 8826603 10253952
36237 10253952 10866688 10750444 10292133 9863262 9456840 8780968 7654392 6149549 4432294
36228 4432294 2679846 1094883 -263244 -1643521 -3298239 -4955619 -5904367 -5747511
36220 -5747511 -4798110 -3520284 -1835000 680634 4001390 7399442 10030018 11542495
36212 11542495 12051289 11732987 10641093 8853724 6650411 4493975 2861869 2083841
36204 2083841 2270415 3294538 4787867 6246519 7322941 8066207 8734413 9294666 9289238
36195 9289238 8401386 7066016 6256631 6587971 7743822 8792860 8917547 7847687 5867403
36186 5867403 3621118 1801526 772799 405319 318257 265566 232433 217630 58318 -500071
36176 -500071 -1647336 -3461706 -5942284 -8988322 -12307565 -15366704 -17507733 -18239117
36168 -18239117 -17528167 -15838836 -13839381 -12011371 -10470465 -9074576 -7657020 -6214688
36160 -6214688 -4973257 -4282834 -4362204 -5074956 -5971000 -6592963 -6766482 -6623095 -6400493
36151 -6400493 -6255555 -6231571 -6330172 -6574926 -7014879 -7681929 -8538040 -9451388 -10231026 -10710213
36141 -10710213 -10818380 -10585119 -10096091 -9474280 -8890104 -8504081 -8325200 -8176276 -7927833
36132 -7927833 -7778454 -8135405 -9072354 -9980463 -9944197 -8515482 -6039628 -3242505 -663527
36123 -663527 1466698 3040394 4052307 4752351 5562944 6675398 7776351 8264355 7726484
36114 7726484 6177431 3910376 1240377 -1570983 -4226493 -6356288 -7650743 -8038173
36106 -8038173 -7687385 -6806106 -5474839 -3730277 -1769928 49799 1481505 2594020
36098 2594020 3650514 4812921 6006907 7008311 7557284 7417691 6478669 4886401 3017236
36089 3017236 1244240 -254112 -1421702 -2122561 -2122180 -1322018 12210 1303974 2008828
36080 2008828 1995039 1658405 1657174 2469848 4141104 6370563 8728151 10727754 11824834
36071 11824834 11601221 10110560 7992826 6124738 5104009 5042778 5732900 6838261 7905460
36062 7905460 8382740 7868255 6429646 4616955 3072706 2079686 1444851 764218 -215639
36053 -215639 -1418778 -2510145 -3128313 -3146514 -2793661 -2497400 -2522544 -2727079 -2702493 -2172615
36043 -2172615 -1242575 -279363 381572 597444 395144 -89302 -655630 -1143425 -1571588
36034 -1571588 -2132779 -2959197 -3867045 -4395122 -4182171 -3333142 -2360841 -1711415 -1380959
36025 -1380959 -1083151 -777195 -876196 -1820712 -3509720 -5256406 -6257001 -6007659 -4383684
36016 -4383684 -1608204 1745292 4931004 7432182 9163161 10210022 10523642 10047787
36008 10047787 9021218 7853166 6671225 5255860 3529312 1883917 848621 580627
36000 580627 871638 1520106 2432326 3384457 3968073 3901721 3265285 2334637 1294808 218546
35990 218546 -755437 -1361031 -1345539 -649524 511871 1706657 2485499 2627032 2229276
35981 2229276 1564554 865879 245903 -266161 -706371 -1196992 -1908530 -2924162 -4100508
35972 -4100508 -5072665 -5471996 -5214104 -4546331 -3733393 -2732000 -1315633 459131 2074456
35963 2074456 2940951 2867337 2073932 899072 -351086 -1408698 -2177078 -2861759 -3742252
35954 -3742252 -4755809 -5486629 -5623792 -5238951 -4521113 -3461250 -2032503 -595283 134060
35945 134060 -379734 -2029236 -4120288 -5807199 -6494661 -5968769 -4325895 -1913740 657250
35936 657250 2658256 3689866 4057533 4510390 5480345 6700977 7674742 8344005 9113192
35927 9113192 10326965 11940949 13616817 14876581 15192944 14262157 12358001 10253365
35919 10253365 8636613 7652902 7029027 6472253 5847309 5141625 4482344 4175689 4565193
35910 4565193 5752968 7432539 8968555 9684596 9222964 7730360 5668375 3417024
35902 3417024 1108361 -1185263 -3268619 -4915512 -6030177 -6627049 -6752559 -6521106 -6111065
35893 -6111065 -5585412 -4809051 -3717823 -2621915 -2042421 -2190612 -2704928 -2921802 -2337586
35884 -2337586 -854027 1252162 3514217 5512833 7044191 8121329 8872354 9453575
35876 9453575 9967362 10377398 10573738 10625548 10894179 11733773 13082614 14463596 15352028
35867 15352028 15414593 14484376 12606866 10220884 8076404 6776183 6436448 6827726 7677388
35858 7677388 8706203 9525273 9739796 9194944 8048639 6638744 5340677 4454359 4065839
35849 4065839 4007189 4037395 4054942 4075161 4055660 3852493 3330671 2435277 1196111 -226118
35839 -226118 -1529476 -2446534 -2948849 -3173325 -3157168 -2807407 -2188302 -1675073 -1665528 -2177688
35829 -2177688 -2831342 -3188944 -3011353 -2217506 -787058 1148323 3158502 4623422 5113843
35820 5113843 4686358 3790974 2926182 2417469 2433006 3014397 4010622 5118592 6135395
35811 6135395 7117693 8164542 9088095 9464790 9042629 7989933 6745920 5773517 5463885
35802 5463885 6033027 7306275 8700836 9633268 9969856 9975090 9854478 9511184 8778503
35793 8778503 7720865 6578824 5487103 4367508 3091317 1654448 164105 -1286854
35785 -1286854 -2670920 -3944153 -4945647 -5428679 -5240841 -4489320 -3503135 -2605026 -1919952
35776 -1919952 -1405897 -1033517 -885548 -1080372 -1653719 -2553778 -3712329 -5039233 -6328902
35767 -6328902 -7261923 -7613377 -7482561 -7243958 -7204875 -7312088 -7214027 -6597413 -5459712 -4104667
35757 -4104667 -2912625 -2055157 -1328100 -257308 1526882 3945569 6517814 8752742
35749 8752742 10422846 11438802 11626492 10827406 9194597 7182970 5158476 3148692
35741 3148692 1080784 -860014 -2280517 -2942698 -2908921 -2328555 -1272167 125177 1486722
35732 1486722 2318217 2319384 1545710 343416 -785644 -1326461 -933796 433862 2564319
35723 2564319 5151860 7870577 10357768 12273090 13436454 13857241 13616238 12790893 11501529
35714 11501529 9907579 8083104 5998081 3746706 1737295 489895 189536 515313
35706 515313 950534 1211145 1357077 1572876 1915737 2244489 2324236 2003782 1350130 638947
35696 638947 199439 252057 875761 2070897 3768452 5738631 7535173 8630841 8711041
35687 8711041 7895339 6671851 5575172 4881064 4559559 4442770 4368611 4194722 3817587
35678 3817587 3299982 2950658 3146935 3995942 5183934 6182317 6588410 6288162 5401690
35669 5401690 4189412 3002544 2194314 1962284 2262119 2911708 3776056 4801806 5852878
35660 5852878 6577020 6544690 5593310 4032577 2467436 1384448 882312 748915 730255
35651 730255 710670 702352 746861 854195 1017448 1276967 1774043 2719947 4267235 6384457
35641 6384457 8851517 11363776 13630466 15409217 16517164 16852545 16413996 15322114
35633 15322114 13846958 12360286 11140027 10169170 9195291 8048332 6853387 5880112
35625 5880112 5242731 4819109 4403060 3843314 3110120 2392841 2108300 2594912 3715136
35616 3715136 4936285 5931328 6946818 8396578 10197740 11728483 12405912 12095871 10978860
35607 10978860 9302067 7386991 5653982 4411537 3676431 3317986 3281614 3524447 3823773
35598 3823773 3860565 3504837 2864153 2023461 876614 -720456 -2716433 -4841532 -6773926
35589 -6773926 -8318955 -9488212 -10425287 -11220551 -11818611 -12153008 -12301738 -12384690 -12341919
35580 -12341919 -11968793 -11169309 -10001589 -8453605 -6407780 -3965806 -1628955 53218
35572 53218 956891 1382985 1686622 2074075 2664881 3488744 4373619 5030330 5343955 5471228
35562 5471228 5584080 5626828 5427871 5001162 4642119 4696439 5227288 5890838 6155216 5684609
35552 5684609 4523869 2947296 1254006 -221667 -1072286 -1047496 -333363 606796 1545381
35543 1545381 2689004 4281177 6149062 7760650 8630643 8562671 7607402 5979022 4039339
35534 4039339 2249466 1043644 670954 1045325 1716969 2127824 2040687 1703245 1526337
35525 1526337 1651719 1897110 2021089 1881408 1357552 299839 -1336350 -3329503 -5193450
35516 -5193450 -6354383 -6417691 -5387537 -3655542 -1720831 107870 1760966 3266441
35508 3266441 4650170 5907832 6939611 7524107 7492787 6974703 6387501 6150323 6442746
35499 6442746 7199752 8205703 9165183 9822617 10130360 10284982 10574995 11225082 12346079
35490 12346079 13885858 15571309 17028270 18060168 18722255 19044742 18831565 17925655 16595747
35481 16595747 15395594 14560346 13726912 12380763 10460680 8381341 6549757 5050442
35473 5050442 3793928 2754582 1931191 1190547 333487 -660674 -1554124 -2053326 -2042580
35464 -2042580 -1607466 -908353 -97651 672494 1244763 1501326 1408876 1014015 405874 -301107
35454 -301107 -949342 -1350187 -1396081 -1192728 -999777 -942401 -812786 -278182 691710 1708981
35444 1708981 2326753 2439436 2300414 2256593 2526682 3095648 3657203 3711128 2907531 1380331
35434 1380331 -284879 -1400809 -1500091 -488073 1284157 3086754 4165143 4179882 3293924
35425 3293924 1871467 231535 -1321694 -2496121 -3241292 -3860357 -4668493 -5546679 -6015392
35416 -6015392 -5800873 -5196631 -4785529 -4886853 -5354293 -5841899 -6136198 -6228116 -6213629 -6260516
35406 -6260516 -6634088 -7579226 -9050266 -10592697 -11599046 -11715374 -10970621 -9554592 -7604317
35397 -7604317 -5274053 -2905545 -943156 410710 1407491 2522619 3966153 5449115
35389 5449115 6479840 6880311 6960153 7185130 7733873 8370529 8635626 8106254 6601833
35380 6601833 4309361 1718081 -666827 -2578983 -3966914 -4832654 -5222717 -5310111 -5297525
35371 -5297525 -5215222 -4958818 -4557483 -4259601 -4292501 -4656997 -5218824 -5879396 -6566170 -7143017
35361 -7143017 -7423028 -7241268 -6526473 -5437401 -4466466 -4222368 -4950017 -6330021 -7833748
35352 -7833748 -9163414 -10244905 -10963604 -11164322 -10908575 -10545271 -10464737 -10835498 -11530175
35343 -11530175 -12201651 -12492977 -12332017 -12006826 -11800637 -11554782 -10761562 -9140253 -6987298
35334 -6987298 -4892250 -3217221 -1928253 -837244 120319 861509 1357902 1813336 2574863
35325 2574863 3823065 5403874 7026933 8548381 9938922 11052169 11628332 11537498 10827043
35316 10827043 9488723 7407657 4692116 1891615 -324548 -1675424 -2343207 -2627972
35308 -2627972 -2704817 -2685964 -2685625 -2685122 -2418122 -1529820 96500 2169455 4145156 5582447
35298 5582447 6406724 6863360 7214578 7483877 7503671 7196259 6774446 6647220 7123657 8201059
35288 8201059 9631120 11174285 12757046 14373954 15907665 17147994 17994191 18528025
35280 18528025 18803724 18618010 17599456 15564872 12753652 9689769 6828364 4339159
35272 4339159 2198467 443495 -692772 -894911 1827 1870466 4313959 6777864
35264 6777864 8696377 9662110 9556532 8538640 6903560 4955152 2981871 1267372
35256 1267372 43009 -598427 -752435 -687581 -765324 -1285596 -2304680 -3571612 -4698395
35247 -4698395 -5465305 -5979663 -6511125 -7171313 -7800847 -8177317 -8236633 -8003986 -7400940 -6312017
35237 -6312017 -4849401 -3342740 -1971657 -601403 852702 2072907 2612583 2443262
35229 2443262 1944292 1358512 584155 -376722 -1063192 -913153 139612 1626695 3018369
35220 3018369 4045067 4620566 4706384 4349475 3739738 3144394 2803825 2877145 3411401 4324749
35210 4324749 5421741 6398911 6845212 6380348 4959258 3042762 1352307 412650 357990
35201 357990 1106410 2549703 4514867 6674215 8650295 10250160 11576721 12909432
35193 12909432 14466523 16229473 17937776 19231426 19819804 19573610 18528126 16821960
35185 16821960 14589554 11881950 8723660 5270778 1874353 -1043045 -3151719 -4281366
35177 -4281366 -4444572 -3860040 -2853459 -1625493 -164128 1541475 3300080 4874695
35169 4874695 6274284 7706904 9251056 10758883 12118254 13417024 14737203 15914941
35161 15914941 16627249 16647999 15944557 14628812 12944230 11247999 9864163 8913808 8303891
35152 8303891 7831439 7270603 6473554 5510337 4654070 4106285 3781151 3494046 3308247
35143 3308247 3473351 3963999 4300476 4027799 3308216 2859999 3271450 4443702 5688950
35134 5688950 6272069 5860049 4611023 2986172 1469429 333059 -459150 -1173722 -2096506
35125 -2096506 -3298556 -4527465 -5346992 -5477186 -5050291 -4504599 -4211593 -4254322 -4568295
35116 -4568295 -5152090 -5979756 -6742822 -6882252 -6009949 -4267026 -2210724 -376662 1028847
35107 1028847 2090395 2945095 3594878 3924715 3912629 3807533 4006779 4690723 5642648
35098 5642648 6517384 7232985 7966449 8761736 9281222 9035037 7823746 5922136 3864361
35089 3864361 2069712 628729 -596245 -1670757 -2408792 -2539456 -2054608 -1325904 -821515
35080 -821515 -700858 -684846 -310718 659321 2025333 3334531 4309362 5071650 5891525
35071 5891525 6763765 7362681 7434703 7104273 6730670 6584928 6754780 7217091 7792125 8059504
35061 8059504 7559569 6216335 4487540 3000497 2059123 1548503 1270852 1281506 1857183
35052 1857183 3152029 4918629 6610176 7788692 8416174 8720648 8838990 8710559 8329111
35043 8329111 7938167 7835835 8043066 8318861 8518384 8792597 9349921 10112812 10729005
35034 10729005 10904101 10641519 10177486 9783697 9642318 9789084 10083106 10277740 10213116
35025 10213116 9955477 9720356 9672271 9823923 10095860 10417453 10775610 11207816 11738414
35016 11738414 12274655 12571487 12356651 11511841 10107250 8275375 6124765 3813938 1658027
35007 1658027 84415 -565216 -228242 837121 2190563 3429578 4333656 4863632 5102536
34998 5102536 5232328 5492989 6045601 6847850 7715932 8496713 9085316 9266853 8701082
34989 8701082 7221738 5132399 3081101 1593024 770762 457209 596343 1332945 2752505
34980 2752505 4595485 6290324 7281848 7341651 6630002 5549306 4538421 3888805 3652332
34971 3652332 3747223 4213379 5314618 7275373 9898425 12518611 14360221 14919269 14085855
34962 14085855 12097634 9473012 6872641 4851974 3664399 3249434 3335218 3571865 3723706
34953 3723706 3835772 4128715 4628632 4968587 4680580 3672030 2339991 1258563 839311
34944 839311 1213079 2223987 3439399 4276191 4273992 3323414 1670803 -254946 -2026416
34935 -2026416 -3307964 -3858852 -3533708 -2356310 -605911 1252697 2819449 3960345
34927 3960345 4758678 5312820 5612508 5563504 5096028 4311897 3571411 3336272 3801417 4701365
34917 4701365 5551273 6025433 6024910 5496470 4400118 2862954 1190427 -326577 -1510684
34908 -1510684 -2227992 -2422309 -2294966 -2277223 -2679741 -3432168 -4227102 -4806008 -5023961 -4788436
34898 -4788436 -4134449 -3345363 -2863322 -3046641 -4037920 -5781078 -8027348 -10315779 -12060443
34889 -12060443 -12759751 -12211449 -10643307 -8675987 -7023431 -6051049 -5586027 -5205082 -4698285
34880 -4698285 -4232230 -4130654 -4555253 -5316413 -5898959 -5771151 -4862900 -3762325 -3291110
34871 -3291110 -3798016 -4894296 -5851618 -6158490 -5714311 -4679291 -3290115 -1792403 -450021
34862 -450021 438468 590758 -99936 -1411708 -2839262 -3841397 -4084165 -3543421 -2508987
34853 -2508987 -1512588 -1115619 -1612931 -2871922 -4421257 -5673226 -6143195 -5636119 -4331918
34844 -4331918 -2646669 -939477 648294 2093774 3348467 4356976 5129709 5684689
34836 5684689 5937829 5730795 4953098 3568580 1549682 -1100422 -4205962 -7336456 -9899213
34827 -9899213 -11325479 -11250737 -9687511 -7150352 -4565111 -2861073 -2448756 -3001500 -3771667
34818 -3771667 -4187786 -4189462 -4030421 -3858138 -3578545 -3087426 -2474541 -1914454 -1434883 -891220
34808 -891220 -146304 788357 1757437 2541675 2975166 3072338 2998227 2776268 2025109 187207
34798 187207 -2801855 -6106847 -8413188 -8858601 -7600218 -5556993 -3693565 -2503890
34790 -2503890 -1965297 -1780564 -1647507 -1433936 -1201178 -1053459 -941707 -663885 -107629
34781 -107629 570660 1128093 1604595 2384164 3796571 5703098 7540348 8730944 9000056
34772 9000056 8387248 7126747 5556707 4016146 2716181 1704171 937830 305234 -459990
34763 -459990 -1757379 -3845076 -6524762 -9125312 -10832424 -11109464 -9957757 -7913322
34755 -7913322 -5778908 -4215863 -3465449 -3400428 -3801575 -4566643 -5702846 -7180988 -8783368
34746 -8783368 -10052860 -10447882 -9675512 -7919241 -5682786 -3382144 -1128174 1102739
34738 1102739 3174159 4702660 5219671 4444003 2529447 105202 -2042124 -3449422
34730 -3449422 -4141678 -4335904 -4129022 -3550727 -2727921 -1768956 -577722 946943 2527038
34721 2527038 3596117 3862164 3538217 2881768 1770662 21602 -2007113 -3481769 -3830267
34712 -3830267 -3216235 -2243160 -1400006 -886482 -756069 -980046 -1396051 -1775192 -2002034
34703 -2002034 -2117551 -2157562 -2020103 -1562284 -829479 -146885 58079 -450850 -1581950
34694 -1581950 -3015994 -4358556 -5186817 -5104880 -3963419 -2077937 -119998 1284725 1834695
34685 1834695 1495148 371576 -1236582 -2800399 -3816711 -4156984 -4080475 -3912675 -3820700
34676 -3820700 -3886034 -4190291 -4670363 -4958123 -4534040 -3110106 -842170 1814805 4399074
34667 4399074 6607353 8299858 9475743 10274752 10931944 11626978 12305322 12636924 12197401
34658 12197401 10760663 8473471 5781580 3201642 1141668 -138317 -505613 19702
34650 19702 1201346 2577835 3573176 3722556 2942085 1679458 735601 733055 1588056 2498776
34640 2498776 2564720 1527478 -27747 -1151237 -1217675 -266888 1160331 2443408 3217525
34631 3217525 3449775 3316326 3052451 2862965 2852222 2970426 3086892 3198070 3523437 4287492
34621 4287492 5401873 6453862 7015352 6863135 5897728 4038598 1364354 -1703394 -4515443
34612 -4515443 -6540993 -7576078 -7684250 -7076672 -6084985 -5134082 -4605889 -4667828 -5220912
34603 -5220912 -6020900 -6870783 -7703746 -8476132 -9031385 -9170125 -8870344 -8320857 -7652691
34594 -7652691 -6711815 -5189687 -2932357 -68844 3038915 5824113 7613112 7996878
34586 7996878 7216185 6018334 4989646 4052836 2644352 325964 -2750112 -5818246
34578 -5818246 -7884600 -8307739 -7166395 -5051642 -2483435 378687 3461046 6448480
34570 6448480 8900252 10552317 11302066 10985753 9438525 6827630 3733727 775728
34562 775728 -1798204 -4121189 -6385296 -8542191 -10280836 -11307841 -11703178 -11957250 -12540565
34553 -12540565 -13422763 -14099638 -14085245 -13277487 -11876691 -10147871 -8350903 -6739416 -5451228
34544 -5451228 -4424656 -3505281 -2578461 -1515876 -92439 1851321 4127641 6202341
34536 6202341 7550530 7995272 7737294 7179554 6750219 6725211 7029620 7210639 6749152
34527 6749152 5478055 3658346 1645234 -408259 -2458641 -4329667 -5764502 -6715041
34519 -6715041 -7390444 -7938771 -8223571 -8032718 -7396263 -6539078 -5576353 -4432206 -3072648
34510 -3072648 -1678274 -546521 74559 34380 -703362 -1998703 -3547535 -5033637 -6281891
34501 -6281891 -7295673 -8211458 -9180455 -10153197 -10742706 -10434412 -9029917 -6828805 -4336267
34492 -4336267 -1888745 384283 2376378 3937060 4941248 5310849 5004357 4099057 2878529
34483 2878529 1754438 1084822 1061824 1658475 2571774 3294444 3408177 2833662 1731401
34474 1731401 222541 -1646292 -3679843 -5454611 -6557155 -6864504 -6599309 -6189018 -6037213
34465 -6037213 -6276126 -6686875 -6957666 -7043352 -7145028 -7294023 -7123518 -6199570 -4512892
34456 -4512892 -2528843 -803904 341621 855138 882079 751239 885276 1538834 2572791
34447 2572791 3539397 4023237 3885187 3198345 2065751 614724 -885336 -2099811 -2928767
34438 -2928767 -3616091 -4417298 -5209370 -5570917 -5225972 -4251167 -2817183 -882198 1747656
34429 1747656 5103614 8865390 12472125 15421384 17508940 18787060 19287530 18894144
34421 18894144 17614357 15887456 14382032 13425454 12789476 12073281 11105875 9907123 8497843
34412 8497843 6950805 5504851 4449429 3965259 4173352 5161984 6741470 8273147 9010766
34403 9010766 8665009 7533526 6130409 4801270 3575590 2180865 283139 -2027547
34395 -2027547 -4015891 -4841047 -4377141 -3302161 -2371219 -1849702 -1666296 -1748054 -1989635
34386 -1989635 -2143431 -2013496 -1661052 -1252339 -827180 -378193 -8858 209621 449914
34377 449914 971708 1777791 2597611 3189687 3520599 3695048 3862139 4136031 4436155 4447926
34367 4447926 3921015 2964826 1849321 562853 -1154058 -3296121 -5397543 -6978386
34359 -6978386 -7966996 -8541283 -8795389 -8822348 -8977248 -9713113 -11078744 -12556482 -13475433
34350 -13475433 -13499619 -12704336 -11319684 -9503178 -7320774 -4866577 -2357274 -75005
34342 -75005 1805536 3304474 4512256 5386090 5671658 4972738 2908341 -617608 -5120221
34333 -5120221 -9576533 -13006620 -15112332 -16255263 -16824651 -16840843 -16255252 -15363939 -14624420
34324 -14624420 -14139813 -13619896 -12897583 -12229965 -11953493 -12021334 -12059370 -11770394 -11090812 -10008878
34314 -10008878 -8466807 -6515909 -4410253 -2426832 -659951 922717 2285516 3298986
34306 3298986 3898732 4176453 4292063 4367475 4504441 4842421 5515238 6545337 7824216
34297 7824216 9188136 10440976 11283085 11334191 10386217 8667844 6755927 5142144 3909297
34288 3909297 2856797 1868683 1073780 677594 733453 1102375 1597170 2159419 2909316
34279 2909316 3986087 5310423 6569775 7501930 8111201 8490061 8517108 7958576 6907385
34270 6907385 5909440 5505642 5734358 6177926 6402881 6254774 5837513 5387613 5151172
34261 5151172 5215179 5384430 5283625 4634472 3455188 2047137 831699 140766 67216
34252 67216 491586 1245816 2181342 3053922 3483051 3193400 2293385 1217785 400963 61412
34242 61412 216102 724534 1290657 1562780 1322669 558225 -622723 -2058935 -3529894
34233 -3529894 -4815945 -5823446 -6584619 -7112931 -7345327 -7266961 -7013445 -6781351 -6650977
34224 -6650977 -6498834 -6050006 -5053258 -3507686 -1739425 -190549 860867 1303171 995316
34215 995316 -193080 -2037412 -3818992 -4747980 -4578045 -3767040 -3042396 -2808775 -2898221
34206 -2898221 -2830549 -2350519 -1758586 -1695407 -2568725 -4178816 -5854693 -6909723 -7064188
34197 -7064188 -6614733 -6215718 -6311027 -6663985 -6526866 -5343699 -3240088 -866127 1049397
34188 1049397 1977142 1751683 737551 -293091 -720670 -540604 -170719 85401 185991
34179 185991 61056 -515651 -1669363 -3215672 -4812311 -6221987 -7356501 -8136584 -8382832
34170 -8382832 -7853186 -6425683 -4299171 -1980170 -9952 1270658 1696986 1218160 32607
34161 32607 -1345440 -2413739 -3079544 -3561831 -3953042 -4109840 -3954898 -3609457 -3184510
34152 -3184510 -2722132 -2431751 -2670060 -3462122 -4239898 -4284791 -3320561 -1537911 738459
34143 738459 3120940 5040841 5954701 5802408 5119836 4648365 4895592 5961954 7525091
34134 7525091 8913315 9379015 8474589 6222191 3030522 -399373 -3149798 -4384902
34126 -4384902 -3835094 -2004255 182138 1971098 3096981 3665740 3861234 3788942 3570829
34117 3570829 3524623 4122446 5654176 7938168 10446017 12714002 14572707 16016847 16987099
34108 16987099 17320460 16837301 15475652 13459007 11363343 9868764 9306064 9468321 9925267
34099 9925267 10479114 11254792 12388057 13699702 14679816 14785963 13815839 12040935 9958786
34090 9958786 7908009 5972841 4238231 2972998 2436973 2586836 3122540 3823360 4723224
34081 4723224 5925363 7331709 8625560 9527088 10060310 10538440 11207031 11879729 12047074
34072 12047074 11452454 10463828 9709558 9395373 9182521 8742407 8188596 7853524 7844595 7997355
34062 7997355 8122485 8096355 7817540 7331435 6976503 7141929 7794046 8421664 8536391 8079980
34052 8079980 7270545 6236539 4949946 3381750 1552543 -472407 -2466085 -4014789
34044 -4014789 -4847457 -5189075 -5580613 -6305976 -7159229 -7794338 -8081702 -8018178 -7506428 -6454605
34034 -6454605 -5023568 -3574632 -2359199 -1379234 -545143 160709 701489 1041286 1109499
34025 1109499 790408 56735 -884840 -1663519 -2020272 -1997977 -1803326 -1489039 -880841 100086
34015 100086 1131453 1673837 1480137 798464 50700 -538877 -947519 -1192090 -1342284
34006 -1342284 -1582991 -2046164 -2572850 -2775133 -2350886 -1290544 119553 1349605 1798913
33997 1798913 1216334 24919 -986940 -1432132 -1675225 -2354825 -3707794 -5463996 -7232510
33988 -7232510 -8777450 -9970469 -10693906 -10875455 -10542758 -9801798 -8797250 -7698225 -6674852
33979 -6674852 -5854325 -5280616 -4893827 -4568385 -4231882 -3935812 -3711926 -3349735 -2476866
33970 -2476866 -995614 617681 1560207 1238624 -455773 -3238492 -6584935 -9820062
33962 -9820062 -12297095 -13659977 -13944650 -13439444 -12503408 -11458519 -10463163 -9391234 -7947438
33953 -7947438 -6038824 -4012261 -2432575 -1625467 -1500143 -1800167 -2406905 -3308973 -4329810
33944 -4329810 -5049666 -5126342 -4678554 -4233867 -4225530 -4577132 -4814740 -4515853 -3578336 -2137768
33934 -2137768 -401197 1388739 2959504 4116597 4861021 5361124 5800590 6244458 6601675
33925 6601675 6674514 6269928 5341903 4100993 3002447 2544095 2926315 3832266 4619660
33916 4619660 4847258 4618566 4353033 4258242 4119150 3570639 2434362 767260 -1261397
33907 -1261397 -3428093 -5475926 -7214846 -8623557 -9812174 -10879252 -11793961 -12365515
33899 -12365515 -12328376 -11545788 -10165954 -8492082 -6650414 -4487012 -1876240 964958
33891 964958 3596785 5734850 7380556 8623312 9492314 10036056 10380141 10588401 10549696
33882 10549696 10138207 9499649 9097136 9400065 10481040 11890136 12942923 13199988 12733583
33873 12733583 11967701 11280478 10745036 10182621 9404095 8427792 7529462 7063564 7145337
33864 7145337 7474356 7535416 7041088 6185037 5448208 5149344 5156615 5004666 4310474 3125157
33854 3125157 1889502 1025434 588703 343792 111378 -62087 -47663 219208 817648
33845 817648 1953195 3825941 6335248 8947664 10887147 11513358 10645162 8640462 6173343
33836 6173343 3847898 1924038 319785 -1198335 -2819170 -4564174 -6249636 -7570543
33828 -7570543 -8286965 -8363025 -7934015 -7177081 -6251676 -5333616 -4623584 -4266043 -4252098 -4409496
33818 -4409496 -4503289 -4379302 -4037669 -3567029 -2999560 -2234489 -1102287 503720 2533246
33809 2533246 4753889 6791839 8247728 8857662 8607393 7727199 6569048 5413433 4303519
33800 4303519 3057061 1499824 -301845 -2093230 -3708432 -5197182 -6634240 -7905178
33792 -7905178 -8792932 -9255472 -9530488 -9940861 -10611684 -11353247 -11789060 -11615705 -10760449
33783 -10760449 -9287399 -7218812 -4589469 -1697878 888863 2757812 4020396 5120533
33775 5120533 6312617 7461102 8305910 8743402 8852396 8868326 9223663 10402533 12517105
33766 12517105 15038608 17105065 18173718 18373164 18258912 18283985 18479974 18553464 18220102
33757 18220102 17437870 16351041 15064411 13514591 11548512 9094677 6281300 3443924
33749 3443924 1006769 -724876 -1710762 -2125194 -2182708 -2014771 -1616135 -788219 825050
33740 825050 3470065 6978007 10812902 14465481 17705635 20416109 22340589 23159544
33732 23159544 22785009 21478934 19699959 17902090 16430154 15477467 15078539 15136776 15431516
33723 15431516 15603393 15251074 14172858 12516912 10631606 8770568 6962668 5092145
33715 5092145 3012777 640152 -1915094 -4260024 -5859559 -6345824 -5693770 -4106037
33707 -4106037 -1792911 1081514 4254767 7248129 9506273 10747156 11167050 11216679 11152467
33698 11152467 10867548 10140780 8904407 7232205 5275107 3390458 2197594 2226179 3452442
33689 3452442 5317092 7220402 8897718 10358508 11662994 12811049 13680361 13985060
33681 13985060 13429654 12017091 10131023 8234517 6548495 5067540 3776524 2737617
33673 2737617 2005047 1527441 1105656 430113 -732740 -2295378 -3839316 -4919533 -5336068
33664 -5336068 -5076967 -4128563 -2496361 -371848 1876217 3918160 5610778 6942537
33656 6942537 7921957 8541841 8793754 8688053 8273933 7625677 6789188 5784453 4707755
33647 4707755 3784897 3236170 3072286 3044681 2774562 1941276 491162 -1179373 -2290663
33638 -2290663 -2131999 -568345 1926893 4745770 7576597 10363784 12985651 15107935
33630 15107935 16354114 16567788 15930833 14883757 13907498 13263360 12825372 12137453 10719764
33621 10719764 8462566 5819644 3612537 2570423 2959659 4533189 6721222 8875622
33613 8875622 10489842 11347729 11495215 11046608 10053082 8579373 6816794 5036847 3503423
33604 3503423 2515983 2421802 3383255 5139057 7158386 9024817 10490448 11173605 10522860
33595 10522860 8303519 5003883 1592707 -1074065 -2566483 -2853118 -2253800 -1357744
33587 -1357744 -686214 -309397 112915 901918 2070562 3396462 4552732 5125427 4766326
33578 4766326 3561803 2186444 1501270 1935125 3270679 4962273 6554695 7798576
33570 7798576 8475440 8240463 6747328 4002868 571642 -2687833 -5163062 -6750898
33562 -6750898 -7617588 -7836596 -7340892 -6125452 -4360795 -2330394 -346385 1316830 2543032
33553 2543032 3463732 4346856 5350754 6406919 7324151 7949902 8244469 8272399 8128191
33544 8128191 7811121 7183408 6138046 4817293 3562681 2589158 1766592 774617 -567478
33535 -567478 -2154044 -3701862 -4924782 -5624780 -5691176 -5054388 -3665660 -1574892 936996
33526 936996 3343196 5066848 5759096 5454841 4525845 3470742 2632927 2013314 1357813
33517 1357813 477332 -519042 -1331947 -1787722 -2005666 -2259812 -2707847 -3251166 -3634199
33508 -3634199 -3678245 -3421339 -3013853 -2488469 -1692851 -474217 1129625 2923347 4705730
33499 4705730 6310898 7564307 8335875 8653648 8657557 8396726 7756129 6644338 5193187
33490 5193187 3696861 2374029 1235359 147260 -1045030 -2433166 -3972765 -5441350
33482 -5441350 -6542447 -7147207 -7425058 -7656928 -7914900 -8029007 -7925801 -7884880 -8296799
33473 -8296799 -9168563 -10016548 -10309544 -9912867 -9031635 -7847635 -6376208 -4652087 -2894384
33464 -2894384 -1415241 -411658 139567 441656 749932 1206117 1713869 1952838 1543630
33455 1543630 275429 -1727604 -4033166 -6173235 -7964325 -9525875 -10958429 -12123471
33447 -12123471 -12870275 -13394713 -14154211 -15365747 -16725713 -17717384 -18131890 -18232809 -18457684
33438 -18457684 -18979781 -19489993 -19379008 -18223499 -16179549 -13900169 -12067334 -11018762
33430 -11018762 -10729134 -10951971 -11322155 -11503426 -11413065 -11269735 -11326222 -11593320 -11893278 -12100897
33420 -12100897 -12195033 -12094938 -11596229 -10549899 -9074036 -7551278 -6403167 -5832722 -5752652
33411 -5752652 -5954580 -6311306 -6752393 -7087344 -7036722 -6551659 -5992965 -5827456 -6152822 -6628639
33401 -6628639 -6859469 -6724920 -6325510 -5756211 -5051922 -4307503 -3714404 -3393500 -3215621
33392 -3215621 -2883231 -2249108 -1493167 -887888 -434190 115244 857834 1553890 1940956
33383 1940956 2081777 2232181 2440336 2441035 1928202 833120 -592671 -1824443 -2267995
33374 -2267995 -1653620 -314495 1015726 1707772 1501426 397114 -1457609 -3709271 -5820208
33365 -5820208 -7308877 -7963182 -7832661 -7118225 -6072401 -4860409 -3459423 -1800932 -49556
33356 -49556 1384719 2170522 2296506 1987897 1557653 1381595 1767829 2641862 3494181 3869283
33346 3869283 3882152 4102705 4969394 6446124 8172304 9735182 10799594 11205629 11065592
33337 11065592 10665924 10190549 9612882 8923504 8383624 8428521 9268643 10589974 11681083
33328 11681083 11934466 11295042 10205030 9081504 7922649 6522435 5001668 3935329
33320 3935329 3886841 4914442 6570559 8250424 9444188 9778887 9045604 7282050 4776328
33311 4776328 1938243 -835175 -3194893 -4826844 -5498028 -5179597 -4142992 -2886874
33303 -2886874 -1873448 -1270363 -951968 -754363 -673675 -766928 -907197 -740419 69917 1576203
33293 1576203 3517316 5494605 7152903 8259256 8709716 8507748 7720658 6430354 4713277
33284 4713277 2662078 433338 -1709694 -3420611 -4416892 -4678835 -4483470 -4163341 -3819042
33275 -3819042 -3338714 -2717491 -2250511 -2304231 -2926087 -3775439 -4440692 -4737229 -4680892 -4294523
33265 -4294523 -3568856 -2598241 -1621288 -816530 -58716 1040453 2779948 5050304 7373151
33256 7373151 9218295 10248445 10349653 9626073 8458383 7434049 7042521 7422863 8460945
33247 8460945 10041886 12048621 14152815 15839800 16763657 16978430 16735561 16161114 15262358
33238 15262358 14191921 13332012 13032545 13283892 13661256 13593772 12742527 11198833 9355487
33229 9355487 7578988 5975352 4407926 2666881 619442 -1719279 -4187123 -6539606
33221 -6539606 -8529794 -9942773 -10624002 -10571880 -10006079 -9252145 -8512448 -7783476 -6978208
33212 -6978208 -6038052 -4929920 -3668991 -2396614 -1313045 -452380 375392 1337897 2381936
33203 2381936 3378956 4357415 5451463 6697565 8033975 9450842 10986004 12597953
33195 12597953 14181704 15669849 16947969 17703700 17608029 16748263 15713063 15109959 15077747
33186 15077747 15356588 15723006 16203682 16899400 17760180 18611116 19353015 20064375 20865011
33177 20865011 21684930 22218989 22143853 21337987 19854514 17774508 15220447 12466908 9840534
33168 9840534 7437343 5068390 2572721 83744 -2109283 -3872414 -5268875 -6334756
33160 -6334756 -6961416 -7041373 -6642070 -5965686 -5159509 -4223590 -3131586 -2009326 -1114805
33151 -1114805 -596192 -326606 -60950 273384 542527 653389 713107 903067 1287527 1777443
33141 1777443 2168931 2158393 1449363 -16489 -1962822 -3984209 -5804261 -7285142 -8292191
33132 -8292191 -8684780 -8396236 -7394519 -5588460 -2916206 432851 3958659 7033391
33124 7033391 9122676 9932695 9542308 8447410 7314433 6515002 5860776 4812114 2952672
33115 2952672 318948 -2611027 -5193437 -6954765 -7754323 -7665270 -6763330 -5138605 -3125304
33106 -3125304 -1360413 -437215 -472932 -1087886 -1815796 -2465954 -3079129 -3647057 -4001371
33097 -4001371 -3984030 -3636238 -3164748 -2771935 -2592616 -2769845 -3461774 -4671420 -6086863
33088 -6086863 -7172966 -7483337 -6922408 -5744142 -4306458 -2789898 -1131271 751389
33080 751389 2694511 4346502 5523667 6393519 7205089 7942730 8423390 8703782 9186366
33071 9186366 10250607 11900581 13819031 15631556 17066675 18044463 18766812 19597213 20642107
33062 20642107 21467277 21389896 20082382 17819855 15195423 12733542 10722536 9168052
33054 9168052 7780941 6137005 3992040 1444371 -1192801 -3556026 -5254623 -5956751
33046 -5956751 -5675386 -4919934 -4362260 -4276040 -4355807 -4078285 -3175907 -1794172 -309809
33037 -309809 973298 2030631 3061323 4188817 5227245 5814961 5772670 5246495 4507815
33028 4507815 3726309 2944242 2108837 1044992 -452100 -2330339 -4148776 -5391188 -5904575
33019 -5904575 -5906830 -5577485 -4787973 -3265122 -893110 2183374 5603936 8840206 11334656
33010 11334656 12788719 13330605 13303195 12900168 12117841 11041999 9987280 9224477 8666260
33001 8666260 7982705 7018632 5962219 5081945 4449597 4019292 3847877 4035112 4442072
32992 4442072 4647993 4285914 3341543 2058961 659544 -721970 -1896043 -2606298 -2727544
32983 -2727544 -2385285 -1811413 -1122727 -280600 772251 1979115 3151633 4058509 4560072
32974 4560072 4694810 4643250 4617692 4803783 5365541 6389863 7737831 8972260 9525386
32965 9525386 9040307 7644779 5949251 4730764 4483286 5164985 6345090 7568660 8555979
32956 8555979 9131348 9146389 8582294 7652499 6686535 5893992 5246568 4519584 3412065
32947 3412065 1749859 -280626 -2132685 -3271874 -3574912 -3299914 -2725277 -1971090 -1154361
32938 -1154361 -497972 -175843 -196692 -571153 -1465808 -2986493 -4823747 -6300107 -6869276
32929 -6869276 -6536449 -5778925 -5104660 -4676581 -4275044 -3579354 -2531268 -1468032 -889925
32920 -889925 -1083264 -1970095 -3291331 -4876313 -6721239 -8841248 -11060758 -12946858 -14009702
32911 -14009702 -14079026 -13526533 -13057400 -13205181 -13976545 -14914116 -15434063 -15145625 -13993423
32902 -13993423 -12185337 -9950207 -7328955 -4244165 -791735 2621796 5505876 7611236
32894 7611236 8980982 9742624 9952442 9653484 9028485 8466048 8448452 9291599 10931146
32885 10931146 12989225 15071195 16937943 18391076 19170047 19125550 18412998 17340912 16054718
32876 16054718 14508665 12682228 10606073 8185828 5272533 2028939 -958150 -3065417
32868 -3065417 -4016157 -3823225 -2586088 -544106 1839069 4130642 6255905 8379891
32860 8379891 10482607 12242981 13355495 13786544 13683473 13188984 12402891 11398109 10212830
$$ [...]
##END NTUPLES=NMR SPECTRUM
##END=
