##TITLE=31Pdec_IPACAT-34
 CDCl3 
  64 sc
 25.10.2023
##JCAMPDX= 6.0         $$ Bruker NMR JCAMP-DX V2.0
##DATA TYPE= NMR SPECTRUM
##DATA CLASS= NTUPLES
##ORIGIN= UXNMR, Bruker Analytische Messtechnik GmbH
##OWNER= root
$$ XWIN-NMR		Version 3.5
$$ Wed Oct 25 14:49:05 2023 Russian Standard Time (UT+4h)  she@DPX200
##.OBSERVE FREQUENCY= 81.013821
##.OBSERVE NUCLEUS= ^31P
##.ACQUISITION MODE= SIMULTANEOUS
##.ACQUISITION SCHEME= undefined
##.AVERAGES= 80
##.DIGITISER RES= 16
##SPECTROMETER/DATA SYSTEM= spect
##.PULSE SEQUENCE= zgpg30
##.SOLVENT NAME= CDCl3
##.SHIFT REFERENCE= (INTERNAL, CDCl3, 0, 248.564)
##AUDIT TRAIL= $$ (NUMBER, WHEN, WHO, WHERE, WHAT)
$$ ##TITLE= Audit trail, XWIN-NMR		Version 3.5
$$ ##JCAMPDX= 5.01
$$ ##ORIGIN= Bruker BioSpin GmbH
$$ ##OWNER= she
$$ F:/spectra/data/she/nmr/P31/1/pdata/1/auditp.txt
$$ ##AUDIT TRAIL=  $$ (NUMBER, WHEN, WHO, WHERE, WHAT)
(   1,<2023-10-25 14:48:14.76 +0400>,<she>,<DPX200>,
      <continue with go, POWCHK disabled, PULCHK disabled
       configuration hash MD5:
       00 E9 B6 7A A2 85 ED C7 34 08 36 98 17 FE 4E 26
       data hash MD5: 32K
       FC 4E 00 6B CB 0C 93 9A 94 94 6E 82 68 D1 2C A2>)
(   2,<2023-10-25 14:48:17.48 +0400>,<she>,<DPX200>,
      <Start of raw data processing
       efp BC_mod = 2 LB = 5 FT_mod = 6 PKNL = 1 PHC0 = -10735.98 PHC1 = 259.8862 SI = 64K 
       data hash MD5: 64K
       FB 01 D7 DC 25 8E 86 99 0F D2 8F 06 C2 37 6D AF>)
(   3,<2023-10-25 14:48:36.59 +0400>,<she>,<DPX200>,
      <pk PHC0 = 53.21532 PHC1 = -113.8 
       data hash MD5: 64K
       B6 FA 42 5B 3A 9A BA 9D 9F 7E 24 B1 CC CD A6 E3>)
$$ ##END=
$$ 
$$ hash MD5
$$ 8D 59 DD BC B1 67 E1 A5 AA E5 23 74 80 1C 22 2E
##$RELAX= 
##$RELAX= 
##$RELAX= 
##$RELAX= 
##$RELAX= 
##$RELAX= 
##$RELAX= 
##$RELAX= 
##$RELAX= 
$$ Bruker specific parameters
$$ --------------------------
##$DU= <F:/spectra>
##$EXPNO= 1
##$NAME= <P31>
##$PROCNO= 1
##$TYPE= <nmr>
##$USER= <she>
##$AMP= (0..31)
100 100 100 100 100 100 100 100 100 100 100 100 100 100 100 100 100 100 
100 100 100 100 100 100 100 100 100 100 100 100 100 100 
##$AQSEQ= 0
##$AQ_mod= 1
##$AUNM= <au_zg>
##$AUTOPOS= <>
##$BF1= 81.014009
##$BF2= 200.13
##$BF3= 200.13
##$BF4= 200.13
##$BF5= 200.13
##$BF6= 200.13
##$BF7= 200.13
##$BF8= 200.13
##$BYTORDA= 1
##$CFDGTYP= 0
##$CFRGTYP= 5
##$CHEMSTR= <none>
##$CNST= (0..31)
1 1 145 1 1 1 1 1 1 1 1 1 1 1 1 1 1 1 1 1 1 1 1 1 1 1 1 1 1 1 1 1 
##$CPDPRG= <waltz16>
##$CPDPRG1= <>
##$CPDPRG2= <waltz16>
##$CPDPRG3= <>
##$CPDPRG4= <mlev>
##$CPDPRG5= <mlev>
##$CPDPRG6= <mlev>
##$CPDPRG7= <mlev>
##$CPDPRG8= <mlev>
##$CPDPRGB= <>
##$CPDPRGT= <>
##$D= (0..31)
0 1 0 0 0 0 0 0 0 0 0 0.03 2e-05 3e-06 0 0 0 0 0 0 0 0 0 0 0 0 0 0 0 0 
0 0 
##$DATE= 1698230782
##$DBL= (0..7)
120 120 120 11 120 120 24 19 
##$DBP= (0..7)
150 150 150 150 150 150 150 150 
##$DBP07= 0
##$DBPNAM0= <>
##$DBPNAM1= <>
##$DBPNAM2= <>
##$DBPNAM3= <>
##$DBPNAM4= <>
##$DBPNAM5= <>
##$DBPNAM6= <>
##$DBPNAM7= <>
##$DBPOAL= (0..7)
0.5 0.5 0.5 0.5 0.5 0.5 0.5 0.5 
$$ [...]
##$SUBNAM2= <"">
##$SUBNAM3= <"">
##$SUBNAM4= <"">
##$SUBNAM5= <"">
##$SUBNAM6= <"">
##$SUBNAM7= <"">
##$SUBNAM8= <"">
##$SUBNAM9= <"">
##$SW= 501.771253377433
##$SWIBOX= (0..15)
0 1 3 0 0 0 0 0 0 0 0 0 0 0 0 0 
##$SW_h= 40650.406504065
##$TD= 32768
##$TD0= 1
##$TE= 0
##$TE2= 300
##$TE3= 300
##$TEG= 300
##$TL= (0..7)
0 120 53 12 22 120 120 120 
##$TP= (0..7)
150 150 150 150 150 150 150 150 
##$TP07= 0
##$TPNAME0= <>
##$TPNAME1= <>
##$TPNAME2= <>
##$TPNAME3= <>
##$TPNAME4= <>
##$TPNAME5= <>
##$TPNAME6= <>
##$TPNAME7= <>
##$TPOAL= (0..7)
0.5 0.5 0.5 0.5 0.5 0.5 0.5 0.5 
##$TPOFFS= (0..7)
0 0 0 0 0 0 0 0 
##$TUNHIN= 0
##$TUNHOUT= 0
##$TUNXOUT= 0
##$USERA1= <user>
##$USERA2= <user>
##$USERA3= <user>
##$USERA4= <user>
##$USERA5= <user>
##$V9= 5
##$VALIST= <valist>
##$VCLIST= <CCCCCCCCCCCCCCC>
##$VD= 0
##$VDLIST= <DDDDDDDDDDDDDDD>
##$VPLIST= <PPPPPPPPPPPPPPP>
##$VTLIST= <TTTTTTTTTTTTTTT>
##$WBST= 1024
##$WBSW= 4
##$XGAIN= (0..3)
0 0 0 0 
##$XL= 0
##$YL= 0
##$YMAX_a= 5756
##$YMIN_a= -2859
##$ZGOPTNS= <>
##$ZL1= 120
##$ZL2= 120
##$ZL3= 120
##$ZL4= 120
##$ABSF1= 0
##$ABSF2= 0
##$ABSG= 0
##$ABSL= 0
##$ALPHA= 0
##$AQORDER= 0
##$ASSFAC= 0
##$ASSFACI= 0
##$ASSFACX= 0
##$ASSWID= 0
##$AUNMP= <proc_1d>
##$AZFE= 0.1
##$AZFW= 0.5
##$BCFW= 0
##$BC_mod= 2
##$BYTORDP= 0
##$COROFFS= 0
##$CY= -3
##$DATMOD= 1
##$DC= 0
##$DFILT= <>
##$DTYPP= 0
##$F1P= 0
##$F2P= 0
##$FCOR= 1
##$FTSIZE= 65536
##$FT_mod= 6
##$GAMMA= 0
##$GB= 0
##$INTBC= 1
##$INTSCL= 6.047779e-11
##$ISEN= 30
##$LB= 5
##$LEV0= 0
##$LPBIN= 0
##$MAXI= 10000
##$MC2= 0
##$MEAN= 0
##$ME_mod= 0
##$MI= 50
##$NCOEF= 0
##$NC_proc= -9
##$NLEV= 6
##$NOISF1= 182.463
##$NOISF2= 159.3651
##$NSP= 0
##$NTH_PI= 0
##$NZP= 0
##$OFFSET= 248.5645
##$PC= 4
##$PHC0= -10682.77
##$PHC1= 146.0862
##$PH_mod= 1
##$PKNL= yes
##$PPARMOD= 0
##$PSCAL= 0
##$PSIGN= 0
##$REVERSE= no
##$SF= 81.0140089999694
##$SI= 65536
##$SIGF1= 159.3651
##$SIGF2= -187.1042
##$SINO= 113.3802
##$SIOLD= 16384
##$SREGLST= <1H.CDCl3>
##$SSB= 0
##$STSI= 65536
##$STSR= 0
##$SW_p= 40650.406504065
##$SYMM= 0
##$S_DEV= 0
##$TDeff= 32768
##$TDoff= 0
##$TI= <>
##$TILT= no
##$TM1= 0
##$TM2= 0
##$TOPLEV= 0
##$USERP1= <user>
##$USERP2= <user>
##$USERP3= <user>
##$USERP4= <user>
##$USERP5= <user>
##$WDW= 1
##$XDIM= 65536
##$YMAX_p= 303205620
##$YMIN_p= -108852398
$$ End of Bruker specific parameters
$$ ---------------------------------
##NTUPLES= NMR SPECTRUM
##VAR_NAME=  FREQUENCY,     SPECTRUM/REAL,   SPECTRUM/IMAG
##SYMBOL=    X,             R,               I
##VAR_TYPE=  INDEPENDENT,   DEPENDENT,       DEPENDENT
##VAR_FORM=  AFFN,          ASDF,            ASDF
##VAR_DIM=   65536,         65536,           65536
##UNITS=     HZ,            ARBITRARY UNITS, ARBITRARY UNITS
##FACTOR=    0.620285442955139, 1,           1
##FIRST=     20137.2065510682, 0,            0
##LAST=      -20513.1999529968, 0,           0
##MIN=       -20513.1999529968, -108852398,  0
##MAX=       20137.2065510682, 303205620,    0
$$ Real data points
##PAGE= N=1
##DATA TABLE= (X++(R..R)), XYDATA
$$ [...]
38357I197527r00357q67834o64736k00530J99756J80627k20586p17166j186065
38348D820636j697305k202944k451953k244126j595641o51399L71651J136090
38340d514991J326946R84098N40133L83265M76320N10175L14754j1878k68566
38331b59744k80479M7848O08935J044855J007760M95789j90211q06727j331700
38322C36326j776512k024142j920955j402360m99306O14973J533422J780921J240448
38313b117185L16586m49433q34971r06914o95931j27859P45943J635909K171585
38304b62270K099637J393912L24357o17000j055387j060685j025366j193893j433309
38295b830004j485380j291883j005284q04357p70699q29186p38742k84736L95501
$$ y = [9197527, 8297170, 7429336, 6764600, 6564070, 6763826, 6944453, 6723867, 6006701, 4820636, 3123331, 920387, -1531566, -3775692, -5371333, -6022732, -5651081, -4514991, -3188045, -2203947, -1663814, -1280549, -804229, -294054, 20700, 8822, -259744, -540223, -492375, 116560, 1161415, 2169175, 2664964, 2474753, 1668026, 336326, -1440186, -3464328, -5385283, -6787643, -7286949, -6671976, -5138554, -3357633, -2117185, -1800599, -2250032, -3085003, -3991917, -4687848, -4815707, -4069764, -2433855, -262270, 1837367, 3231279, 3555636, 2938636, 1883249, 822564, -202802, -1396695, -2830004, -4315384, -5607267, -6612551, -7416908, -8187607, -9016793, -9755535, -10040271, -9644770]
38286i644770Q05261N88732j7930m18436l21157K4110K83093M94527Q95945J438119
38276e872506J745264J595649J224977J012624J000935R18714O32298L54077L54020
38267B966052O52410J094422J542794J825751J658340R00269j31035q67764j068354
38258H572885r83433r08325q34419o81982o22845r03458j461697j968517k203263
38249a995054k177861j934901j461903q19631j38320N52677J292742J963026K353240
38240b365985K556335K998823L818239M410992L962695K417158O21887n49587
38232A7870557r78452j139139j444767j956208k533400k970911l030078k613827
38224A203775j967763j503577j338987j188987q28805m97467o37966j296274j980679
$$ y = [-9644770, -8839509, -8250777, -8268707, -8687143, -9008300, -8984190, -8701097, -8206570, -7310625, -5872506, -4127242, -2531593, -1306616, -293992, 706943, 1625657, 2257955, 2612032, 2966052, 3618462, 4712884, 6255678, 8081429, 9739769, 10640038, 10509003, 9641239, 8572885, 7589452, 6681127, 5846708, 5164726, 4541881, 3638423, 2176726, 208209, -1995054, -4172915, -6107816, -7569719, -8389350, -8527670, -7974993, -6682251, -4719225, -2365985, 190350, 3189173, 7007412, 11418404, 15381099, 17798257, 18420144, 17870557, 16892105, 15752966, 14308199, 12351991, 9818591, 6847680, 3817602, 1203775, -763988, -2267565, -3606552, -4795539, -5624344, -6121811, -6759777, -8056051, -10036730]
38215a0036730k153475j728090j027408l59838K63313J010478J897708K616182
38207i517860K734333K110212J089162K58498J2340L42754R43665J422414J506687
38198I02205J243134J022168J243207J851970K273001J872163M95420j374733
38190I528535k875179l245036k333689p77084M75447R59689R63878R70129J042296
38181D708986R40428O42589M22065M14376L94257Q8721m61299r57410j153107
38172E039606j030978p64854n83406o12782p94542r82704j119806j257798j421900
38163c529164j559963j646758j731032j822845j806619j524940r22218j02919
38155a4646458P03743J263953J527649J702629K032955K486227K776163K718074
$$ y = [-10036730, -12190205, -13918295, -14945703, -15305541, -15042228, -14031750, -12134042, -9517860, -6783527, -4673315, -3584153, -3325655, -3313315, -2970561, -2026896, -604482, 902205, 2145339, 3167507, 4410714, 6262684, 8535685, 10407848, 10903268, 9528535, 6653356, 3408320, 1074631, 297547, 772994, 1732683, 2696561, 3666690, 4708986, 5649414, 6292003, 6714068, 7128444, 7522701, 7611422, 7150123, 6192713, 5039606, 4008628, 3243774, 2660368, 2047586, 1253044, 270340, -849466, -2107264, -3529164, -5089127, -6735885, -8466917, -10289762, -12096381, -13621321, -14543539, -14646458, -13942715, -12678762, -11151113, -9448484, -7415529, -4929302, -2153139, 564935]
38147E64935K416947K039652J557329Q48588m3036r12046j608691k108061k362444
38138C93173k220119j565554n10234N88565J318155J479721J230281R41645Q56818
38129B512451Q63254O27328k2774q34982j274324j001423k57291L08280K95236
38120A215755j6862l1286M24605R15991R56037N04425j59353p88399j196252j145977
38110F78684n18087M48173J305238J791126J927888J792089J403832Q48766L11316
38101I989025o9734k58140k39857m5314J43190R1020k28208o16891r27545j178550
38091F658996j347519j261020q31928k66465J14751J79150M526k86965n85905
38082B377621p91196r15182j130859j536256j886348j739353r37019J50660R08238
$$ y = [564935, 2981882, 5021534, 6578863, 7427451, 7384415, 6472369, 4863678, 2755617, 393173, -1826946, -3392500, -3902734, -3314169, -1996014, -516293, 713988, 1655633, 2512451, 3375705, 4003033, 3980259, 3145277, 1870953, 869530, 612239, 920519, 1215755, 1198893, 1167607, 1592212, 2508203, 3464240, 3968665, 3809312, 3020913, 1824661, 678684, 160597, 608770, 1914008, 3705134, 5633022, 7425111, 8828943, 9677709, 9989025, 9919291, 9661151, 9421294, 9375980, 9519170, 9610190, 9381982, 8765091, 7837546, 6658996, 5311477, 4050457, 3218529, 2952064, 3066815, 3245965, 3250491, 2963526, 2377621, 1586425, 671243, -459616, -1995872, -3882220, -5621573, -6558592, -6407932, -5499694]
38073e499694R64754M31555k27359n11935j73197O67135J599705K149080K036347
38064A436391J375452O41954L26776N23024Q97351J105062J124565J096900R81813
38055I509288N90609o5245o66827q82513o38947r6394M48602N83161l7477j294087
38045G450170k516064l046071k878374k525052k252375j725521n50115J053311
38037f990091K372002K927735K833764K416625J761895Q25452j63466p06679n20153
38028D757084J43237P57341J023032J010420Q87665O80688L30550j54845p13415
38019H721757j324842j974597k536420k809412k713928k367526j911438j338387
38011h254793n86809K30096Q03504Q72679M46044k11984p40653q34194l69343
$$ y = [-5499694, -4534940, -4103385, -4330744, -4842679, -5015876, -4348741, -2749036, -599956, 1436391, 2811843, 3453797, 3780573, 4303597, 5200948, 6306010, 7430575, 8527475, 9509288, 10099897, 10034652, 9367825, 8485312, 7846365, 7749971, 8198573, 8781734, 8744257, 7450170, 4934106, 1888035, -990339, -3515391, -5767766, -7493287, -8043402, -6990091, -4618089, -1690354, 1143410, 3560035, 5321930, 6147382, 5983916, 5277237, 4757084, 4900321, 5657662, 6680694, 7691114, 8578779, 9259467, 9590017, 9435172, 8721757, 7396915, 5422318, 2885898, 76486, -2637442, -5004968, -6916406, -8254793, -8841602, -8611506, -7808002, -6935323, -6489279, -6701263, -7441916, -8276110, -8645453]
38002h645453M99123J391990J948096K061104J888602J666707J550885J604224
37994C965278J853602K279214K718376K828413K277294J072545l64328j586770
37986A5043624k545500l433626m119036m037823k853192j016703N97795J515610
37978h48851J853499J795514J273285K73919q50770j612880j797537j515823r98780
37969b428424m81862j56733n4400k8948L2620O9726K3057K3196K22757N02548
37959b276463N32415J33305n38848j157382j470301j412891j094692o80262k29521
37950h194640K89530P80317R52567O35758N5458l97207n96438o61206n70112j01501
37940g807474P87937J794463K586677L063697L171048K717924J632847K71395
$$ y = [-8645453, -8146330, -6754340, -4806244, -2745140, -856538, 810169, 2361054, 3965278, 5818880, 8098094, 10816470, 13644883, 15922177, 16994722, 16630394, 15043624, 12498124, 9064498, 4945462, 907639, -1945553, -2962256, -2364461, -848851, 1004648, 2800162, 4073447, 4347366, 3496596, 1883716, 86179, -1429644, -2428424, -2910286, -3067019, -3121419, -3150367, -3117747, -3048021, -3024964, -3001768, -2779011, -2276463, -1744048, -1610743, -2149591, -3306973, -4777274, -6190165, -7284857, -7965119, -8194640, -7905110, -7124793, -6172226, -5536468, -5481010, -5878217, -6474655, -7135861, -7705973, -7807474, -7019537, -5225074, -2638397, 425300, 3596348, 6314272, 7947119, 8218514]
37932H218514p94275j283976j343817j208932r24316m36582J86768P21265R30826
37923D065475P37195L06082j9383N1790N08862R92022J035988M56651m30004j014958
37913F689720r29080l87577O1718J05661j30679m02125o35359q19564q23429n14687
37903B214599M6680O97910J349663J892250K039576J538637N44979m33344j018556
37894H872394j227992j248856j170518j021997q68933p23246m87770j30879J92074
37885B184277L40717M31801P13321J221235J702512J886750J724224J333457Q01596
37876A2339890R3025q42489j857807k534707k462581j697887q48464n28341p42177
37867I18462r58637p84202l72092j02323n6369J5960L03811P02409R76663J026317
$$ y = [8218514, 7424239, 6140263, 4796446, 3587514, 2663198, 2226616, 2413384, 3134649, 4065475, 4802670, 5108752, 5089369, 5141159, 5650021, 6642043, 7678031, 8134682, 7704678, 6689720, 5760640, 5373063, 5434781, 5540442, 5409763, 5007638, 4372279, 3552715, 2729286, 2214599, 2261279, 2959189, 4308852, 6201102, 8240678, 9779315, 10324294, 9890950, 8872394, 7644402, 6395546, 5225028, 4203031, 3334098, 2610852, 2123082, 1992203, 2184277, 2524994, 2956795, 3670116, 4891351, 6593863, 8480613, 10204837, 11538294, 12339890, 12432915, 11590426, 9732619, 7197912, 4735331, 3037444, 2188980, 1660639, 918462, -40175, -824377, -1196469, -1298792, -1355161, -1339201, -1035390, -332981, 643682, 1669999]
37857A669999R62830J011015J340192J883859K287237K140978J370129L71760
37849A3037999k90976l26064J58892Q73479J573730K078378K189663J736338P43783
37840B1775222m76034j477346j979977k020794j787365j338686n90362L90210
37832A2494868J192565J317056O35188m87017j534557k229822k571702k638896
37824F177683k493749k249660k086898k104097k164450j950192j222469m9175
37816h143007J230155K259472K851846K938522K475593J549280N19357j60089
37808E521129l55982l62877n03405p48871q52481p12705l98063R7471Q41183J666923
37798D192322K156604K066816J616831J200622R25319N85275o439q43319j813863
$$ y = [1669999, 2632829, 3643844, 4984036, 6867895, 9155132, 11296110, 12666239, 13037999, 12747023, 12420959, 12579851, 13453330, 15027060, 17105438, 19295101, 21031439, 21775222, 21299188, 19821842, 17841865, 15821071, 14033706, 12695020, 12104658, 12494868, 13687433, 15004489, 15639677, 15152660, 13618103, 11388281, 8816579, 6177683, 3683934, 1434274, -652624, -2756721, -4921171, -6871363, -8093832, -8143007, -6912852, -4653380, -1801534, 1136988, 3612581, 5161861, 5681218, 5521129, 5165147, 4802270, 4298865, 3549994, 2697513, 1984808, 1586745, 1684216, 2525399, 4192322, 6348926, 8415742, 10032573, 11233195, 12158514, 12743789, 12737350, 11894031, 10080168]
37789A0080168k735044l277454l092253k165195r42155K5968N09184N87078L32458
37780f77245k68164j047999j533242j280948l22081Q41609J666640J914297J650597
37771I43464J116846O49155N01952N64311L76408l49835j277905j746360j526076
37762g48040j041028p86489p99124q43962q45532q45017p03008k14055M93269
37753f332986R94993J085237R87208R51492R04568O74413L58170K25112L56095
37744B04302N93482P88582Q97536Q64086O16339K12115j68271m10559n24306n03445
37734B569861k87171Q8679M49713O80739Q50052J036930J132855R41917M33288
37725G896863k18439q20432j281715j545448j510406j089083l27351N54724J237288
$$ y = [10080168, 7345124, 4067670, 975417, -1189778, -2131933, -2105965, -1596781, -1009703, -677245, -945409, -1993408, -3526650, -4807598, -5129679, -4288070, -2621430, -707133, 943464, 2060310, 2709465, 3211417, 3775728, 4152136, 3802301, 2524396, 778036, -748040, -1789068, -2575557, -3374681, -4218643, -5064175, -5909192, -6612200, -6826255, -6332986, -5337993, -4252756, -3265548, -2314056, -1409488, -735075, -376905, -151793, 204302, 797784, 1586366, 2483902, 3347988, 3964327, 4176442, 4008171, 3597612, 3073306, 2569861, 2282690, 2371369, 2821082, 3501821, 4351873, 5388803, 6521658, 7463575, 7896863, 7678424, 6857992, 5576277, 4030829, 2520423, 1431340, 1103989, 1658713, 2896001]
37716B896001J445053J102479M24908j48511k23126K10343O80071O12319p3705
37707F925832q09731r40743m07167K56564N34742L22569k77014j214772k348611
37698B041669l249215l441353k804777j576759o7685J401559K392379K549587
37690b754595K019277J424110J280457J580511K008632K344895K511845K450372
37682A2865504K223332K152856K574854L417983M217347M608938M660615M622343
37674D1343772M465818L833999K479585O75688r04564j778389k119239k574533
37666D5422137l588036m942810n994671o279489n819164m908350l770857k495645
37658G623115j214923j98651L01660K79429l0075m15027q85874j524366k183374
$$ y = [2896001, 4341054, 5443533, 5868441, 5719930, 5496804, 5707147, 6387218, 6999537, 6925832, 6116101, 5175358, 4768191, 5024755, 5559497, 5882066, 5605052, 4390280, 2041669, -1207546, -4648899, -7453676, -9030435, -9098120, -7696561, -5304182, -2754595, -735318, 688792, 1969249, 3549760, 5558392, 7903287, 10415132, 12865504, 15088836, 17241692, 19816546, 23234529, 27451876, 32060814, 36721429, 41343772, 45809590, 49643589, 52123174, 52798862, 51894298, 50115909, 47996670, 45422137, 41834101, 36891291, 30896620, 24617131, 18797967, 13889617, 10118760, 7623115, 6408192, 6209541, 6511201, 6790630, 6760555, 6345528, 5459654, 3935288, 1751914]
37649A751914k503617k292450j755125j238301q37472l99393J46623O44098R23512
37640e560211J005790R98865Q79669N00047j84237r58916j470068j503721j139833
37631g432615o17300m9064P00077J825711L270355M599140N205983M719276L295191
37622A5516754J514917o6725j262207k103957k484539k198703j377024n73552
37614F964964j86773L3428O13647J557893K219237K022175J086608M5425n78418
37605A3778186p08081n87968m97104n56579p07230q24583q27098o70733l51172
37596H047638k6716k4665m91026j055419j123168n91511k7392K8386k68006k97063
37586D171058K63153J144892J871853K165353J961740J287781K80071p61869j486987
$$ y = [1751914, -751703, -3044153, -4799278, -6037579, -6875051, -7274444, -7127821, -6483723, -5560211, -4554421, -3555556, -2675887, -2175840, -2360077, -3318993, -4789061, -6292782, -7432615, -8049915, -8098979, -7398902, -5573191, -2302836, 2296304, 7502287, 12221563, 15516754, 17031671, 16964946, 15702739, 13598782, 11114243, 8915540, 7538516, 6964964, 6778191, 6811619, 7425266, 8983159, 11202396, 13224571, 14311179, 14356604, 13778186, 13070105, 12482137, 11985033, 11428454, 10721224, 9896641, 9069543, 8398810, 8047638, 8020922, 7996257, 7505231, 6449812, 5326644, 4735133, 4707741, 4736127, 4468121, 4171058, 4434211, 5579103, 7450956, 9616309, 11578049, 12865830, 13145901, 12384032, 10897045]
37577A0897045j713846j559328j349689j347361j500086j473812r89214j39126
37569H24583O35896Q83995M97249j80833o03995m92385r5736J02608l5880j58147
37559A377355J05100P00450J307254J749085K040986K143127J934328J447884
37551A2805569R44480O98586Q12698J229527J797736K319790K651860K780971
37543B6041217K753544K590054K366484K288558K517875K967368L434756L913953
37535D8873809M618993N720494P187211Q823012J0324994J1448178J2344108J3595538
37527A22936337J5631506J8282785K1246973K4549411K7580154K7732215K1509244
37520B79468625Q228287p868706k0409598k5982475k5934006k3544210k0742215
$$ y = [10897045, 9183199, 7623871, 6274182, 4926821, 3426735, 1952923, 963709, 824583, 1460479, 2344474, 2841723, 2660890, 2056895, 1564510, 1468774, 1571382, 1535502, 1377355, 1482455, 2182905, 3490159, 5239244, 7280230, 9423357, 11357685, 12805569, 13750049, 14448635, 15261333, 16490860, 18288596, 20608386, 23260246, 26041217, 28794761, 31384815, 33751299, 36039857, 38557732, 41525100, 44959856, 48873809, 53492802, 59213296, 66400507, 75223519, 85548513, 96996691, 109340799, 122936337, 138567843, 156850628, 178097601, 202647012, 230227166, 257959381, 279468625, 287696912, 279828206, 259418608, 233436133, 207502127, 183957917, 163215702]
37513A63215702j7909065j5454086j4104505j3813791j3497145j2210648j0085437
37506F6141025p885041o085494m677619l538481k602760j766175r38917k33193
37498C8413345R7982k6368l88302p21889r84341j269156j519017j505543j153793
37489C0942918p39533o12425p85688r65915r60075q36258o37169k02783N07494
37480B5710566J082748R56316M4838j137047k054778k642526l107011l427611
37472A5425495l279035k453347j210940j26324L99123M35575L28874K51737N4459
37463I825617l88316q22302q14706l05634K62605M61527L37953K15913K10348
37454H983005J81483R9727J71624N35046J031902J387173J470058J287134Q78759
$$ y = [163215702, 145306637, 129852551, 115748046, 101934255, 88437110, 76226462, 66141025, 58255984, 52170490, 47492871, 43954390, 41351630, 39585455, 38646538, 38413345, 38511327, 38484959, 38096657, 37374768, 36390427, 35121271, 33602254, 32096711, 30942918, 30203385, 29590960, 28805272, 27839357, 26879282, 26043024, 25405855, 25203072, 25710566, 26793314, 27749630, 27794468, 26657421, 24602643, 21960117, 18853106, 15425495, 12146460, 9693113, 8482173, 8355849, 8754972, 9190547, 9519421, 9771158, 9825617, 9437301, 8614999, 7800293, 7494659, 7757264, 8218791, 8556744, 8772657, 8983005, 9164488, 9264215, 9435839, 9970885, 11002787, 12389960, 13860018, 15147152, 16025911]
37445A6025911L84268J02014K70479P73607J196471J197200P44003K8399o91395
37436B0030957j145689j156464q22988m92519m02099m23030l10439j33718k28034
37427A4915977o82130j109115j090911p15918m75695o75712j142808j526349j690171
37418E807168j705369j597607j273256o87072K2711O00206Q52696P90312O24627
37409C434416O07391Q26943J159115J407758J440545J190229O47629m4399n67232
37400A0102395o49178l33692O2347K79934L60376N78148J190337K186109L148254
37391A6925030L404546K547093R21746n27675j045952o70958k5675L51939L51485
37382B2231579J09927k45853o31184r62230j203558j399502j596631j779443j918918
$$ y = [16025911, 16410179, 16512193, 16782672, 17556279, 18752750, 19949950, 20693953, 20722352, 20030957, 18885268, 17728804, 16905816, 16413297, 16011198, 15588168, 15277729, 15144011, 14915977, 14233847, 13124732, 12033821, 11317903, 10842208, 10166496, 9023688, 7497339, 5807168, 4101799, 2504192, 1230936, 543864, 566575, 1166781, 2019477, 2809789, 3434416, 4041807, 4868750, 6027865, 7435623, 8876168, 10066397, 10714026, 10669627, 10102395, 9453217, 9119525, 9181872, 9461806, 9822182, 10400330, 11590667, 13776776, 16925030, 20329576, 22876669, 23798415, 23270740, 22224788, 21553830, 21528155, 21880094, 22231579, 22341506, 22095653, 21464469, 20502239, 19298681, 17899179, 16302548, 14523105, 12604187]
37373A2604187k023401k077185j959018j497073o45180L88333J197503J414036
37365G402202R60642J06454p38265j281835j406662j046509j60177J087540K197029
37356G120419K560160J947205P86045j19805k47920K24035O65339O47657L02930
37347A3886065L9975L9976J42510J39352r506k64094o16677j006735j249687j202175
37337I899004r55704p35445o10771m18900r743N01746P70544N12156j90689q17736
37327G944462p25809L01401J767903K826595K987570K430721J646895R29539K87976
37318B0397253l13611q34462j233617j494386j555761j352133r57099n85550m08913
37309A1661721m26163n10056m92973k30664K74363P89263J034646R93976Q92633
$$ y = [12604187, 10580786, 8503601, 6544583, 5047510, 4402330, 4790663, 5988166, 7402202, 8362844, 8469298, 7731033, 6449198, 5042536, 3996027, 3835850, 4923390, 7120419, 9680579, 11627784, 12413829, 12294024, 12046104, 12270139, 12935478, 13583135, 13886065, 13926040, 13966016, 14108526, 14247878, 14238372, 13974278, 13357601, 12350866, 11101179, 9899004, 8943300, 8207855, 7597084, 7178184, 7168441, 7670187, 8440731, 8952887, 8762198, 7944462, 7218653, 7520054, 9287957, 12114552, 15102122, 17532843, 19179738, 20109277, 20397253, 20083642, 19249180, 18015563, 16521177, 14965416, 13613283, 12656184, 12070634, 11661721, 11235558, 10725502, 10232529, 10001865, 10276228, 11065491, 12100137, 13094113, 13986746]
37300A3986746Q27483O16025J16414n17913j078387j587281k081158k271442j781252
37291F229235o98864M34038J224680J714346K000964J926518J337871M10624n04104
37282A4075308j179710j485894j275954n63342L19001R86387J347648J479497
37274A3702941J292811O25800l71321j238394j622748j476914q71115P6333J007387
37265A1124780J380563R43409J5756q34253j274080j284324r67780n01253j66903
37256H435915j82033m73038p61495q86339r14096r06544p20677j68938O24201
37247D046956J122299P55343n11663j992168k748198k325453j054631L22634J252362
37238a132519J621847J583204J284757Q02947K59542j00437m1261M16210R29345
$$ y = [13986746, 14814229, 15430254, 15546668, 15028755, 13950368, 12363087, 10281929, 8010487, 6229235, 5530371, 5964409, 7189089, 8903435, 10904399, 12830917, 14168788, 14579412, 14075308, 12895598, 11409704, 10133750, 9570408, 9889409, 10875796, 12223444, 13702941, 14995752, 15621552, 15250231, 14011837, 12389089, 10912175, 10041060, 10117393, 11124780, 12505343, 13448752, 13464508, 12630255, 11356175, 10071851, 9104071, 8602818, 8435915, 8253882, 7780844, 7019349, 6133010, 5218914, 4312370, 3591693, 3422755, 4046956, 5169255, 5924598, 5412935, 3420767, 672569, -1652884, -2707515, -2384881, -1132519, 489328, 2072532, 3357289, 4160236, 4419778, 4319341, 4278080, 4694290, 5623635]
37229E623635J080693O89118j22375j065172j801649k028315j641729q54097k7711
37220a47602O14298J009158J047768N93346k05407q30365q19509k19073M99643
37211A542257R09795R22066O98272M22186J50540k00909p21970j304345j607520
37202H10372j316489m60715N41972J165876J138452O02710m7463n24815q29642
37193A080258j038693j016498n30303L40578J119007J350594R77691K49056n36295
37184A995395j075943j083026n21973K36828O98580O77618L55773o641k89760
37175I86851n37122r11404j542263k258633k568103k107336j066111J3790P86821
37166i203510J242273J398435J203517Q08971O52985J095121K072405L151140
$$ y = [5623635, 6704328, 7393446, 7271071, 6205899, 4404250, 2375935, 734206, -119891, -147602, 466696, 1475854, 2523622, 3116968, 2911561, 2081196, 1261687, 1042614, 1542257, 2452052, 3374118, 4072390, 4494576, 4645116, 4444207, 3722237, 2417892, 810372, -506117, -966832, -424860, 741016, 1879468, 2482178, 2434715, 1909900, 1080258, 41565, -974933, -1505236, -1164658, -45651, 1304943, 2282634, 2531690, 1995395, 919452, -163574, -685547, -448719, 249861, 927479, 1283252, 1276611, 986851, 449729, -461675, -2003938, -4262571, -6830674, -8938010, -10004121, -9990331, -9203510, -7961237, -6562802, -5359285, -4550314, -3897329, -2802208, -729803, 2421337]
37158B421337L760568L393790J901958k14269k001223k770270k565571j838953
37150B087367q68337K65693J282587J692712J349818Q01759Q40453J682367K719322
37141A1853741L131359K658207J678055O15132m93808j745724k896248l412999
37133A1387715l001420j887717n68208N38399J180480J277678R90447O30116L43880
37124A0891370j0592n60889j127650j414055j393148j293055j221528j024796
37116B845657n85248r3170J11083q4610m39398o14546m98548k55077q7262l7382
37106B61499o2449k15870o00565j141765j583536j796876j937054k150245k245370
37097a1472231j862482r27617K52617J333750K154611K595097K496744J916662
$$ y = [2421337, 6181905, 9575695, 11477653, 11263384, 9262161, 6491891, 3926320, 2087367, 1219030, 1484723, 2767310, 4460022, 5809840, 6611599, 7452052, 9134419, 11853741, 14985100, 17643307, 19321362, 19936494, 19442686, 17696962, 14800714, 11387715, 8386295, 6498578, 5930370, 6468769, 7649249, 8926927, 9917374, 10547490, 10891370, 10880778, 10319889, 9192239, 7778184, 6385036, 5091981, 3870453, 2845657, 2260409, 2167239, 2278322, 2193712, 1754314, 1139768, 641220, 386143, 298881, 261499, 199050, -16820, -617385, -1759150, -3342686, -5139562, -7076616, -9226861, -11472231, -13334713, -14262330, -14009713, -12675963, -10521352, -7926255, -5429511, -3512849]
37089c512849J281133J027110J141903J281038J309695J445003J788712K023269
37081G785014J821159J379219J230277J562187K017898K196405K044121J641237
37073B1677517R32841m4926q75415j054166n47462J94451P53020J009284R18268
37064B2963412L71904n44655j397653j739792j529033j088621p37177n76762n66626
37055A5154997o61125q67434j219789j687113k118690k360974k421812k403484
37047A414576k278489j898630j252187n04702K88224J258825K346539L068818
37039B442974K955928K120982J154673N12923K21406R4147n2960m04802j057823
37030G987448j822697k328900k427802k312998k156795j843659j224397m52927
$$ y = [-3512849, -2231716, -1204606, -62703, 1218335, 2528030, 3973033, 5761745, 7785014, 9606173, 10985392, 12215669, 13777856, 15795754, 17992159, 20036280, 21677517, 22610358, 22565432, 21690017, 20635851, 20088389, 20282840, 21035860, 22045144, 22963412, 23335316, 22790661, 21393008, 19653216, 18124183, 17035562, 16298385, 15721623, 15154997, 14493872, 13626438, 12406649, 10719536, 8600846, 6239872, 3818060, 1414576, -863913, -2762543, -4014730, -4519432, -4231208, -2972383, -625844, 2442974, 5398902, 7519884, 8674557, 9187480, 9408886, 9503033, 9450073, 9045271, 7987448, 6164751, 3835851, 1408049, -904949, -3061744, -4905403, -6129800, -6582727]
37022f582727J65642N86152J048529J673961K221699K329208J888013J108938
37014D439415L06394k78347n06719l79286j24277j35732o57383j495229k127620
37005i58784k142799j545068o73337O8712M10632L23239L1832j93748l69902q08883
36995e858106j654388k497222k649944j814891l60746J041615J924837K199220
36987i669625K025139J619032J130140O64772M17439O51874J402187K265159K709465
36978C215582K621156K363510K252875K156843J692876O72840p30089k097993
36970A2147600k950439k987350k343364j539396j045184r27515r93404j136917
36962a775969j366502j575068j517366j060544l21952M65380J095118J373528
$$ y = [-6582727, -6417085, -5830933, -4782404, -3108443, -886744, 1442464, 3330477, 4439415, 4745809, 4467462, 3960743, 3581457, 3457180, 3321448, 2664065, 1168836, -958784, -3101583, -4646651, -5319988, -5251276, -4840644, -4517405, -4485573, -4679321, -5049223, -5858106, -7512494, -10009716, -12659660, -14474551, -14835297, -13793682, -11868845, -9669625, -7644486, -6025454, -4895314, -4230542, -3813103, -3161229, -1759042, 506117, 3215582, 5836738, 8200248, 10453123, 12609966, 14302842, 14975682, 14245593, 12147600, 9197161, 6209811, 3866447, 2327051, 1281867, 354352, -639052, -1775969, -3142471, -4717539, -6234905, -7295449, -7617401, -7152021, -6056903, -4683375]
36954d683375J137623M37299l40786o64276k50937P02014J672367K206811K209810
36945B426550J909604J596815J404740J275938J059143O59625J99752L7758M75439
36936A1045364J341774J974328J784605Q42201k17072q61407j114432j312848
36928A3482513j572392j642109j246800m23663N31443J347860J907742K148545
36920A4533139K007166J536418R76153N95956M99093O43393R60238J314249J429816
36911B4495621J091535M46241r7980l26799l70288l52176j92022N8136j1180o90210
36901B4050878j606727k067068j910089j633637j634803j729376j565093j123609
36893A0780476n61686J20179R11858J530918J722880J711529J958512K500169
$$ y = [-4683375, -3545752, -3108453, -3449239, -4113515, -4364452, -3662438, -1990071, 216740, 2426550, 4336154, 5932969, 7337709, 8613647, 9672790, 10332415, 10532167, 10569925, 11045364, 12387138, 14361466, 16146071, 16988272, 16771200, 15909793, 14795361, 13482513, 11910121, 10268012, 9021212, 8597549, 9128992, 10476852, 12384594, 14533139, 16540305, 18076723, 19052876, 19648832, 20147925, 20791318, 21751556, 23065805, 24495621, 25587156, 26033397, 25935417, 25608618, 25238330, 24886154, 24694132, 24752268, 24741088, 24050878, 22444151, 20377083, 18466994, 16833357, 15198554, 13469178, 11904085, 10780476, 10218790, 10338969, 11250827, 12781745, 14504625, 16216154, 18174666, 20674835]
36885B0674835K896521K869188K598946K254285J600719L78514j124929k169764
36877B9978315k182146j153836L97892J643077J781860N68747j403414l147368
36869B6483127m098533m387492m352218m055871l400015k478796j577811q78891
36861A253500l40156J33624N16464O70404M75932k0388n40593p23626m43383L7670
36851A019448L15216K31225m8650k92382m00099l40597n6779M37492R26825J107887
36841B899586Q96247N72581N51677R75919J550051J792773J438876N91480m46462
36832A0822728j380937j976933k064652j637518r18072k29065K18806L99451M07302
36823C641110L96287N04169O96865P12576L22780l13566p04572n30511q235L41836
$$ y = [20674835, 23571356, 26440544, 29039490, 31293775, 32894494, 33273008, 32148079, 29978315, 27796169, 26642333, 27040225, 28683302, 30465162, 31033909, 29630495, 26483127, 22384594, 17997102, 13644884, 9589013, 6188998, 3710202, 2132391, 1253500, 913344, 1046968, 1563432, 2233836, 2709768, 2689380, 2148787, 1425161, 981778, 1019448, 1334664, 1565889, 1517239, 1224857, 824758, 484161, 427382, 864874, 1791699, 2899586, 3795833, 4368414, 4920091, 5896010, 7446061, 9238834, 10677710, 11269190, 10822728, 9441791, 7464858, 5400206, 3762688, 2844616, 2615551, 2834357, 3233808, 3641110, 4037397, 4541566, 5238431, 5951007, 6273787, 5960221, 5255649, 4725138, 4716903, 5058739]
36813E058739K36856j38316l81112k45642K01845O73552Q68738O89051L39661
36804G303372K02843N28635J186535J719722J692047J040450J20541n81041p75360
36795A2437744m56416K23863J052183J746096K005220J703834J024178L06130
36787B0042832k76853q49033j599188k454117l069397l168873k814366k273670
36779C537335j704666j116005o05433l96253m97514m95211P8853J189261K296781
36770B287148K932978L098478L032684K766834K064606P59518r52094k546390
36762A3443762l467089l449049k638385j419399j41198R54870J615848J591883
36754F491243Q96398l7591o15847n39566O017N60991P38068M43452j09738n77083
$$ y = [5058739, 5295595, 5157279, 4776167, 4530525, 4732370, 5405922, 6274660, 6963711, 7303372, 7506215, 8034850, 9221385, 10941107, 12633154, 13673604, 13794145, 13213104, 12437744, 11981328, 12205191, 13257374, 15003470, 17008690, 18712524, 19736702, 20042832, 19765979, 18916946, 17317758, 14863641, 11794244, 8625371, 5811005, 3537335, 1832669, 716664, 111231, -285022, -782536, -1277747, -1198894, -9633, 2287148, 5220126, 8318604, 11351288, 14118122, 16182728, 16942246, 15990152, 13443762, 9976673, 6527624, 3889239, 2469840, 2328642, 3283512, 4899360, 6491243, 7387641, 7350050, 6734203, 6194637, 6200654, 6761645, 7499713, 7943165, 7833427, 7256344]
36744G256344p46818o90856o68229q82319j311537j720328j812695j432835o78427
36735b687700J83082R18484J422902J629417J439316Q40282O2198m83884m73634
36726B850463J04137R37687J570457J643771J083292J40128p31296j096943p66685
36717E735011J12165J196893K230948L147965L851907M010282L269335J707495
36709B5262001p6510j396800j921999j710636j023938k23527L04954L36170n8859
36700A9490856n99261r88430j060383q93702q14173j094138j563439j725311j395895
36691I356124j005026j041575j398609j573540j389812j153757j108107j095927
36683d10229q78294n02059j81908M024J42556L15880N18326O78373P11190O12420
$$ y = [7256344, 6509526, 5818670, 5150441, 4268122, 2956585, 1236257, -576438, -2009273, -2687700, -2504618, -1586134, -163232, 1466185, 2905501, 3745783, 3807981, 3324097, 2850463, 2954600, 3892287, 5462744, 7106515, 8189807, 8329935, 7598639, 6501696, 5735011, 5847176, 7044069, 9275017, 12422982, 16274889, 20285171, 23554506, 25262001, 25185491, 23788691, 21866692, 20156056, 19132118, 18908591, 19213545, 19549715, 19490856, 18891595, 17903165, 16842782, 15949080, 15134907, 14040769, 12477330, 10752019, 9356124, 8351098, 7309523, 5910914, 4337374, 2947562, 1793805, 685698, -410229, -1288523, -1790582, -1972490, -1968466, -1825910, -1510030, -991704, -313331, 397859, 1010279]
36673A010279M87428L73044P5886n95618j411356j782482j380078n23014J75161
36664c570750L88400J87406k29559o75315r33756q30464l80115K61038R83330
36655d799785J743167K404292K715950K547810K112812J879273K189429K909332
36647A3702280L475383L369163K570441J498623N49363j84026p47914j098610
36639B3134703j146167q90807l92460K95548J051264J648567J936421J986269
36631B7623338J943483J811203J512439J086586O63280K88047p2689l99672o68873
36622C3787142j002774j564737k262548k744152k776840k491028k151174j810248
36614A6983641j331006o84690p5398K52367K37044K830k82349m94087n58047m84907
$$ y = [1010279, 1497707, 1870751, 1946637, 1351019, -60337, -1842819, -3222897, -3745911, -3570750, -3182350, -2994944, -3224503, -3899818, -4833574, -5664038, -6044153, -5783115, -4799785, -3056618, -652326, 2063624, 4611434, 6724246, 8603519, 10792948, 13702280, 17177663, 20546826, 23117267, 24615890, 25165253, 24981227, 24233313, 23134703, 21988536, 21097729, 20705269, 21000817, 22052081, 23700648, 25637069, 27623338, 29566821, 31378024, 32890463, 33977049, 34640329, 34928376, 34855687, 34456015, 33787142, 32784368, 31219631, 28957083, 26212931, 23436091, 20945063, 18793889, 16983641, 15652635, 14967945, 14892547, 15144914, 15381958, 15384788, 15102439, 14608352, 14050305, 13565398]
36604A3565398m17899n30651p87436q85549n71568J9679M88611O12001M72874
36595A1965460J41290n05829j491425k478064l042473l107637k877615k414553
36587c810846j542313k09134J246869K286352K565370K164746J519613J096647
36579E317304J051359J225104J479676J832279K137700J936162R86911k06106
36571A5760389q63887r18144j059517j709701k430727k584906k134900j442231
36563B616376o57831K09743Q69212R49365N90290L51855M64893N69067L02348
36554F265318k07406o02947p44737o84358m28048J4275M70167P29750P82650P54934
36544F349598O43488K91501l25414q96813r56534k97964P79923J666306J918973
$$ y = [13565398, 13147499, 12616848, 11829412, 10943863, 10372295, 10391974, 10880585, 11492586, 11965460, 12106750, 11600921, 10109496, 7631432, 4588959, 1481322, -1396293, -3810846, -5353159, -5562293, -4315424, -2029072, 536298, 2701044, 4220657, 5317304, 6368663, 7593767, 9073443, 10905722, 13043422, 14979584, 15966495, 15760389, 14896502, 13978358, 12918841, 11209140, 8778413, 6193507, 4058607, 2616376, 1958545, 2168288, 3037500, 3986865, 4577155, 4929010, 5393903, 5962970, 6265318, 6057912, 5454965, 4710228, 4025870, 3597822, 3612097, 4082264, 4812014, 5594664, 6349598, 6993086, 7284587, 6959173, 6062360, 5105826, 4807862, 5587785, 7254091, 9173064]
36535I173064J550973Q60871J24059m32570n29694m5072O45868Q62806L33248
36526A2543553m90555r88835j035650q89453o48826j90272M02464P29115N24168
36517I955709j0804m57115o01792m98455k57207O3104M11947P30086R84405J168958
36507A1488836J272394J247737R92822M06245m43156j228531j588888j475507
36499A0671952j160450q80970o29032l40299q8040O2439K35795N67148R07044
36490I345587R20641M95299j04729n06496n15709j27056N78489J438701K195773
36481A3720500K598998K557069K183108J681632J162190N61285j88648r04129
36473B3372005j205172r38358m32809j66589k52970m51406o22595r00652j384798
$$ y = [9173064, 10724037, 11584908, 11708967, 11276397, 10746703, 10701631, 11347499, 12210305, 12543553, 12052998, 11064163, 10028513, 9139060, 8490234, 8299962, 8702426, 9431541, 9955709, 9944905, 9487790, 8885998, 8387543, 8130336, 8193440, 8605387, 9335473, 10319878, 11488836, 12761230, 14008967, 15001789, 15408034, 14964878, 13736347, 12147459, 10671952, 9511502, 8630532, 8001500, 7661201, 7573161, 7635600, 7871395, 8438543, 9345587, 10266228, 10761527, 10656798, 10150302, 9634593, 9507537, 10086026, 11524727, 13720500, 16319498, 18876567, 21059675, 22741307, 23903497, 24464782, 24276134, 23372005, 22166833, 21228475, 20795666, 20629077, 20376107, 19924701, 19302106, 18401454, 17016656]
36464A7016656j935110k379666k675954k721612k271191j310054l41486K5332
36456C406915k56258o74726q20294p64696p34902p10975n52472l46130l59095
36447a812633o51405r33162q94269n81485l42616m07988o14223n84774j20049
36438f942604O77194J616306K582723L407082L725757L191995J864919K73737
36430A0397109r68846j596013j755871j737907j664027j423595r01818k41018
36422A08014K31328L85445M55449O61166P76310L53112n92105j401802j459008
36413d82091q68735k55536l406M9582J90776L99313M70081L87117L55030M92806
36403G34937O89922Q30672J015924J413131J928559K195001J956562J378050Q85907
$$ y = [17016656, 15081546, 12701880, 10025926, 7304314, 5033123, 3723069, 3381583, 3406915, 3150657, 2475931, 1655637, 890941, 156039, -554936, -1107408, -1453538, -1812633, -2464038, -3397200, -4291469, -4872954, -5215570, -5623558, -6237781, -6822555, -6942604, -6265410, -4649104, -2066381, 1340701, 5066458, 8258453, 10123372, 10397109, 9428263, 7832250, 6076379, 4338472, 2674445, 1250850, 349032, 108014, 339342, 724787, 1180236, 1841402, 2617712, 2970824, 2378719, 976917, -482091, -1350826, -1606362, -1609768, -1560186, -1369410, -970097, -500016, -112899, 242131, 734937, 1424859, 2255531, 3271455, 4684586, 6613145, 8808146, 10764708, 12142758, 13028665]
36394A3028665P38344Q14898P91056M44969j84439q55376j318683j497169j478866
36385A0483399j336864j031911n49572m2303K91055M25003M77182M91948M14217
36376I622154K81712K60158M13816N79665N57405L14066q3566o20214j278829
36367A0046367j886190k139865j826000j008563l8296O45844Q33707O99299N54060
36358E880363M45680J55514l70061p94521p30017j36110P67085J793256K756520
36349I767709L290729L048952K112105R37000j59719j230229k327789l157946
36341A2280812l291779k617747j436654j87829P96347J341989J401089R97345
36333I283573J71560r73110k145830k917117l042775k707668k317851k050657
$$ y = [13028665, 13767009, 14581907, 15372963, 15817932, 15633493, 14778117, 13459434, 11962265, 10483399, 9146535, 8114624, 7565052, 7522749, 7813804, 8238807, 8715989, 9207937, 9622154, 9903866, 10164024, 10577840, 11157505, 11714910, 12028976, 11945410, 11325196, 10046367, 8160177, 6020312, 4194312, 3185749, 3147453, 3793297, 4627004, 5326303, 5880363, 6326043, 6481557, 6111496, 5316975, 4586958, 4450848, 5217933, 7011189, 9767709, 13058438, 16107390, 18219495, 19156495, 18996776, 17766547, 15438758, 12280812, 8989033, 6371286, 4934632, 4746803, 5543150, 6885139, 8286228, 9283573, 9455133, 8482023, 6336193, 3419076, 376301, -2331367, -4649218, -6699875]
36325f699875j725810j131334l36267M00115R23759J258463J428822J379868J134102
36316c368157Q98965Q80808J028383J084642Q94050N50012K34370M4976J7439
36307B265488J61555L80943M97065M91734O09718J044471J603096J885010J753699
36298A0692779J424451J108987Q24125N89542N32844O39730O05844J47398o46279
36289A5919421j442880k062951k574547l056730l451007l637419l519886l062921
36281f888920k399595j887079j848677k162478k227819j469472J21724J949570
36273a6812746L243300L537056K893261J819845R52439O73124R34621J432859
36265a326241J928481K355439K636399K534735J849783P61389j91810o16863o87657
$$ y = [-6699875, -8425685, -9557019, -9893286, -9493171, -8569412, -7310949, -5882127, -4502259, -3368157, -2469192, -1588384, -560001, 524641, 1418691, 1968703, 2203073, 2248049, 2265488, 2427043, 2807986, 3305051, 3796785, 4406503, 5450974, 7054070, 8939080, 10692779, 12117230, 13226217, 14050342, 14639884, 15172728, 15812458, 16418302, 16565700, 15919421, 14476541, 12413590, 9839043, 6782313, 3331306, -306113, -3825999, -6888920, -9288515, -11175594, -13024271, -15186749, -17414568, -18884040, -18762316, -16812746, -13569446, -10032390, -7139129, -5319284, -4366845, -3693721, -2759100, -1326241, 602240, 2957679, 5594078, 8128813, 9978596, 10739985, 10548175, 9931312, 9243655]
36256I243655r23890j572203k355458k843561k890368k616826k127037j413402
36248g499090m81250N74940J594211K352497K615308K348339J867742J626233
36240D998930J795772K133846K257814J957854J269363M10138k92213n63373m18534
36231A3549597k01479k93736p77028j402096j844856j949543j763850j416799
36223C900210j001179n68897j92698N6808K28816M76697Q06754R31322N75643
36214E213476p5037m69350l24222L2287R5780k08594n51928p00157p23335p38907
36204A550013p11453n79930l92994k23907r4800p3416k97301p58575j148858j074312
36194c805533m33813M75491J195351J406623J087947N01254j0552l25250o37164
$$ y = [9243655, 8319765, 6747562, 4392104, 1548543, -1341825, -3958651, -6085688, -7499090, -7980340, -7405400, -5811189, -3458692, -843384, 1504955, 3372697, 4998930, 6794702, 8928548, 11186362, 13144216, 14413579, 14823717, 14531504, 13968131, 13549597, 13348118, 13054382, 12277354, 10875258, 9030402, 7080859, 5317009, 3900210, 2899031, 2330134, 2137436, 2194244, 2423060, 2899757, 3706511, 4637833, 5213476, 5138439, 4669089, 4344867, 4377154, 4472934, 4264340, 3712412, 3012255, 2288920, 1550013, 838560, 258630, -134364, -358271, -453071, -526487, -823788, -1582363, -2731221, -3805533, -4239346, -3763855, -2568504, -1161881, -73934, 427320, 416768, 91518, -545646]
36185e45646j165918j801329k166852k030909j499658p69904J06944J067281J803759
36176g002232J959173J561266J046099P67671O59994N08756L88839N90023J136452
36167A616041J618577J599512J050039K89932l64386p44878p33147k69948M57735
36158D519477R94022R29367K38198p36417j593635k127769k337503k301068k084816
36149d500144j734479j309306q95716n58842k75103M9723M67918R22151J310104
36140f523694J565845J629823J405093Q62370J89047k92547m26855l74633l87431
36131b352982m86703m67848k17293P9469J17493j61373m43983l36698K02139P42861
36121c324918P37505M736j133834k133664k551410k147874r14174Q17612K386483
$$ y = [-545646, -1711564, -3512893, -5679745, -7710654, -9210312, -9980216, -9873272, -8805991, -7002232, -5043059, -3481793, -2435694, -1668023, -1008029, -499273, -110434, 479589, 1616041, 3234618, 4834130, 5884169, 6174101, 5809715, 5064837, 4331690, 4061742, 4519477, 5513499, 6442866, 6681064, 5944647, 4351012, 2223243, -114260, -2415328, -4500144, -6234623, -7543929, -8439645, -8998487, -9273590, -9223867, -8755949, -7833798, -6523694, -4957849, -3328026, -1922933, -1060563, -871516, -1164063, -1590918, -1965551, -2352982, -2839685, -3307533, -3524826, -3445357, -3327864, -3489237, -3933220, -4269918, -4067779, -3324918, -2587413, -2582677, -3716511, -5850175, -8401585, -10549459, -11463633, -10646021, -8259538]
36112h259538L168876L032362K372118J712085J360382J392186J730071K131329
36104H639871K265261J978113J422296Q13474J53042o54386j479005j967069j889762
36095I281835j348149o14097Q4441N89475P97774P27693N07774K25697j18961
36086A0133482m61737o23649n41234m28615n42625q50274j097018j168357j202242
36077C217731j329703j466558j412256j041911l78512L94666R58657J040171O53607
36068F35892Q5526l86620o54685o75301m24685m8699J53556N4828j65726l78740
36058a804654p71519j466331k043003j865025q94295K04972Q72646J193663J449978
36049e123568J504035J012377R9051n72172m49685L84456J362163J936344J925177
$$ y = [-8259538, -5090662, -2058300, 313818, 2025903, 3386285, 4778471, 6508542, 8639871, 10905132, 12883245, 14305541, 15119015, 15272057, 14617671, 13138666, 11171597, 9281835, 7933686, 7319589, 7404030, 7993505, 8791279, 9518972, 10026746, 10252443, 10133482, 9671745, 9048096, 8506862, 8078247, 7535622, 6685348, 5588330, 4419973, 3217731, 1888028, 421470, -990786, -2032697, -2411209, -2016543, -1057886, -17715, 635892, 721418, 334798, -319887, -995188, -1419873, -1468572, -1315016, -1260188, -1425914, -1804654, -2576173, -4042504, -6085507, -7950532, -8844827, -8639855, -7767209, -6573546, -5123568, -3619533, -2607156, -2508105, -3080277, -3529962, -3145506, -1783343, 153001, 2078178]
36040B078178J489516Q28427r2893j399555k832146l625281l122392j476353M45962
36031g706537J804426K264317J891798R56092r4101p67459q28605l51006N29664
36022b301411J683482K781768L354915L238848K734113K155314J477763O52998
36014A5777790j47q7889L03865P08861Q89976J011268J201403J301911J162017
36005B2269055Q98634O98320N63948M25789L47286M31580N97253N99585K56527
35996B7087977m23968j299292k206386l055474l849822m567042n009922m875091
35988A800980m032296k667176j102762M30724J788079K790919L272367L236060
35980E516895K874901K417413K005034J700232J521532J420650J270851R63899
$$ y = [2078178, 3567694, 4396121, 4303228, 2903673, 71527, -3553754, -6676146, -8152499, -7706537, -5902111, -3637794, -1745996, -789904, -884005, -1651464, -2480069, -2831075, -2301411, -617929, 2163839, 5518754, 8757602, 11491715, 13647029, 15124792, 15777790, 15777643, 15689754, 15993619, 16702480, 17592456, 18603724, 19805127, 21107038, 22269055, 23167689, 23866009, 24429957, 24855746, 25203032, 25634612, 26231865, 26831450, 27087977, 26664009, 25364717, 23158331, 20102857, 16253035, 11685993, 6676071, 1800980, -2231316, -4898492, -6001254, -5570530, -3782451, -991532, 2280835, 5516895, 8391796, 10809209, 12814243, 14514475, 16036007, 17456657, 18727508, 19691407]
35972A9691407N64783L27090M54040Q10267R64318O00920j71706j003365j684034
35963B0553720k184633k406376k167205j508284p90961l51302k02764j92469k79341
35954A0470385m77458o54191o18803l81318j31394L6366J99022L86063M55083
35945I283755K66289j16911m59092n14606j44424O08463J489608K169785K509691
35936A5092558K651578K773627K790759K402808J467539K64459o60369r03186
35928B5879773m57170L70020J201351J755772J894244J626158J072791L59558
35920C3702497m47777j241575j756461j714174j154972n24639l27972p10415j399624
35911B4424888j981056k188535k032080j749464j576447j464513j070431j30539
$$ y = [19691407, 20256190, 20583280, 21037320, 21847587, 22811905, 23412825, 23241119, 22237754, 20553720, 18369087, 15962711, 13795506, 12287222, 11496261, 11144959, 10942195, 10749726, 10470385, 9992927, 9338736, 8719933, 8338615, 8207221, 8243587, 8442609, 8828672, 9283755, 9550044, 9433133, 8974041, 8459435, 8315011, 8923474, 10413082, 12582867, 15092558, 17744136, 20517763, 23308522, 25711330, 27178869, 27443328, 26782959, 25879773, 25422603, 25792623, 26993974, 28749746, 30643990, 32270148, 33342939, 33702497, 33254720, 32013145, 30256684, 28542510, 27387538, 26862899, 26534927, 25824512, 24424888, 22443832, 20255297, 18223217, 16473753, 14897306, 13432793, 12362362, 12231823]
35903A2231823J178770K342399K941093K911222K447177J803146J184410O71538
35895B7711578J92580l24395p33055p35065k62039L00837M09365j27500j013298
35886B5419008j824158k381335k704315k698954k083794p27418J011449K413719
35878A6424202K911600K445263J371133J62885p71699j164378r72919m04151K34141
35869B0236077P34425J070001J360477J763825K260699K486885J971463P22762
35861C2606614n47563j016032n31596L67133J147942J743760K313713K835679
35853C8919650L085586K871052K172846J167871J90301m53469p25062q22597q59340
35844D5546838o94725j49285P46697J810463K890099L883226M673265N158023
$$ y = [12231823, 13410593, 15752992, 18694085, 21605307, 24052484, 25855630, 27040040, 27711578, 27904158, 27579763, 26846708, 26111643, 25849604, 26150441, 26559806, 26432306, 25419008, 23594850, 21213515, 18509200, 15810246, 13726452, 12999034, 14010483, 16424202, 19335802, 21781065, 23152198, 23315083, 22543384, 21379006, 20406087, 20001936, 20236077, 20970502, 22040503, 23400980, 25164805, 27425504, 29912389, 31883852, 32606614, 32059051, 31043019, 30511423, 30878556, 32026498, 33770258, 36083971, 38919650, 42005236, 44876288, 47049134, 48217005, 48407306, 47953837, 47228775, 46406178, 45546838, 44852113, 44702828, 45449525, 47259988, 50150087, 54033313, 58706578, 63864601]
35836F3864601N274205M932306M049874K754630J439365M73965p9474l81231n55763
35827H1772478o41078o82128p04079o54367n26918m87864p09208j105575j399177
35818G4862084j442809j336714j226902j124591r39631n86965o6849M65000P58412
35809F9361035P44980P15395J048009J776416K611704L374326M144966M918871
35801H8695702N386993N262648M669930M012963L566678L391981L580694M350003
35793A22917592N839779P927712J0268141J2448438J4149266J5272482J5919578
35786B04742988J6174838J5959277J5204710J4078774J2792076J1145026Q528910
35779B98626599M579021k74937n060839q982772j1766517j3464813j4250859j4439615
$$ y = [63864601, 69138806, 74071112, 78120986, 80875616, 82314981, 82788946, 82709472, 82328241, 81772478, 81131400, 80449272, 79745193, 79090826, 78563908, 78076044, 77366836, 76261261, 74862084, 73419275, 72082561, 70855659, 69731068, 68791437, 68204472, 68137623, 68602623, 69361035, 70106015, 70821410, 71869419, 73645835, 76257539, 79631865, 83776831, 88695702, 94082695, 99345343, 104015273, 108028236, 111594914, 114986895, 118567589, 122917592, 128757371, 136685083, 146953224, 159401662, 173550928, 188823410, 204742988, 220917826, 236877103, 252081813, 266160587, 278952663, 290097689, 298626599, 303205620, 302930683, 297869844, 288887072, 277120555, 263655742, 249404883, 234965268]
35771B34965268j4403245j4259467j3786595j2825846j1667136j0846674j0605307
35764A46570998j0710925j0779051j0584930j0063332r213456q098712o814047
35757H0306545n379236l779452k185782j009392n96869q90785j447475j756705
35749F3260849j543843q87499j39287L38274M49914L79900L34242L66976M74648
35740F3034174O97735J016714J262433J261446J007452O03104J24179l66595p85518
35731F7855124j127024j485090j850317k019020j862627j539681j228890q01251
35723E5941224n5845Q02542J274175J180453Q51127O12471L74691j41609j009447
35714E9829782k074942l130373l953520m348600m317018m074733l789444l433223
$$ y = [234965268, 220562023, 206302556, 192515961, 179690115, 168022979, 157176305, 146570998, 135860073, 125081022, 114496092, 104432760, 95219304, 87120592, 80306545, 74927309, 71147857, 68962075, 67952683, 67355814, 66465029, 65017554, 63260849, 61717006, 60829507, 60690220, 61028494, 61478408, 61858308, 62192550, 62559526, 63034174, 63731909, 64748623, 66011056, 67272502, 68279954, 68883058, 69007237, 68640642, 67855124, 66728100, 65243010, 63392693, 61373673, 59511046, 57971365, 56742475, 55941224, 55885379, 56687921, 57962096, 59142549, 59993676, 60606147, 60980838, 60839229, 59829782, 57754840, 54624467, 50670947, 46322347, 42005329, 37930596, 34141152, 30707929]
35706C0707929k981187k557684k226240j811675j142505l61220K04022M04361
35698B0235801L45438J88263N7804Q2348L29662P21781J155561J655149K232089
35689B7003896K633296K454837J596723M94981j88859j10252N06061J128312J464685
35680C6983680J747239K375550L275998L803778L390495K134091O28617o04353
35672E3735095j350526j613370j623827j830660k516805l398540l880134l725194
35664C3796039l206954k583060j767020o65290M38982J067552R92080L70765m28846
35655B8014248j031082j206811r57779l97242M50486J565449K631380L085552
35647C2154201K635283J566026M12429m92090j009178j014618n50619n9420j31841
$$ y = [30707929, 27726742, 25169058, 22942818, 21131143, 19988638, 19627418, 19831440, 20235801, 20581239, 20769502, 20827306, 20909654, 21239316, 21961097, 23116658, 24771807, 27003896, 29637192, 32092029, 33688752, 34183733, 33994874, 33884622, 34390683, 35518995, 36983680, 38730919, 41106469, 44382467, 48186245, 51576740, 53710831, 54339448, 53735095, 52384569, 50771199, 49147372, 47316712, 44799907, 41401367, 37521233, 33796039, 30589085, 28006025, 26239005, 25573715, 26012697, 27080249, 28072329, 28443094, 28014248, 26983166, 25776355, 24818576, 24421334, 24871820, 26437269, 29068649, 32154201, 34789484, 36355510, 36767939, 36275849, 35266671, 34252053, 33701434, 33642014, 33510173]
35638C3510173r36047k022092k701535k570178j805854j132196j344138k553122
35630A8445011l880021m151188k997918j148534L44802R70981Q87225N23936K55395
35621I249689K70437N26355Q33591J057559J177077J126943P60707R5083n62015
35612A4535426r21846j075222j343597j792961k083941j832193r73345K41642
35604D753963J436150K230881K373334J936611J346841J068636J222863J521970
35596A7891249J515919Q80373l64795j732274k455491k094132j051729k94955
35588A2294165m12965j069946j493828j340482q84085n04264l11529k99704n54746
35579E422616j134142j902321k642716l217950l487438l212745k274440r51151
$$ y = [33510173, 32574126, 30552034, 27850499, 25280321, 23474467, 22342271, 20998133, 18445011, 14564990, 10413802, 7415884, 6267350, 6612152, 7583133, 8470358, 8994294, 9249689, 9520126, 10046481, 10880072, 11937631, 13114708, 14241651, 15002358, 15097441, 14535426, 13613580, 12538358, 11194761, 9401800, 7317859, 5485666, 4512321, 4753963, 6190113, 8420994, 10794328, 12730939, 14077780, 15146416, 16369279, 17891249, 19407168, 20287541, 19922746, 18190472, 15734981, 13640849, 12589120, 12294165, 11881200, 10811254, 9317426, 7976944, 7092859, 6588595, 6277066, 5977362, 5422616, 4288474, 2386153, -256563, -3474513, -6961951, -10174696, -12449136, -13400287]
35571a3400287K20985R03813J146808J136878R51459O29024L10197J56567J99372
35562g745184L79908O67859J006373J201279J069359P51877P09391J250064K103039
35553A393965K569782K111378P75075q61864k072416k410686j988591j370392
35545a853749j040502r23012n62193J99303R43978J197583R99009P41759O34691
35536C36867O12868O56842Q21030R39965O89456P2555m62115n62954l85438k76444
35526B442632k96432k97577k65604k72985k07185J35492O98829J162656J308117
35517D407943J200829J024827R27515J016957J300166J585648J613156J319519
35509A4396560Q63374M17148Q4490l5515P4168K16256J57101m9669j68391k45424
$$ y = [-13400287, -13179302, -12275489, -11128681, -9991803, -9040344, -8411320, -8101123, -7944556, -7745184, -7365276, -6697417, -5691044, -4489765, -3420406, -2668529, -1959138, -709074, 1393965, 3963747, 6075125, 6850200, 5988336, 3915920, 1505234, -483357, -1853749, -2894251, -3817263, -4379456, -4180153, -3236175, -2038592, -1039583, -297824, 336867, 949735, 1606577, 2427607, 3367572, 4057028, 4129583, 3667468, 3104514, 2719076, 2442632, 2146200, 1848623, 1583019, 1310034, 1102849, 1238341, 1937170, 3099826, 4407943, 5608772, 6633599, 7561114, 8578071, 9878237, 11463885, 13077041, 14396560, 15259934, 15677082, 15761572, 15726057, 15800225, 16016481, 16173582, 16123913, 15955522, 15710098]
35499A5710098o60863j563356k498962k812797k274260j155981J14589J159975
35491F018443J661657J466140P09616l08088j341701k165042k425831j816503
35483A798691m72616R74213J878519K079765J877680J582264J185291M94900m73388
35474A0925319j348434j711871j510607j077846p69347o82078p11264p27960o51037
35465A734875m75590k97480k04199j05771J72635N64102P14196M07228j03586
35456B406410l59767j94028J83592M88182N81179M88215L88681N18996Q90472
35447E391932J150071R17673K39722m65028q72358r81743r39797q86423r80065
35438B573984j309357j692772j773852j423056q97117n29155m14082m59596n60164
$$ y = [15710098, 15049235, 13485879, 10986917, 8174120, 5899860, 4743879, 4858468, 6018443, 7680100, 9146240, 9855856, 9547768, 8206067, 6041025, 3615194, 1798691, 1326075, 2300288, 4178807, 6258572, 8136252, 9718516, 10903807, 11398707, 10925319, 9576885, 7865014, 6354407, 5276561, 4507214, 3825136, 3113872, 2385912, 1734875, 1259285, 961805, 757606, 651835, 824470, 1388572, 2102768, 2509996, 2406410, 2046643, 1852615, 2036207, 2524389, 3105568, 3593783, 3982464, 4501460, 5391932, 6542003, 7459676, 7699398, 7234370, 6362012, 5380269, 4440472, 3554049, 2573984, 1264627, -428145, -2201997, -3625053, -4522170, -5051325, -5465407, -5925003, -6485167]
35429f485167o04144m61653j16606K53585M15863K60382j40134n20964n11472
35420g910310K1819O54285O94712l6185r31408j290200j088428q36914q67692
35411a1590321j064523j174417j030631m98597M28417J399544J900168J842082
35403i788278J717858J985575K514344K875593L010276L264711L763251M066277
35395A3409607L630102K457760J109713J19964m30836p50948r30931q64576n50510
35386A7199345l07513n40056j247601j837583j576378l60823R83345J361209M96626
35377A4170571p37101j216894p11614O0974M09573L48234K42364J92130R1195
35368A2849432N3695L45515Q98611J246306J044031M29404k03987n72691n76565
$$ y = [-6485167, -7089311, -7550964, -7667570, -7413985, -6998122, -6737740, -6877874, -7398838, -7910310, -7888491, -7234206, -6539494, -6575679, -7507087, -8797287, -9885715, -10722629, -11590321, -12654844, -13829261, -14859892, -15358489, -14930072, -13530528, -11630360, -9788278, -8070420, -6084845, -3570501, -694908, 2315368, 5580079, 9343330, 13409607, 17039709, 19497469, 20607182, 20727146, 20296310, 19545362, 18614431, 17749855, 17199345, 16891832, 16351776, 15104175, 13266592, 11690214, 11329391, 12312736, 13673945, 14170571, 13433470, 12216576, 11504962, 11565936, 11975509, 12323743, 12566107, 12758237, 12849432, 12903127, 13248642, 14147253, 15393559, 16437590, 16866994, 16663007, 16090316, 15513751]
35359A5513751k70682O2207P172n89680j410122k011797k297113k467419k615603
35350C920714k614280k402508k129654j904437j564462q46020K67558J457470
35342e815619K297267K519028K125644J367901O41887L09500M71698Q27985Q09374
35333E554665K1957j310285k391270k479216j516839j13757J034786J603262J600750
35324B004053J171888N76885J72674J57899L52258L92666J36180k76900p25426
35315C962177j254670j860550k325503k420818k179263j840440j577873j369846
35307a0866786j080445n81928J36820Q86097J364520J446304J329543J283749
35299f082126J305707J169208P79778L11044k0625j62568j79867j46371j19200
$$ y = [15513751, 15243069, 15305276, 15312448, 14722768, 13312646, 11300849, 9003736, 6536317, 3920714, 1306434, -1096074, -3225728, -5130165, -6694627, -7540647, -7273089, -5815619, -3518352, -999324, 1126320, 2494221, 3136108, 3445608, 3917306, 4745291, 5554665, 5576622, 4266337, 1875067, -604149, -2120988, -2234745, -1199959, 403303, 2004053, 3175941, 3752826, 3925500, 4083399, 4435657, 4828323, 4964503, 4687603, 3962177, 2707507, 846957, -1478546, -3899364, -6078627, -7919067, -9496940, -10866786, -11947231, -12529159, -12392339, -11506242, -10141722, -8695418, -7365875, -6082126, -4776419, -3607211, -2827433, -2516389, -2537014, -2699582, -2879449, -3025820, -3145020]
35290c145020q8367Q2497N17288J078203J412852J333360J009704P06638M90720
35281C397875L10020J86267J46366R5585l6475j21118j9619J27222M6178k58341
35271C873960n01571n46660n58551o31654n30305r428P62446J322645J387498
35262D568380J022395M05745l27038r47170j080316n35715L30846Q00798M86800
35253D724725k33573o41940n26997m05143p98530j497572j786895j329094n45700
35244c040719p3910q6211k72003l04353j33858R9522K69531L66743M85263P18477
35234a971518J046236J349101J518904J477286J120754M31144l06703o08243k74904
35225C782057L52213P81346Q83225Q26088O37786J38606o85380j511990j970115
$$ y = [-3145020, -3233387, -3150890, -2633602, -1555399, -142547, 1190813, 2200517, 2907155, 3397875, 3707895, 3894162, 4040528, 4136113, 4099638, 3978520, 3958901, 4086123, 4132301, 3873960, 3372389, 2825729, 2267178, 1635524, 1105219, 1095791, 1858237, 3180882, 4568380, 5590775, 5996520, 5669482, 4722312, 3641996, 3106281, 3437127, 4237925, 4724725, 4491152, 3849212, 3322215, 2917072, 2118542, 620970, -1165925, -2495019, -3040719, -3114629, -3200840, -3472843, -3777196, -3911054, -3811532, -3542001, -3175258, -2689995, -1971518, -925282, 423819, 1942723, 3420009, 4540763, 4971907, 4665204, 4056961, 3782057, 4134270, 4915616, 5798841, 6624929, 7262715, 7401321, 6715941, 5203951, 3233836]
35216C233836j922505j436378p06602r3950J1403m38369j056798j466173j678353
35207e553889j833201j731483r89768L18669J512485J972557J784092J541858
35199b978680J650043K002107K254109K162750J635779O95613m46801j399482
35191E575438j850223j820364j562701j229639p67960j65970L30012L64833j79299
35182a305873j050410j830165k227977k200783j860638j309684n66751L52464
35174a1999817J314838K091272K518155K579305K307619J722650R78214M66895
35166A979131N41094J075520J497355J380341Q88660N02606M31315M96637N14646
35157I307305N02418M44798J30977n66106j384376j869280j835539j459100r60693
$$ y = [3233836, 1311331, -125047, -831649, -925599, -914196, -1352565, -2409363, -3875536, -5553889, -7387090, -9118573, -10108341, -9789672, -8277187, -6304630, -4520538, -2978680, -1328637, 673470, 2927579, 5090329, 6726108, 7421721, 6974920, 5575438, 3725215, 1904851, 342150, -887489, -1655449, -1821419, -1491407, -1126574, -1305873, -2356283, -4186448, -6414425, -8615208, -10475846, -11785530, -12352281, -11999817, -10684979, -8593707, -6075552, -3496247, -1188628, 534022, 1512236, 1979131, 2520225, 3595745, 5093100, 6473441, 7362101, 7864707, 8296022, 8792659, 9307305, 9809723, 10254521, 10385498, 9819392, 8435016, 6565736, 4730197, 3271097, 2310404]
35148B310404m36786l8919m3959n28399j092075j147248n12744M14544J105357
35139C0175J397605J508856J665471J829712J777295J369152P18400J10357k17998
35130A0189025k22003k8170J47364N4924m80063j362262k162907k393579j916769
35121A825560j058783l26461o2130l07483q23432j189721j054619m44057K23549
35112c217577N37829M90441M07038N41192Q26103J003912R30528P67296Q83818
35103C170580J470263K192630K396311J815819R47542M76559M23632J88384n52876
35094A2528844j386375j776703j788128j840011j947977j651566p18560M34116
35086A853640J156742J183217P26410J73982j53868j12324J88739M57638N04348
$$ y = [2310404, 1873618, 1834699, 1790740, 1262341, 170266, -976982, -1489726, -1075182, 30175, 1427780, 2936636, 4602107, 6431819, 8209114, 9578266, 10296666, 10407023, 10189025, 9967022, 9938852, 10086216, 10141140, 9661077, 8298815, 6135908, 3742329, 1825560, 766777, 440316, 378186, 70703, -752729, -1942450, -2997069, -3441126, -3217577, -2679748, -2189307, -1782269, -1241077, -414974, 588938, 1519466, 2286762, 3170580, 4640843, 6833473, 9229784, 11045603, 11993145, 12469704, 12893336, 13081720, 12528844, 11142469, 9365766, 7577638, 5737627, 3789650, 2138084, 1419524, 1853640, 3010382, 4193599, 4920009, 5093991, 4940123, 4827799, 5016538, 5474176, 5978524]
35077E978524M04433K83118L7988n35501j360093k011988k125807j774665j373679
35068b477670j238948j276732j097729m52587M16439R02360N95607k85816j094923
35059f009999j361556j116863o65258k15803K01934O17078J054381J529292J995074
35050c971720K322198K398065K203318J737860R69410j8441q87671j227123r14899
35041B610997k16122M86795R75234J219352J262073J148038Q97689M99823k5197
35032H858682n40352q50518q95751q37424r18643j275843j871317k496619k802054
35023c629839k458312j425036k7141J318627K415097L257460L783327L814969
35015G049152L270681K315412J252920L36171l05482o68386q89567j196900j736586
$$ y = [5978524, 6382957, 6666075, 6704063, 6168562, 4808469, 2796481, 670674, -1103991, -2477670, -3716618, -4993350, -6091079, -6543666, -6127227, -5224867, -4629260, -4915076, -6009999, -7371555, -8488418, -9153676, -9369479, -9167545, -8550467, -7496086, -5966794, -3971720, -1649522, 748543, 2951861, 4689721, 5659131, 5640690, 4753019, 3525896, 2610997, 2394875, 2881670, 3856904, 5076256, 6338329, 7486367, 8384056, 8883879, 8858682, 8318330, 7467812, 6572061, 5734637, 4815994, 3540151, 1668834, -827785, -3629839, -6088151, -7513187, -7540328, -6221701, -3806604, -549144, 3234183, 7049152, 10319833, 12635245, 13888165, 14224336, 13918854, 13250468, 12360901, 11164001, 9427415]
35006I427415k422548k974714l100899k660023j741056o61697J56506M29196J79560
34997c368260l41358q75870j255668j348597j083867n93502j87137m6177o199
34988i106635K20199O38319R31358Q18536L18001l32263q31855q78410l25014
34979h547764N67657J229921J356233J271683J506791K084363K471873K210238
34971D150995J333846J58602j050698k076908k657235k619029k051852j245294
34963f057573n16023j09221r8975k94526m01453l87948n37326j004368j480345
34954a0887758j485223q84058N7274J004932J731831K072219J992484J715153
34946d683146J535530J473225J297682R28215N95176N22005O28805O66189N14172
$$ y = [9427415, 7004867, 4030153, 929254, -1730769, -3471825, -4133522, -3977016, -3547820, -3368260, -3709618, -4585488, -5841156, -7189753, -8273620, -8867122, -9054259, -9100436, -9106635, -8886436, -8248117, -7316759, -6498223, -6180222, -6512485, -7344340, -8222750, -8547764, -7980107, -6750186, -5393953, -4122270, -2615479, -531116, 1940757, 4150995, 5484841, 5643443, 4592745, 2515837, -141398, -2760427, -4812279, -6057573, -6573596, -6682817, -6781792, -7076318, -7477771, -7865719, -8403045, -9407413, -10887758, -12372981, -13257039, -13199765, -12194833, -10463002, -8390783, -6398299, -4683146, -3147616, -1674391, -376709, 551506, 1146682, 1668687, 2297492, 2963681, 3477853]
34937C477853K37773n4228k90217m26757m47591l62902j91591K1399J88188K60067
34927B411994L18787M85108P33932R10182R27680Q12120N29033n0148r13584j771074
34917D394030k261579k221320j696835q46527M2065N76535N22199M2881m59163
34908a907714p51521r05944j018926r46331m42454M50418J267048J499998J150866
34899a604560P91906R48169J469845J696643J259996N23527J34184L04203O73130
34890F197043P48975L32327l85834r67372j043762o85891m26231p21845j384780
34881A662630j704914j160488J11970J514879K456064K611542J990603R25118
34873H407404j10840q33701j303473j708624k069010k204602j920954j171621
$$ y = [3477853, 3715626, 3661398, 3371181, 2944424, 2496833, 2133931, 1942340, 1963739, 2151927, 2411994, 2730781, 3215889, 3949821, 4860003, 5787683, 6599803, 7128836, 7078688, 6165104, 4394030, 2132451, -88869, -1785704, -2632231, -2590166, -2013631, -1491432, -1448551, -1907714, -2659235, -3565179, -4584105, -5530436, -5972890, -5522472, -4255424, -2755426, -1604560, -812654, 135515, 1605360, 3302003, 4561999, 5085526, 5219710, 5523913, 6197043, 6946018, 7278345, 6892511, 5925139, 4881377, 4195486, 3769255, 3047410, 1662630, -42284, -1202772, -1090802, 424077, 2880141, 5491683, 7482286, 8407404, 8296564, 7462863, 6159390, 4450766, 2381756, 177154, -1743800, -2915421]
34865b915421j34688P88979J159303Q31363R8625n80969r73245j120252j102929
34856c949234r21793n96278j97113K75241Q81482J508733J787609J431282O32229
34847H52158l1159j13193L57426J031085J579346J832293J728837J296586O73325
34838I206704M2436n00674j011483j631050k431867l246243l636921l176572j879861
34829h265531l04651Q77727J380713J334909R86238N51048K59034K45907L67785
34820b566821L61582K47496L28514O99031J025165R91164P21506N17408L82941
34811B707986J34652j43209j20980L05399Q90866J423064J895988K193174J932092
34802A1219032Q92534n52305j666769j974526j551122q26503k56754q8412k35809
$$ y = [-2915421, -3050109, -2261130, -1101827, -270464, -171839, -752808, -1726053, -2846305, -3949234, -4871027, -5467305, -5664418, -5389177, -4507695, -2998962, -1211353, 219929, 852158, 820999, 707806, 1065232, 2096317, 3675663, 5507956, 7236793, 8533379, 9206704, 9249140, 8748466, 7736983, 6105933, 3674066, 427823, -3209098, -6385670, -8265531, -8570182, -7692455, -6311742, -4976833, -3990595, -3439547, -3180513, -2934606, -2566821, -2205239, -1957743, -1629229, -930198, 94967, 1086131, 1807637, 2325045, 2707986, 2842638, 2699429, 2578449, 2883848, 3774714, 5197778, 7093766, 9286940, 11219032, 12111566, 11559261, 9892492, 7917966, 6366844, 5540341, 5283587, 5195175, 4959366]
34793D959366l77861k87203n1611J01330J17661J22722J80507K30486K63897L83314
34783E642608O28051Q80056J024937J099078J185850J257061J235520J155926
34775A4109087J112959J038931O83331p8091r72020j489052j360103q37284m82703
34766A1725055o91368j389824k115833k360842j927651j073929l19492l7350j78245
34757A630521l79618l16032O9853O12932J109059J451134J634686J632921J281858
34748H727314M20715p45778j569846j513110p83257j53094n7284j42166J02219
34739D285713N35943N49829o5203q43396j305738j523622j793460j998004j636540
34730c794478m83950J019495K128109K442871K152879J701568J290175P24066
$$ y = [4959366, 4581505, 4294302, 4242691, 4344021, 4461682, 4584404, 4764911, 4995397, 5259294, 5642608, 6270659, 7150715, 8175652, 9274730, 10460580, 11717641, 12953161, 14109087, 15222046, 16260977, 16944308, 16866217, 15894197, 14405145, 13045042, 12207758, 11725055, 11033687, 9643863, 7528030, 5167188, 3239537, 2165608, 1846116, 1808766, 1630521, 1250903, 934871, 1004724, 1617656, 2726715, 4177849, 5812535, 7445456, 8727314, 9148029, 8402251, 6832405, 5319295, 4536038, 4382944, 4325660, 4183494, 4285713, 4821656, 5371485, 5306282, 4462886, 3157148, 1633526, -159934, -2157938, -3794478, -4278428, -3258933, -1130824, 1312047, 3464926, 5166494, 6456669, 7180735]
34722G180735k64137j573700k683411l083571k731698k037144j424729r78059
34714g595714n03469J43701Q58476J378717J505849J214557O13579r8958o22201
34705c105463o16710O2898J169815K185740K686774K566449J951755J068373K50334
34696H219965j10298J47524P35146J156970J188204R73805O69241K21173l73449
34687A2828281p97149o62506j0067O49099Q42496N64691J62843o7374q1679J2977
34677A3441612J09365J40434O2758j36185m10623o52321p41405o35525m10042
34668A0768068j82279q22J55804K93086L91239M85075O44993Q18698P87849L90931
34658A4552642k54786q53413j217489j349356j280109j005424o34335m39813o12035
$$ y = [7180735, 6916598, 5342898, 2659487, -424084, -3155782, -5192926, -6617655, -7595714, -8099183, -7955482, -7097006, -5718289, -4212440, -2997883, -2384304, -2483262, -3105463, -3722173, -3659275, -2489460, -303720, 2383054, 4949503, 6901258, 7969631, 8219965, 8109667, 8257191, 8992337, 10149307, 11337511, 12311316, 12980557, 13201730, 12828281, 12031132, 11368626, 11358559, 12007658, 12850154, 13414845, 13577688, 13510314, 13428635, 13441612, 13550977, 13691411, 13754169, 13617984, 13207361, 12555040, 11813635, 11178110, 10768068, 10585789, 10584967, 10740771, 11033857, 11425096, 11910171, 12555164, 13373862, 14161711, 14552642, 14297856, 13444443, 12226954, 10877598, 9597489, 8592065, 7957730, 7517917, 6905882]
34649F905882j008999j277848j238086j073063j117213j482447j904059j950719
34641d146552j406284m58289M98386J205641J611628J639015J106173M2452j049101
34632i56931j507957j144497l91357K14438N32897P38926R47302J118887J246059
34623G97767J413375J653652J874507J940763J740330J218694N14685N0689K55874
34614A1460336J066168J825156J827680R34818l80269j469092j907064j636547
34606A1721186r54081l43077j33473k66039m45277m59656k33982L14548J186255
34597A0386404K033932K283724J712033P55738Q9838M729L18827P36942J078932
34588A9401099J265497J343690J508563J857881K103036J761066P16055n96383
$$ y = [6905882, 5896883, 4619035, 3380949, 2307886, 1190673, -291774, -2195833, -4146552, -5552836, -6011125, -5512739, -4307098, -2695470, -1056455, 49718, 92170, -956931, -2464888, -3609385, -4000742, -3786304, -3253407, -2514481, -1567179, -448292, 797767, 2211142, 3864794, 5739301, 7680064, 9420394, 10639088, 11153773, 11204462, 11460336, 12526504, 14351660, 16179340, 17114158, 16733889, 15264797, 13357733, 11721186, 10767105, 10424028, 10290555, 10024516, 9579239, 9119583, 8885601, 9200149, 10386404, 12420336, 14704060, 16416093, 17171831, 17261669, 17266398, 17585225, 18322167, 19401099, 20666596, 22010286, 23518849, 25376730, 27479766, 29240832, 29956887, 29360504]
34580B9360504j632937k164635k170485j606456n79802L86291O43286Q6604o59215
34571B1663155q43231k87387N51827J071379R64030K92083o81969j679398k495097
34562A8555392k988735l051951k650245j917823j150062o29168m44487m91365
34554E231556o08988o79392o28993m19611p1962L42022P66252J202178J648587
34545F781649K000323K049540J642163Q59739J9880n61120q37949j058313j505655
34536I390257k229255l005872l491651l384277k549647j145605L71892J509683
34528d534475K102228K375406K610712K825963K854582K640499K304458J944628
34520A5124001J535241J065660O36612L22207M2503k83416m91685k32267O64938
$$ y = [29360504, 27727567, 25562932, 23392447, 21785991, 21206189, 21592480, 22235766, 22322370, 21663155, 20819924, 20532537, 21084364, 22155743, 23119773, 23411856, 22729887, 21050489, 18555392, 15566657, 12514706, 9864461, 7946638, 6796576, 6167408, 5722921, 5231556, 4622568, 3943176, 3314183, 2894572, 2822610, 3164632, 3930884, 5133062, 6781649, 8781972, 10831512, 12473675, 13333414, 13353294, 12792174, 11954225, 10895912, 9390257, 7161002, 4155130, 663479, -2720798, -5270445, -6416050, -6044158, -4534475, -2432247, -56841, 2553871, 5379834, 8234416, 10874915, 13179373, 15124001, 16659242, 17724902, 18361514, 18683721, 18726224, 18442808, 17951123, 17718856, 18383794]
34511A8383794J940154L055201L560166L316129K464958J294783J34499p25773
34503C3423911j118918j057724p21503l82698l05030o24362j250915j895675k268011
34494B3799075k292800k118513j921627j775787j734580j919584k381346k894246
34486F760592l037150k548171j551710m26339M74356R71101J082452J017520J078307
34477C820958J434934J969446K382598K448012K144499J604709J019730N74299
34469A7399185L78633M11792N44412O38497O53727O90671R00414J262470J455959
34460B4335760J100892K19182o64519j029038r10551q26364j204765k032664k991582
34451A5996351l697783l775604k967285j396576L40949J519295J771285J268334
$$ y = [18383794, 20323948, 23379149, 26939315, 30255444, 32720402, 34015185, 34149684, 33423911, 32304993, 31247269, 30525766, 30143068, 29838038, 29213676, 27962761, 26067086, 23799075, 21506275, 19387762, 17466135, 15690348, 13955768, 12036184, 9654838, 6760592, 3723442, 1175271, -376439, -802778, -328422, 642679, 1725131, 2742651, 3820958, 5255892, 7225338, 9607936, 12055948, 14200447, 15805156, 16824886, 17399185, 17777818, 18189610, 18734022, 19372519, 20026246, 20716917, 21617331, 22879801, 24335760, 25436652, 25655834, 24991315, 23962277, 23051726, 22225362, 21020597, 18987933, 15996351, 12298568, 8522964, 5555679, 4159103, 4500052, 6019347, 7790632, 9058966]
34443I058966N23654O2429J33221N56071Q56771O88868J92177r7822K77535J301649
34433A3553519K482102L170391K926964J730262l7202j792321l028265l514866
34425A5490584l329157k735553k026114j427265j076650j000769j094159j184421
34417A616496j167458j054658q86031o84173n26949n31270o52677o26595k91422
34408d804737J16010K24153N9646M0860L73619P19061O19547O3337n44460q23147
34398c956111o61786j68049M21220Q53884J061029J193483J351701J398135J182548
34389B676054Q05527M56389J35409k03263l64129j07208M21345Q28880J072630
34380E721634J533908K387188L261670L717801L730785L456828K826022J716325
$$ y = [9058966, 9582620, 9645049, 9778270, 10334341, 11191112, 11879980, 12072157, 11974335, 12251870, 13553519, 16035621, 19206012, 22132976, 23863238, 23826036, 22033715, 19005450, 15490584, 12161427, 9425874, 7399760, 5972495, 4895845, 3895076, 2800917, 1616496, 449038, -605620, -1491651, -2175824, -2702773, -3234043, -3886720, -4513315, -4804737, -4688727, -4464574, -4404928, -4364068, -3990449, -3271388, -2651841, -2588504, -3132964, -3956111, -4617897, -4785946, -4364726, -3510842, -2449813, -1256330, 95371, 1493506, 2676054, 3481581, 3937970, 4073379, 3870116, 3505987, 3398779, 3820124, 4649004, 5721634, 7255542, 9642730, 12904400, 16622201, 20352986, 23809814, 26635836, 28352161]
34372B8352161L49317q39129j638751k092487k194374j904646j440605j205304
34364A7386182j345351j627121j812218j916011k022315k088187k058254j974031
34356B542694j830894j486067q51121o7715N98643R18356P09207p5537j104026
34347f46460j717050j489887o77825R1807M96275O95057R31580J230671J482441
34338C96609J557818J284784N60734l87845j054839j129684q11747n21170m07303
34329e12643l00057p2121J45160J38471j10697l77907l82086j1650N87681J128949
34319B33100J404425J409306J281861J173219J169040J255755J319085J232315
34311A0478106R94938P41374N71458M18795J33220l43864r17483j395661j571401
$$ y = [28352161, 28701478, 27862349, 26223598, 24131111, 21936737, 20032091, 18591486, 17386182, 16040831, 14413710, 12601492, 10685481, 8663166, 6574979, 4516725, 2542694, 711800, -774267, -1625388, -1693103, -1094460, -176104, 533103, 457566, -646460, -2363510, -3853397, -4531222, -4439415, -3943140, -3248083, -2316503, -1085832, 396609, 1954427, 3239211, 3799945, 3412100, 2357261, 1227577, 415830, -105340, -512643, -812700, -884821, -739661, -601190, -711887, -1089794, -1471880, -1483530, -895849, 233100, 1637525, 3046831, 4328692, 5501911, 6670951, 7926706, 9245791, 10478106, 11473044, 12214418, 12785876, 13204671, 13337891, 12994027, 12076544, 10680883, 9109482]
34302I109482j328841p51947r2384M31361P71937R68936J027481R64686Q81206
34293A1981917Q49913P78348N11740M3296n01719j048169j572077j935342j929541
34284G178366j563461j148224r87668j089145j262315j372741j369424j179991
34276b794603p79252l40685j34198k20520l71319l47383j36998J67585O02154
34267d355219J237183J851564J927157J164242m6205q51043p07832J39996R65220
34258A325063J207107P82281n2770r20987j433827j307518n28295N84434J505328
34249A160816J758453J205486K04601n89103p28028k83293L86271J042872J600825
34240E758900J915374J863671J624636J543675J622344J446119P84993o519m18782
$$ y = [9109482, 7780641, 7028694, 6936310, 7367671, 8139608, 9108544, 10136025, 11100711, 11981917, 12831830, 13610178, 14121918, 14165214, 13663495, 12615326, 11043249, 9107907, 7178366, 5614905, 4466681, 3479013, 2389868, 1127553, -245188, -1614612, -2794603, -3573855, -3914540, -4048738, -4269258, -4640577, -4987960, -5124958, -4957373, -4355219, -3118036, -1266472, 660685, 1824927, 1778722, 927679, 219847, 359843, 1325063, 2532170, 3314451, 3261681, 2340694, 906867, -400651, -928946, -344512, 1160816, 2919269, 4124755, 4329356, 3740253, 3012225, 2728932, 3115203, 4158075, 5758900, 7674274, 9537945, 11162581, 12706256, 14328600, 15774719, 16559712, 16553193, 16134411]
34231A6134411m01739k96160l39441n49110r60273j595222k200531k374615k058462
34222E358858j621539j338268j032824m18359M16589J089436J382644J404504
34214E241041J332156J192850R34573N79251K36471J0804q1661j32235k62252
34205I050998m79083o16871m70292J1382O97483J413059K017307K336236K140802
34196A6101021J324209R5290j117577k010374k587373k959389l067528k758030
34188C020249k104944j469365j142951j041217q56857m43876N9533M28062N32629
34179c018737L52573l8936m52481o51356n19933j34513L43639P86750J109861
34170b223133J266019J298394J328685J408593J415742J183935P35602L07171
$$ y = [16134411, 15732672, 15436512, 15097071, 14547961, 13587688, 11992466, 9791935, 7417320, 5358858, 3737319, 2399051, 1366227, 947868, 1364457, 2453893, 3836537, 5241041, 6573197, 7766047, 8700620, 9279871, 9516342, 9527146, 9445485, 9313250, 9050998, 8571915, 7955044, 7484752, 7496134, 8193617, 9606676, 11623983, 13960219, 16101021, 17425230, 17520520, 16402943, 14392569, 11805196, 8845807, 5778279, 3020249, 915305, -554060, -1697011, -2738228, -3595085, -4038961, -3979428, -3551366, -3018737, -2666164, -2705100, -3157581, -3808937, -4328870, -4463383, -4119744, -3332994, -2223133, -957114, 341280, 1669965, 3078558, 4494300, 5678235, 6413837, 6721008]
34162F721008J21045J96503M16924O97746R87850J156808J057961P75769O60631
34153A2792245R43589J362905J358464O77936l37519j105803j313138j038474
34145A3340205n47869q8448K39252N53894J064444J745225K235039K224278J864637
34136B2630657J586204J538163J449608J089229O24109L81605M22516N33847N54133
34127C0810071N05322M02880J14873m91055j331597k135763k690973l001366l171111
34118A9011281l174184k822002j998296q83851J15550O76819P78236O34602M74692
34109A2812847M07697M54871O05702P72017P49710L96315p8414j56399M53104
34100A6417450J361890J785953J297567J34651j196108k328399k988260k920172
$$ y = [6721008, 6842053, 7038556, 7455480, 8153226, 9141076, 10297884, 11355845, 12131614, 12792245, 13735834, 15098739, 16457203, 17135139, 16797620, 15691817, 14378679, 13340205, 12792336, 12703888, 12943140, 13497034, 14561478, 16306703, 18541742, 20766020, 22630657, 24216861, 25755024, 27204632, 28293861, 28917970, 29299575, 29722091, 30255938, 30810071, 31315393, 31718273, 31833146, 31342091, 30010494, 27874731, 25183758, 22182392, 19011281, 15837097, 13015095, 11016799, 10132948, 10248498, 10925317, 11703553, 12338155, 12812847, 13220544, 13675415, 14281117, 15053134, 15802844, 16199159, 16120745, 15964346, 16417450, 17779340, 19565293, 20862860, 20997511, 19801403, 17473004, 14484744, 11564572]
34092A1564572k165213j207077n21832r2685L45803P12727O16241j4423p00982
34083H537131r36898o78532k23769J44723K75560J54759k4472L2085L77336P16210
34073H374133P77292O50182N91399O15236M81976O3320m44109p02564n56870j54588
34063I695407K35391N06766P52957R72166Q79689K42926o37452j074821p20354
34054A0852675Q3612P62662J069352J047665P37282K09003k67274m05616k28156
34045A3861205n447O9980k7077k84794o23224p80431m91950J86964R25475J472198
34035A4302899J759642J679243J053138m1734j128684j683852j559352r97383
34027A3383917l69523j0303j61167q58508j838933k652571k941369k651594k036136
$$ y = [11564572, 9399359, 8192282, 7670450, 7577765, 7923568, 8636295, 9252536, 9238113, 8537131, 7600233, 6921701, 6697932, 6842655, 7118215, 7272974, 7248502, 7280587, 7657923, 8374133, 9151425, 9801607, 10393006, 11008242, 11490218, 11553538, 11109429, 10406865, 9849995, 9695407, 9930798, 10437564, 11190521, 12162687, 13042376, 13285302, 12647850, 11573029, 10852675, 10936287, 11698949, 12768301, 13815966, 14553248, 14762251, 14494977, 14089361, 13861205, 13855758, 13925738, 13898661, 13613867, 12990643, 12210212, 11718262, 11905226, 12830701, 14302899, 16062541, 17741784, 18794922, 18753188, 17624504, 15940652, 14381300, 13383917, 13014394, 13004091, 12842924, 11984416, 10145483, 7492912, 4551543, 1899949, -136187]
34018a36187j459271j120918r10925n58888M6277P18602J169236J277889J126367
34009A52182Q21215L87927j30461n50887o35949l38008R7916L32926K21331j16137
33999B42055m24696m44452j6504P40794J377314J462818J070987P16310P06594
33990E431220P68607M78057j50912p52756j122511j322421j355444j097442o13235
33981B63163k24555j12814o7570K20036P70467J345932J711188J728422J349738
33972F984007P14303J71965L926J09784J07567k35001p63445j138779j178603
33963D775724r47391n63246n746Q09667J745895K325153K055801R33266m87286
33954A0641837j589517k175470k366265k169126j398131p7370J289722K056186
$$ y = [-136187, -1595458, -2716376, -3627301, -4186189, -4139912, -3421310, -2252074, -974185, 152182, 973397, 1361324, 1230863, 679976, 44027, -293981, -196065, 136861, 358192, 242055, -182641, -627093, -643597, 97197, 1474511, 2937329, 4008316, 4724626, 5431220, 6199827, 6677884, 6526972, 5774216, 4651705, 3329284, 1973840, 876398, 263163, 38608, -74206, -141776, 78260, 848727, 2194659, 3905847, 5634269, 6984007, 7698310, 7870275, 7874201, 7983985, 8091552, 7856551, 7093106, 5954327, 4775724, 3828333, 3265087, 3259341, 4069008, 5814903, 8140056, 10195857, 11129123, 10641837, 9052320, 6876850, 4510585, 2341459, 943328, 865958, 2155680, 4211866]
33946D211866K014498J514442J004001O09139K48482P923J57880P50605J384051
33937A1902887J527433J043998K86057l08664o25009q87593j361845k058267k689021
33928F829976k926154k737002k407260k155138j809981j060508k0841O89057N87288
33919e010563p0705n26690l19961L12736Q28797R60595P97588M65555l1941o56391
33909c250980j237590j632921j826965j740737j104186K19499J814363K902229
33901e857288L058951K543861J816889R73852j12030j274962k034881k105970
33893b991578j668955j083488n53302j51948O6258J76121M50425J070218J782613
33884b903636K055621J643895Q65905K26226j28684m23142p63047q59754l81466
$$ y = [4211866, 6226364, 7740806, 8744807, 9353946, 9602428, 9610351, 9768231, 10518836, 11902887, 13430320, 14474318, 14760375, 14451711, 13826702, 12939109, 11577264, 9518997, 6829976, 3903822, 1166820, -1240440, -3395578, -5205559, -6266067, -6286908, -5597851, -5010563, -5081268, -5607958, -5927919, -5615183, -4786386, -3825791, -3028203, -2562648, -2594589, -3250980, -4488570, -6121491, -7948456, -9689193, -10793379, -10573880, -8759517, -5857288, -2798337, -254476, 1562413, 2536265, 2424235, 1149273, -885608, -2991578, -4660533, -5744021, -6297323, -6449271, -6383013, -6206892, -5756467, -4686249, -2903636, -848015, 795880, 1661785, 1888011, 1759327, 1336185, 573138, -286616, -668082]
33875f68082N40409J355705J641649J449012J101005Q33202O94657O26527N16058
33866H090142K83669l155k30200m89513r86955j562253j614477q43977J22341
33857B765622K68350o73441j965925k717113k594955j699146k65161J220342K018679
33848c642748J721188P44682n3601k13523O6094L80368N50403O19080O75681P74125
33838A621749Q91583R05282O95489L15430O020O149L45433P96920J025871Q37208
33828G447134L04527l64292j033468j600762j816730j396499m22233N48126R36516
33819B602319O33454j8859n51561n79401N6112J085639J890647K066436J853659
33810I038445J775394J925628J912962J477700Q13814J95511l89133j049318j684819
$$ y = [-668082, -127673, 1228032, 2869681, 4318693, 5419698, 6252900, 6947557, 7574084, 8090142, 8373811, 8370656, 8140456, 7650943, 6663988, 5101735, 3487258, 2643281, 2765622, 3033972, 2360531, 394606, -2322507, -4917462, -6616608, -6881769, -5661427, -3642748, -1921560, -1176878, -1230479, -1444002, -1377908, -997540, -447137, 171943, 847624, 1621749, 2513332, 3418614, 4114103, 4429533, 4435553, 4441702, 4787135, 5584055, 6609926, 7447134, 7751661, 7387369, 6353901, 4753139, 2936409, 1539910, 1117677, 1665803, 2602319, 3235773, 3216914, 2665353, 2085952, 2142064, 3227703, 5118350, 7184786, 9038445, 10813839, 12739467, 14652429, 16130129, 16943943, 17139454, 16750321, 15701003, 14016184]
33801A4016184k100274k269964k257531j970989j246100j76407Q28797J375162
33793F198878J390350J108622Q49339Q06403R46806J082781J095217J061482J079341
33784A5619219J020852O46016k867n20762n94959m04107l77939o36569q79332
33775A3869552q15566m93587j70655o7247l12516q89502j480967j592563j077182
33766F969767m04552j50823l11095m04908k14804p3001l35283q75642j276850
33757B922809j321955j124422r10072q24951q71251r30487r22586r55982j150413
33748f089310j287769r16949M3087J059171J560848J543379J346297J072295O16974
33739a051977J46545O5779M27038P53484O29141K03377o8218K6338L52078O94280
$$ y = [14016184, 11915910, 9645946, 7388415, 5417426, 4171326, 3994919, 4823716, 6198878, 7589228, 8697850, 9547189, 10353592, 11300398, 12383179, 13478396, 14539878, 15619219, 16640071, 17286087, 17283220, 16762458, 16167499, 15763392, 15385453, 14748884, 13869552, 13053986, 12560399, 12389744, 12322497, 12009981, 11120479, 9639512, 8046949, 6969767, 6565215, 6414392, 6103297, 5698389, 5483585, 5410584, 5075301, 4199659, 2922809, 1600854, 476432, -433640, -1258591, -2129842, -3060329, -3982915, -4938897, -6089310, -7377079, -8294028, -8250941, -7191770, -5630922, -4087543, -2741246, -1668951, -1051977, -905432, -839653, -412615, 340869, 970010, 1173387, 1105169, 1131507, 1483585, 2177865]
33729B177865Q97207Q38525N28562K64766M75981J256869K101145K237456J320728
33720A2099104k20069j566284k210610k205694j802626j111034k39376M82162
33712C225573P33362N99451M57005M58527L89624Q3180k96095n04340n26418m61665
33702D158204k88482M0986L87494N39307N05764M91965N69391N60170L20843r840
33692G275802j88715k40124m87131j129551j863200k054731j343949m237J334626
33683A298790K230154K621377K614568K294270J764229J190078O92900K64632
33675A4970998j70287o71411j254647j831774k158802j986024j335925n43097
33667E019031L3460K57727J78374q8804l67330m68857l60001j80668j6657K04461
$$ y = [2177865, 3075072, 3913597, 4442159, 4706925, 5182906, 6439775, 8540920, 10778376, 12099104, 11879035, 10312751, 8102141, 5896447, 4093821, 2982787, 2743411, 3225573, 3958935, 4558386, 5015391, 5473918, 5863542, 5946722, 5650627, 5146287, 4619869, 4158204, 3869722, 3910708, 4298202, 4837509, 5343273, 5835238, 6404629, 6964799, 7285642, 7275802, 7087087, 6846963, 6359832, 5230281, 3367081, 1312350, -31599, -35836, 1298790, 3528944, 6150321, 8764889, 11059159, 12823388, 14013466, 14706366, 14970998, 14800711, 14129300, 12874653, 11042879, 8884077, 6898053, 5562128, 5019031, 5052491, 5310218, 5488592, 5399788, 5032458, 4563601, 4203600, 4022932, 4006275, 4210736]
33657D210736M89304O30724M64108J31653j11041k19964k50438n1159N70009J371660
33647G235592J738193J353642N45309k01523q17378j514213k270557k730617k553470
33638G84978j664071k42922J300122K392818K630319K138536J460651J029713
33630I830144Q77196Q50684Q82201R22843P98678L27396m81503j464343k463848
33621A0079448l316451l749735l488765k521943j177259R7504J002352J492837
33613a582012J738381J976014K298987K541641K410534J741967O29839o19756
33605A1135595j585366j886532j441750o05048Q2309L28902K35851O8966M3518
33596F376445K89883P75286J172520J040401L24613m49581o69385k59969L06770
$$ y = [4210736, 4700040, 5330764, 5794872, 5926525, 5815484, 5595520, 5345082, 5293923, 5863932, 7235592, 8973785, 10327427, 10872736, 10671213, 9853835, 8339622, 6069065, 3338448, 784978, -879093, -1122015, 178107, 2570925, 5201244, 7339780, 8800431, 9830144, 10707340, 11558024, 12440225, 13363068, 14161746, 14489142, 14007639, 12543296, 10079448, 6762997, 3013262, -475503, -2997446, -4174705, -4077201, -3074849, -1582012, 156369, 2132383, 4431370, 6973011, 9383545, 11125512, 11755351, 11135595, 9550229, 7663697, 6221947, 5616899, 5699208, 6028110, 6263961, 6332927, 6376445, 6666328, 7441614, 8614134, 9654535, 9979148, 9529567, 8860182, 8600213, 8906983]
33587H906983N43406L48440k9342k38297p3491L25589N00245N4336r14000j833359
33577G590510k149336j764806j030699l90602l3164J81005M72523Q23012R67268
33568D665711P40670L17895o616j74838l34208n04133m72587o6166N99797J177401
33558E942926J327366R42102K48387l17731m38702j19091M63753J166484J788149
33549A1003643J942348J339993J91412r64587j878346k753051l702957m349043
33541H29412m163115l032516j302849N73086K228214L370356L850012L751047
33533F103647L273605K541610J631134P44394K14187K87152R05413J658913J976980
33524A9337035J531095N51242l50472p56436p66212p06927o84605n50602j95899
$$ y = [8906983, 9450389, 9798829, 9769487, 9531190, 9457699, 9783288, 10283533, 10337869, 9423869, 7590510, 5441174, 3676368, 2645669, 2255067, 2221903, 2402908, 2875431, 3698443, 4665711, 5406381, 5724276, 5717660, 5542822, 5208614, 4704481, 4231894, 4165728, 4765525, 5942926, 7270292, 8212394, 8460781, 8143050, 7704348, 7585257, 8049010, 9215494, 11003643, 12945991, 14285984, 14477396, 13512809, 11634463, 8881412, 5178455, 829412, -3333703, -6366219, -7669068, -7095982, -4867768, -1497412, 2352600, 6103647, 9377252, 11918862, 13549996, 14294390, 14508577, 14795729, 15701142, 17360055, 19337035, 20868130, 21419372, 21068900, 20312464, 19546252, 18839325, 18154720, 17604118, 17408219]
33515A7408219K64040N27769K47793p27255k096403l197368l533726l184832k611269
33506C096968k167120j914679j749081j486349r33142j11133O31352R45942Q99106
33497b788136Q82919J165166J712370K357317K863956K886188K223915J200779
33489A2504474M82771L81981N67808N77053L55376J36580L9888L0309J05691K54170
33479A5436101L13171J23665j95054l37391k04321m9609j99929p43017j519624
33470A2623992k317826l012183l548700l837914l701305k993809j816029n44654
33462i148428M11769Q73355R13911P28380N27414M53799M89888M95954M21560
33453c832398M11828O02070Q67303R01300N21427j98336j035402j715116j950315
$$ y = [17408219, 17672259, 18200028, 18447821, 17720566, 15624163, 12426795, 8893069, 5708237, 3096968, 929848, -984831, -2733912, -4220261, -5153403, -5264536, -4633184, -3687242, -2788136, -1905217, -740051, 972319, 3329636, 6193592, 9079780, 11303695, 12504474, 12987245, 13369226, 13937034, 14514087, 14869463, 15006043, 15045931, 15076240, 15181931, 15436101, 15749272, 15872937, 15677883, 15340492, 15136171, 15086562, 14886633, 14143616, 12623992, 10306166, 7293983, 3745283, -92631, -3793936, -6787745, -8603774, -9148428, -8736659, -7863304, -6949393, -6221013, -5693599, -5239800, -4749912, -4253958, -3832398, -3420570, -2818500, -1951197, -1049897, -528470, -726806, -1762208, -3477324, -5427639]
33444e427639j609836r28247l83391k22012j74279K35901J110803K001058K324285
33435c073357J909705J113446M47618J52790J25707J68712J98753K22480K51020
33426A516874L30516N59587R45973J299200J410452J315151J217497J159774R79993
33417A0735017O84113O48596J239804K305946L232095L484933K977088J962574
33409B7270166P99864j44283n89958n23558k06372J16751M58731R35007J438678
33400B9555026J636431J310450N90304j90329p81124j138204j373946j654723
33392B7953885k058052k430250k448925j961961j258231q58997r75494j271485
33384A4690490j253613q23329l12103K048K32159O43300J200195J530812J341488
$$ y = [-5427639, -7037475, -7965722, -8349113, -8571125, -8745404, -8509503, -7398700, -5397642, -3073357, -1163652, -50206, 397412, 550202, 675909, 844621, 1043374, 1265854, 1516874, 1847390, 2406977, 3352950, 4652150, 6062602, 7377753, 8595250, 9755024, 10735017, 11419130, 12067726, 13307530, 15613476, 18845571, 22330504, 25307592, 27270166, 28070030, 27925747, 27335789, 26812231, 26605859, 26722610, 27181341, 28116348, 29555026, 31191457, 32501907, 33092211, 32901882, 32120758, 30982554, 29608608, 27953885, 25895833, 23465583, 21016658, 19054697, 17796466, 16937469, 15961975, 14690490, 13436877, 12613548, 12301445, 12303493, 12535652, 13178952, 14379147, 15909959, 17251447]
33375A7251447P20872k1405o79010j185836j425642j219961n66714K50439R02529
33366A4026719J298461J533873J626226J454169R76387L73035j14143m13730o29317
33357B0131680q81557j236436j728150k299236k695971k577367j856921q98566
33349E957476k70893k76906p28063j130540j063526m71058K90886P15236N74491
33340C597103J21211k03090k25191r3504O8244L22469O64898Q59002P16775L70907
33330F198824K3277m51129j325277k446009l159965k943093j899715n31606P71344
33321e763349J856303K635589L049250L134433K941190K434380J666512J003606
33313A2957914R41470J612943K601865L319796L511247L377273L284267L379424
$$ y = [17251447, 17972319, 17950914, 17271904, 16086068, 14660426, 13440465, 12873751, 13124190, 14026719, 15325180, 16859053, 18485279, 19939448, 20915835, 21288870, 21174727, 20760997, 20131680, 19250123, 18013687, 16285537, 13986301, 11290330, 8712963, 6856042, 5957476, 5686583, 5409677, 4681614, 3551074, 2487548, 2016490, 2307376, 3022612, 3597103, 3718314, 3515224, 3290033, 3196529, 3264773, 3587242, 4252140, 5111142, 5827917, 6198824, 6222101, 5770972, 4445695, 1999686, -1160279, -4103372, -6003087, -6534693, -5763349, -3907046, -1271457, 1777793, 4912226, 7853416, 10287796, 11954308, 12957914, 13899384, 15512327, 18114192, 21433988, 24945235, 28322508, 31606775, 34986199]
33305C4986199L438523L078463K144717Q52139m85161j745311k892825l696024
33297C5680720l806979l174550k201266j417454j116953j313633j830234k323486
33289A8496165k441799k175110j937596k090446k438657k411935j742109p68776
33281B489737l5256K48639K70596K94379L98324M59946K92220j68158p18716r63500
33271B568211o34334J22753Q36849J131553J037968Q69799Q27560Q03216N97404
33262H160979K43550K317K9161J59455J00471k22764o04398q18812q53755q67404
33252E328800r81672j156818j248075j169361r94473q49889o78738k11493O78650
33243a283069J616065J930348J347705L55228k69568k15109K33958P38032J287405
$$ y = [34986199, 38424722, 41503185, 43647902, 44500041, 44014880, 42269569, 39376744, 35680720, 31873741, 28699191, 26497925, 25080471, 23963518, 22649885, 20819651, 18496165, 16054366, 13879256, 11941660, 9851214, 7412557, 5000622, 3258513, 2489737, 2454481, 2703120, 2973716, 3268095, 3666419, 4126365, 4418585, 4250427, 3531711, 2568211, 1933877, 2056630, 2893479, 4025032, 5063000, 5932799, 6760359, 7563575, 8160979, 8404529, 8406846, 8436007, 8595462, 8695933, 8473169, 7868771, 7049959, 6196204, 5328800, 4347128, 3190310, 1942235, 772874, -221599, -1071488, -1750226, -1961719, -1283069, 332996, 2263344, 3611049, 3966277, 3696709, 3481600, 3715558, 4453590, 5740995]
33234E740995J945592K461887K432038J818089J058437N68677L03895m9893n90193
33225A5689524j122351j522907j904549k303155k420754j933983j001495k11292
33217C269038M7495j2755R6192N44843J057561J301710J243998J100971J032677
33208I681730R39524N70913j28207p77918p80778J22769J571351K935237L861739
33199A7996360M338732M333017L660148K297711O05338r41456k131161k983441
33191B7175248l430327l253265k417162j366854q52337j350362k600256l756126
33183H148559m102506l636888k888969k236027j588487p48518K08764J079271
33175e764801J819534K418086K620725K134796J121822J77726k93698m72826p75551
$$ y = [5740995, 7686587, 10148474, 12580512, 14398601, 15457038, 16025715, 16329610, 16279717, 15689524, 14567173, 13044266, 11139717, 8836562, 6415808, 4481825, 3480330, 3269038, 3316533, 3303778, 3399970, 3944813, 5002374, 6304084, 7548082, 8649053, 9681730, 10621254, 11192167, 11063960, 10286042, 9505264, 9628033, 11199384, 14134621, 17996360, 22335092, 26668109, 30328257, 32625968, 33231306, 32289850, 30158689, 27175248, 23744921, 20491656, 18074494, 16707640, 15855303, 14504941, 11904685, 8148559, 4046053, 409165, -2479804, -4715831, -6304318, -7052836, -6844072, -5764801, -3945267, -1527181, 1093544, 3228340, 4350162, 4527888, 4234190, 3761364, 2985813]
$$ [...]
##END NTUPLES=NMR SPECTRUM
##END=
