##TITLE=31Pdec_IPACAT-34-5
 CDCl3
  128 sc
 23.11.2023
##JCAMPDX= 6.0         $$ Bruker NMR JCAMP-DX V2.0
##DATA TYPE= NMR SPECTRUM
##DATA CLASS= NTUPLES
##ORIGIN= UXNMR, Bruker Analytische Messtechnik GmbH
##OWNER= root
$$ XWIN-NMR		Version 3.5
$$ Thu Nov 23 16:03:31 2023 Russian Standard Time (UT+4h)  she@DPX200
##.OBSERVE FREQUENCY= 81.013821
##.OBSERVE NUCLEUS= ^31P
##.ACQUISITION MODE= SIMULTANEOUS
##.ACQUISITION SCHEME= undefined
##.AVERAGES= 128
##.DIGITISER RES= 16
##SPECTROMETER/DATA SYSTEM= spect
##.PULSE SEQUENCE= zgpg30
##.SOLVENT NAME= CDCl3
##.SHIFT REFERENCE= (INTERNAL, CDCl3, 0, 248.564)
##AUDIT TRAIL= $$ (NUMBER, WHEN, WHO, WHERE, WHAT)
$$ ##TITLE= Audit trail, XWIN-NMR		Version 3.5
$$ ##JCAMPDX= 5.01
$$ ##ORIGIN= Bruker BioSpin GmbH
$$ ##OWNER= she
$$ F:/spectra/data/she/nmr/P31/1/pdata/1/auditp.txt
$$ ##AUDIT TRAIL=  $$ (NUMBER, WHEN, WHO, WHERE, WHAT)
(   1,<2023-11-23 16:02:29.20 +0400>,<she>,<DPX200>,
      <continue with go, POWCHK disabled, PULCHK disabled
       configuration hash MD5:
       00 E9 B6 7A A2 85 ED C7 34 08 36 98 17 FE 4E 26
       data hash MD5: 32K
       3C 6E 2A F6 9D EC A6 67 AE B3 7A 19 D4 95 BE BE>)
(   2,<2023-11-23 16:02:33.28 +0400>,<she>,<DPX200>,
      <Start of raw data processing
       efp BC_mod = 2 LB = 10 FT_mod = 6 PKNL = 1 PHC0 = -11948.75 PHC1 = 538.0942 SI = 64K 
       data hash MD5: 64K
       60 10 7B 41 B1 52 CE C2 67 5B C3 C1 A2 66 4F 03>)
(   3,<2023-11-23 16:02:46.65 +0400>,<she>,<DPX200>,
      <pk PHC0 = -2.801239 PHC1 = 0 
       data hash MD5: 64K
       29 6D 22 C7 6D 28 E7 10 45 82 9D 97 6F 4A 61 31>)
(   4,<2023-11-23 16:02:52.26 +0400>,<she>,<DPX200>,
      <abs ABSG = 5 
       data hash MD5: 64K
       63 DE A7 1C 33 7E 6A 46 6B 79 25 DC BC 62 89 C2>)
$$ ##END=
$$ 
$$ hash MD5
$$ 97 76 B1 F6 0D D6 F1 67 18 5B 93 C0 5E EA 74 85
##$RELAX= 
##$RELAX= 
##$RELAX= 
##$RELAX= 
##$RELAX= 
##$RELAX= 
##$RELAX= 
##$RELAX= 
##$RELAX= 
$$ Bruker specific parameters
$$ --------------------------
##$DU= <F:/spectra>
##$EXPNO= 1
##$NAME= <P31>
##$PROCNO= 1
##$TYPE= <nmr>
##$USER= <she>
##$AMP= (0..31)
100 100 100 100 100 100 100 100 100 100 100 100 100 100 100 100 100 100 
100 100 100 100 100 100 100 100 100 100 100 100 100 100 
##$AQSEQ= 0
##$AQ_mod= 1
##$AUNM= <au_zg>
##$AUTOPOS= <>
##$BF1= 81.014009
##$BF2= 200.13
##$BF3= 200.13
##$BF4= 200.13
##$BF5= 200.13
##$BF6= 200.13
##$BF7= 200.13
##$BF8= 200.13
##$BYTORDA= 1
##$CFDGTYP= 0
##$CFRGTYP= 5
##$CHEMSTR= <none>
##$CNST= (0..31)
1 1 145 1 1 1 1 1 1 1 1 1 1 1 1 1 1 1 1 1 1 1 1 1 1 1 1 1 1 1 1 1 
##$CPDPRG= <waltz16>
##$CPDPRG1= <>
##$CPDPRG2= <waltz16>
##$CPDPRG3= <>
##$CPDPRG4= <mlev>
##$CPDPRG5= <mlev>
##$CPDPRG6= <mlev>
##$CPDPRG7= <mlev>
##$CPDPRG8= <mlev>
##$CPDPRGB= <>
##$CPDPRGT= <>
##$D= (0..31)
0 1 0 0 0 0 0 0 0 0 0 0.03 2e-05 3e-06 0 0 0 0 0 0 0 0 0 0 0 0 0 0 0 0 
0 0 
##$DATE= 1700740709
##$DBL= (0..7)
120 120 120 11 120 120 24 19 
##$DBP= (0..7)
150 150 150 150 150 150 150 150 
##$DBP07= 0
##$DBPNAM0= <>
##$DBPNAM1= <>
$$ [...]
##$SUBNAM3= <"">
##$SUBNAM4= <"">
##$SUBNAM5= <"">
##$SUBNAM6= <"">
##$SUBNAM7= <"">
##$SUBNAM8= <"">
##$SUBNAM9= <"">
##$SW= 501.771253377433
##$SWIBOX= (0..15)
0 1 3 0 0 0 0 0 0 0 0 0 0 0 0 0 
##$SW_h= 40650.406504065
##$TD= 32768
##$TD0= 1
##$TE= 0
##$TE2= 300
##$TE3= 300
##$TEG= 300
##$TL= (0..7)
0 120 53 12 22 120 120 120 
##$TP= (0..7)
150 150 150 150 150 150 150 150 
##$TP07= 0
##$TPNAME0= <>
##$TPNAME1= <>
##$TPNAME2= <>
##$TPNAME3= <>
##$TPNAME4= <>
##$TPNAME5= <>
##$TPNAME6= <>
##$TPNAME7= <>
##$TPOAL= (0..7)
0.5 0.5 0.5 0.5 0.5 0.5 0.5 0.5 
##$TPOFFS= (0..7)
0 0 0 0 0 0 0 0 
##$TUNHIN= 0
##$TUNHOUT= 0
##$TUNXOUT= 0
##$USERA1= <user>
##$USERA2= <user>
##$USERA3= <user>
##$USERA4= <user>
##$USERA5= <user>
##$V9= 5
##$VALIST= <valist>
##$VCLIST= <CCCCCCCCCCCCCCC>
##$VD= 0
##$VDLIST= <DDDDDDDDDDDDDDD>
##$VPLIST= <PPPPPPPPPPPPPPP>
##$VTLIST= <TTTTTTTTTTTTTTT>
##$WBST= 1024
##$WBSW= 4
##$XGAIN= (0..3)
0 0 0 0 
##$XL= 0
##$YL= 0
##$YMAX_a= 2453
##$YMIN_a= -7409
##$ZGOPTNS= <>
##$ZL1= 120
##$ZL2= 120
##$ZL3= 120
##$ZL4= 120
##$ABSF1= 248.5645
##$ABSF2= -253.2056
##$ABSG= 5
##$ABSL= 3
##$ALPHA= 0
##$AQORDER= 0
##$ASSFAC= 0
##$ASSFACI= 0
##$ASSFACX= 0
##$ASSWID= 0
##$AUNMP= <proc_1d>
##$AZFE= 0.1
##$AZFW= 0.5
##$BCFW= 0
##$BC_mod= 2
##$BYTORDP= 0
##$COROFFS= 0
##$CY= -3
##$DATMOD= 1
##$DC= 0
##$DFILT= <>
##$DTYPP= 0
##$F1P= 0
##$F2P= 0
##$FCOR= 1
##$FTSIZE= 65536
##$FT_mod= 6
##$GAMMA= 0
##$GB= 0
##$INTBC= 1
##$INTSCL= 6.047779e-11
##$ISEN= 30
##$LB= 10
##$LEV0= 0
##$LPBIN= 0
##$MAXI= 10000
##$MC2= 0
##$MEAN= 0
##$ME_mod= 0
##$MI= 50
##$NCOEF= 0
##$NC_proc= -10
##$NLEV= 6
##$NOISF1= 182.463
##$NOISF2= 159.3651
##$NSP= 0
##$NTH_PI= 0
##$NZP= 0
##$OFFSET= 248.5645
##$PC= 4
##$PHC0= -11951.55
##$PHC1= 538.0942
##$PH_mod= 1
##$PKNL= yes
##$PPARMOD= 0
##$PSCAL= 0
##$PSIGN= 0
##$REVERSE= no
##$SF= 81.0140089999694
##$SI= 65536
##$SIGF1= 159.3651
##$SIGF2= -187.1042
##$SINO= 113.3802
##$SIOLD= 16384
##$SREGLST= <1H.CDCl3>
##$SSB= 0
##$STSI= 65536
##$STSR= 0
##$SW_p= 40650.406504065
##$SYMM= 0
##$S_DEV= 0
##$TDeff= 32768
##$TDoff= 0
##$TI= <>
##$TILT= no
##$TM1= 0
##$TM2= 0
##$TOPLEV= 0
##$USERP1= <user>
##$USERP2= <user>
##$USERP3= <user>
##$USERP4= <user>
##$USERP5= <user>
##$WDW= 1
##$XDIM= 65536
##$YMAX_p= 457465145
##$YMIN_p= -343364267
$$ End of Bruker specific parameters
$$ ---------------------------------
##NTUPLES= NMR SPECTRUM
##VAR_NAME=  FREQUENCY,     SPECTRUM/REAL,   SPECTRUM/IMAG
##SYMBOL=    X,             R,               I
##VAR_TYPE=  INDEPENDENT,   DEPENDENT,       DEPENDENT
##VAR_FORM=  AFFN,          ASDF,            ASDF
##VAR_DIM=   65536,         65536,           65536
##UNITS=     HZ,            ARBITRARY UNITS, ARBITRARY UNITS
##FACTOR=    0.620285442955139, 1,           1
##FIRST=     20137.2065510682, 0,            0
##LAST=      -20513.1999529968, 0,           0
##MIN=       -20513.1999529968, -343364267,  0
##MAX=       20137.2065510682, 457465145,    0
$$ Real data points
##PAGE= N=1
##DATA TABLE= (X++(R..R)), XYDATA
$$ [...]
$$ plain form
39760 16922519 18879639 20221792 20907161 20959796 20478106 19625184 18596236 17572817 16682996
39751 16682996 15981352 15448727 15004105 14524381 13872894 12934792 11649422 10026530 8138571
39742 8138571 6092440 3993895 1921403 -79810 -1985786 -3777505 -5433503 -6932412
39734 -6932412 -8254370 -9372316 -10239488 -10791432 -10973434 -10782199 -10295294 -9668482 -9102422
39725 -9102422 -8796640 -8910053 -9538537 -10710138 -12391627 -14497902 -16899963 -19435296 -21927155
39716 -21927155 -24211543 -26159824 -27684125 -28724915 -29233809 -29166631 -28491132 -27201139 -25325068
39707 -25325068 -22923059 -20076721 -16880659 -13441760 -9884101 -6350918 -2995976 36450
39699 36450 2636086 4745619 6366308 7548700 8374248 8937551 9335355 9659244 9983770
$$ packed form
39760A6922519J957120J342153O85369N2635m81690q52922j028948j023419q89821
39751A6682996p01644n32625m44622m79724o51487r38102j285370j622892j887959
39742H138571k046131k098545k072492k001213j905976j791719j655998j498909
39734f932412j321958j117946q67172n51944j82002J91235M86905O26812N66060
39725i102422L05782j13413o28484j171601j681489k106275k402061k535333k491859
39716b1927155k284388j948281j524301j040790n08894O7178O75499J289993J876071
39707b5325068K402009K846338L196062L438899L557659L533183L354942L032426
39699C6450K599636K109533J620689J182392Q25548N63303L97804L23889L24526
$$ plain form
39690 9983770 10347772 10738946 11096670 11338868 11402614 11278985 11026165 10756490 10603947 10683146
39680 10683146 11050418 11677243 12446862 13180988 13690728 13831044 13535172 12818403 11758410
39671 11758410 10467530 9068316 7675332 6381207 5245892 4292072 3510459 2873315
39663 2873315 2347952 1903971 1516751 1172492 871518 620905 417812 240469 61899
39654 61899 -120021 -259949 -268287 -38368 519032 1451026 2756519 4397488 6319061 8467996
39644 8467996 10802243 13288712 15890224 18548115 21172709 23652461 25880412 27783037
39636 27783037 29334420 30549091 31459221 32088056 32431776 32459106 32131599 31437673 30425141
39627 30425141 29216402 27998150 26987593 26383827 26316299 26806644 27763449 29021199 30410146
$$ packed form
39690I983770L64002L91174L57724K42198O3746j23629k52820k69675j52543P9199
39680A0683146L67272O26825P69619P34126N09740J40316k95872p16769j059993
39671A1758410j290880j399214j392984j294125j135315r53820p81613o37144
39663B873315n25363m43981l87220l44259l00974k50613k03093j77343j78570
39654F1899j81920j39928q338K29919N57400R31994J305493J640969J921573K148935
39644H467996K334247K486469K601512K657891K624594K479752K227951J902625
39636B7783037J551383J214671R10130O28835L43720K7330l27507o93926j012532
39627C0425141j208739j218252j010557o03766o7528M90345R56805J257750J388947
$$ plain form
39618 30410146 31818908 33212210 34597738 35972198 37285284 38438308 39307396 39772565
39610 39772565 39742358 39172444 38076102 36520543 34605671 32432858 30080362 27598794
39602 27598794 25026052 22409202 19819661 17354210 15119943 13206207 11654482 10443168
39594 10443168 9498618 8726870 8047764 7415864 6824942 6300814 5887252 5628906 5557338
39585 5557338 5686068 6014619 6535040 7234919 8096737 9097655 10213030 11423325 12719766
39576 12719766 14100562 15552288 17023513 18411608 19581445 20411798 20841717 20888174 20627839
39567 20627839 20158153 19560025 18879882 18139550 17369045 16641040 16079718 15831277 16009912
39558 16009912 16649956 17689947 18994698 20401120 21763264 22975714 23970616 24701289
$$ packed form
39618C0410146J408762J393302J385528J374460J313086J153024Q69088M65169
39610C9772565l0207n69914j096342j555559j914872k172813k352496k481568
39602B7598794k572742k616850k589541k465451k234267j913736j551725j211314
39594A0443168r44550p71748o79106o31900n90922n24128m13562k58346p1568
39585E557338J28730L28551N20421O99879Q61818J000918J115375J210295J296441
39576A2719766J380796J451726J471225J388095J169837Q30353M29919M6457k60335
39567B0627839m69686n98128o80143p40332p70505p28005n61322k48441J78635
39558A6009912O40044J039991J304751J406422J362144J212450R94902P30673
$$ plain form
39550 24701289 25131404 25238434 25023654 24513633 23745974 22747145 21518430 20039678 18286114
39541 18286114 16245160 13925038 11357231 8599244 5739522 2899740 227197 -2126775
39533 -2126775 -4039601 -5450851 -6382376 -6935631 -7266232 -7545065 -7920514 -8495342 -9322854
39524 -9322854 -10414746 -11749252 -13277967 -14939569 -16682577 -18482527 -20335164 -22225914
39516 -22225914 -24097534 -25839932 -27309533 -28368790 -28929602 -28984503 -28612914 -27958025 -27181638
39507 -27181638 -26413317 -25712507 -25057801 -24367235 -23539327 -22494180 -21195822 -19649888 -17884722
39498 -17884722 -15930447 -13808693 -11537810 -9147796 -6691920 -4244478 -1884209 328155
39490 328155 2367402 4247851 6010170 7695910 9323922 10883102 12343868 13676901
$$ packed form
39550B4701289M30115J07030k14780n10021p67659r98829j228715j478752j753564
39541A8286114k040954k320122k567807k757987k859722k839782k672543k353972
39533b126775j912826j411250r31525n53255l30601k78833l75449n74828q27512
39524i322854j091892j334506j528715j661602j743008j799950j852637j890750
39516b2225914j871620j742398j469601j059257n60812n4901L71589O54889P76387
39507b7181638P68321P00810O54706O90566Q27908J045147J298358J545934J765166
39498a7884722J954275K121754K270883K390014K455876K447442K360269K212364
39490C28155K039247J880449J762319J685740J628012J559180J460766J333033
$$ plain form
39482 13676901 14865307 15905340 16800266 17554574 18172677 18661157 19029555 19285944 19430670
39473 19430670 19456995 19361650 19156112 18865847 18515569 18111253 17630561 17025290 16234394 15206145
39463 15206145 13925254 12433131 10827643 9239414 7796768 6596311 5687692 5070989
39455 5070989 4703319 4515081 4435263 4417094 4449856 4549444 4734957 5006913 5337068 5668664
39445 5668664 5921278 5997359 5790534 5195220 4117954 2494754 318396 -2330618 -5268031
39436 -5268031 -8222864 -10888583 -12989042 -14333458 -14845021 -14562636 -13622344 -12224684 -10594778
39427 -10594778 -8945976 -7458386 -6275425 -5509951 -5247503 -5540312 -6395772 -7769021 -9568084
39418 -9568084 -11672756 -13959507 -16321473 -18678258 -20977788 -23192390 -25306198 -27293368
$$ packed form
39482A3676901J188406J040033Q94926P54308O18103M88480L68398K56389J44726
39473A9430670K6325r5345k05538k90265l50278m04316m80692o05271p90896j028249
39463A5206145j280891j492123j605488j588229j442646j200457r08619o16703
39455E070989l67670j88238p9818j8169L2762R9588J85513K71956L30155L31596
39445E668664K52614P6081k06825n95314j077266j623200k176358k649014k937413
39436e268031k954833k665719k100459j344416n11563K82385R40292J397660J629906
39427a0594778J648802J487590J182961P65474K62448k92809q55460j373249j799063
39418i568084k104672k286751k361966k356785k299530k214602k113808j987170
$$ plain form
39410 -27293368 -29098384 -30635678 -31813633 -32568344 -32886002 -32804576 -32400081 -31766446 -30993629
39401 -30993629 -30146261 -29248009 -28279933 -27198539 -25969633 -24602499 -23164857 -21768049
39393 -21768049 -20528579 -19524157 -18763251 -18180064 -17656289 -17058935 -16275391 -15230849 -13888843
39384 -13888843 -12248156 -10345695 -8260027 -6102283 -3989081 -2007659 -191853 1477840
39376 1477840 3052010 4583633 6110862 7657158 9238939 10866482 12534578 14212841
39368 14212841 15847311 17374082 18733601 19872660 20730668 21220460 21221520 20599000 19246444
39359 19246444 17134111 14339725 11047128 7513062 4013633 787576 -2005298 -4296550
39351 -4296550 -6090440 -7427105 -8347886 -8877972 -9029859 -8821940 -8301523 -7558320 -6715620
$$ packed form
39410b7293368j805016j537294j177955p54711l17658Q1426M04495O33635P72817
39401c0993629Q47368Q98252R68076J081394J228906J367134J437642J396808
39393b1768049J239470J004422P60906N83187N23775N97354P83544J044542J342006
39384a3888843J640687J902461K085668K157744K113202J981422J815806J669693
39376A477840J574170J531623J527229J546296J581781J627543J668096J678263
39368A4212841J634470J526771J359519J139059Q58008M89792J060o22520j352556
39359A9246444k112333k794386l292597l534066l499429l226057k792874k291252
39351d296550j793890j336665r20781n30086j51887K07919N20417P43203Q42700
$$ plain form
39342 -6715620 -5897512 -5188257 -4609496 -4130165 -3699569 -3277157 -2839101 -2364895 -1824115
39333 -1824115 -1178437 -394422 548857 1664611 2966017 4462330 6140819 7946729 9776850
39324 9776850 11493942 12957958 14062149 14759437 15067645 15051482 14790872 14352645 13780101
39315 13780101 13102418 12350805 11562847 10767739 9964379 9113314 8152706 7028698 5720531
39306 5720531 4247185 2656007 1003100 -663494 -2310882 -3917383 -5461211 -6908049
39298 -6908049 -8204720 -9284663 -10085223 -10568194 -10731092 -10603474 -10234728 -9683773 -9013198
39289 -9013198 -8281618 -7530464 -6771836 -5988780 -5151708 -4242205 -3269711 -2272071 -1301883
39280 -1301883 -407890 380254 1060909 1662553 2236785 2841240 3519467 4291555 5163175
$$ packed form
39342f715620Q18108P09255N78761M79331M30596M22412M38056M74206N40780
39333a824115O45678P84015R43279J115754J301406J496313J678489J805910J830121
39324I776850J717092J464016J104191O97288L08208j6163k60610m38227n72544
39315A3780101o77683p51613p87958p95108q03360q51065r60608j124008j308167
39306E720531j473346j591178j652907j666594j647388j606501j543828j446838
39298f908049j296671j079943q00560m82971j62898J27618L68746N50955O70575
39289i013198P31580P51154P58628P83056Q37072R09503R72494R97640R70188
39280a301883Q93993P88144O80655O01644N74232O04455O78227P72088Q71620
$$ plain form
39271 5163175 6144398 7259916 8539935 9998659 11617956 13349823 15136907 16935743
39263 16935743 18722670 20473834 22133141 23596265 24728823 25409847 25572476 25218830
39255 25218830 24406059 23216468 21728230 19999218 18069662 15979955 13790780 11590015
39247 11590015 9478281 7538350 5804907 4253194 2814863 1412257 -8893 -1464322
39239 -1464322 -2934603 -4377034 -5736922 -6956518 -7983061 -8774726 -9300839 -9536052 -9455238
39230 -9455238 -9038883 -8291591 -7262487 -6049238 -4777547 -3567358 -2507165 -1649354 -1023975
39221 -1023975 -660565 -608050 -943123 -1758126 -3128007 -5070391 -7518918 -10320591 -13253901
39212 -13253901 -16059308 -18475546 -20274445 -21284417 -21398158 -20572879 -18836348 -16299967
$$ packed form
39271E163175R81223J115518J280019J458724J619297J731867J787084J798836
39263A6935743J786927J751164J659307J463124J132558O81024J62629l53646
39255B5218830q12771j189591j488238j729012j929556k089707k189175k200765
39247A1590015k111734j939931j733443j551713j438331j402606j421150j455429
39239a464322j470281j442431j359888j219596j026543p91665n26113k35213Q0814
39230i455238M16355P47292J029104J213249J271691J210189J060193Q57811O25379
39221a023975L63410N2515l35073q15003j369881j942384k448527k801673k933310
39212a3253901k805407k416238j798899j009972j13741Q25279J736531K536381
$$ plain form
39204 -16299967 -13163222 -9691520 -6166096 -2825914 169407 2736151 4827203 6386401
39196 6386401 7332426 7586442 7122777 6003582 4371963 2408704 279921 -1896653 -4055098
39187 -4055098 -6163522 -8205737 -10176215 -12082165 -13935551 -15730474 -17423157 -18934386
39179 -18934386 -20172718 -21056883 -21520390 -21502774 -20945195 -19802009 -18063745 -15775931 -13039982
39170 -13039982 -9994254 -6785723 -3545773 -377531 2644640 5465214 8031242 10278816
39162 10278816 12131973 13515090 14369536 14664136 14395847 13582490 12251351 10430737 8153729
39153 8153729 5476488 2499403 -627110 -3720734 -6601035 -9122115 -11191261 -12770936
39145 -12770936 -13870428 -14536713 -14849897 -14920478 -14881587 -14873489 -15024490 -15433558 -16155795 -17189952
$$ packed form
39204a6299967L136745L471702L525424L340182K995321K566744K091052J559198
39196F386401R46025K54016m63665j119195j631619j963259k128783k176574k158445
39187d055098k108424k042215j970478j905950j853386j794923j692683j511229
39179a8934386j238332q84165m63507J7616N57579J143186J738264K287814K735949
39170a3039982L045728L208531L239950L168242L022171K820574K566028K247574
39162A0278816J853157J383117Q54446K94600k68289q13357j331139j820614k277008
39153H153729k677241k977085l126513l093624k880301k521080k069146j579675
39145a2770936j099492o66285l13184p0581L8891Q098j51001m09068p22237j034157
$$ plain form
39135 -17189952 -18471042 -19875251 -21240740 -22398297 -23199392 -23533198 -23333786 -22583317 -21312718
39126 -21312718 -19596132 -17537467 -15254168 -12864779 -10480804 -8197297 -6078419 -4141780
39118 -4141780 -2351256 -626628 1129165 2993860 4994683 7094050 9196763 11175905
39110 11175905 12909130 14313077 15362270 16083923 16531758 16753473 16770185 16578965 16174871
39101 16174871 15575252 14826564 13986718 13095043 12151708 11121649 9962458 8663100 7274475
39092 7274475 5913259 4729056 3843516 3289724 2984822 2751459 2376619 1679569 563084
39083 563084 -964462 -2796887 -4762271 -6668426 -8345703 -9672741 -10582233 -11055916 -11118870
39074 -11118870 -10834046 -10291553 -9590988 -8823006 -8058924 -7352801 -6753015 -6313764 -6095439
$$ packed form
39135a7189952j281090j404209j365489j157557q01095l33806J99412P50469J270599
39126b1312718J716586K058665K283299K389389K383975K283507K118878J936639
39118d141780J790524J724628J755793J864695K000823K099367K102713J979142
39110A1175905J733225J403947J049193P21653M47835K21715J6712j91220m04094
39101A6174871n99619p48688q39846q91675r43335j030059j159191j299358j388625
39092G274475j361216j184203q85540n53792l04902k33363l74840o97050j116485
39083E63084j527546j832425j965384j906155j677277j327038r09492m73683o2954
39074a1118870K84824N42493P00565P67982P64082P06123N99786M39251K18325
$$ plain form
39065 -6095439 -6150365 -6503006 -7139296 -8011329 -9050813 -10181277 -11325831 -12412493 -13377003
39056 -13377003 -14160701 -14705097 -14951437 -14852634 -14394494 -13612114 -12586932 -11422968 -10216882
39047 -10216882 -9040771 -7944525 -6967833 -6147188 -5512734 -5080953 -4850087 -4798565 -4883058
39038 -4883058 -5036697 -5173585 -5204591 -5061219 -4716424 -4191681 -3548004 -2866772 -2228012 -1691275
39028 -1691275 -1282942 -993984 -789145 -622201 -448931 -233469 49600 412631 849673
39019 849673 1329758 1792197 2149430 2303202 2173763 1730312 1003765 70947 -980655
39010 -980655 -2083369 -3196129 -4289876 -5329851 -6270233 -7061812 -7664278 -8056743 -8243828
39001 -8243828 -8253821 -8125891 -7891207 -7560956 -7130946 -6598449 -5976665 -5296256 -4596663 -3918529
$$ packed form
39065f095439n4926l52641o36290q72033j039484j130464j144554j086662r64510
39056a3377003p83698n44396k46340R8803M58140P82380J025182J163964J206086
39047a0216882J176111J096246R76692Q20645O34454M31781K30866N1522q4493
39038d883058j53639j36888l1006J43372L44795N24743O43677O81232O38760N36737
39028a691275M08333K88958K04839J66944J73270K15462K83069L63031M37042
39019H49673M80085M62439L57233J53772j29439m43451p26547r32818j051602
39010i80655j102714j112760j093747j039975r40382p91579o02466l92465j87085
39001h243828r993J27930K34684L30251M30010N32497O21784O80409O99593O78134
$$ plain form
38991 -3918529 -3305389 -2811887 -2507756 -2469328 -2761206 -3419579 -4446375 -5812964 -7465553
38982 -7465553 -9328113 -11305670 -13291097 -15173062 -16840897 -18187597 -19117630 -19563323
38974 -19563323 -19503817 -18973866 -18053543 -16842120 -15430249 -13884461 -12247527 -10547572 -8807427
38965 -8807427 -7050993 -5306048 -3600445 -1949242 -338478 1281059 2980016 4818829
38957 4818829 6811302 8899052 10948848 12776711 14191049 15037175 15225820 14739988 13627814
38948 13627814 11993422 9991875 7824116 5721698 3914491 2587117 1841246 1680310
38940 1680310 2020475 2719603 3613462 4551177 5422431 6168027 6769664 7224617 7519205
38931 7519205 7615837 7461330 7012256 6262677 5258017 4087810 2862105 1683030 622953
$$ packed form
38991c918529O13140M93502L04131L8428k91878o58373j026796j366589j652589
38982g465553j862560j977557j985427j881965j667835j346700r30033m45693
38974a9563323N9506N29951R20323J211423J411871J545788J636934J699955J740145
38965h807427J756434J744945J705603J651203J610764J619537J698957J838813
38957D818829J992473K087750K049796J827863J414338Q46126J88645m85832j112174
38948A3627814j634392k001547k167759k102418j807207j327374p45871j60936
38940A680310L40165O99128Q93859R37715Q71254P45596O01637M54953K94588
38931G519205R6632j54507m49074p49579j004660j170207j225705j179075j060077
$$ plain form
38922 622953 -283855 -1036432 -1657130 -2185190 -2674662 -3189709 -3792677 -4529182 -5417965 -6448886
38912 -6448886 -7588366 -8790614 -10010338 -11207911 -12340231 -13342876 -14120163 -14557176
38904 -14557176 -14553230 -14061343 -13112447 -11809591 -10293984 -8700875 -7125568 -5607116 -4125228
38895 -4125228 -2607451 -951174 938313 3107211 5531833 8128144 10784072 13394942
38887 13394942 15886698 18223927 20407403 22464344 24429787 26319312 28101536 29683031
38879 29683031 30912367 31601385 31560673 30648163 28822673 26179967 22946279 19424139 15913627
38870 15913627 12645276 9750533 7273186 5205826 3527798 2227064 1302432 753670
38862 753670 567616 703790 1083420 1590789 2094134 2481008 2690975 2729285 2657142 2565148
$$ packed form
38922F22953r06808p52577o20698n28060m89472n15047o02968p36505q88783j030921
38912f448886j139480j202248j219724j197573j132320j002645p77287m37013
38904a4557176L946M91887R48896J302856J515607J593109J575307J518452J481888
38895d125228J517777J656277J889487K168898K424622K596311K655928K610870
38887A3394942K491756K337229K183476K056941J965443J889525J782224J581495
38879B9683031J229336O89018m0712r12510j825490k642706l233688l522140l510512
38870A5913627l268351k894743k477347k067360j678028j300734r24632n48762
38862G53670j86054J36174L79630N07369N03345L86874K09967L8310p2143r1994
$$ plain form
38852 2565148 2540121 2634007 2842221 3098039 3288123 3288928 3013202 2445554 1647877 733856
38842 733856 -166873 -930791 -1441731 -1583828 -1243363 -327639 1203421 3307572 5852278
38833 5852278 8641331 11467925 14166799 16639734 18849907 20799235 22503901 23974393
38825 23974393 25201453 26150422 26765871 26984455 26751036 26034004 24838807 23220384 21292769
38816 21292769 19227959 17233410 15507264 14188810 13330248 12902530 12825236 13000978 13343604
38807 13343604 13800386 14367251 15089129 16038469 17277372 18821470 20624447 22588887 24592611
38798 24592611 26514148 28250075 29729083 30927880 31882643 32681692 33431697 34206547 35002160
38789 35002160 35722382 36208273 36299764 35898368 34998977 33680818 32074093 30326642 28582016
$$ packed form
38852B565148k5027R3886K08214K55818J90084Q05k75726n67648p97677r14021
38842G33856r00729p63918n10940j42097L40465R15724J531060K104151K544706
38833E852278K789053K826594K698874K472935K210173J949328J704666J470492
38825B3974393J227060R48969O15449K18584k33419p17032j195197j618423j927615
38816B1292769k064810j994549j726146j318454q58562m27718p7294J75742L42626
38807A3343604M56782N66865P21878R49340J238903J544098J802977J964440K003724
38798B4592611J921537J735927J479008J198797R54763P99049P50005P74850P95613
38789C5002160P20222M85891R1491m01396q99391j318159j606725j747451j744626
$$ plain form
38780 28582016 26964958 25567992 24440330 23584725 22964311 22515518 22161597 21824207 21434487
38771 21434487 20946029 20348647 19674756 18986414 18338572 17732109 17084728 16242863 15033308
38762 15033308 13329001 11098732 8425572 5496358 2571066 -61369 -2135484 -3460820
38754 -3460820 -3959044 -3674202 -2752508 -1401262 154483 1702122 3056720 4070095 4640633
38745 4640633 4721267 4319702 3490632 2324358 933004 -568415 -2084742 -3557673 -4967469
38736 -4967469 -6320254 -7631247 -8913306 -10172223 -11405233 -12599951 -13733198 -14770348
38728 -14770348 -15667073 -16376353 -16861083 -17106611 -17124645 -16945091 -16601950 -16124145 -15537368
38719 -15537368 -14872921 -14172853 -13482965 -12835531 -12233907 -11652392 -11054228 -10417156 -9751335
$$ packed form
38780B8582016j617058j396966j127662q55605o20414m48793l53921l37390l89720
38771B1434487m88458n97382o73891o88342o47842o06463o47381q41865j209555
38762A5033308j704307k230269k673160k929214k925292k632435k074115j325336
38754c460820m98224K84842R21694J351246J555745J547639J354598J013375N70538
38745D640633Q0634m01565q29070j166274j391354j501419j516327j472931j409796
38736d967469j352785j310993j282059j258917j233010j194718j133247j037150
38728a4770348q96725p09280m84730k45528j8034J79554L43141M77805N86777
38719a5537368O64447P00068O89888O47434O01624N81515N98164O37072O65821
$$ plain form
38710 -9751335 -9101890 -8539125 -8143584 -7990398 -8133991 -8594204 -9345523 -10310130 -11355633
38701 -11355633 -12301921 -12945086 -13101430 -12660704 -11625157 -10112318 -8315925 -6440276 -4635577
38692 -4635577 -2960380 -1384467 172605 1787437 3488147 5236250 6937966 8475954
38684 8475954 9746121 10682750 11260547 11475361 11319972 10774553 9819317 8460350 6752731
38675 6752731 4809334 2790365 873494 -788752 -2107976 -3075002 -3741225 -4176784 -4430537
38666 -4430537 -4513494 -4410239 -4105984 -3611980 -2978738 -2295674 -1679920 -1256334 -1130912 -1364062
38656 -1364062 -1954676 -2844097 -3939185 -5141283 -6362849 -7522255 -8525930 -9261022 -9615953
38647 -9615953 -9522188 -8988750 -8103723 -7001925 -5820508 -4664266 -3586673 -2583182 -1597853
$$ packed form
38710i751335O49445N62765L95541J53186j43593m60213p51319r64607j045503
38701a1355633r46288o43165j56344M40726J035547J512839J796393J875649J804699
38692d635577J675197J575913J557072J614832J700710J748103J701716J537988
38684H475954J270167R36629N77797K14814j55389n45419r55236j358967j707619
38675F752731j943397k018969j916871j662246j319224r67026o66223m35559k53753
38666d430537q2957J03255L04255M94004O33242O83064O15754M23586J25422k33150
38656a364062n90614q89421j095088j202098j221566j159406j003675p35092l54931
38647i615953R3765N33438Q85027J101798J181417J156242J077593J003491R85329
$$ plain form
38638 -1597853 -549389 625967 1933727 3308290 4640430 5833333 6856783 7768777
38630 7768777 8692306 9759871 11053889 12569479 14213260 15837613 17297769 18508776
38622 18508776 19475607 20280289 21033104 21815173 22642317 23464779 24196990 24758714 25108256
38613 25108256 25256760 25263565 25219483 25225366 25370321 25712685 26268305 27010978 27884904 28821263
38603 28821263 29748605 30594460 31286536 31762779 31987047 31954999 31679067 31160146 30366709
38594 30366709 29235889 27693170 25676798 23157301 20152147 16738298 13059930 9322801
38586 9322801 5768037 2626389 64078 -1861399 -3215918 -4161780 -4893816 -5562557 -6217768
38577 -6217768 -6796456 -7157117 -7141230 -6634408 -5604138 -4104025 -2250267 -186754 1945212
$$ packed form
38638a597853J048464J175356J307760J374563J332140J192903J023450R11994
38630G768777R23529J067565J294018J515590J643781J624353J460156J211007
38622A8508776R66831Q04682P52815P82069Q27144Q22462P32211N61724L49542
38613B5108256J48504O805m4082N883J44955L42364N55620P42673Q73926R36359
38603B8821263R27342Q45855O92076M76243K24268l2048k75932n18921p93437
38594C0366709j130820j542719k016372k519497l005154l413849l678368l737129
38586I322801l554764l141648k562311j925477j354519r45862p32036o68741o55211
38577f217768n78688l60661J5887N06822J030270J500113J853758K063513K131966
$$ plain form
38568 1945212 4025778 5965752 7709937 9236899 10556421 11704517 12734176 13701777
38560 13701777 14654602 15626215 16638663 17702725 18811256 19932319 21012028 21986543
38552 21986543 22792399 23367984 23651460 23585248 23128627 22269496 21026768 19444457 17584686
38543 17584686 15523067 13343546 11131116 8967581 6936044 5130227 3655399 2610807
38535 2610807 2057287 1986642 2311694 2886140 3546407 4154344 4621745 4914453 5047585 5079366
38525 5079366 5097358 5189461 5407402 5743064 6130585 6467613 6638686 6530991 6046744 5121208
38515 5121208 3746548 1988753 -17827 -2100761 -4089321 -5843433 -7263146 -8285173
38507 -8285173 -8877438 -9035918 -8780436 -8145069 -7164890 -5867914 -4280629 -2443853 -422748
$$ packed form
38568A945212K080566J939974J744185J526962J319522J148096J029659R67601
38560A3701777R52825R71613J012448J064062J108531J121063J079709R74515
38552B1986543Q05856N75585K83476o6212m56621q59131j242728j582311j859771
38543A7584686k061619k179521k212430k163535k031537j805817j474828j044592
38535B610807n53520p0645L25052N74446O60267O07937M67401K92708J33132L1781
38525E079366J7992R2103K17941L35662L87521L37028J71073j07695m84247r25536
38515E121208j374660j757795k006580k082934j988560j754112j419713j022027
38507h285173n92265j58480K55482O35367R80179J296976J587285J836776K021105
$$ plain form
38498 -422748 1703110 3865067 6025717 8178091 10325963 12460734 14549970 16544701
38490 16544701 18402202 20110119 21693301 23195496 24648216 26049215 27363059 28538330
38482 28538330 29527452 30298339 30834448 31126554 31165786 30948420 30492914 29854252 29116236
38473 29116236 28357900 27614260 26861005 26036222 25083032 23980863 22743967 21392718 19922906
38464 19922906 18297497 16469115 14422309 12211291 9966971 7861133 6041878 4575752
38456 4575752 3429822 2500474 1666249 832348 -51481 -996805 -1992832 -3023095 -4078964
38447 -4078964 -5167679 -6310544 -7529465 -8828102 -10180085 -11533448 -12829226 -14022355
38439 -14022355 -15092547 -16041095 -16879046 -17615155 -18248070 -18762163 -19125596 -19291636 -19206084
$$ packed form
38498d22748K125858K161957K160650K152374K147872K134771K089236J994731
38490A6544701J857501J707917J583182J502195J452720J400999J313844J175271
38482B8538330R89122P70887N36109K92106L9232k17366m55506o38662p38016
38473B9116236p58336p43640p53255q24783r53190j102169j236896j351249j469812
38464A9922906j625409j828382k046806k211018k244320k105838j819255j466126
38456D575752j145930r29348q34225q33901q83829r45324r96027j030263j055869
38447d078964j088715j142865j218921j298637j351983j353363j295778j193129
38439a4022355j070192r48548q37951p36109o32915n14093l63433j66040Q5552
$$ plain form
38430 -19206084 -18822590 -18124327 -17145100 -15977693 -14758417 -13628687 -12690466 -11978103 -11458717
38421 -11458717 -11056556 -10687138 -10287377 -9832175 -9333247 -8822702 -8330769 -7869106 -7427205
38412 -7427205 -6982572 -6518243 -6035394 -5549146 -5067260 -4567522 -3994181 -3279501 -2376546
38403 -2376546 -1283417 -49292 1235772 2462721 3532923 4385895 5010170 5427707 5660045
38394 5660045 5699469 5505252 5025848 4229604 3124734 1762594 231484 -1352245 -2858967
38385 -2858967 -4173152 -5228976 -6035804 -6676154 -7275419 -7958373 -8809024 -9843041 -10997340
38376 -10997340 -12140808 -13106655 -13739084 -13940799 -13706474 -13129204 -12373219 -11619559 -11006137
38367 -11006137 -10586256 -10316551 -10070638 -9672145 -8944877 -7773050 -6150506 -4192730 -2102158
$$ packed form
38430a9206084L83494O98263R79227J167407J219276J129730R38221P12363N19386
38421a1458717M02161L69418L99761M55202M98928N10545M91933M61663M41901
38412g427205M44633M64329M82849M86248M81886M99738N73341P14680R02955
38403b376546J093129J234125J285064J226949J070202Q52972O24275M17537K32338
38394E660045L9424j94217m79404p96244j104870j362140j531110j583729j506722
38385b858967j314185j055824q06828o40350n99265o82954q50651j034017j154299
38376a0997340j143468r65847o32429k01715K34325N77270P55985P53660O13422
38367a1006137M19881K69705K45913L98493P27268J171827J622544J957776K090572
$$ plain form
38358 -2102158 -105137 1605460 2896404 3687471 3931717 3606518 2725079 1357453 -359454
38349 -359454 -2234875 -4055321 -5620306 -6772553 -7418617 -7536660 -7168238 -6396893 -5323924
38340 -5323924 -4051240 -2672838 -1269892 93724 1373836 2543054 3580941 4458170
38332 4458170 5120731 5486520 5465361 4999209 4102499 2880153 1515394 235660 -730325
38323 -730325 -1195385 -1050429 -287005 1002598 2651326 4462173 6253219 7882344 9244641
38314 9244641 10255555 10840276 10937382 10508141 9540735 8049191 6073089 3678778 956607
38305 956607 -1989102 -5053265 -8139467 -11162324 -14044618 -16713598 -19099231 -21133947
38297 -21133947 -22752661 -23895783 -24520820 -24623278 -24257398 -23542934 -22650578 -21768228 -21056335
$$ packed form
38358b102158J997021J710597J290944P91067K44246l25199q81439j367626j716907
38349c59454j875421j820446j564985j152247o46064j18043L68422P71345J072969
38340e323924J272684J378402J402946J363616J280112J169218J037887Q77229
38332D458170O62561L65789k1159m66152q96710j222346j364759j279734r65985
38323g30325m65060J44956P63424J289603J648728J810847J791046J629125J362297
38314I244641J010914N84721R7106m29241r67406j491544j976102k394311k722171
38305I56607k945709l064163l086202l022857k882294k668980k385633k034716
38297b1133947j618714j143122o25037j02458L65880P14464Q92356Q82350P11893
$$ plain form
38288 -21056335 -20604833 -20408892 -20377935 -20376158 -20273315 -19980265 -19458343 -18709624 -17761138 -16650540
38278 -16650540 -15414323 -14078959 -12658192 -11160092 -9601763 -8021818 -6479712 -5040652
38270 -5040652 -3755687 -2646603 -1696326 -842705 17977 1006182 2214015 3662463 5289580
38261 5289580 6979244 8613332 10117984 11482486 12745781 13959824 15147409 16273941
38253 16273941 17246871 17944129 18259912 18148860 17650332 16881648 16000860 15152591 14419002
38244 14419002 13795840 13200514 12503510 11567172 10279463 8578202 6465216 4009704 1340303
38235 1340303 -1372074 -3936665 -6167401 -7907210 -9047901 -9539377 -9384912 -8627408 -7338094
38226 -7338094 -5616052 -3594683 -1440413 668509 2578905 4195978 5495187 6511102
$$ packed form
38288b1056335M51502J95941L0957J777J02843K93050N21922P48719R48486J110598
38278a6650540J236217J335364J420767J498100J558329J579945J542106J439060
38270e040652J284965J109084R50277Q53621Q60682R88205J207833J448448J627117
38261E289580J689664J634088J504652J364502J263295J214043J187585J126532
38253A6273941R72930O97258L15783j11052m98528p68684q80788q48269p33589
38244A4419002o23162n95326o97004r36338j287709j701261k112986k455512k669401
38235A340303k712377k564591k230736j739809j140691m91476J54465P57504J289314
38226g338094J722042K021369K154270K108922J910396J617073J299209J015915
$$ plain form
38218 6511102 7315200 7993045 8621926 9247707 9866903 10424838 10835121 11014447 10918864 10565826
38208 10565826 10030874 9419773 8832682 8343103 8001770 7854192 7951792 8347041 9078536
38199 9078536 10156613 11555532 13214920 15052289 16983414 18939190 20867593 22721302
38191 22721302 24443883 25966422 27215092 28122448 28637995 28739188 28443177 27813908 26957290
38182 26957290 26002198 25072552 24259942 23606101 23101061 22697389 22334624 21963909 21562930
38173 21562930 21136035 20700976 20268797 19824730 19316661 18656303 17736696 16464295 14794417
38164 14794417 12753079 10434729 7980066 5546705 3281129 1293160 -364352 -1701598
38156 -1701598 -2776879 -3666143 -4431512 -5100532 -5659621 -6061172 -6242555 -6150982 -5763288
$$ packed form
38218F511102Q04098O77845O28881O25781O19196N57935M10283J79326r5583l53038
38208A0565826n34952o11101n87091m89579l41333j47578R7600L95249P31495
38199I078536J078077J398919J659388J837369J931125J955776J928403J853709
38191B2721302J722581J522539J248670R07356N15547J01193k96011o29269q56618
38182B6957290r55092r29646q12610o53841n05040m03672l62765l70715m00979
38173B1562930m26895m35059m32179m44067n08069o60358r19607j272401j669878
38164A4794417k041338k318350k454663k433361k265576j987969j657512j337246
38156a701598j075281q89264p65369o69020n59089m01551j81383R1573L87694
$$ plain form
38147 -5763288 -5092540 -4183431 -3104639 -1942384 -791517 260846 1157356 1888732 2497519
38138 2497519 3062741 3670846 4386091 5233374 6198176 7237907 8294813 9305198 10207214
38129 10207214 10952375 11521287 11936725 12263832 12591683 13000743 13530501 14164208 14839808
38120 14839808 15481614 16035037 16486160 16859718 17203945 17576211 18035397 18633777 19397295
38111 19397295 20294929 21216097 21980180 22383961 22264179 21540099 20217919 18368066 16099299
38102 16099299 13542146 10837552 8124976 5533183 3178739 1167300 -413158 -1508661
38094 -1508661 -2113168 -2268644 -2053027 -1564935 -906849 -161756 632983 1496499 2485377
38085 2485377 3653196 5014696 6532109 8118849 9646939 10955900 11872042 12240872
$$ packed form
38147e763288O70748R09109J078792J162255J150867J052363Q96510P31376O08787
38138B497519N65222O08105P15245Q47283R64802J039731J056906J010385R02016
38129A0207214P45161N68912M15438L27107L27851M09060N29758O33707O75600
38120A4839808O41806N53423M51123L73558L44227L72266M59186N98380P63518
38111A9397295Q97634R21168P64083M03781j19782p24080j322180j849853k268767
38102A6099299k557153k704594k712576k591793k354444k011439j580458j095503
38094a508661o04507j55476K15617M88092O58086P45093P94739Q63516R88878
38085B485377J167819J361500J517413J586740J528090J308961R16142L68830
$$ plain form
38077 12240872 11960425 10999387 9395126 7239673 4663841 1823619 -1112495 -3977148
38069 -3977148 -6618823 -8915856 -10786880 -12194407 -13139459 -13648496 -13757945 -13503796 -12921893
38060 -12921893 -12058364 -10982909 -9795224 -8619244 -7587323 -6821158 -6415449 -6426383 -6864683
38051 -6864683 -7693573 -8832918 -10169071 -11566434 -12876375 -13944911 -14627435 -14816714 -14476931
38042 -14476931 -13663520 -12511996 -11198842 -9895457 -8734866 -7795843 -7099090 -6614222 -6281828
38033 -6281828 -6048379 -5897646 -5858684 -5985365 -6322895 -6884410 -7649375 -8577323 -9620909
38024 -9620909 -10727902 -11835242 -12866880 -13743578 -14401557 -14808672 -14968960 -14915753 -14700549
38015 -14700549 -14383937 -14029070 -13695445 -13432904 -13278098 -13253949 -13370302 -13625425 -14010488
$$ packed form
38077A2240872k80447r61038j604261k155453k575832k840222k936114k864653
38069c977148k641675k297033j871024j407527r45052n09037j09449K54149N81903
38060a2921893Q63529J075455J187685J175980J031921P66165M05709j0934m38300
38051f864683q28890j139345j336153j397363j309941j068536o82524j89279L39783
38042a4476931Q13411J151524J313154J303385J160591R39023O96753M84868L32394
38033f281828K33449J50733L8962j26681l37530n61515p64965r27948j043586
38024i620909j106993j107340j031638q76698o57979m07115j60288N3207K15204
38015a4700549L16612L54867L33625K62541J54806K4149j16353k55123l85063
$$ plain form
38006 -14010488 -14516831 -15141026 -15883550 -16743121 -17710402 -18759337 -19833827 -20838888 -21653993
37997 -21653993 -22173546 -22353145 -22229648 -21901776 -21486664 -21079683 -20735413 -20471957 -20290776
37988 -20290776 -20200474 -20233038 -20445035 -20903974 -21668460 -22774145 -24231248 -26026140 -28112256
37979 -28112256 -30386446 -32668842 -34713280 -36257829 -37096132 -37135563 -36416698 -35088605 -33353599
37970 -33353599 -31406840 -29395844 -27410692 -25497089 -23675731 -21956376 -20343709 -18836499
37962 -18836499 -17423174 -16077785 -14759180 -13413242 -11977843 -10392496 -8613737 -6631957
37954 -6631957 -4482546 -2247833 -50284 1962705 3642568 4867788 5567709 5733526
37946 5733526 5412952 4690000 3656528 2387755 933562 -673437 -2405026 -4232578
$$ packed form
38006a4010488n06343o24195p42524q59571r67281j048935j074490j005061q15105
37997b1653993n19553j79599J23497L27872M15112M06981L44270K63456J81181
37988b0290776R0302l2564k11997m58939p64486j105685j457103j794892k086116
37979b8112256k274190k282396k044438j544549q38303l9431P18865J328093J735006
37970c3353599J946759K010996J985152J913603J821358J719355J612667J507210
37962a8836499J413325J345389J318605J345938J435399J585347J778759J981780
37954f631957K149411K234713K197549K012989J679863J225220O99921J65817
37946E733526l20574p22952j033472j268773j454193j606999j731589j827552
$$ plain form
37938 -4232578 -6130618 -8077714 -10046456 -11987851 -13824701 -15463808 -16822276 -17852420
37930 -17852420 -18552064 -18958450 -19133122 -19145265 -19056596 -18908141 -18709802 -18435378 -18027243 -17413190
37920 -17413190 -16531319 -15352036 -13889555 -12206787 -10421095 -8705601 -7268260 -6301404
37912 -6301404 -5922003 -6136925 -6851313 -7909296 -9142298 -10406772 -11604864 -12686699 -13634431
37903 -13634431 -14433614 -15046458 -15405342 -15435663 -15098031 -14425357 -13532839 -12594383 -11793433
37894 -11793433 -11263384 -11038001 -11036425 -11098599 -11059888 -10826250 -10409901 -9913003 -9478197 -9235120
37884 -9235120 -9261683 -9565380 -10084799 -10710735 -11322317 -11825920 -12180555 -12398073 -12518162 -12570313
37874 -12570313 -12541698 -12367624 -11950046 -11194245 -10043878 -8497964 -6607156 -4459167 -2164656
$$ packed form
37938d232578j898040j947096j968742j941395j836850j639107j358468j030144
37930a7852420o99644m06386j74672j2143Q8669J48455J98339K74424M08135O14053
37920a7413190Q81871J179283J462481J682768J785692J715494J437341R66856
37912f301404L79401k14922p14388j057983j233002j264474j198092j081835r47732
37903a3634431p99183o12844l58884l0321L37632O72674Q92518R38456Q00950
37894a1793433N30049K25383J576o2174L8711K33638M16349M96898M34806K43077
37884i235120k6563l03697n19419o25936o11582n03603l54635k17518j20089n2151
37874a2570313K8615J74074M17578P55801J150367J545914J890808K147989K294511
$$ plain form
37865 -2164656 152692 2365629 4357126 6038891 7369316 8361908 9076011 9588149 9952998
37856 9952998 10171934 10186809 9904647 9241842 8166753 6723819 5034568 3279361 1664847
37847 1664847 382305 -433904 -734867 -562858 -33442 698766 1479215 2185675 2745302
37838 2745302 3134375 3363980 3457018 3424026 3250416 2908710 2396026 1774299 1180213 789705
37828 789705 755293 1153345 1966324 3096671 4392364 5670603 6741401 7436844 7641545
37819 7641545 7310585 6465922 5176504 3535888 1647631 -380391 -2436983 -4409338
37811 -4409338 -6190649 -7697005 -8890123 -9794086 -10492739 -11104264 -11743604 -12490067 -13371663
37802 -13371663 -14365684 -15407309 -16399291 -17222557 -17751475 -17874687 -17516557 -16652350 -15313845
$$ packed form
37865b164656K317348K212937J991497J681765J330425R92592P14103N12138L64849
37856I952998K18936J4875k82162o62805j075089j442934j689251j755207j614514
37847A664847j282542q16209l00963J72009N29416P32208P80449P06460N59627
37838B745302L89073K29605R3038l2992j73610l41706n12684o21727n94086l90508
37828G89705l4412L98052Q12979J130347J295693J278239J070798O95443K04701
37819G641545l30960q44663j289418j640616j888257k028022k056592j972355
37811d409338j781311j506356j193118r03963o98653o11525o39340p46463q81596
37802a3371663r94021j041625r91982q23266n28918j23212L58130Q64207J338505
$$ plain form
37793 -15313845 -13585580 -11590955 -9465993 -7324055 -5225062 -3165953 -1098839 1032556
37785 1032556 3255889 5548666 7841987 10050237 12113063 14023505 15821126 17554593
37777 17554593 19243279 20866186 22379762 23741750 24919330 25881271 26590408 27008906
37769 27008906 27111690 26893049 26358163 25507040 24325794 22792208 20889472 18618450 16006118
37760 16006118 13113549 10042418 6931630 3937096 1198992 -1189659 -3199925 -4864174
37752 -4864174 -6255527 -7456345 -8527065 -9488437 -10324289 -11000141 -11485845 -11773048 -11883930
37743 -11883930 -11868462 -11787384 -11685547 -11570471 -11409563 -11144379 -10708169 -10037123 -9077978 -7798433
37733 -7798433 -6200058 -4327530 -2268585 -141704 1928863 3845033 5560433 7086457
$$ packed form
37793a5313845J728265J994625K124962K141938K098993K059109K067114K131395
37785A032556K223333K292777K293321K208250K062826J910442J797621J733467
37777A7554593J688686J622907J513576J361988J177580R61941P09137M18498
37769B7008906J02784k18641n34886q51123j181246j533586j902736k271022k612332
37760A6006118k892569l071131l110788k994534k738104k388651k010266j664249
37752d864174j391353j200818j070720r61372q35852o75852m85704k87203j10882
37743a1883930J5468Q1078J01837J15076J60908K65184M36210O71046R59145J279545
37733g798433J598375J872528K058945K126881K070567J916170J715400J526024
$$ plain form
37725 7086457 8476380 9796447 11096353 12389918 13654458 14850784 15952939 16967793
37717 16967793 17931624 18888761 19868860 20875193 21884775 22853629 23720115 24404398 24810292
37708 24810292 24840917 24432471 23592431 22416414 21067570 19727967 18549916 17631130 17017701
37699 17017701 16721683 16736882 17045401 17618355 18418176 19405585 20547721 21822442 23217749
37690 23217749 24727856 26345739 28051063 29796712 31502858 33066249 34383489 35377462
37682 35377462 36012475 36288372 36216581 35796280 35012917 33864378 32393563 30698021 28908326
37673 28908326 27154570 25544079 24153892 23026574 22163984 21525787 21037882 20604664 20117716
37664 20117716 19465132 18551911 17330500 15823977 14124316 12366766 10698060 9253402
$$ packed form
37725G086457J389923J320067J299906J293565J264540J196326J102155J014854
37717A6967793R63831R57137R80099J006333J009582R68854Q66486O84283M05894
37708B4810292L0625m08446q40040j176017j348844j339603j178051r18786o13429
37699A7017701k96018J5199L08519N72954P99821R87409J142136J274721J395307
37690B3217749J510107J617883J705324J745649J706146J563391J317240R93973
37682C5377462O35013K75897p1791m20301p83363j148539j470815j695542j789695
37673B8908326j753756j610491j390187j127318q62590o38197m87905m33218m86948
37664B0117716o52584r13221j221411j506523j699661j757550j668706j444658
$$ plain form
37656 9253402 8141491 7429482 7128966 7195521 7550536 8116026 8840382 9698666 10670284
37647 10670284 11712988 12753567 13702177 14478842 15031226 15330598 15351990 15057752 14399697
37638 14399697 13339649 11875963 10061489 8003183 5840221 3706206 1690363 -183549
37630 -183549 -1949152 -3664285 -5370994 -7070166 -8722437 -10270241 -11663270 -12870611
37622 -12870611 -13876619 -14672540 -15258426 -15657439 -15929053 -16164275 -16459052 -16879536 -17439445
37613 -17439445 -18099903 -18785990 -19406052 -19864905 -20073221 -19960238 -19490561 -18675253 -17566536
37604 -17566536 -16238175 -14768121 -13238467 -11748516 -10419318 -9372609 -8691090 -8386428
37596 -8386428 -8396963 -8614610 -8921242 -9213727 -9409701 -9439800 -9237699 -8736523 -7873845 -6602567
$$ packed form
37656I253402j111911p12009l00516O6555L55015N65490P24356Q58284R71618
37647A0670284J042704J040579R48610P76665N52384K99372K1392k94238o58055
37638A4399697j060048j463686j814474k058306k162962k134015k015843j873912
37630a83549j765603j715133j706709j699172j652271j547804j393029j207341
37622a2870611j006008p95921n85886l99013k71614k35222k94777m20484n59909
37613a7439445o60458o86087o20062m58853k08316J12983M69677Q15308J108717
37604a7566536J328361J470054J529654J489951J329198J046709O81519L04662
37596h386428j0535k17647l06632k92485j95974l0099K02101N01176Q62678J271278
$$ plain form
37586 -6602567 -4904668 -2806403 -391913 2193685 4762249 7122100 9123126 10685294
37578 10685294 11799701 12509721 12887931 13018890 12988430 12876526 12752936 12676845 12700618 12873742
37568 12873742 13239849 13822368 14603564 15510592 16421749 17195511 17712128 17910283 17802648
37559 17802648 17464145 17001378 16520661 16106716 15810545 15640014 15555209 15478065 15318800 15006953
37549 15006953 14510337 13835135 13013713 12092297 11127385 10190367 9370262 8762762 8444982
37540 8444982 8449739 8755405 9295013 9975495 10696664 11366107 11910534 12283584 12468347 12472433
37530 12472433 12315362 12013323 11571733 10993725 10300695 9549032 8827702 8233735 7836401
37521 7836401 7647404 7612892 7634335 7610729 7480923 7243288 6943760 6643115 6385686 6187273
$$ packed form
37586f602567J697899K098265K414490K585598K568564K359851K001026J562168
37578A0685294J114407P10020L78210J30959l0460j11904j23590p6091K3773J73124
37568A2873742L66107N82519P81196R07028R11157P73762N16617J98155j07635
37559A7802648l38503m62767m80717m13945k96171j70531q4805p7144j59265l11847
37549A5006953m96616o75202q21422r21416r64912r37018q20105o07500l17780
37540H444982M757L05666N39608O80482P21169O69443N44427L73050J84763M086
37530A2472433j57071l02039m41590n78008o93030p51663p21330n93967l97334
37521G836401j88997l4512K1443k3606j29806k37635k99528l00645k57429j98413
$$ plain form
37511 6187273 6044610 5954640 5928772 5995127 6190677 6547714 7078255 7763076 8555351 9401789
37501 9401789 10267849 11145863 12038679 12933335 13785329 14519955 15043138 15255864 15074645
37492 15074645 14458359 13429842 12076265 10525075 8910830 7353597 5956574 4812477
37484 4812477 4003102 3588760 3599369 4038943 4899678 6169818 7825492 9813237 12038242
37475 12038242 14368276 16654020 18759609 20590633 22103658 23290710 24152112 24681353
37467 24681353 24873263 24744593 24347363 23764738 23092209 22413661 21783956 21227820 20755093
37458 20755093 20378800 20119451 19992735 19994930 20102128 20284918 20525231 20821287 21178092 21592188
37448 21592188 22040420 22476100 22832088 23031908 23009759 22732230 22207194 21471431 20565934
$$ packed form
37511F187273j42663q9970k5868O6355J95550L57037N30541O84821P92275Q46438
37501I401789Q66060Q78014Q92816Q94656Q51994P34626N23183K12726j81219
37492A5074645o16286j028517j353577j551190j614245j557233j397023j144097
37484D812477q09375m14342J0609M39574Q60735J270140J655674J987745K225005
37475A2038242K330034K285744K105589J831024J513025J187052Q61402N29241
37467B4681353J91910j28670l97230n82625o72529o78548o29705n56136m72727
37458B0755093l76293k59349j26716K195J07198J82790K40313K96056L56805M14096
37448B1592188M48232M35680L55988J99820k2149k77529n25036p35763r05497
$$ plain form
37439 20565934 19518779 18348771 17086190 15794981 14580311 13574053 12903807 12661122
37431 12661122 12884382 13560979 14641728 16056853 17725712 19556993 21442043 23250673
37423 23250673 24840083 26078635 26874377 27194307 27066234 26562959 25775299 24786361 23660309
37414 23660309 22449160 21206651 19994536 18878376 17922424 17191343 16753378 16672330 16983780
37405 16983780 17667160 18634346 19748550 20868365 21894619 22795613 23599873 24363254 25126627
37396 25126627 25880751 26551685 27015498 27140980 26843362 26121256 25055095 23767951 22372254
37387 22372254 20931575 19453280 17908730 16265854 14516873 12688916 10836062 9024248
37379 9024248 7325330 5825654 4636858 3890718 3712325 4182977 5310002 7014691 9140969
$$ packed form
37439B0565934j047155j170008j262581j291209j214670j006258o70246k42685
37431A2661122K23260O76597J080749J415125J668859J831281J885050J808630
37423B3250673J589410J238552P95742L19930j28073n03275p87660r88938j126052
37414B3660309j211149j242509j212115j116160r55952p31081m37965q1048L11450
37405A6983780O83380R67186J114204J119815J026254R00994Q04260P63381P63373
37396B5126627P54124O70934M63813J25482k97618p22106j066161j287144j395697
37387B2372254j440679j478295j544550j642876j748981j827957j852854j811814
37379I024248j698918j499676j188796p46140j78393M70652J127025J704689K126278
$$ plain form
37370 9140969 11481138 13809881 15915654 17622980 18807059 19404750 19420827 18923676 18027845
37361 18027845 16869483 15585998 14307939 13161470 12270718 11747816 11667413 12035986 12773301
37352 12773301 13718373 14660760 15388739 15740747 15642635 15113745 14236310 13103455 11775000
37343 11775000 10263799 8553607 6632247 4522385 2300092 96029 -1924841 -3603431
37335 -3603431 -4832823 -5589163 -5932755 -5983218 -5885983 -5785076 -5804430 -6032039 -6505348 -7204590
37325 -7204590 -8060314 -8970863 -9817366 -10468818 -10783309 -10618421 -9856112 -8433294 -6363036
37316 -6363036 -3737801 -717188 2492751 5664903 8581942 11071640 13039039 14483274
37308 14483274 15489254 16194051 16739888 17234127 17734127 18260150 18821162 19432195 20112909
$$ packed form
37370I140969K340169K328743K105773J707326J184079N97691J6077m97151q95831
37361A8027845j158362j283485j278059j146469q90752n22902q0403L68573P37315
37352A2773301R45072R42387P27979L52008r8112n28890q77435j132855j328455
37343A1775000j511201j710192j921360k109862k222293k204063k020870j678590
37335c603431j229392p56340l43592n0463R7235J00907j9354k27609m73309o99242
37325g204590q55724r10549q46503o51452l14491J64888P62309J422818K070258
37316f363036K625235L020613L209939L172152K917039K489698J967399J444235
37308A4483274J005980P04797N45837M94239N00000N26023N61012O11033O80714
$$ plain form
37299 20112909 20873681 21702428 22560283 23387551 24118734 24703273 25124083 25404105 25596809
37290 25596809 25765207 25958161 26191697 26441279 26649067 26745473 26677533 26432267 26044810 25588498
37280 25588498 25155030 24840961 24752667 25023560 25820111 27317156 29648946 32865919 36925853
37271 36925853 41723856 47141619 53089529 59524850 66444367 73861355 81781736 90193214
37263 90193214 99075150 108426454 118296622 128799625 140100111 152381844 165820980
37256 165820980 180578684 196807931 214658247 234265972 255725520 279040528 304056641
37249 304056641 330383886 357323162 383818166 408466079 429628357 445659264 455205158
37242 455205158 457465145 452307519 440216328 422132544 399280864 373030754 344786990
$$ packed form
37299B0112909P60772Q28747Q57855Q27268P31183N84539M20810K80022J92704
37290B5596809J68398J92954K33536K49582K07788R6406o7940k45266l87457m56312
37280B5588498m33468l14069q8294K70893P96551J497045K331790L216973M059934
37271C6925853M798003N417763N947910O435321O919517P416988P920381Q411478
37263I0193214Q881936R351304R870168J0503003J1300486J2281733J3439136
37256A65820980J4757704J6229247J7850316J9607725K1459548K3315008K5016113
37249C04056641K6327245K6939276K6495004K4647913K1162278J6030907R545894
37242D55205158K259987n157626j2091191j8083784k2851680k6250110k8243764
$$ plain form
37235 344786990 315889185 287516838 260612363 235833512 213538907 193807641 176493270
37228 176493270 161305672 147902263 135962773 125227496 115495983 106601535 98385349
37221 98385349 90688279 83363608 76300998 69446627 62806968 56431686 50382729 44707289
37213 44707289 39431884 34578741 30185443 26305786 22989674 20262369 18123245 16561770
37205 16561770 15570128 15137598 15232103 15785665 16693549 17824539 19035977 20191684 21183263
37196 21183263 21950869 22493772 22862153 23131121 23368675 23612522 23864577 24102382 24299619
37187 24299619 24444476 24544915 24616536 24661702 24658035 24568481 24366233 24054292 23664798 23240843
37177 23240843 22814750 22394170 21959227 21469852 20881362 20163178 19311659 18350197 17319532
$$ packed form
37235C44786990k8897805k8372347k6904475k4778851k2294605j9731266j7314371
37228A76493270j5187598j3403409j1939490j0735277r731513q894448q216186
37221I8385349p697070p324671p062610o854371o639659o375282o048957n675440
37213D4707289n275405m853143m393298l879657l316112k727305k139124j561475
37205A6561770r91642m32530R4505N53562R07884J130990J211438J155707R91579
37196B1183263P67606N42903L68381K68968K37554K43847K52055K37805J97237
37187B4299619J44857J00439P1621M5166l667q9554k02248l11941l89494m23955
37177B3240843m26093m20580m34943m89375n88490p18184q51519r61462j030665
$$ plain form
37168 17319532 16270565 15270375 14418480 13855816 13748314 14244121 15425429 17282565 19722918
37159 19722918 22603887 25767279 29059247 32334620 35454062 38281998 40687339 42545355
37151 42545355 43741818 44186456 43841478 42756193 41081661 39041852 36866780 34724627
37143 34724627 32691676 30767216 28907233 27047552 25111623 23020314 20718305 18210283
37135 18210283 15583262 12994722 10626380 8624729 7057526 5905844 5091385 4520735
37127 4520735 4121701 3854152 3694442 3609754 3545504 3438804 3249913 2988549 2716499 2527320
37117 2527320 2519045 2773649 3344485 4246471 5449435 6882090 8451159 10068646 11671714
37108 11671714 13223554 14697089 16056029 17248745 18218934 18923458 19344931 19495150 19413557
$$ packed form
37168A7319532j048967j000190q51895n62664j07502M95807J181308J857136K440353
37159A9722918K880969L163392L291968L275373L119442K827936K405341J858016
37151D2545355J196463M44638l44978j085285j674532k039809k175072k142153
37143C4724627k032951j924460j859983j859681j935929k091309k302009k508022
37135A8210283k627021k588540k368342k001651j567203j151682q14459n70650
37127D520735l99034k67549j59710q4688o4250j06700j88891k61364k72050j89179
37117B527320q275K54604N70836R01986J202964J432655J569069J617487J603068
37108A1671714J551840J473535J358940J192716R70189P04524M21473J50219q1593
$$ plain form
37099 19413557 19163366 18821647 18459368 18115182 17774327 17364109 16769541 15861388 14522218
37090 14522218 12661642 10226707 7220350 3728107 -66558 -3899515 -7474901 -10522450
37082 -10522450 -12839113 -14307196 -14895798 -14655974 -13716200 -12277338 -10599225 -8971164
37074 -8971164 -7669461 -6916520 -6855097 -7539889 -8940165 -10948545 -13396071 -16075717 -18774390
37065 -18774390 -21308438 -23551534 -25442947 -26973741 -28161476 -29027268 -29581075 -29814433
37057 -29814433 -29701778 -29213606 -28337876 -27096504 -25544867 -23755071 -21795890 -19722551
37049 -19722551 -17579026 -15404563 -13234424 -11093364 -8990484 -6924973 -4902358 -2949837
37041 -2949837 -1117608 537943 1981074 3218310 4302716 5319552 6362492 7511063
$$ packed form
37099A9413557k50191l41719l62279l44186l40855m10218n94568r08153j339170
37090A4522218j860576k434935l006357l492243l794665l832957l575386l047549
37082a0522450k316663j468083n88602K39824R39774J438862J678113J628061
37074h971164J301703P52941O1423o84792j400276k008380k447526k679646k698673
37065a8774390k534048k243096j891413j530794j187735q65792n53807k33358
37057b9814433J12655M88172Q75730J241372J551637J789796J959181K073339
37049a9722551K143525K174463K170139K141060K102880K065511K022615J952521
37041b949837J832229J655551J443131J237236J084406J016836J042940J148571
$$ plain form
37033 7511063 8813645 10275134 11850094 13446819 14946873 16236648 17237656 17919450
37025 17919450 18288063 18358939 18133152 17590476 16699030 15433835 13798491 11844479 9676797
37016 9676797 7433978 5245182 3186785 1264498 -570802 -2388882 -4251628 -6203270
37008 -6203270 -8273909 -10482248 -12830857 -15300151 -17849567 -20425412 -22968968 -25424124
37000 -25424124 -27750038 -29937959 -32019240 -34051287 -36083824 -38123421 -40115947 -41955649
36992 -41955649 -43515904 -44687035 -45404625 -45658689 -45485928 -44955180 -44155001 -43185407 -42149707
36983 -42149707 -41141686 -40227847 -39431228 -38726732 -38054341 -37347846 -36568130 -35725330 -34875926
36974 -34875926 -34091975 -33417357 -32837296 -32280203 -31649422 -30864213 -29887346 -28728032 -27423757
$$ packed form
37033G511063J302582J461489J574960J596725J500054J289775J001008O81794
37025A7919450L68613P0876k25787n42676q91446j265195j635344j954012k167682
37016I676797k242819k188796k058397j922287j835300j818080j862746j951642
37008f203270k070639k208339k348609k469294k549416k575845k543556k455156
37000b5424124k325914k187921k081281k032047k032537k039597j992526j839702
36992d1955649j560255j171131p17590k54064J72761N30748Q00179R69594J035700
36983d2149707J008021R13839P96619P04496O72391P06495P79716Q42800Q49404
36974c4875926P83951O74618N80061N57093O30781P85209R76867J159314J304275
$$ plain form
36965 -27423757 -26015170 -24530461 -22987794 -21411222 -19846059 -18359664 -17021852 -15871747
36957 -15871747 -14889419 -13992060 -13060587 -11982369 -10687536 -9166475 -7470833 -5704611
36949 -5704611 -4006741 -2523698 -1375519 -626233 -272098 -254062 -486263 -880984 -1354891
36940 -1354891 -1820090 -2178015 -2328689 -2189565 -1707895 -857885 371061 1980804 3955572
36931 3955572 6239781 8715762 11197456 13448763 15224000 16319853 16624008 16143777
36923 16143777 15001820 13399461 11564224 9703987 7980879 6504296 5335306 4495882
36915 4495882 3979863 3764956 3824396 4134027 4668888 5389116 6226056 7084375 7865386 8498302
36905 8498302 8958255 9261320 9446151 9559730 9654756 9791011 10029186 10415538 10966541 11662642
$$ packed form
36965b7423757J408587J484709J542667J576572J565163J486395J337812J150105
36957a5871747R82328Q97359R31473J078218J294833J521061J695642J766222
36949e704611J697870J483043J148179P49286L54135J8036k32201l94721m73907
36940a354891m65199l57925j50674J39124M81670Q50010J228946J609743J974768
36931C955572K284209K475981K481694K251307J775237J095853L04155m80231
36923A6143777j141957j602359j835237j860237j723108j476583j168990q39424
36915D495882n16019k14907N9440L09631N34861P20228Q36940Q58319P81011O32916
36905H498302M59953L03065J84831J13579R5026J36255K38175L86352N51003O96101
$$ plain form
36895 11662642 12451689 13256740 13984596 14535504 14815440 14750530 14301168 13471973 12313297
36886 12313297 10912872 9381233 7836957 6394623 5154449 4192721 3554176 3246293
36878 3246293 3233437 3432408 3718168 3947753 3997284 3793790 3325528 2628993 1762886 780730
36868 780730 -288520 -1443033 -2689534 -4012413 -5350246 -6593945 -7603242 -8228999
36860 -8228999 -8336323 -7832763 -6700061 -5013623 -2931574 -651703 1644913 3837567
36852 3837567 5878889 7774699 9543467 11177524 12626531 13809453 14643877 15073493
36844 15073493 15080991 14686688 13941451 12920982 11721484 10451323 9214243 8086595 7098696
36835 7098696 6232304 5438941 4671151 3910273 3175917 2512798 1961711 1528107 1163140
$$ packed form
36895A1662642P89047Q05051P27856N50908K79936o4910m49362q29195j158676
36886A2313297j400425j531639j544276j442334j240174r61728o38545l07883
36878C246293j2856J98971K85760K29585M9531k03494m68262o96535q66107r82156
36868G80730j069250j154513j246501j322879j337833j243699j009297o25757
36860h228999j07324N03560J132702J686438K082049K279871K296616K192654
36852C837567K041322J895810J768768J634057J449007J182922Q34424M29616
36844A5073493P498l94303p45237j020469j199498j270161j237080j127648r87899
36835G098696q66392p93363p67790p60878p34356o63119n51087m33604l64967
$$ plain form
36826 1163140 768821 230119 -536265 -1537635 -2687516 -3824619 -4760667 -5335739 -5459221
36817 -5459221 -5126022 -4410431 -3444279 -2383768 -1370423 -498549 196115 722212 1104150
36808 1104150 1356461 1472417 1428293 1198057 770028 157348 -600525 -1442018 -2290720 -3069544
36798 -3069544 -3725152 -4253770 -4708344 -5174240 -5724284 -6381704 -7113442 -7851830 -8523130
36789 -8523130 -9063709 -9422804 -9564059 -9473875 -9171382 -8708875 -8157784 -7584446 -7025241 -6472562
36779 -6472562 -5882109 -5203183 -4418560 -3571300 -2763002 -2125613 -1781644 -1808634 -2217867 -2951033
36769 -2951033 -3893773 -4901527 -5831158 -6570201 -7054149 -7264473 -7208954 -6896937 -6326089
36760 -6326089 -5489128 -4394784 -3087106 -1648491 -183282 1208288 2451405 3504026
$$ packed form
36826A163140l94319n38702p66384j001370j149881j137103r36048n75072j23482
36817e459221L33199P15591R66152J060511J013345Q71874O94664N26097L81938
36808A104150K52311J15956m4124k30236m28029o12680p57873q41493q48702p78824
36798c069544o55608n28618m54574m65896n50044o57420p31738p38388o71300
36789h523130n40579l59095j41255R0184L02493M62507N51091N73338N59205N52679
36779f472562N90453O78926P84623Q47260Q08298O37389L43969k6990m09233p33166
36769b951033r42740j007754r29631p39043m83948k10324N5519L12017N70848
36760f326089Q36961J094344J307678J438615J465209J391570J243117J052621
$$ plain form
36752 3504026 4349510 4980119 5381505 5530308 5410526 5039387 4482683 3845662 3243490
36743 3243490 2767993 2466052 2336174 2341259 2429771 2555451 2689124 2821683 2958451 3103861
36733 3103861 3239725 3309632 3223322 2882577 2215416 1202334 -114707 -1642278 -3261162
36724 -3261162 -4858658 -6353614 -7702818 -8887634 -9890591 -10675951 -11184453 -11343248 -11084298
36715 -11084298 -10364357 -9184500 -7607748 -5766460 -3848096 -2058260 -575722 481701
36707 481701 1071832 1226658 1040353 648895 202150 -167669 -374031 -393343 -267969 -96387
36697 -96387 -13910 -166142 -678105 -1627586 -3034542 -4870646 -7079403 -9591919 -12331820
36688 -12331820 -15213910 -18143528 -21018312 -23729974 -26164767 -28205717 -29742627 -30692800
$$ packed form
36752C504026Q45484O30609M01386J48803j19782l71139n56704o37021o02172
36743C243490m75497l01941j29878N085Q8512J25680J33673J32559J36768J45410
36733C103861J35864O9907q6310l40745o67161j013082j317041j527571j618884
36724c261162j597496j494956j349204j184816j002957p85360n08502j58795K58950
36715a1084298P19941J179857J576752J841288J918364J789836J482538J057423
36707D81701N90131J54826j86305l91458m46745l69819k06362j9312J25374J71582
36697i6387Q2477j52232n11963r49481j406956j836104k208757k512516k739901
36688a2331820k882090k929618k874784k711662k434793k040950j536910r50173
$$ plain form
36680 -30692800 -31026550 -30784651 -30078412 -29072965 -27958850 -26914408 -26063440 -25442907 -24999518
36671 -24999518 -24619557 -24175245 -23565460 -22740760 -21713861 -20556188 -19378548 -18300626 -17423233
36662 -17423233 -16815202 -16512954 -16519790 -16796072 -17246407 -17720492 -18038932 -18037194 -17605813 -16706382
36652 -16706382 -15360054 -13622929 -11566821 -9273297 -6835173 -4354914 -1935981 327537
36644 327537 2355887 4083182 5458515 6454282 7079247 7387978 7479114 7479737 7517816 7689347
36634 7689347 8031806 8516218 9061711 9562620 9911060 10005493 9751296 9066886 7901186
36625 7901186 6254763 4191830 1836001 -649872 -3095669 -5360607 -7363246 -9094091
36617 -9094091 -10608619 -12008333 -13419180 -14971166 -16778081 -18915704 -21398996 -24163472
$$ packed form
36680c0692800l33750K41899P06239J005447J114115J044442Q50968O20533M43389
36671b4999518L79961M44312O09785Q24700J026899J157673J177640J077922Q77393
36662a7423233O08031L02248o836k76282m50335m74085l18440J738M31381Q99431
36652a6706382J346328J737125K056108K293524K438124K480259K418933K263518
36644C27537K028350J727295J375333R95767O24965L08731R1136O23L8079J71531
36634G689347L42459M84412N45493N00909L48440R4433k54197o84410j165700
36625G901186j646423k062933k355829k485873k445797k264938k002639j730845
36617i094091j514528j399714j410847j551986j806915k137623k483292k764476
$$ plain form
36609 -24163472 -27061913 -29887320 -32419870 -34477982 -35950313 -36801564 -37062881 -36818642
36601 -36818642 -36189286 -35304098 -34267546 -33136004 -31920842 -30616019 -29228553 -27786954
36593 -27786954 -26320941 -24830990 -23276532 -21597021 -19752792 -17756222 -15671450 -13585528
36585 -13585528 -11574290 -9686146 -7949273 -6389222 -5040148 -3942967 -3134954 -2638594
36577 -2638594 -2454455 -2559913 -2914511 -3471619 -4193418 -5063047 -6087147 -7285984 -8675556
36568 -8675556 -10250390 -11973076 -13771231 -15541483 -17162673 -18518146 -19519424 -20120583
36560 -20120583 -20320168 -20156063 -19697785 -19034080 -18253994 -17427527 -16596196 -15777446 -14976942
36551 -14976942 -14198928 -13449128 -12732371 -12052475 -11420077 -10865015 -10441925 -10220707 -10265374
$$ packed form
36609b4163472k898441k825407k532550k058112j472331q51251k61317K44239
36601c6818642O29356Q85188J036552J131542J215162J304823J387466J441599
36593b7786954J466013J489951J554458J679511J844229J996570K084772K085922
36585a3585528K011238J888144J736873J560051J349074J097181Q08013M96360
36577b638594J84139j05458l54598n57108p21799q69629j024100j198837j389572
36568h675556j574834j722686j798155j770252j621190j355473j001278o01159
36560b0120583j99585J64105M58278O63705P80086Q26467Q31331Q18750Q00504
36551a4976942P78014P49800P16757O79896O32398N55062M23090K21218m4667
$$ plain form
36542 -10265374 -10613117 -11262511 -12171982 -13265670 -14444024 -15597104 -16619867 -17430448 -17990207
36533 -17990207 -18316778 -18478438 -18568380 -18673230 -18853127 -19137866 -19530793 -20012824 -20546952
36524 -20546952 -21085649 -21579271 -21982309 -22258344 -22385468 -22358355 -22180221 -21845841 -21329600
36515 -21329600 -20594731 -19625084 -18460184 -17206441 -16011160 -15012314 -14294430 -13874972 -13722326
36506 -13722326 -13787395 -14030293 -14434915 -15011612 -15788144 -16790731 -18023605 -19457458 -21028294
36497 -21028294 -22638853 -24158459 -25429707 -26293455 -26629198 -26390767 -25616186 -24407666 -22896780
36488 -22896780 -21214746 -19476838 -17775995 -16177118 -14711762 -13380686 -12167763 -11057071
36480 -11057071 -10039964 -9107494 -8236510 -7381958 -6481530 -5469223 -4289593 -2906453 -1306194
$$ packed form
36542a0265374l47743o49394r09471j093688j178354j153080j022763q10581n59759
36533a7990207l26571j61660q9942j04850j79897k84739l92927m82031n34128
36524b0546952n38697m93622m03038k76035j27124K7113J78134L34380N16241
36515b1329600P34869R69647J164900J253743J195281R98846P17884M19458J52646
36506a3722326o5069k42898m04622n76697p76532j002587j232874j433853j570836
36497b1028294j610559j519606j271248q63748l35743K38431P74581J208520J510886
36488b2896780J682034J737908J700843J598877J465356J331076J212923J110692
36480a1057071J017107R32470Q70984Q54552R00428J012307J179630J383140J600259
$$ plain form
36471 -1306194 499705 2471729 4545349 6646619 8714507 10712788 12620632 14411186
36463 14411186 16038601 17443922 18572239 19387605 19880071 20067202 19992664 19721893 19334407
36454 19334407 18912590 18526561 18216979 17982705 17781223 17542471 17188001 16646943 15866442
36445 15866442 14818028 13499290 11929432 10141386 8176598 6085654 3932978 1803441
36437 1803441 -190669 -1908867 -3200128 -3943713 -4097240 -3723116 -2976424 -2064223 -1200864
36428 -1200864 -575119 -328135 -536473 -1202038 -2255735 -3575748 -5012101 -6408113 -7617599
36419 -7617599 -8523799 -9063013 -9245277 -9157883 -8943321 -8757812 -8728382 -8926851 -9368800 -10031705
36409 -10031705 -10877975 -11870096 -12973700 -14151864 -15355489 -16514091 -17533416 -18306996
$$ packed form
36471a306194J805899J972024K073620K101270K067888J998281J907844J790554
36463A4411186J627415J405321J128317Q15366M92466J87131p4538k70771l87486
36454A9334407m21817l86029l09582k34274k01482k38752l54470n41058p80501
36445A5866442j048414j318738j569858j788046j964788k090944k152676k129537
36437A803441j994110j718198j291261p43585j53527L74124P46692R12201Q63359
36428a200864O25745K46984k08338o65565j053697j320013j436353j396012j209486
36419g617599r06200n39214j82264Q7394K14562J85509K9430j98469m41949o62905
36409a0031705q46270r92121j103604j178164j203625j158602j019325p73580
$$ plain form
36401 -18306996 -18740550 -18775821 -18398425 -17628260 -16505745 -15086911 -13447465 -11686577 -9921938
36392 -9921938 -8272862 -6833371 -5643888 -4676120 -3842360 -3026731 -2123082 -1063267 173011
36383 173011 1567506 3085255 4695024 6373649 8091764 9795181 11400576 12811217
36375 12811217 13942379 14741665 15196091 15325542 15166205 14749275 14081573 13135030 11850949
36366 11850949 10161667 8024696 5454667 2535447 -594600 -3774197 -6849468 -9691918
36358 -9691918 -12204913 -14323939 -16012763 -17255619 -18048431 -18394949 -18311569 -17838002 -17044123
36349 -17044123 -16021089 -14852142 -13574403 -12156406 -10511325 -8541709 -6188310 -3455103
36341 -3455103 -404200 2864496 6231401 9567630 12742768 15636344 18154388 20246473
$$ packed form
36401a8306996m33554l5271L77396P70165J122515J418834J639446J760888J764639
36392i921938J649076J439491J189483R67768Q33760Q15629R03649J059815J236278
36383A73011J394495J517749J609769J678625J718115J703417J605395J410641
36375A2811217J131162P99286M54426J29451j59337m16930o67702r46543j284081
36366A1850949j689282k136971k570029k919220l130047l179597l075271k842450
36358i691918k512995k119026j688824j242856p92812l46518Q3380M73567P93879
36349a7044123J023034J168947J277739J417997J645081J969616K353399K733207
36341c455103L050903L268696L366905L336229L175138K893576K518044K092085
$$ plain form
36333 20246473 21914537 23205447 24187363 24921571 25446173 25780700 25946929 25991490 25995590
36324 25995590 26064502 26300376 26771396 27492859 28428689 29510181 30661345 31820853 32954915
36315 32954915 34058114 35141296 36210108 37243579 38183980 38943532 39424393 39541476 39237216
36306 39237216 38483393 37274412 35623344 33570191 31200903 28662781 26158078 23907067
36298 23907067 22089408 20787929 19962309 19467454 19107555 18696553 18095497 17218435 16022645
36289 16022645 14503794 12700243 10693612 8594035 6514335 4547944 2760059 1189176
36281 1189176 -148643 -1255393 -2143859 -2826118 -3301978 -3554301 -3555428 -3282781 -2736613
36272 -2736613 -1951982 -1000423 18701 995027 1829099 2453294 2841981 3004049 2962130
$$ packed form
36333B0246473J668064J290910R81916P34208N24602L34527J66229M4561M100
36324B5995590O8912K35874M71020P21463R35830J081492J151164J159508J134062
36315C2954915J103199J083182J068812J033471R40401P59552M80861J17083l04260
36306C9237216p53823j208981j651068k053153k369288k538122k504703k251011
36298B3907067j817659j301479q25620m94855l59899m11002o01056q77062j195790
36289A6022645j518851j803551k006631k099577k079700j966391j787885j570883
36281A189176j337819j106750q88466o82259m75860k52323j127K72647N46168
36272b736613P84631R51559J019124R76326Q34072O24195L88687J62068m1919
$$ plain form
36263 2962130 2732733 2319050 1715917 918282 -72444 -1243159 -2563559 -3983530 -5438098
36254 -5438098 -6860270 -8197033 -9422211 -10541110 -11584417 -12592041 -13591245 -14575951
36246 -14575951 -15495684 -16261794 -16772613 -16947615 -16752286 -16200951 -15341978 -14242603 -12985962
36237 -12985962 -11677074 -10444110 -9424430 -8735852 -8443563 -8538434 -8941037 -9534194 -10208964
36228 -10208964 -10897686 -11575543 -12234364 -12850693 -13370506 -13718707 -13825441 -13652553 -13204489
36219 -13204489 -12517707 -11637248 -10597920 -9421469 -8125170 -6728399 -5251243 -3712244
36211 -3712244 -2133744 -552206 977272 2387792 3613614 4601254 5316829 5751878 5925993
36202 5925993 5880218 5659471 5292851 4785092 4124314 3298980 2312585 1190534 -19404
$$ packed form
36263B962130k29397m13683o03133p97635r90726j170715j320400j419971j454568
36254e438098j422172j336763j225178j118899j043307j007624r99204r84706
36246a4575951r19733p66110n10819j75002J95329N51335Q58973J099375J256641
36237a2985962J308888J232964J019680O88578K92289r4871m02603n93157o74770
36228a0208964o88722o77857o58821o16329n19813l48201j06734J72888M48064
36219a3204489O86782Q80459J039328J176451J296299J396771J477156J538999
36211c712244J578500J581538J529478J410520J225822R87640P15575M35049J74115
36202E925993m5775k20747l66620n07759o60778q25334r86395j122051j209938
$$ plain form
36193 -19404 -1250321 -2422221 -3450082 -4251539 -4751608 -4883399 -4585292 -3797318 -2462410
36184 -2462410 -537901 1983660 5052712 8549401 12283406 16007448 19444112 22323143
36176 22323143 24421322 25594988 25799358 25093221 23627838 21618854 19305494 16908843
36168 16908843 14602061 12498877 10658704 9102245 7829108 6828749 6080552 5547904
36160 5547904 5177870 4914619 4722549 4604304 4600144 4768553 5161329 5806833 6702603 7807898
36150 7807898 9031030 10221746 11187068 11737373 11745925 11190972 10158388 8807452 7321439
36141 7321439 5864938 4557642 3464663 2601365 1949491 1476998 1152581 951819 858469
36132 858469 863802 962672 1146534 1399297 1701636 2040688 2415928 2836208 3311194 3842771
$$ packed form
36193a9404j230917j171900j027861q01457n00069j31791K98107P87974J334908
36184b462410J924509K521561L069052L496689L734005L724042L436664K879031
36176B2323143K098179J173666K04370p06137j465383k008984k313360k396651
36168A6908843k306782k103184j840173j556459j273137j000359p48197n32648
36160E547904l70034k63251j92070j18245m160J68409L92776O45504Q95770J105295
36150G807898J223132J190716R65322N50305Q552n54953j032584j350936j486013
36141G321439j456501j307296j092979q63298o51874m72493l24417k00762r3350
36132H58469N333R8870J83862K52763L02339L39052L75240M20280M74986N31577
$$ plain form
36122 3842771 4418615 5008502 5565957 6037791 6379114 6566640 6603651 6515198 6337196 6105569
36112 6105569 5850875 5599766 5377704 5203612 5072573 4935695 4694636 4222045 3402231
36103 3402231 2173234 551901 -1365928 -3426697 -5452440 -7276488 -8775117 -9890928
36095 -9890928 -10642756 -11116510 -11437933 -11739770 -12139816 -12735800 -13607964 -14815683 -16384083
36086 -16384083 -18288792 -20451587 -22754537 -25069234 -27287367 -29337938 -31187237 -32829928
36078 -32829928 -34279917 -35560296 -36687498 -37652348 -38408350 -38874088 -38946555 -38518289 -37494481
36069 -37494481 -35809091 -33437688 -30404477 -26784932 -22708615 -18363053 -13990698 -9867137
36061 -9867137 -6257753 -3367460 -1307943 -97182 315996 23415 -858960 -2194931 -3829085
$$ packed form
36122C842771N75844N89887N57455M71834L41323J87526L7011q8453j78002k31627
36112F105569k54694k51109k22062j74092j31039j36878k41059m72591q19814
36103C402231j228997j621333j917829k060769k025743j824048j498629j115811
36095i890928p51828m73754l21423l01837m00046n95984q72164j207719j568400
36086a6384083j904709k162795k302950k314697k218133k050571j849299j642691
36078c2829928j449989j280379j127202r64850p56002m65738p2467M28266J023808
36069c7494481J685390K371403L033211L619545M076317M345562M372355M123561
36061i867137L609384K890293K059517J210761M13178k92581q82375j335971j634154
$$ plain form
36052 -3829085 -5595230 -7337234 -8938407 -10345646 -11571354 -12666879 -13679818 -14617717
36044 -14617717 -15434543 -16041384 -16332176 -16213016 -15626249 -14564047 -13069851 -11229922 -9159610
36035 -9159610 -6988362 -4844732 -2841582 -1064362 432180 1617553 2476394 3005432
36027 3005432 3215721 3129936 2769346 2139664 1229991 26588 -1471592 -3247425 -5267148
36018 -5267148 -7477365 -9794346 -12097920 -14245987 -16111828 -17626694 -18802162 -19717893
36010 -19717893 -20481956 -21186492 -21880249 -22565076 -23208967 -23764343 -24186360 -24452079 -24579048
36001 -24579048 -24634125 -24721770 -24951832 -25402329 -26098004 -27014380 -28098941 -29290907 -30526068
35992 -30526068 -31727763 -32797473 -33619622 -34084393 -34118084 -33704102 -32884519 -31745993 -30402157
$$ packed form
36052c829085j766145j742004j601173j407239j225708j095525j012939r37899
36044a4617717q16826o06841k90792J19160N86767J062202J494196J839929K070312
36035i159610K171248K143630K003150J777220J496542J185373Q58841N29038
36027C005432K10289q5785l60590o29682r09673j203403j498180j775833k019723
36018e267148k210217k316981k303574k148067j865841j514866j175468r15731
36010a9717893p64063p04536o93757o84827o43891n55376m22017k65719j26969
36001b4579048n5077q7645k30062m50497o95675r16376j084561j191966j235161
35992c0526068j201695j069710q22149m64771l3691M13982Q19583J138526J343836
$$ plain form
35983 -30402157 -28980335 -27610345 -26409320 -25462147 -24803510 -24407266 -24185566 -24000639 -23692291
35974 -23692291 -23116082 -22175678 -20834154 -19105142 -17037343 -14701341 -12177558 -9546223
35966 -9546223 -6888307 -4300163 -1905328 158979 1782269 2923152 3625013 3995789
35958 3995789 4163801 4230495 4239823 4176446 3990739 3634243 3086275 2363395 1515756 617299
35948 617299 -247308 -998849 -1581292 -1977148 -2214661 -2361420 -2503738 -2719989 -3061554 -3549937
35938 -3549937 -4186072 -4959806 -5852014 -6833353 -7869774 -8938505 -10045403 -11228561 -12541303
35929 -12541303 -14023262 -15676654 -17458873 -19290072 -21067829 -22683847 -24041768 -25074029
35921 -25074029 -25752780 -26091874 -26142823 -25988754 -25734706 -25488511 -25332636 -25298527 -25358303 -25439687
$$ packed form
35983c0402157J421822J369990J201025R47173O58637L96244K21700J84927L08348
35974b3692291N76209R40404J341524J729012K067799K336002K523783K631335
35966i546223K657916K588144K394835K064307J623290J140883P01861L70776
35958C995789J68012O6694R328o3377j85707l56496n47968p22880q47639q98457
35948F17299q64607p51541n82443l95856k37513j46759j42318k16251l41565m88383
35938c549937o36135p73734q92208r81339j036421j068731j106898j183158j312742
35929a2541303j481959j653392j782219j831199j777757j616018j357921j032261
35921b5074029o78751l39094n0949J54069K54048K46195J55875L4109n9776q1384
$$ plain form
35911 -25439687 -25457821 -25351134 -25106988 -24763780 -24383568 -24006416 -23613836 -23126473 -22438602
35902 -22438602 -21467766 -20191500 -18654710 -16947378 -15163402 -13357136 -11515467 -9558264
35894 -9558264 -7368771 -4842500 -1934409 1315597 4787827 8310998 11695697 14759803
35886 14759803 17346025 19339105 20685455 21408767 21612253 21462848 21160268 20899719 20839194
35877 20839194 21079025 21654785 22540432 23658696 24896004 26117104 27174839 27917207 28199726
35868 28199726 27907592 26981810 25438699 23376287 20966383 18432011 16011618 13917761
35860 13917761 12302372 11236392 10703562 10606562 10788114 11069188 11296222 11377966 11293384
35851 11293384 11067529 10732024 10296343 9748086 9080040 8323452 7562815 6919644 6512248
$$ packed form
35911b5439687j8134J06687K44146L43208L80212L77152L92580M87363O87871
35902b2438602R70836J276266J536790J707332J783976J806266J841669J957203
35894i558264K189493K526271K908091L250006L472230L523171L384699L064106
35886A4759803K586222J993080J346350P23312K03486j49405l02580k60549o0525
35877B0839194K39831N75760Q85647J118264J237308J221100J057735P42368K82519
35868B8199726k92134r25782j543111k062412k409904k534372k420393k093857
35860A3917761j615389j065980n32830r7000J81552K81074K27034Q1744q4582
35851A1293384k25855l35505m35681n48257o68046p56588p60637o43171m07396
$$ plain form
35842 6512248 6412602 6621461 7069833 7639664 8191149 8589952 8734081 8577912 8144583 7519092
35832 7519092 6824754 6194430 5745877 5562312 5675792 6055490 6607765 7192414 7651558
35823 7651558 7842214 7664723 7082020 6124689 4876617 3442628 1911195 330874 -1289462
35814 -1289462 -2962271 -4699439 -6498350 -8338770 -10187603 -12007898 -13770331 -15466227
35806 -15466227 -17118151 -18779669 -20516995 -22375623 -24346961 -26351610 -28246919 -29856447
35798 -29856447 -31013393 -31604303 -31593833 -31016344 -29940378 -28431365 -26536404 -24293976 -21753264
35789 -21753264 -18987462 -16096348 -13201288 -10436476 -7938024 -5830888 -4212764 -3135727
35781 -3135727 -2591043 -2505676 -2755550 -3192012 -3671629 -4079021 -4336274 -4398262 -4240544 -3851896
$$ packed form
35842F512248r9646K08859M48372N69831N51485L98803J44129j56169m33329o25491
35832G519092o94338o30324m48553j83565J13480L79698N52275N84649M59144
35823G651558J90656j77491n82703r57331j248072j433989j531433j580321j620336
35814a289462j672809j737168j798911j840420j848833j820295j762433j695896
35806a5466227j651924j661518j737326j858628j971338k004649j895309j609528
35798b9856447j156946n90910J0470N77489J075966J509013J894961K242428K540712
35789b1753264K765802K891114K895060K764812K498452K107136J618124J077037
35781c135727N44684Q5367k49874m36462m79617m07392k57253o1988J57718L88648
$$ plain form
35771 -3851896 -3239740 -2442509 -1530670 -583624 347756 1264957 2210783 3229480 4326123
35762 4326123 5450653 6510828 7400715 8029132 8339623 8319144 7994857 7421062 6662188
35753 6662188 5778795 4820683 3827359 2833580 1875302 989812 207047 -462892 -1035736
35744 -1035736 -1547283 -2041305 -2560360 -3141519 -3810764 -4571912 -5395033 -6213577 -6934187
35735 -6934187 -7456147 -7695737 -7611549 -7224481 -6622327 -5941146 -5326582 -4890485 -4681694 -4681472
35725 -4681472 -4820194 -5002760 -5131277 -5121154 -4912595 -4478762 -3827939 -2996125 -2030950 -974109
35715 -974109 148534 1325115 2548988 3812267 5106273 6424654 7761395 9101560
35707 9101560 10410824 11632975 12700090 13552040 14154363 14502303 14607165 14474919 14093408
$$ packed form
35771c851896O12156P97231R11839R47046R31380R17201R45826J018697J096643
35762D326123J124530J060175Q89887O28417L10491k0479l24287n73795p58874
35753F662188q83393r58112r93324r93779r58278q85490p82765o69939n72844
35744a035736n11547m94022n19055n81159o69245p61148q23121q18544p20610
35735f934187n21960k39590Q4188L87068O02154O81181O14564M36097K08791K22
35725d681472j38722j82566j28517J0123K08559M33833O50823Q31814R65175J056841
35715i74109J122643J176581J223873J263279J294006J318381J336741J340165
35707I101560J309264J222151J067115Q51950O02323L47940J04862j32246l81511
$$ plain form
35698 14093408 13436525 12479693 11215204 9661096 7863724 5895869 3852344 1845715
35690 1845715 2411 -1546016 -2681943 -3327489 -3464565 -3139385 -2453013 -1545459 -576826
35681 -576826 295892 945323 1296916 1341822 1137093 794444 459219 282073 389281 859380
35671 859380 1710820 2899741 4325078 5840613 7274856 8456094 9235859 9506099 9212151
35662 9212151 8365485 7052965 5431342 3698589 2047464 618943 -525989 -1407374
35654 -1407374 -2103443 -2715243 -3331622 -4003708 -4732439 -5469417 -6130002 -6615363 -6837030
35645 -6837030 -6737241 -6301833 -5565159 -4605552 -3529561 -2447789 -1451177 -596582 95010
35636 95010 628522 1015320 1250619 1301402 1118895 674618 -1580 -809272 -1602277 -2236983
$$ packed form
35698A4093408o56883r56832j264489j554108j797372j967855k043525k006629
35690A845715j843304j548427j135927o45546j37076L25180O86372R07554R68633
35681e76826Q72718O49431L51593M4906k04729l42649l35225j77146J07208M70099
35671H59380Q51440J188921J425337J515535J434243J181238P79765K70240k93948
35662I212151q46666j312520j621623j732753j651125j428521j144932q81385
35654a407374o96069o11800o16379o72086p28731p36978o60585m85361k21667
35645f837030R9789M35408P36674R59607J075991J081772R96612Q54595O91592
35636I5010N33512L86798K35299N0783j82507m44277o76198q07692p93005o34706
$$ plain form
35626 -2236983 -2618009 -2721348 -2590257 -2311356 -1983864 -1694418 -1503812 -1443018 -1511714 -1678015
35616 -1678015 -1886164 -2077307 -2216469 -2309579 -2399106 -2541012 -2776378 -3111656 -3514843 -3925772
35606 -3925772 -4271410 -4476639 -4469161 -4186265 -3590610 -2691107 -1555220 -300322 936999
35597 936999 2042512 2959236 3700316 4334008 4946619 5597637 6284081 6929358 7403922
35588 7403922 7570373 7332050 6663423 5613248 4284416 2798854 1257691 -287761 -1838076
35579 -1838076 -3419352 -5048099 -6712790 -8380902 -10018504 -11602434 -13115209 -14528046
35571 -14528046 -15786566 -16811831 -17518192 -17837252 -17735102 -17218412 -16333528 -15162870 -13818329
35562 -13818329 -12430862 -11137907 -10069440 -9329838 -8974607 -8990501 -9294005 -9755859 -10242090
$$ packed form
35626b236983l81026j03339J31091K78901L27492K89446J90606O0794o8696j66301
35616a678015k08149j91143j39162r3110q9527j41906k35366l35278m03187m10929
35606c925772l45638k05229P478K82896N95655Q99503J135887J254898J237321
35597I36999J105513R16724P41080O33692O12611O51018O86444O45277M74564
35588G403922J66451k38323o68627j050175j328832j485562j541163j545452j550315
35579a838076j581276j628747j664691j668112j637602j583930j512775j412837
35571a4528046j258520j025265p06361l19060J02150N16690Q84884J170658J344541
35562a3818329J387467J292955J068467P39602L55231j5894l03504m61854m86231
$$ plain form
35553 -10242090 -10650553 -10926568 -11056348 -11048339 -10913536 -10651717 -10248382 -9685040 -8957645 -8088393
35543 -8088393 -7117323 -6076380 -4965488 -3749900 -2379937 -816409 956613 2936218
35535 2936218 5111031 7461184 9940664 12452497 14839730 16909056 18480650 19436650
35527 19436650 19741798 19432101 18588287 17312852 15716687 13911102 12000896 10077454
35519 10077454 8211523 6445608 4789534 3226501 1734198 315750 -975955 -2039918
35511 -2039918 -2762688 -3073775 -2989437 -2618235 -2126341 -1683462 -1414254 -1369699 -1523618 -1794758
35501 -1794758 -2087451 -2333329 -2514381 -2659539 -2823656 -3065536 -3436001 -3974610 -4704944
35492 -4704944 -5621589 -6675301 -7772291 -8796573 -9645282 -10255728 -10610843 -10726575 -10634706
$$ packed form
35553a0242090m08463k76015j29780Q009J34803K61819M03335N63342P27395Q69252
35543h088393R71070J040943J110892J215588J369963J563528J773022J979605
35535B936218K174813K350153K479480K511833K387233K069326J571594R56000
35527A9436650L05148l09697q43814j275435j596165j805585j910206j923442
35519A0077454j865931j765915j656074j563033j492303j418448j291705j063963
35511b039918p22770l11087Q4338L71202M91894M42879K69208M4555j53919k71140
35501a794758k92693k45878j81052j45158j64117k41880l70465n38609p30334
35492d704944r16645j053712j096990j024282q48709o10446l55115j15732R1869
$$ plain form
35483 -10634706 -10373057 -9988357 -9549143 -9157904 -8948096 -9058522 -9592367 -10579611 -11960559
35474 -11960559 -13596598 -15301763 -16883207 -18180352 -19094791 -19603042 -19747068 -19607722 -19276773
35465 -19276773 -18841571 -18382821 -17975056 -17681480 -17543640 -17571023 -17735140 -17970653 -18182652
35456 -18182652 -18254695 -18054478 -17444570 -16310963 -14607768 -12393419 -9829381 -7136459 -4533998
35447 -4533998 -2194765 -229536 1308522 2417603 3146507 3592383 3886958 4171087 4567403
35438 4567403 5160988 5991476 7055990 8321478 9741551 11268577 12854448 14443060
35430 14443060 15964036 17334183 18466532 19283479 19729419 19776950 19422766 18677146 17557124
35421 17557124 16089778 14321714 12325517 10198228 8053832 6013413 4193873 2695367
$$ packed form
35483a0634706K61649L84700M39214L91239K09808j10426n33845r87244j380948
35474a1960559j636039j705165j581444j297145r14439n08251j44026J39346L30949
35465a9276773M35202M58750M07765K93576J37840k7383j64117k35513k11999
35456a8182652p2043K00217O09908J133607J703195K214349K564038K692922K602461
35447d533998K339233J965229J538058J109081P28904M45876K94575K84129L96316
35438D567403N93585Q30488J064514J265488J420073J527026J585871J588612
35430A4443060J520976J370147J132349Q16947M45940M7531l54184p45620j120022
35421A7557124j467346j768064j996197k127289k144396k040419j819540j498506
$$ plain form
35413 2695367 1590236 917893 686448 876409 1441280 2305308 3363498 4487962 5540719
35404 5540719 6391215 6935581 7111701 6903176 6331926 5447720 4322381 3046552 1721787
35395 1721787 447016 -693723 -1637229 -2342392 -2789437 -2975893 -2909059 -2600613 -2069433
35386 -2069433 -1350196 -498407 413452 1305062 2097023 2719526 3124360 3297809 3264544 3074976
35376 3074976 2780750 2413649 1981474 1481787 920683 319758 -296243 -921681 -1582309
35367 -1582309 -2324726 -3188924 -4182204 -5268004 -6370888 -7393262 -8239020 -8835703 -9142662
35358 -9142662 -9140738 -8816122 -8158071 -7176552 -5926359 -4518415 -3108726 -1868561 -947862
35349 -947862 -446024 -399165 -783529 -1529278 -2541637 -3728061 -5023424 -6398819 -7847835
$$ packed form
35413B695367j105131o72343k31445J89961N64871Q64028J058190J124464J052757
35404E540719Q50496N44366J76120k08525n71250q84206j125339j275829j324765
35395A721787j274771j140739r43506p05163m47045j86456O6834L08446N31180
35386b069433P19237Q51789R11859Q91610P91961O22503M04834J73449l3265j89568
35376C074976k94226l67101m32175m99687n61104o00925o16001o25438o60628
35367a582309p42417q64198r93280j085800j102884j022374q45758n96683l06959
35358i142662J924L24616O58051R81519J250193J407944J409689J240165R20699
35349i47862N01838M6859l84364p45749j012359j186424j295363j375395j449016
$$ plain form
35340 -7847835 -9362176 -10916138 -12468226 -13972205 -15386006 -16674808 -17811807 -18780127
35332 -18780127 -19574381 -20197460 -20650863 -20923753 -20989494 -20813424 -20365945 -19631341 -18608604
35323 -18608604 -17308274 -15750705 -13967358 -12004260 -9927216 -7827745 -5825283 -4058788
35315 -4058788 -2664394 -1744183 -1337404 -1404617 -1829935 -2443070 -3060769 -3539925 -3822688
35306 -3822688 -3950199 -4035832 -4212048 -4577273 -5162964 -5926857 -6768975 -7563141 -8194598 -8593022
35296 -8593022 -8751814 -8728458 -8625303 -8555938 -8608495 -8819484 -9167300 -9585835 -9991046 -10309199
35286 -10309199 -10495036 -10532032 -10415406 -10127814 -9622523 -8825880 -7661679 -6089323 -4140651
35277 -4140651 -1939028 311842 2372800 4035854 5184542 5817333 6023100 5927895 5646800
$$ packed form
35340g847835j514341j553962j552088j503979j413801j288802j136999r68320
35332a8780127p94254o23079m53403k72890o5741J76070M47479P34604J022737
35323a8608604J300330J557569J783347J963098K077044K099471K002462J766495
35315d058788J394394R20211M06779o7213m25318o13135o17699m79156k82763
35306c822688j27511q5633j76216l65225n85691p63893q42118p94166o31457l98424
35296h593022j58792K3356J03155O9365n2557k10989l47816m18535m05211l18153
35286a0309199j85837l6996J16626K87592N05291P96643J164201J572356J948672
35277d140651K201623K250870K060958J663054J148688O32791K05767r5205k81095
$$ plain form
35268 5646800 5261371 4817598 4326512 3757951 3034563 2040791 654410 -1207636 -3549848
35259 -3549848 -6285068 -9253076 -12258757 -15110904 -17650023 -19765572 -21406858 -22585461
35251 -22585461 -23361704 -23814923 -24012665 -23999078 -23807571 -23480543 -23073586 -22638984 -22204885
35242 -22204885 -21770605 -21323523 -20864433 -20421040 -20037669 -19746307 -19538355 -19357410 -19119503
35233 -19119503 -18748301 -18202236 -17476562 -16582299 -15521902 -14282546 -12850328 -11230438 -9458412
35224 -9458412 -7602319 -5763323 -4073391 -2679809 -1713372 -1253324 -1307759 -1818654 -2687340
35215 -2687340 -3808412 -5097600 -6502695 -7997061 -9565580 -11192012 -12847089 -14473448
35207 -14473448 -15973552 -17216135 -18069080 -18445222 -18332680 -17788978 -16903663 -15756526 -14398440
$$ packed form
35268E646800l85429m43773m91086n68561p23388r93772j386381j862046k342212
35259c549848k735220k968008l005681k852147k539119k115549j641286j178603
35251b2585461p76243m53219j97742J3587J91507L27028M06957M34602M34099
35242b2204885M34280M47082M59090M43393L83371K91362K07952J80945K37907
35233a9119503L71202N46065P25674Q94263J060397J239356J432218J619890J772026
35224i458412J856093J838996J689932J393582R66437M60048n4435n10895q68686
35215b687340j121072j289188j405095j494366j568519j626432j655077j626359
35207a4473448j500104j242583q52945l76142J12542N43702Q85315J147137J358086
$$ plain form
35198 -14398440 -12859572 -11166625 -9348522 -7427742 -5411175 -3293730 -1074254 1228258
35190 1228258 3571044 5900733 8175279 10378737 12516080 14588832 16565954 18368356
35182 18368356 19878399 20973003 21566367 21641807 21257641 20526935 19583906 18551451 17518918
35173 17518918 16535843 15625429 14813217 14153332 13730450 13629046 13883511 14436127 15126597
35164 15126597 15721890 15977529 15707270 14832907 13394241 11520058 9381521 7154255 5000514
35155 5000514 3062481 1451666 232154 -588517 -1046491 -1189204 -1043446 -605084 144457
35146 144457 1208876 2555081 4109860 5771902 7428986 8974103 10321146 11421852
35138 11421852 12279340 12947573 13508716 14031892 14529505 14931548 15091396 14823362 13960044
$$ packed form
35198a4398440J538868J692947J818103J920780K016567K117445K219476K302512
35190A228258K342786K329689K274546K203458K137343K072752J977122J802402
35182A8368356J510043J094604N93364P5440l84166p30706r43029j032455j032533
35173A7518918r83075r10414q12212o59885m22882j01404K54465N52616O90470
35164A5126597N95293K55639k70259q74363j438666j874183k138537k227266k153741
35155E000514j938033j610815j219512q20671m57974j42713J45758M38362P49541
35146A44457J064419J346205J554779J662042J657084J545117J347043J100706
35138A1421852Q57488O68233N61143N23176M97613M02043J59848k68034q63318
$$ plain form
35129 13960044 12409734 10193009 7445057 4384523 1262787 -1688816 -4300932 -6489365
35121 -6489365 -8254021 -9653254 -10762502 -11633160 -12266041 -12606540 -12561891 -12035211 -10965117
35112 -10965117 -9357009 -7296879 -4946225 -2519646 -245851 1683347 3161874 4196297
35104 4196297 4897713 5440588 6004150 6718196 7632248 8715106 9876531 10995230 11943210
35095 11943210 12607564 12913114 12841258 12434441 11781608 10991915 10168524 9388628 8689583
35086 8689583 8062210 7456112 6798889 6021671 5078936 3957203 2676968 1293558 -104679
35077 -104679 -1407556 -2505659 -3317402 -3809220 -4002084 -3965051 -3799873 -3618338 -3512933
35068 -3512933 -3527740 -3644792 -3797250 -3901653 -3885222 -3691417 -3271690 -2585570 -1618387 -402819
$$ packed form
35129A3960044j550310k216725k747952l060534l121736k951603k612116k188433
35121f489365j764656j399233j109248q70658o32881l40499M4649N26680J070094
35112a0965117J608108K060130K350654K426579K273795J929198J478527J034423
35104D196297P01416N42875N63562P14046R14052J082858J161425J118699R47980
35095A1943210O64354L05550p1856m06817o52833p89693q23391p79896o99045
35086H689583o27373o06098o57223p77218r42735j121733j280235j383410j398237
35077a04679j302877j098103q11743m91818j92864L7033J65178J81535J05405
35068c512933j4807j17052j52458j04403J6431J93805M19727O86120R67183J215568
$$ plain form
35058 -402819 975956 2396427 3725882 4840073 5633455 6025970 5973452 5482491 4622670
35049 4622670 3525700 2365237 1321290 542020 117144 69865 363886 917343 1619457
35040 1619457 2352101 3017181 3561331 3983342 4317192 4600182 4846548 5043312 5170445
35031 5170445 5230925 5267899 5352526 5546589 5864696 6263876 6669345 7020257 7308112 7588109
35021 7588109 7959798 8526568 9350143 10417313 11632088 12837496 13859637 14557016 14855403
35012 14855403 14754830 14308403 13585850 12641721 11505086 10195109 8750618 7251512 5813446
35003 5813446 4553974 3546582 2786925 2188862 1612087 907683 -39188 -1285370 -2827918
34994 -2827918 -4617220 -6575889 -8617936 -10664723 -12653435 -14535966 -16272275 -17825710
$$ packed form
35058d02819J378775J420471J329455J114191P93382L92515n2518m90961q59821
35049D622670j096970j160463j043947p79270m24876m7279K94021N53457P02114
35040A619457P32644O65080N44150M22011L33850K82990K46366J96764J27133
35031E170445O0480L6974Q4627J94063L18107L99180M05469L50912K87855K79997
35021G588109L71689N66770Q23575J067170J214775J205408J022141O97379K98387
35012A4855403j00573m46427p22553r44129j136635j309977j444491j499106j438066
35003E813446j259472j007392p59657n98063n76775p04404r46871j246182j542548
34994b827918j789302j958669k042047k046787j988712j882531j736309j553435
$$ plain form
34986 -17825710 -19163100 -20255697 -21077692 -21606161 -21828768 -21757890 -21440263 -20951536 -20375397
34977 -20375397 -19777662 -19188862 -18604464 -18003163 -17374564 -16742021 -16168227 -15739582 -15535274
34968 -15535274 -15594095 -15894294 -16356998 -16871645 -17329092 -17645138 -17766330 -17661736 -17309456
34959 -17309456 -16686253 -15767275 -14538593 -13015801 -11254121 -9339821 -7366659 -5410085
34951 -5410085 -3508977 -1658490 182941 2069367 4031429 6047560 8042058 9912350
34943 9912350 11565667 12940341 14003164 14735748 15128686 15189339 14952750 14481539 13850702
34934 13850702 13124300 12334103 11467079 10465718 9244370 7721606 5860566 3700540
34926 3700540 1363113 -971223 -3103573 -4856526 -6104574 -6796164 -6966587 -6733352 -6267636
$$ packed form
34986a7825710j337390j092597q21995n28469k22607P0878L17627M88727N76139
34977b0375397N97735N88800N84398O01301O28599O32543N73794M28645K04308
34968a5535274n8821l00199m62704n14647m57447l16046j21192J04594L52280
34959a7309456O23203R18978J228682J522792J761680J914300J973162J956574
34951e410085J901108J850487J841431J886426J962062K016131J994498J870292
34943I912350J653317J374674J062823P32584L92938O0653k36589m71211o30837
34934A3850702p26402p90197q67024j001361j221348j522764j861040k160026
34926C700540k337427k334336k132350j752953j248048o91590j70423K33235M65716
$$ plain form
34917 -6267636 -5749121 -5322354 -5070459 -5012103 -5118660 -5341417 -5633788 -5957187 -6273150 -6536407
34907 -6536407 -6700619 -6734506 -6635924 -6432752 -6168019 -5877274 -5574124 -5256736 -4930652 -4625654
34897 -4625654 -4388172 -4255274 -4235135 -4311346 -4464871 -4694751 -5025847 -5505050 -6191915 -7146429
34887 -7146429 -8414640 -10014768 -11927644 -14093157 -16411761 -18750856 -20958518 -22885674
34879 -22885674 -24410382 -25451463 -25962904 -25914863 -25279161 -24034700 -22192663 -19825305 -17077921
34870 -17077921 -14153104 -11272626 -8633747 -6375991 -4563744 -3180960 -2135722 -1280270
34862 -1280270 -452576 467504 1510918 2607169 3616809 4393424 4843987 4959068 4802738
34853 4802738 4474120 4065005 3634035 3202543 2764075 2298085 1784372 1217264 614218
$$ packed form
34917f267636N18515M26767K51895N8356j06557k22757k92371l23399l15963k63257
34907f536407j64212l3887R8582K03172K64733K90745L03150L17388L26084L04998
34897d625654K37482J32898K0139p6211j53525k29880l31096m79203o86865r54514
34887g146429j268211j600128j912876k165513k318604k339095k207662j927156
34879b2885674j524708j041081n11441M8041O35702J244461J842037K367358K747384
34870a7077921K924817K880478K638879K257756J812247J382784J045238Q55452
34862a280270Q27694R20080J043414J096251J009640P76615M50563J15081j56330
34853D802738l28618m09115m30970m31492m38468m65990n13713n67108o03046
$$ plain form
34844 614218 10837 -558648 -1084551 -1593128 -2138786 -2782618 -3569145 -4509938 -5576044
34835 -5576044 -6698558 -7778339 -8705463 -9383436 -9748695 -9779710 -9498315 -8967397 -8281906
34826 -8281906 -7547516 -6851403 -6241002 -5721916 -5268838 -4834888 -4354876 -3751691 -2953793
34817 -2953793 -1919009 -651862 794583 2333569 3871711 5338999 6708346 7994127
34809 7994127 9231080 10445857 11633584 12743229 13671401 14269073 14369706 13839354 12632327
34800 12632327 10825530 8611520 6250548 4000936 2054416 497342 -693063 -1619879
34792 -1619879 -2416174 -3190755 -3990581 -4795216 -5543176 -6172111 -6649400 -6981818 -7210369
34783 -7210369 -7401795 -7639490 -8007783 -8566647 -9325210 -10228564 -11166735 -12002759 -12608397
$$ packed form
34844F14218o03381n69485n25903n08577n45658o43832p86527r40793j066106
34835e576044j122514j079781r27124o77973l65259l1015K81395N30918O85491
34826h281906P34390O96113O10401N19086M53078M33950M80012O03185P97898
34817b953793J034784J267147J446445J538986J538142J467288J369347J285781
34809G994127J236953J214777J187727J109645R28172N97672J00633n30352j207027
34800A2632327j806797k214010k360972k249612j946520j557074j190405r26816
34792a619879p96295p74581p99826q04635p47960o28935m77289l32418k28551
34783g210369j91426k37695l68293n58864p58563r03354r38171q36024o05638
$$ plain form
34774 -12608397 -12895141 -12832376 -12449882 -11826906 -11074140 -10314924 -9667180 -9223125 -9027581
34765 -9027581 -9065054 -9268028 -9546941 -9826326 -10068178 -10275299 -10480613 -10731853 -11075298 -11536382
34755 -11536382 -12096017 -12670578 -13113153 -13250141 -12945157 -12157702 -10962497 -9521837 -8033165
34746 -8033165 -6681277 -5609174 -4904155 -4590837 -4628412 -4916209 -5312649 -5666615 -5851220
34737 -5851220 -5786588 -5444798 -4840492 -4015744 -3026132 -1931491 -792495 327669 1358513
34728 1358513 2216273 2800140 2997800 2706869 1868183 493305 -1332791 -3477747 -5801729
34719 -5801729 -8189634 -10561503 -12861570 -15038636 -17034265 -18787856 -20254285 -21421156
34711 -21421156 -22315300 -22996986 -23546340 -24046560 -24565716 -25138383 -25751417 -26341960 -26813300
$$ packed form
34774a2608397k86744O2765L82494O22976P52766P59216O47744M44055J95544
34765i027581l7473k02974k78913k79385k41852k07121k05314k51240l43445m61084
34755a1536382n59635n74561m42575j36988L04984P87455J195205J440660J488672
34746h033165J351888J072103P05019L13318l7575k87797l96440l53966j84605
34737e851220O4632L41790O04306Q24748R89612J094641J138996J120164J030844
34728A358513Q57760N83867J97660k90931q38686j374878j826096k144956k323982
34719e801729k387905k371869k300067k177066j995629j753591j466429j166871
34711b1421156q94144o81686n49354n00220n19156n72667o13034n90543m71340
$$ [...]
##END NTUPLES=NMR SPECTRUM
##END=
