##TITLE=31Pdec_IPACAT-34-2
 CDCl3
  64 sc
 21.11.2023
##JCAMPDX= 6.0         $$ Bruker NMR JCAMP-DX V2.0
##DATA TYPE= NMR SPECTRUM
##DATA CLASS= NTUPLES
##ORIGIN= UXNMR, Bruker Analytische Messtechnik GmbH
##OWNER= root
$$ XWIN-NMR		Version 3.5
$$ Tue Nov 21 16:17:32 2023 Russian Standard Time (UT+4h)  she@DPX200
##.OBSERVE FREQUENCY= 81.013821
##.OBSERVE NUCLEUS= ^31P
##.ACQUISITION MODE= SIMULTANEOUS
##.ACQUISITION SCHEME= undefined
##.AVERAGES= 64
##.DIGITISER RES= 16
##SPECTROMETER/DATA SYSTEM= spect
##.PULSE SEQUENCE= zgpg30
##.SOLVENT NAME= DMSO
##.SHIFT REFERENCE= (INTERNAL, DMSO, 0, 248.564)
##AUDIT TRAIL= $$ (NUMBER, WHEN, WHO, WHERE, WHAT)
$$ ##TITLE= Audit trail, XWIN-NMR		Version 3.5
$$ ##JCAMPDX= 5.01
$$ ##ORIGIN= Bruker BioSpin GmbH
$$ ##OWNER= she
$$ F:/spectra/data/she/nmr/P31/1/pdata/1/auditp.txt
$$ ##AUDIT TRAIL=  $$ (NUMBER, WHEN, WHO, WHERE, WHAT)
(   1,<2023-11-21 16:13:55.89 +0400>,<she>,<DPX200>,
      <created by zg, POWCHK disabled, PULCHK disabled
       configuration hash MD5:
       00 E9 B6 7A A2 85 ED C7 34 08 36 98 17 FE 4E 26
       data hash MD5: 32K
       68 70 C3 A7 17 06 4E 37 FE 22 BB CB 66 61 B7 77>)
(   2,<2023-11-21 16:16:56.10 +0400>,<she>,<DPX200>,
      <Start of raw data processing
       efp BC_mod = 2 LB = 10 FT_mod = 6 PKNL = 1 PHC0 = -11382.09 PHC1 = 124.4937 SI = 64K 
       data hash MD5: 64K
       A2 1E 7F 49 94 97 A2 EC FA 7D D6 21 E5 E4 8A 73>)
$$ ##END=
$$ 
$$ hash MD5
$$ 65 BD CF 6D C8 0A D2 98 68 AE 1F 19 45 5E F8 32
##$RELAX= 
##$RELAX= 
##$RELAX= 
##$RELAX= 
##$RELAX= 
##$RELAX= 
##$RELAX= 
##$RELAX= 
##$RELAX= 
$$ Bruker specific parameters
$$ --------------------------
##$DU= <F:/spectra>
##$EXPNO= 1
##$NAME= <P31>
##$PROCNO= 1
##$TYPE= <nmr>
##$USER= <she>
##$AMP= (0..31)
100 100 100 100 100 100 100 100 100 100 100 100 100 100 100 100 100 100 
100 100 100 100 100 100 100 100 100 100 100 100 100 100 
##$AQSEQ= 0
##$AQ_mod= 1
##$AUNM= <au_zg>
##$AUTOPOS= <>
##$BF1= 81.014009
##$BF2= 200.13
##$BF3= 200.13
##$BF4= 200.13
##$BF5= 200.13
##$BF6= 200.13
##$BF7= 200.13
##$BF8= 200.13
##$BYTORDA= 1
##$CFDGTYP= 0
##$CFRGTYP= 5
##$CHEMSTR= <none>
##$CNST= (0..31)
1 1 145 1 1 1 1 1 1 1 1 1 1 1 1 1 1 1 1 1 1 1 1 1 1 1 1 1 1 1 1 1 
##$CPDPRG= <waltz16>
##$CPDPRG1= <>
##$CPDPRG2= <waltz16>
##$CPDPRG3= <>
##$CPDPRG4= <mlev>
##$CPDPRG5= <mlev>
##$CPDPRG6= <mlev>
##$CPDPRG7= <mlev>
##$CPDPRG8= <mlev>
##$CPDPRGB= <>
##$CPDPRGT= <>
##$D= (0..31)
0 1 0 0 0 0 0 0 0 0 0 0.03 2e-05 3e-06 0 0 0 0 0 0 0 0 0 0 0 0 0 0 0 0 
0 0 
##$DATE= 1700568835
##$DBL= (0..7)
120 120 120 11 120 120 24 19 
##$DBP= (0..7)
150 150 150 150 150 150 150 150 
##$DBP07= 0
##$DBPNAM0= <>
##$DBPNAM1= <>
##$DBPNAM2= <>
##$DBPNAM3= <>
##$DBPNAM4= <>
##$DBPNAM5= <>
##$DBPNAM6= <>
##$DBPNAM7= <>
##$DBPOAL= (0..7)
0.5 0.5 0.5 0.5 0.5 0.5 0.5 0.5 
##$DBPOFFS= (0..7)
0 0 0 0 0 0 0 0 
##$DE= 6
##$DECBNUC= <off>
##$DECIM= 3
##$DECNUC= <off>
##$DECSTAT= 4
##$DIGMOD= 1
##$DIGTYP= 9
##$DL= (0..7)
0 0 52 120 120 21 21 25 
##$DP= (0..7)
$$ [...]
##$SUBNAM2= <"">
##$SUBNAM3= <"">
##$SUBNAM4= <"">
##$SUBNAM5= <"">
##$SUBNAM6= <"">
##$SUBNAM7= <"">
##$SUBNAM8= <"">
##$SUBNAM9= <"">
##$SW= 501.771253377433
##$SWIBOX= (0..15)
0 1 3 0 0 0 0 0 0 0 0 0 0 0 0 0 
##$SW_h= 40650.406504065
##$TD= 32768
##$TD0= 1
##$TE= 0
##$TE2= 300
##$TE3= 300
##$TEG= 300
##$TL= (0..7)
0 120 53 12 22 120 120 120 
##$TP= (0..7)
150 150 150 150 150 150 150 150 
##$TP07= 0
##$TPNAME0= <>
##$TPNAME1= <>
##$TPNAME2= <>
##$TPNAME3= <>
##$TPNAME4= <>
##$TPNAME5= <>
##$TPNAME6= <>
##$TPNAME7= <>
##$TPOAL= (0..7)
0.5 0.5 0.5 0.5 0.5 0.5 0.5 0.5 
##$TPOFFS= (0..7)
0 0 0 0 0 0 0 0 
##$TUNHIN= 0
##$TUNHOUT= 0
##$TUNXOUT= 0
##$USERA1= <user>
##$USERA2= <user>
##$USERA3= <user>
##$USERA4= <user>
##$USERA5= <user>
##$V9= 5
##$VALIST= <valist>
##$VCLIST= <CCCCCCCCCCCCCCC>
##$VD= 0
##$VDLIST= <DDDDDDDDDDDDDDD>
##$VPLIST= <PPPPPPPPPPPPPPP>
##$VTLIST= <TTTTTTTTTTTTTTT>
##$WBST= 1024
##$WBSW= 4
##$XGAIN= (0..3)
0 0 0 0 
##$XL= 0
##$YL= 0
##$YMAX_a= 12537
##$YMIN_a= -1765
##$ZGOPTNS= <>
##$ZL1= 120
##$ZL2= 120
##$ZL3= 120
##$ZL4= 120
##$ABSF1= 0
##$ABSF2= 0
##$ABSG= 0
##$ABSL= 0
##$ALPHA= 0
##$AQORDER= 0
##$ASSFAC= 0
##$ASSFACI= 0
##$ASSFACX= 0
##$ASSWID= 0
##$AUNMP= <proc_1d>
##$AZFE= 0.1
##$AZFW= 0.5
##$BCFW= 0
##$BC_mod= 2
##$BYTORDP= 0
##$COROFFS= 0
##$CY= -3
##$DATMOD= 1
##$DC= 0
##$DFILT= <>
##$DTYPP= 0
##$F1P= 0
##$F2P= 0
##$FCOR= 1
##$FTSIZE= 65536
##$FT_mod= 6
##$GAMMA= 0
##$GB= 0
##$INTBC= 1
##$INTSCL= 6.047779e-11
##$ISEN= 30
##$LB= 10
##$LEV0= 0
##$LPBIN= 0
##$MAXI= 10000
##$MC2= 0
##$MEAN= 0
##$ME_mod= 0
##$MI= 50
##$NCOEF= 0
##$NC_proc= -11
##$NLEV= 6
##$NOISF1= 182.463
##$NOISF2= 159.3651
##$NSP= 0
##$NTH_PI= 0
##$NZP= 0
##$OFFSET= 248.5645
##$PC= 4
##$PHC0= -11382.09
##$PHC1= 124.4937
##$PH_mod= 1
##$PKNL= yes
##$PPARMOD= 0
##$PSCAL= 0
##$PSIGN= 0
##$REVERSE= no
##$SF= 81.0140089999694
##$SI= 65536
##$SIGF1= 159.3651
##$SIGF2= -187.1042
##$SINO= 113.3802
##$SIOLD= 16384
##$SREGLST= <1H.CDCl3>
##$SSB= 0
##$STSI= 65536
##$STSR= 0
##$SW_p= 40650.406504065
##$SYMM= 0
##$S_DEV= 0
##$TDeff= 32768
##$TDoff= 0
##$TI= <>
##$TILT= no
##$TM1= 0
##$TM2= 0
##$TOPLEV= 0
##$USERP1= <user>
##$USERP2= <user>
##$USERP3= <user>
##$USERP4= <user>
##$USERP5= <user>
##$WDW= 1
##$XDIM= 65536
##$YMAX_p= 416247266
##$YMIN_p= -93142462
$$ End of Bruker specific parameters
$$ ---------------------------------
##NTUPLES= NMR SPECTRUM
##VAR_NAME=  FREQUENCY,     SPECTRUM/REAL,   SPECTRUM/IMAG
##SYMBOL=    X,             R,               I
##VAR_TYPE=  INDEPENDENT,   DEPENDENT,       DEPENDENT
##VAR_FORM=  AFFN,          ASDF,            ASDF
##VAR_DIM=   65536,         65536,           65536
##UNITS=     HZ,            ARBITRARY UNITS, ARBITRARY UNITS
##FACTOR=    0.620285442955139, 1,           1
##FIRST=     20137.2065510682, 0,            0
##LAST=      -20513.1999529968, 0,           0
##MIN=       -20513.1999529968, -93142462,   0
##MAX=       20137.2065510682, 416247266,    0
$$ Real data points
##PAGE= N=1
##DATA TABLE= (X++(R..R)), XYDATA
$$ [...]
39935a2974441j207231j358078j400433j307885j080147p47838l71474k6403K22665
$$ -12974441 -14181672 -15539750 -16940183 -18248068 -19328215 -20076053 -20447527 -20473930 -20251265
39926b0251265L42615L37047K35754P5831j17264l38992n97335q89383j179871
$$ -20251265 -19908650 -19571603 -19335849 -19260018 -19377282 -19716274 -20313609 -21202992 -22382863
39917b2382863j400219j470896j331837r62199l82210L57025J185497K021819
$$ -22382863 -23783082 -25253978 -26585815 -27548014 -27930224 -27573199 -26387702 -24365883
39909b4365883K777355L362899L702998L756078L530784L087332K520153J929869
$$ -24365883 -21588528 -18225629 -14522631 -10766553 -7235769 -4148437 -1628284 301585
39901C01585J399850R88148P31606O47806P25439R12027J118939J251469J246586
$$ 301585 1701435 2689583 3421189 4068995 4794434 5706461 6825400 8076869 9323455
39892I323455J091035Q09758M40142J4966m37200q82470j276272j569495j723893
$$ 9323455 10414490 11224248 11664390 11679356 11242156 10359686 9083414 7513919 5790026
39883E790026j726263j589622j340319j005496o16288k22263J06321L02963L39863
$$ 5790026 4063763 2474141 1133822 128326 -487962 -710225 -603904 -300941 38922
39874C8922K40715N8201j63071m07101o79817r88820j327186j667732j966205
$$ 38922 279637 337838 174767 -232334 -912151 -1900971 -3228157 -4895889 -6862094
39865f862094k171858k243049k160533j930770j579497j143795o68666k06094
$$ -6862094 -9033952 -11277001 -13437534 -15368304 -16947801 -18091596 -18760262 -18966356
39857a8966356J88661M64563N83247N26458L02423m9931m60841q34444j059923
$$ -18966356 -18777695 -18313132 -17729885 -17203427 -16901004 -16950935 -17411776 -18246220 -19306143
39848a9306143j033953o97145p3171P15088J473567K004837K184875K011405J601639
$$ -19306143 -20340096 -21037241 -21110412 -20395324 -18921757 -16916920 -14732045 -12720640 -11119001
39839a1119001J142220Q16365P42944R52947J404216K013505K682202L307609
$$ -11119001 -9976781 -9160416 -8417472 -7464525 -6060309 -4046804 -1364602 1943007
39831A943007L788004M033247L982920L621066K973500K087024J009497k06998
$$ 1943007 5731011 9764258 13747178 17368244 20341744 22428768 23438265 23231267
39823B3231267j481354k686946l673307m322084m599820m569317m351669m063714
$$ 23231267 21749913 19062967 15389660 11067576 6467756 1898439 -2453230 -6516944
39815f516944l768132l462689l109525k679622k178996j640948j099430n74101
$$ -6516944 -10285076 -13747765 -16857290 -19536912 -21715908 -23356856 -24456286 -25030387
39807b5030387q2516L35559O11698O74810M93910J06808l83890q41997j138499
$$ -25030387 -25112903 -24777344 -24165646 -23490836 -22996926 -22890118 -23274008 -24116005 -25254504
39798b5254504j187711r70146n33298L3888O41436J228562J764519K224288K562776
$$ -25254504 -26442215 -27412361 -27945659 -27911771 -27270335 -26041773 -24277254 -22052966 -19490190
39789a9490190K711477K604659K220334J608404Q84680J93097l39547o31942o54500
$$ -19490190 -16778713 -14174054 -11953720 -10345316 -9460636 -9267539 -9607086 -10239028 -10893528
39780a0893528m24639j131N22744J032668J415318J584557J502559J186103O95013
$$ -10893528 -11318167 -11319298 -10796554 -9763886 -8348568 -6764011 -5261452 -4075349 -3380336
39771c380336J09722m90898j045134j516511j893472k180134k383644k507900
$$ -3380336 -3270614 -3761512 -4806646 -6323157 -8216629 -10396763 -12780407 -15288307
39763a5288307k557015k541142k476187k377824k256419k116266j957252j776964
$$ -15288307 -17845322 -20386464 -22862651 -25240475 -27496894 -29613160 -31570412 -33347376
39755c3347376j573488j348137j104592q41717n43486j76274K96363Q83836J543756
$$ -33347376 -34920864 -36269001 -37373593 -38215310 -38758796 -38935070 -38638707 -37754871 -36211115
39746c6211115K186736K714263L063068L222205L215434L073847K826922K513181
$$ -36211115 -34024379 -31310116 -28247048 -25024843 -21809409 -18735562 -15908640 -13395459
39738a3395459K187421J907412J709412J596869J553397J565464J630643J743160
$$ -13395459 -11208038 -9300626 -7591214 -5994345 -4440948 -2875484 -1244841 498319
39730D98319J872370J957682J929437J743134J402858R56790M67653k1017n00101
$$ 498319 2370689 4328371 6257808 8000942 9403800 10360590 10828243 10807226 10307125
39721A0307125r83712j482063j976421k410339k703023k780870k611509k218866
$$ 10307125 9323413 7841350 5864929 3454590 751567 -2029303 -4640812 -6859678
39713f859678j669254j041358m04505J84121O75174J032025J244512J336110J352994
$$ -6859678 -8528932 -9570290 -9974795 -9790674 -9115500 -8083475 -6838963 -5502853 -4149859
39704d149859J339184J312561J255763J128489Q96339N58752J55135k56614o30113
$$ -4149859 -2810675 -1498114 -242351 886138 1782477 2341229 2496364 2239750 1609637
39695A609637r41852j176837j309110j301849j129514q02755l76426O4309M32400
$$ 1609637 667785 -509052 -1818162 -3120011 -4249525 -5052280 -5428706 -5364397 -4931997
39686d931997O68889P60128P32889O31749M94847L41810J74983j2738k29259m77943
$$ -4931997 -4263108 -3502980 -2770091 -2138342 -1643495 -1301685 -1126702 -1139440 -1368699 -1846642
39676a846642p59012j075736j436393j846648k299722k775116l244252l671734
$$ -1846642 -2605654 -3681390 -5117783 -6964431 -9264153 -12039269 -15283521 -18955255
39668a8955255m010186m201083m190621l951077l489308k836164k028709j101600
$$ -18955255 -22965441 -27166524 -31357145 -35308222 -38797530 -41633694 -43662403 -44764003
39660d4764003r3246R41927J929187K783987L431126L821401L941737L822035
$$ -44764003 -44857249 -43915322 -41986135 -39202148 -35771022 -31949621 -28007884 -24185849
39652b4185849L537608L197102K910344K748547K720976K782472K864264K906204
$$ -24185849 -20648241 -17451139 -14540795 -11792248 -9071272 -6288800 -3424536 -518332
39644e18332K871695K742302K504455K143595J649461J023684K81785n46867j414105
$$ -518332 2353363 5095665 7600120 9743715 11393176 12416860 12698645 12151778 10737673
39635A0737673k246979k954340l452318l696707l700931l526684l252942k942904
$$ 10737673 8490694 5536354 2084036 -1612671 -5313602 -8840286 -12093228 -15036132
39627a5036132k627834k312003j986866j641302j267417q69566m75962j39762
$$ -15036132 -17663966 -19975969 -21962835 -23604137 -24871554 -25741120 -26217082 -26356844
39619b6356844P9810J47992P6948p3044k12532k52076j30541J67248O09661J133561
$$ -26356844 -26277034 -26129042 -26052094 -26125138 -26337670 -26589746 -26720287 -26553039 -25943378 -24809817
39609b4809817J668086K156256K565856K886539L117450L255178L290238L211947
$$ -24809817 -23141731 -20985475 -18419619 -15533080 -12415630 -9160452 -5870214 -2658267
39601b658267L014733K700293K276235J754464J149549M75076k60756j053900
$$ -2658267 356466 3056759 5332994 7087458 8237007 8712083 8451327 7397427
39593G397427j891539k730037l478442m007528m193608l980602l421009k661321
$$ 7397427 5505888 2775851 -702591 -4710119 -8903727 -12884329 -16305338 -18966659
39585a8966659j875428j190981o58201k71277q819J46174K15857K45726L07832
$$ -18966659 -20842087 -22033068 -22691269 -22962546 -22971365 -22825191 -22609334 -22363608 -22055776
39576b2055776M81193Q17239J306946J869336K372540K678575K687334K359509
$$ -22055776 -21574583 -20757344 -19450398 -17581062 -15208522 -12529947 -9842613 -7483104
39568g483104J715817Q21471k34912j360239k466283l468517m284674m844287
$$ -7483104 -5767287 -4945816 -5180728 -6540967 -9007250 -12475767 -16760441 -21604728
39560b1604728n106783n073102m780016m281818l634036k890636k113512j379884
$$ -21604728 -26711511 -31784613 -36564629 -40846447 -44480483 -47371119 -49484631 -50864515
39552e0864515p70665l38844q0338O5586J83655L42420N71314Q57388J151880
$$ -50864515 -51635180 -51974024 -52054362 -51988776 -51805121 -51462701 -50891387 -50033999 -48882119
39543d8882119J384671J490806J442135J265026J032357Q35907P53017Q17677
$$ -48882119 -47497448 -46006642 -44564507 -43299481 -42267124 -41431217 -40678200 -39860523
39535c9860523J005800J246086J456492J584044J618573J574082J462184J286784
$$ -39860523 -38854723 -37608637 -36152145 -34568101 -32949528 -31375446 -29913262 -28626478
39527b8626478J062886Q34652O66836O09118O59595P56915Q07979P31456M90767
$$ -28626478 -27563592 -26728940 -26062104 -25452986 -24793391 -24036476 -23228497 -22497041 -22006274
39518b2006274J04814l60780q17562j189410j444120j597658j683561j713725
$$ -22006274 -21901460 -22262240 -23079802 -24269212 -25713332 -27310990 -28994551 -30708276
39510c0708276j668601j525130j290631j005614p11755m14816p5095L65616R37984
$$ -30708276 -32376877 -33902007 -35192638 -36198252 -36910007 -37324823 -37399918 -37034302 -36096318
39501c6096318J610595K291035K862978L233713L361058L249382K929959K446400
$$ -36096318 -34485723 -32194688 -29331710 -26097997 -22736939 -19487557 -16557598 -14111198
39493a4111198J851861J210500N93628O6945l27093n81500p21401p85572q06143
$$ -14111198 -12259337 -11048837 -10455209 -10388264 -10715357 -11296857 -12018258 -12803830 -13609973
39484a3609973p99874p71552p21396o52226n76892n21605n17287n81352p05385
$$ -13609973 -14409847 -15181399 -15902795 -16555021 -17131913 -17653518 -18170805 -18752157 -19457542
39475a9457542q59409j005296j105604j126791j045172q56210n77992k45599R5969
$$ -19457542 -20316951 -21322247 -22427851 -23554642 -24599814 -25456024 -26034016 -26279615 -26183646
39466b6183646L96202O07729P02784O84898N79998M10563J75642j44748n62937
$$ -26183646 -25787444 -25179715 -24476931 -23792033 -23212035 -22801472 -22625830 -22770578 -23333515
39457b3333515j052610j534049j889412k006746j830918j389467p76492j08066
$$ -23333515 -24386125 -25920174 -27809586 -29816332 -31647250 -33036717 -33813209 -33921275
39449c3921275N20370J054224J478414J805813K063243K277497K463637K619190
$$ -33921275 -33400905 -32346681 -30868267 -29062454 -26999211 -24721714 -22258077 -19638887
39441a9638887K725673K754799K675220K458272K084651J553717Q92323J55883
$$ -19638887 -16913214 -14158415 -11483195 -9024923 -6940272 -5386555 -4494232 -4338349
39433d338349n82902j253221j802014k198319k428443k491688k402710k196309
$$ -4338349 -4921251 -6174472 -7976486 -10174805 -12603248 -15094936 -17497646 -19693955
39425a9693955j924830j643725j391448j175321r71876p42459m57142j14386K56188
$$ -19693955 -21618785 -23262510 -24653958 -25829279 -26801155 -27543614 -28000756 -28115142 -27858954
39416b7858954O10943R17627J170176J382946J571866J740323J882014J996887
$$ -27858954 -27248011 -26330384 -25160208 -23777262 -22205396 -20465073 -18583059 -16586172
39408a6586172K103024K229333K391726K573392K728284K805401K772838K623963
$$ -16586172 -14483148 -12253815 -9862089 -7288697 -4560413 -1755012 1017826 3641789
39400C641789K366505K007591J546234R78263L11829m17052j143686j793080k303817
$$ 3641789 6008294 8015885 9562119 10540382 10852211 10435159 9291473 7498393 5194576
39391E194576k640331k793017k778714k644733k463369k307713k221153k203246
$$ 5194576 2554245 -238772 -3017486 -5662219 -8125588 -10433301 -12654454 -14857700
39383a4857700k220260k228013k190182k085857j909884j670582j386498j082528
$$ -14857700 -17077960 -19305973 -21496155 -23582012 -25491896 -27162478 -28548976 -29631504
39375b9631504p86148n24805l24563k08052j88846k62232l98078n44212o43673
$$ -29631504 -30417652 -30942457 -31267020 -31475072 -31663918 -31926150 -32324228 -32868440 -33512113
39366c3512113o59363n92682m84469l96525l84068m75112o66867r35691j248124
$$ -33512113 -34171476 -34764158 -35248627 -35645152 -36029220 -36504332 -37171199 -38106890 -39355014
39357c9355014j564508j838834k024219k086395k016470j832748j570578j267345
$$ -39355014 -40919522 -42758356 -44782575 -46868970 -48885440 -50718188 -52288766 -53556111
39349e3556111r48827o19055k56887J74242P02426J321607J982673K608166L117906
$$ -53556111 -54504938 -55123993 -55380880 -55206638 -54504212 -53182605 -51199932 -48591766 -45473860
39340d5473860L446589L547290L391226K975527K337227J560445P66882R1051
$$ -45473860 -42027271 -38479981 -35088755 -32113228 -29776001 -28215556 -27448674 -27357623
39332b7357623l52371n03109l83764j06074J61043K57715J02423k74027p46460
$$ -27357623 -27709994 -28213103 -28596867 -28702941 -28541898 -28284183 -28181760 -28455787 -29202247
39323b9202247j151059j348876j270907r30949m06642J97392P83153J274724J616586
$$ -29202247 -30353306 -31702182 -32973089 -33904038 -34310680 -34113288 -33330135 -32055411 -30438825
39314c0438825J767875J704309J428856R82431M43838q6277n13609p78697q71807
$$ -30438825 -28670950 -26966641 -25537785 -24555354 -24111516 -24197793 -24711402 -25490099 -26361906
39305b6361906q26142o93543n18362l25593j26575O9425K50954M08486N38132
$$ -26361906 -27188048 -27881591 -28399953 -28725546 -28852121 -28782696 -28531742 -28123256 -27585124
39296b7585124O40026P15639P68702Q07407Q43374Q89104R59170J073987J256891
$$ -27585124 -26945098 -26229459 -25460757 -24653350 -23809976 -22920872 -21961702 -20887715 -19630824
39287a9630824J518449J836748K153298K396186K518366K521556K445159K328701
$$ -19630824 -18112375 -16275627 -14122329 -11726143 -9207777 -6686221 -4241062 -1912361
39279a912361K178073J960029J625034J139355N05943k34269j014910j757728
$$ -1912361 265712 2225741 3850775 4990130 5496073 5261804 4246894 2489166
39271B489166k380023k801158k957014k819520k407223j779553j023982k47304
$$ 2489166 109143 -2692015 -5649029 -8468549 -10875772 -12655325 -13679307 -13926611
39263a3926611M32696R06952J105396J020766P11028K81193j45023m55799n79439
$$ -13926611 -13493915 -12586963 -11481567 -10460801 -9749773 -9468580 -9613603 -10069402 -10648841
39254a0648841n02931k70857M0024L61936O71276R94549J378780J846691K370401
$$ -10648841 -11151772 -11422629 -11382605 -11020669 -10349393 -9354844 -7976064 -6129373 -3758972
39245c758972K882344L311101L611216L765346L762956L579246L176849K533876
$$ -3758972 -876628 2434473 6045689 9811035 13573991 17153237 20330086 22863962
39237B2863962J679797P12176k21748r72480j441082j610893j543464j343143
$$ 22863962 24543759 25255935 25034187 24061707 22620625 21009732 19466268 18123125
39229A8123125j110935r12075p70353o83621o42572o37652o53625o64441o39967
$$ 18123125 17012190 16100115 15329762 14646141 14003569 13365917 12712292 12047851 11407884
39220A1407884n62093m36328k89124j54916o3777l5207p6662j84958l50597n63043
$$ 11407884 10845791 10409463 10120339 9965423 9901646 9866439 9789777 9604819 9254222 8691179
39210H691179q12727j087469j365064j606820j759188j770200j617428j328642
$$ 8691179 7878452 6790983 5425919 3819099 2059911 289711 -1327717 -2656359
39202b656359r73973o29346l36601q9525J46402L96985O50555Q56266R51888R04578
$$ -2656359 -3630332 -4259678 -4596279 -4685804 -4539402 -4142417 -3491862 -2635596 -1683708 -779130
39192g79130P37707N25455L59207L06571L83833N50989P26946Q15613P32825M28143
$$ -779130 -41423 484032 843239 1149810 1533643 2084632 2811578 3627191 4360016 4788159
39182D788159j00726q03993j590648k352307k989313l428918l634407l607234
$$ 4788159 4687433 3883440 2292792 -59515 -3048828 -6477746 -10112153 -13719387
39174a3719387l378298k984701k443179j743069q69566J59494J273605K362093
$$ -13719387 -17097685 -20082386 -22525565 -24268634 -25138200 -24978706 -23705101 -21343008
39166b1343008L308912M025846M466403M619195M493166M109426L505570K745783
$$ -21343008 -18034096 -14008250 -9541847 -4922652 -429486 3679940 7185510 9931293
39158I931293J924048J152533N37496J51710J2255O9341K10658K85644J49156
$$ 9931293 11855341 13007874 13545370 13697080 13709335 13778676 13989334 14274978 14424134
39149A4424134k87086j016822j935077k872816l656868m169004m377763m330304
$$ 14424134 14137048 13120226 11185149 8312333 4655465 486461 -3891302 -8221606
39141h221606m113512l810320l475111l133359k792543k449924k095925j722175
$$ -8221606 -12335118 -16145438 -19620549 -22753908 -25546451 -27996375 -30092300 -31814475
39133c1814475j337585r79412p00648n33901m60297m16325l40005k20006j07973
$$ -31814475 -33152060 -34131472 -34832120 -35366021 -35826318 -36242643 -36582648 -36802654 -36910627
39124c6910627q7542k26450n42160r93629j495627j945637k252396k356709k239589
$$ -36910627 -36998169 -37224619 -37766779 -38760408 -40256035 -42201672 -44454068 -46810777 -49050366
39115d9050366j917071j424221p96372o0256P59235J627803K503113L349288M146307
$$ -49050366 -50967437 -52391658 -53188030 -53248286 -52489051 -50861248 -48358135 -45008847 -40862540
39106d0862540M881502N532805O062280O424645O580912O508813O209352N708520
$$ -40862540 -35981038 -30448233 -24385953 -17961308 -11380396 -4871583 1337769 7046289
39098G046289N051003M288391L471841K655329J902847J286609Q70756O87937
$$ 7046289 12097292 16385683 19857524 22512853 24415700 25702309 26573065 27261002
39090B7261002P22908R13454J168240J391467J502664J446548J195124P46435
$$ 27261002 27983910 28897364 30065604 31457071 32959735 34406283 35601407 36347842
39082C6347842J22705o31950j456752k285493l061118l742971m298103m684346
$$ 36347842 36470547 35838597 34381845 32096352 29035234 25292263 20994160 16309814
39074A6309814m846605m739399m363366l786813l132360k532863k079677j789190
$$ 16309814 11463209 6723810 2360444 -1426369 -4558729 -7091592 -9171269 -10960459
39066a0960459j603293j422527j155005p58200k57191K64465O95540R39057R51465
$$ -10960459 -12563752 -13986279 -15141284 -15899484 -16156675 -15892210 -15196670 -14257613 -13306148
39057a3306148P63988M76166K23221J30218K70180O39894J160199J700961K124634
$$ -13306148 -12542160 -12065994 -11842773 -11712555 -11442375 -10802481 -9642282 -7941321 -5816687
39048e816687K334736K308590K095681J780354J431386J070154O73423K01922
$$ -5816687 -3481951 -1173361 922320 2702674 4134060 5204214 5877637 6079559
39040F079559l65306j006327j651935k209235k607946k841128k966362l062663
$$ 6079559 5714253 4707926 3055991 846756 -1761190 -4602318 -7568680 -10631343
39032a0631343l177491l304753l402204l423292l336536l127211k792722k341934
$$ -10631343 -13808834 -17113587 -20515791 -23939083 -27275619 -30402830 -33195552 -35537486
39024c5537486j799249j207868o26599j18622K64570M97740N88225N68822M77730
$$ -35537486 -37336735 -38544603 -39171202 -39289824 -39025254 -38527514 -37939289 -37370467 -36892737
39015c6892737L36144J40226j24745m59770q38903j218085j556804j834906k054188
$$ -36892737 -36556593 -36416367 -36541112 -37000882 -37839785 -39057870 -40614674 -42449580 -44503768
39006d4503768k226784k360570k453338k500711k510014k504570k509892k529629
$$ -44503768 -46730552 -49091122 -51544460 -54045171 -56555185 -59059755 -61569647 -64099276
38998f4099276k529163k440656k190078j733421j082214l03048N08532J264008
$$ -64099276 -66628439 -69069095 -71259173 -72992594 -74074808 -74377856 -73869324 -72605316
38990g2605316J909146K432986K859241L226490L566946L893532M198125M454874
$$ -72605316 -70696170 -68263184 -65403943 -62177453 -58610507 -54716975 -50518850 -46063976
38982d6063976M622884M651347M494083M132133L592825K953149K322702J810160
$$ -46063976 -41441092 -36789745 -32295662 -28163529 -24570704 -21617555 -19294853 -17484693
38974a7484693J485956J360216J389239J503809J636113J728742J732051J606983
$$ -17484693 -15998737 -14638521 -13249282 -11745473 -10109360 -8380618 -6648567 -5041584
38966e041584J337336R38124M49032q0394n98726j050258j373808j513672j439495
$$ -5041584 -3704248 -2766124 -2317092 -2397486 -2996212 -4046470 -5420278 -6933950 -8373445
38957h373445j161492p30960k26151K69402O87191R85131J147305J176603J087687
$$ -8373445 -9534937 -10265897 -10492048 -10222646 -9535455 -8550324 -7403019 -6226416 -5138729
38948e138729R03073O48944L48040J2350l59673p79876j262265j811252k409136
$$ -5138729 -4235656 -3586712 -3238672 -3226322 -3585995 -4365871 -5628136 -7439388 -9848524
38939i848524l008709l536269l904897m033929l871029l412779k714941j882141
$$ -9848524 -12857233 -16393502 -20298399 -24332328 -28203357 -31616136 -34331077 -36213218
38931c6213218j036239k77781L39148Q07693J149687J392186J551868J632230
$$ -36213218 -37249457 -37527238 -37188090 -36380397 -35230710 -33838524 -32286656 -30654426
38923c0654426J630710J548308J393957J180766R19061O14407K72906r2682m62584
$$ -30654426 -29023716 -27475408 -26081451 -24900685 -23981624 -23367217 -23094311 -23186993 -23649577
38914b3649577q13195j117084j340010j442900j392744j176105q07219l30019
$$ -23649577 -24462772 -25579856 -26919866 -28362766 -29755510 -30931615 -31738834 -32068853
38906c2068853J83636O42726R57744J068689R65224O85899K96756j37765n75310
$$ -32068853 -31885217 -31242491 -30284747 -29216058 -28250834 -27564935 -27268179 -27405944 -27981254
38897b7981254r97599j396029j753637k037599k207828k235688k120290j891092
$$ -27981254 -28978853 -30374882 -32128519 -34166118 -36373946 -38609634 -40729924 -42621016
38889d2621016j594460j274150r60517o73551m30050k43955j21960o4338p1695
$$ -42621016 -44215476 -45489626 -46450143 -47123694 -47553744 -47797699 -47919659 -47983997 -48055692
38880d8055692j47205k88387m76572o75905q43895r45976r65816r06857p85121
$$ -48055692 -48202897 -48491284 -48967856 -49643761 -50487656 -51433632 -52399448 -53306305 -54091426
38871e4091426o19016m24455k16848j2284J77821L52326N16327O70184Q05560
$$ -54091426 -54710442 -55134897 -55351745 -55364029 -55186208 -54833882 -54317555 -53647371 -52841811
38862e2841811R14509J000160J074742J147143J215962J277257J338101J420247
$$ -52841811 -51927302 -50927142 -49852400 -48705257 -47489295 -46212038 -44873937 -43453690
38854d3453690J548459J732006J951595K159263K292557K297951K151225J861327
$$ -43453690 -41905231 -40173225 -38221630 -36062367 -33769810 -31471859 -29320634 -27459307
38846b7459307J456245R66325M23050j26681o10597r44506j066431r67836o98305
$$ -27459307 -26003062 -25036737 -24613687 -24740368 -25350965 -26295471 -27361902 -28329738 -29028043
38837b9028043l39991K9962L65059O51917Q95789J102463J265667J363522J365459
$$ -29028043 -29368034 -29338072 -28973013 -28321096 -27425307 -26322844 -25057177 -23693655 -22328196
38828b2328196J247878J010930O87376L40742N6152p4780K2528L75855R43700
$$ -22328196 -21080318 -20069388 -19382012 -19041270 -18985118 -19059898 -19037370 -18661515 -17717815
38819a7717815J617854K257853K743678L018154L094017L023847K857759K620021
$$ -17717815 -16099961 -13842108 -11098430 -8080276 -4986259 -1962412 895347 3515368
38811C515368K315257J948532J536558J101880O58781K04133k79974q13654j403692
$$ 3515368 5830625 7779157 9315715 10417595 11076376 11280509 11000535 10186881 8783189
38802H783189k031855k650613l188324l566695l729277l668567l433191l106907
$$ 8783189 6751334 4100721 912397 -2654298 -6383575 -10052142 -13485333 -16592240
38794a6592240k770826k469874k198255j906984j528881j011165l42064M40131
$$ -16592240 -19363066 -21832940 -24031195 -25938179 -27467060 -28478225 -28820289 -28380158
38786b8380158J258426K022249K653964L103902L348585L381309L211307K874097
$$ -28380158 -27121732 -25099483 -22445519 -19341617 -15993032 -12611723 -9400416 -6526319
38778f526319K434533J965894J517092J101182P20456M04026K18032K34716M86536
$$ -6526319 -4091786 -2125892 -608800 492382 1212838 1616864 1834896 2069612 2556148
38769B556148R44657J537122K185873K828414L410757L870401M136768M154153
$$ 2556148 3500805 5037927 7223800 10052214 13462971 17333372 21470140 25624293
38761B5624293L906388L421903K758578J983040J156387L28592m60460j176000
$$ 25624293 29530681 32952584 35711162 37694202 38850589 39179181 38718721 37542721
38753C7542721j784058k252144k554247k676177k621193k419208k135624j865353
$$ 37542721 35758663 33506519 30952272 28276095 25654902 23235694 21100070 19234717
38745A9234717j703208j704467j863442k123147k401637k614139k688556k584422
$$ 19234717 17531509 15827042 13963600 11840453 9438816 6824677 4136121 1551699
38737A551699k311790j930254j519966j145970q43855o28603n04178m59620m62455
$$ 1551699 -760091 -2690345 -4210311 -5356281 -6200136 -6828739 -7332917 -7792537 -8254992
38728h254992m66407m32157l44146k11712n8952Q5075J90180K26342J68416M882
$$ -8254992 -8721399 -9153556 -9497702 -9709414 -9768366 -9683291 -9493111 -9266769 -9098353 -9093471
38718i093471k55128n82377r34386j262239j515366j650754j651415j544765j401294
$$ -9093471 -9348599 -9930976 -10865362 -12127601 -13642967 -15293721 -16945136 -18489901 -19891195
38709a9891195j304071j304404j393263j506491j556453j468990j210600q01888
$$ -19891195 -21195266 -22499670 -23892933 -25399424 -26955877 -28424867 -29635467 -30437355
38701c0437355l15271J46547M87434O53612O50309N34506L92440L11972L54724
$$ -30437355 -30752626 -30606079 -30118645 -29465033 -28814724 -28280218 -27887778 -27575806 -27221082
38692b7221082N32875Q00231J066473J232879J234126J065248P80633M68573K17540
$$ -27221082 -26688207 -25887976 -24821503 -23588624 -22354498 -21289250 -20508617 -20040044 -19822504
38683a9822504Q9577J05358K38006M15142N33874M90872K19958k78927r34651
$$ -19822504 -19732927 -19627569 -19389563 -18974421 -18440547 -17949675 -17729717 -18008644 -18943295
38674a8943295j628136k233359k656464k856699k844907k666266k378563k036674
$$ -18943295 -20571431 -22804790 -25461254 -28317953 -31162860 -33829126 -36207689 -38244363
38666c8244363j689143j383748j171130j097193j184741j414111j715664j985117
$$ -38244363 -39933506 -41317254 -42488384 -43585577 -44770318 -46184429 -47900093 -49885210
38658d9885210k123139k081489j883574j600428j300066j012391p35456m69591
$$ -49885210 -52008349 -54089838 -55973412 -57573840 -58873906 -59886297 -60621753 -61091344
38650f1091344k44544j16979j42240l41603o86913j111621j539024j907933k181792
$$ -61091344 -61335888 -61452867 -61595107 -61936710 -62623623 -63735244 -65274268 -67182201 -69363993
38641f9363993k342048k375611k265684j991610j539103r15344j58761O62050
$$ -69363993 -71706041 -74081652 -76347336 -78338946 -79878049 -80793393 -80952154 -80290104
38633h0290104J457040K127308K584020K774628K705607K444791K097831J771795
$$ -80290104 -78833064 -76705756 -74121736 -71347108 -68641501 -66196710 -64098879 -62327084
38625f2327084J546134J462268J528659J731043K040989K423549K845583L280074
$$ -62327084 -60780950 -59318682 -57790023 -56058980 -54017991 -51594442 -48748859 -45468785
38617d5468785L700016M066302M324720M420516M320038M021498L549439K942459
$$ -45468785 -41768769 -37702467 -33377747 -28957231 -24637193 -20615695 -17066256 -14123797
38609a4123797K244241J499250P50651L9880n92561j108030j475567j682097j741707
$$ -14123797 -11879556 -10380306 -9629655 -9589775 -10182336 -11290366 -12765933 -14448030 -16189737
38600a6189737j695781j598539j493191j394466j291102j165827j016347q61722
$$ -16189737 -17885518 -19484057 -20977248 -22371714 -23662816 -24828643 -25844990 -26706712
38592b6706712p30604o39880n78928n13165m07750k54333p8064Q2564K07010L08751
$$ -26706712 -27437316 -28077196 -28656124 -29169289 -29577039 -29831372 -29909436 -29826872 -29619862 -29311111
38582b9311111M19945N52472O66156O78172N18047J89328k13919n50431o99567
$$ -29311111 -28891166 -28338694 -27672538 -26994366 -26476319 -26286991 -26500910 -27051341 -27750908
38573b7750908o07319k94213J62517O57139J085751J370495J470369J381343J133220
$$ -27750908 -28358227 -28652440 -28489923 -27832784 -26747033 -25376538 -23906169 -22524826 -21391606
38564b1391606P81658L87901p180l92588p69337j124152j423481j631698j729045
$$ -21391606 -20609948 -20222047 -20229227 -20621815 -21391152 -22515304 -23938785 -25570483 -27299528
38555b7299528j707950j555240j246765p68360j47794N32773J159705J632273
$$ -27299528 -29007478 -30562718 -31809483 -32577843 -32725637 -32192864 -31033159 -29400886
38547b9400886J897372J953743J830067J558066J159491O52613P1122n19624j024865
$$ -29400886 -27503514 -25549771 -23719704 -22161638 -21002147 -20349534 -20278412 -20798036 -21822901
38538b1822901j346956j424207j258893r18092n09392j46282Q2561J33000J1474
$$ -21822901 -23169857 -24594064 -25852957 -26771049 -27280441 -27426723 -27344162 -27211162 -27199688
38529b7199688k33469n31210q12858j029338j158308j201143j175483j107826
$$ -27199688 -27433157 -27964367 -28777225 -29806563 -30964871 -32166014 -33341497 -34449323
38521c4449323j025921r48709q76307p88749o59506m77080k57909l8986J45022
$$ -34449323 -35475244 -36423953 -37300260 -38089009 -38748515 -39225595 -39483504 -39522490 -39377468
38512c9377468K84031M00767N42225P59607J084553J510179J985252K426153K743663
$$ -39377468 -39093437 -38692670 -38150445 -37390838 -36306285 -34796106 -32810854 -30384701 -27641038
38503b7641038K874254K802952K568282K247261J927354J678897J540637J521570
$$ -27641038 -24766784 -21963832 -19395550 -17148289 -15220935 -13542038 -12001401 -10479831
38495a0479831J610832J784394K004842K219330K361601K360044K152619J709031
$$ -10479831 -8868999 -7084605 -5079763 -2860433 -498832 1861212 4013831 5722862
38487E722862J053229K69707n17627j183611j632060j805244j683390j289205
$$ 5722862 6776091 7045798 6528171 5344560 3712500 1907256 223866 -1065339
38479a065339o93797p809O46249J164880J481041J567545J436141J135839P44804
$$ -1065339 -1759136 -1766945 -1120696 44184 1525225 3092770 4528911 5664750 6409554
38470F409554L51769L2792j66282k37059k08875j45174j31601k49274n37782r67723
$$ 6409554 6761323 6794115 6627833 6390774 6181899 6036725 5905124 5655850 5118068 4150345
38460D150345j443545j839413k049172k024108j781659j384977r08069m08185
$$ 4150345 2706800 867387 -1181785 -3205893 -4987552 -6372529 -7280598 -7688783
38452g688783P9514N27924R02478J160208J264496J204187J004402P21933M24914
$$ -7688783 -7609269 -7081345 -6178867 -5018659 -3754163 -2549976 -1545574 -823641 -398727
38443c98727J64888m4133k27663m34275p11835j087705j557928k087252k620863
$$ -398727 -233839 -277972 -505635 -939910 -1651745 -2739450 -4297378 -6384630 -9005493
38434i005493l103220l491675l753896l853126l740805l374239k755030j960323
$$ -9005493 -12108713 -15600388 -19354284 -23207410 -26948215 -30322454 -33077484 -35037807
38426c5037807j136541m49916k0314J22771M0414j51200l27068l90578k94723
$$ -35037807 -36174348 -36624264 -36644578 -36521807 -36481393 -36632593 -36959661 -37350239 -37644962
38417c7644962m6060L09585P14989J127466J525741J896138K215053K445923K552069
$$ -37644962 -37691022 -37381437 -36666448 -35538982 -34013241 -32117103 -29902050 -27456127 -24904058
38408b4904058K511889K325231K012774J616412J201843Q53798O52998O37267
$$ -24904058 -22392169 -20066938 -18054164 -16437752 -15235909 -14382111 -13729113 -13091846
38400a3091846P69413R41638J024989R34169O60704K54890k15880o89677j103766
$$ -13091846 -12322433 -11380795 -10355806 -9421637 -8760933 -8506043 -8721923 -9411600 -10515366
38391a0515366j388895j490646j405866j197516r69048q15732p85584q68585j011707
$$ -10515366 -11904261 -13394907 -14800773 -15998289 -16967337 -17783069 -18568653 -19437238 -20448945
38382b0448945j146599j215967j188436j059311q43201n65738k55825O2489L74153
$$ -20448945 -21595544 -22811511 -23999947 -25059258 -25902459 -26468197 -26724022 -26661533 -26287380
38373b6287380O67494R23655J115084J218327J227573J153054J007649Q00319
$$ -26287380 -25619886 -24696231 -23581147 -22362820 -21135247 -19982193 -18974544 -18174225
38365a8174225N45414K76548M9015p2395l3216J89196N68146J025375J453954
$$ -18174225 -17628811 -17352263 -17303248 -17375643 -17408859 -17219663 -16651517 -15626142 -14172188
38356a4172188J759376J895520J875563J756953J612943J502948J450421J436427
$$ -14172188 -12412812 -10517292 -8641729 -6884776 -5271833 -3768885 -2318464 -882037
38348h82037J412535J324586J131323Q10111L56651k10939q44156j462724j968495
$$ -882037 530498 1855084 2986407 3796518 4153169 3942230 3098074 1635350 -333145
38339c33145k273949k335710k178066j890897j596076j394765j322712j338634
$$ -333145 -2607094 -4942804 -7120870 -9011767 -10607843 -12002608 -13325320 -14663954
38331a4663954j352594j278595j081154p88430m66696j79146L8799J76055K31308
$$ -14663954 -16016548 -17295143 -18376297 -19164727 -19631423 -19810569 -19771770 -19595715 -19364407
38322a9364407K09654J32423M3500j307M1521J80175L80531N82110P30045Q03067
$$ -19364407 -19154753 -19022330 -18978830 -18980137 -18938616 -18758441 -18377910 -17795800 -17065755 -16262688
38312a6262688Q18432Q12722Q15158Q29827Q31059P70198N94279K73270j79219
$$ -16262688 -15444256 -14631534 -13816376 -12986549 -12155490 -11385292 -10791013 -10517743 -10696962
38303a0696962p08898j246315j732328k122252k372420k434190k272908j899998
$$ -10696962 -11405860 -12652175 -14384503 -16506755 -18879175 -21313365 -23586273 -25486271
38295b5486271j387515q47683l90310q6093M8182M4839l2711j18255j72964j99323
$$ -25486271 -26873786 -27721469 -28111779 -28197872 -28149690 -28104851 -28137562 -28255817 -28428781 -28628104
38285b8628104k26525k77812l46053l94984l81331k79748r5261J42085L96512
$$ -28628104 -28854629 -29132441 -29478494 -29873478 -30254809 -30534557 -30629818 -30487733 -30091221
38276c0091221O48901R08510J205369J567549K000115K482859K987996L498709
$$ -30091221 -29442320 -28533810 -27328441 -25760892 -23760777 -21277918 -18289922 -14791213
38268a4791213M006478M486802M878623N093213N051549M723622M143729L396493
$$ -14791213 -10784735 -6297933 -1419310 3673903 8725452 13449074 17592803 20989296
38260B0989296K585933J803473J107220N20614N1241k81941m34368l50913m866
$$ 20989296 23575229 25378702 26485922 27006536 27057777 26775836 26341468 25990555 25985689
38251B5985689N66073J254825J916494K416331K667676K645905K378734J921192
$$ 25985689 26551762 27806587 29723081 32139412 34807088 37452993 39831727 41752919
38243D1752919J329380O49722p0760p68517j364982j790323k010220k034051j901490
$$ 41752919 43082299 43732021 43661261 42892744 41527762 39737439 37727219 35693168 33791678
38234C3791678j660709j352380j005985o46865l05260j6795J87544K91612K93199
$$ 33791678 32130969 30778589 29772604 29125739 28820479 28803684 28991228 29282840 29576039
38225B9576039J93082j3538l32342p52020j225297j666775j978410k092206k001073
$$ 29576039 29769121 29755583 29423241 28671221 27445924 25779149 23800739 21708533 19707460
38216A9707460j755079j429333j090586p82091n24641l23042j73717p4516l4147
$$ 19707460 17952381 16523048 15432462 14650371 14125730 13802688 13628971 13554455 13520308
38207A3520308p4832k24385m99979q91320j353580j816786k207549k470243k577929
$$ 13520308 13445476 13221091 12721112 11829792 10476212 8659426 6451877 3981634 1403705
38198A403705k533771k367913k130504j878807j659875j494176j365938j226252
$$ 1403705 -1130066 -3497979 -5628483 -7507290 -9167165 -10661341 -12027279 -13253531
38190a3253531j013939o89657k64426J98016O07803Q86867R97349R50683P97029
$$ -13253531 -14267470 -14957127 -15221553 -15023537 -14415734 -13528867 -12531518 -11580835 -10783806
38181a0783806N99656M06303K35969R0891j8922o4568j3368J43716L78610O38849
$$ -10783806 -10184150 -9777847 -9541878 -9450987 -9469909 -9534477 -9547845 -9404129 -9025519 -8386670
38171h386670Q74290J054568J165889J197220J135927R81081P61694N38909L84173
$$ -8386670 -7512380 -6457812 -5291923 -4094703 -2958776 -1977695 -1216001 -677092 -292919
38162b92919L45732M24588N73724P19737P93647P53022N84013K88372j25979o36821
$$ -292919 52813 477401 1051125 1770862 2564509 3317531 3901544 4189916 4063937 3427116
38152C427116j189132j689176k025775k109558j906779j451579q35355j79003
$$ 3427116 2237984 548808 -1476967 -3586525 -5493304 -6944883 -7780238 -7959241
38144g959241M05150Q49219J145119J329433J450069J540504J616144J683497
$$ -7959241 -7554091 -6704872 -5559753 -4230320 -2780251 -1239747 376397 2059894
38136B059894J743633J784796J777002J682926J482784J193205Q59641N22969
$$ 2059894 3803527 5588323 7365325 9048251 10531035 11724240 12583881 13106850
38128A3106850J86305j87759o44834j198090j811518k415506k937547l327246
$$ 13106850 13293155 13105396 12460562 11262472 9450954 7035448 4097901 770655
38120G70655l567003l669290l662702l570625l391335l091548k621581j949820
$$ 770655 -2796348 -6465638 -10128340 -13698965 -17090300 -20181848 -22803429 -24753249
38112b4753249j100664j71729O86556J322951J642235J638881J395380J049284
$$ -24753249 -25853913 -26025642 -25339086 -24016135 -22373900 -20735019 -19339639 -18290355
38104a8290355P42474N72596N68379O99057R06766J138376J361223J563531J747133
$$ -18290355 -17547881 -16975285 -16406906 -15707849 -14801083 -13662707 -12301484 -10737953 -8990820
38095h990820J916210K063014K155076K132201J919463J454686P19234k44243
$$ -8990820 -7074610 -5011596 -2856520 -724319 1195144 2649830 3369064 3124821
38087C124821j338425k438537l423686m198108m701584m915811m866293m610373
$$ 3124821 1786396 -652141 -4075827 -8273935 -12975519 -17891330 -22757623 -27367996
38079b7367996m208867l698108l086317k378396j604610q23702r7041N41006J090334
$$ -27367996 -31576863 -35274971 -38361288 -40739684 -42344294 -43167996 -43265037 -42724031 -41633697
38070d1633697J566846J975660K294098K473049K455611K204051J720490J049401
$$ -41633697 -40066851 -38091191 -35797093 -33324044 -30868433 -28664382 -26943892 -25894491
38062b5894491K62417n62700j356484k060785k623686k994768l130569l013117
$$ -25894491 -25632074 -26194774 -27551258 -29612043 -32235729 -35230497 -38361066 -41374183
38054d1374183k670489k180487j648224j168525p95171n32179l46036j86150r12
$$ -41374183 -44044672 -46225159 -47873383 -49041908 -49837079 -50369258 -50715294 -50901444 -50902356
38045e0902356K53709O06591J059480J576657K089020K516008K792665K886387
$$ -50902356 -50648647 -50042056 -48982576 -47405919 -45316899 -42800891 -40008226 -37121839
38037c7121839K800900K574965K277382J990285J778692J662454J613550J583332
$$ -37121839 -34320939 -31745974 -29468592 -27478307 -25699615 -24037161 -22423611 -20840279
38029b0840279J537106J466852J375549J254452J078496Q23402M87276R9325k88405
$$ -20840279 -19303173 -17836321 -16460772 -15206320 -14127824 -13304422 -12817146 -12717821 -13006226
38020a3006226o20727q61446j006281j077007j101049j094865j064176j012750
$$ -13006226 -13626953 -14488399 -15494680 -16571687 -17672736 -18767601 -19831777 -20844527
38012b0844527r42050q39623o72221l95422K6739O04872J313725K086774K820789
$$ -20844527 -21786577 -22626200 -23298421 -23693843 -23667104 -23062232 -21748507 -19661733 -16840944
38003a6840944L397492L717348L728143L434504K889003K174107J382707O01947
$$ -16840944 -13443452 -9726104 -5997961 -2563457 325546 2499653 3882360 4484307
37995D484307r5939o56012j042676j247183j295700j245399j163049j096294j055188
$$ 4484307 4388368 3732356 2689680 1442497 146797 -1098602 -2261651 -3357945 -4413133
37986d413133j014387r34307p91017n99173m11785k92659k80062l71172n38549
$$ -4413133 -5427520 -6361827 -7152844 -7752017 -8163802 -8456461 -8736523 -9107695 -9646244
37977i646244p58369j021114j318420j625343j897304k083088k144394k073511
$$ -9646244 -10404613 -11425727 -12744147 -14369490 -16266794 -18349882 -20494276 -22567787
37969b2567787j900984j684522j480775j319141j198293j104064j026369r58588
$$ -22567787 -24468771 -26153293 -27634068 -28953209 -30151502 -31255566 -32281935 -33240523
37961c3240523q86176p83259o25234m07968j57637P7828K52290L46354L79379
$$ -33240523 -34126699 -34909958 -35535192 -35943160 -36100797 -36022969 -35770679 -35424325 -35044946
37952c5044946M03214M82401O68149R72992J357381J741817K044382K220510K276566
$$ -35044946 -34641732 -34159331 -33491182 -32518190 -31160809 -29418992 -27374610 -25154100 -22877534
37943b2877534K251403K186078K103579K003981J870287J681826J430549J128308
$$ -22877534 -20626131 -18440053 -16336474 -14332493 -12462206 -10780380 -9349831 -8221523
37935h221523P96141M43802N9484l80667q93529j477014k110510k761098l387678
$$ -8221523 -7425382 -6981580 -6922096 -7302763 -8196292 -9673306 -11783816 -14544914 -17932592
37926a7932592l942060m372109m631821m696535m573748m300211l926224l497635
$$ -17932592 -21874652 -26246761 -30878582 -35575117 -40148865 -44449076 -48375300 -51872935
37918e1872935l044466k576225k081379j534435r16055k40961M25587R81424J330097
$$ -51872935 -54917401 -57493626 -59575005 -61109440 -62025495 -62266456 -61840869 -60859445 -59529348
37909e9529348J427372J300419J027754O97479L75232R9654j03408k10505k06326
$$ -59529348 -58101976 -56801557 -55773803 -55076324 -54701092 -54601438 -54704846 -54915351 -55121677
37900e5121677r7037Q6410L01593N13317P01628Q55905R66296J022234J014709
$$ -55121677 -55218714 -55132304 -54830711 -54317394 -53615766 -52759861 -51793565 -50771331 -49756622
37891d9756622R33707P62258M77997O7662m53283j028397j563050j944821k078719
$$ -49756622 -48822915 -48060657 -47582660 -47514998 -47968281 -48996678 -50559728 -52504549 -54583268
37882e4583268j924132j512690r35600l09539K60026P07401J023807J255905J477802
$$ -54583268 -56507400 -58020090 -58955690 -59265229 -59005203 -58297802 -57273995 -56018090 -54540288
37873e4540288J744575K052598K329120K455287K313781J846275J096289K06902
$$ -54540288 -52795713 -50743115 -48413995 -45958708 -43644927 -41798652 -40702363 -40495461
37865d0495461o36713j287475j684467j841524j801088j601114j277876q86502
$$ -40495461 -41132174 -42419649 -44104116 -45945640 -47746728 -49347842 -50625718 -51512220
37857e1512220n06778k22491r1733j33528l38595o89271j168527j752000k392997
$$ -51512220 -52018998 -52241489 -52333222 -52466750 -52805345 -53494616 -54663143 -56415143 -58808140
37848e8808140l013491l507615l759405l674390l217928k442343j483161n20656
$$ -58808140 -61821631 -65329246 -69088651 -72763041 -75980969 -78423312 -79906473 -80427129
37840h0427129K74329P82863R54516Q03845L99314j51332p23218j203081j513431
$$ -80427129 -80152800 -79369937 -78415421 -77611576 -77212262 -77363594 -78086812 -79289893 -80803324
37831h0803324j620591j526705j255766q42169l23903K59283Q61370J422228J866911
$$ -80803324 -82423915 -83950620 -85206386 -86048555 -86372458 -86113175 -85251805 -83829577 -81962666
37822h1962666K120813K135885J911651J498678R85743M78645P4567j66101k40021
$$ -81962666 -79841853 -77705968 -75794317 -74295639 -73309896 -72831251 -72756684 -72922785 -73162806
37813g3162806j96257j02476l396R7471K22778L93270O12936Q72329J155544J439860
$$ -73162806 -73359063 -73461539 -73464935 -73367464 -73144686 -72751416 -72138480 -71266151 -70110607 -68670747
37803f8670747J692656J875788J959938J942249J856323J764369J730608J791697
$$ -68670747 -66978091 -65102303 -63142365 -61200116 -59343793 -57579424 -55848816 -54057119
37795e4057119J946661K170388K428176K670548K820336K785173K504699J998668
$$ -54057119 -52110458 -49940070 -47511894 -44841346 -42021010 -39235837 -36731138 -34732470
37787c4732470J372802P74907L32841J11106J01025K39342M42599O41890Q01628
$$ -34732470 -33359668 -32584761 -32251920 -32140814 -32039789 -31800447 -31357848 -30715958 -29914330
37778b9914330R13727R75432R71023Q72209O53904L09783j43045o67412j210393
$$ -29914330 -29000603 -28025171 -27054148 -26181939 -25528035 -25218252 -25361297 -26028709 -27239102
37769b7239102j709829k109642k380760k531766k597515k613572k596501k542139
$$ -27239102 -28948931 -31058573 -33439333 -35971099 -38568614 -41182186 -43778687 -46320826
37761d6320826k437846k277698k072471j850604j649516j500554j414523j374553
$$ -46320826 -48758672 -51036370 -53108841 -54959445 -56608961 -58109515 -59524038 -60898591
37753f0898591j340442j264031j108397q58872n20053j06696L58970Q43379J302668
$$ -60898591 -62239033 -63503064 -64611461 -65470333 -65990386 -66097082 -65738112 -64894733 -63592065
37744f3592065J693573J984590K158184K208314K141259J975872J733878J424042
$$ -63592065 -61898492 -59913902 -57755718 -55547404 -53406145 -51430273 -49696395 -48272353
37736d8272353J037182N60486o07o10965j210173j726120k091807k263869k238486
$$ -48272353 -47235171 -46674685 -46675292 -47286257 -48496430 -50222550 -52314357 -54578226 -56816712
37727e6816712k055328j784239j501644j270647j133184j111337j210362j420190
$$ -56816712 -58872040 -60656279 -62157923 -63428570 -64561754 -65673091 -66883453 -68303643
37719f8303643j716830k064450k416169k713207k886479k866184k600486k077224
$$ -68303643 -70020473 -72084923 -74501092 -77214299 -80100778 -82966962 -85567448 -87644672
37711h7644672j337274m68634M20377J236003J921718K457136K840491L073503
$$ -87644672 -88981946 -89450580 -89030203 -87794200 -85872482 -83415346 -80574855 -77501352
37703g7501352L162012L129068L023657K909090K832107K794420K751962K645890
$$ -77501352 -74339340 -71210272 -68186615 -65277525 -62445418 -59650998 -56899036 -54253146
37695e4253146K442805K156570J842113J570401J399236J352948J421041J575064
$$ -54253146 -51810341 -49653771 -47811658 -46241257 -44842021 -43489073 -42068032 -40492968
37687d0492968J786898K030288K269206K456066K552461K556199K507916K470588
$$ -40492968 -38706070 -36675782 -34406576 -31950510 -29398049 -26841850 -24333934 -21863346
37679b1863346K499608K623431K839175L115007L392515L591822L627745L438713
$$ -21863346 -19363738 -16740307 -13901132 -10786125 -7393610 -3801788 -174043 3264670
37671C264670L015267K408294J709743J019048M14918n9066l97075o22930p71383
$$ 3264670 6279937 8688231 10397974 11417022 11831940 11772874 11375799 10752869 9981486
37662I981486q67513r19797r32375r23758r34661j020003j231965j600812k117268
$$ 9981486 9113973 8194176 7261801 6338043 5403382 4383379 3151414 1550602 -566666
37653e66666k724084l327473l828415m155383m276182m186588l896506l432805
$$ -566666 -3290750 -6618223 -10446638 -14602021 -18878203 -23064791 -26961297 -30394102
37645c0394102k851994k238203j676362j220485q84003o54217n08211m13572l23188
$$ -30394102 -33246096 -35484299 -37160661 -38381146 -39265149 -39919366 -40427577 -40841149 -41164337
37636d1164337j84439L3195L10441N73975P25762O95609M89316K00893k4203n4699
$$ -41164337 -41348776 -41315581 -41005140 -40431165 -39705403 -39009794 -38520478 -38319585 -38343788 -38398487
37626c8398487J72090O34133J242767J874088K400353K719631K780383K590973
$$ -38398487 -38226397 -37592264 -36349497 -34475409 -32075056 -29355425 -26575042 -23984069
37618b3984069K208195J711584J177912O67421K25152j08964k95246l05569j44053
$$ -23984069 -21775874 -20064290 -18886378 -18218957 -17993805 -18102769 -18398015 -18703584 -18847637
37609a8847637J45322M98226Q62766J216400J554626J867748K129703K305480
$$ -18847637 -18702315 -18204089 -17341323 -16124923 -14570297 -12702549 -10572846 -8267366
37601h267366K365127K291125K076510J719618J222551N96577j28619r00347j650332
$$ -8267366 -5902239 -3611114 -1534604 185014 1407565 2004142 1875523 975176 -675156
37592f75156k313086k844969l232050l482368l609063l616751l499786l250999
$$ -675156 -2988242 -5833211 -9065261 -12547629 -16156692 -19773443 -23273229 -26524228
37584b6524228k872945k385735j830869j270128p74464m00491j64004k8911P7290
$$ -26524228 -29397173 -31782908 -33613777 -34883905 -35658369 -36058860 -36222864 -36251775 -36174485
37575c6174485K29926M77624Q33569J284723J802006K339441K828768L186510
$$ -36174485 -35944559 -35466935 -34633366 -33348643 -31546637 -29207196 -26378428 -23191918
37567b3191918L339849L256603K957064K500445J959882J405444R01240N07038
$$ -23191918 -19852069 -16595466 -13638402 -11137957 -9178075 -7772631 -6871391 -6364353
37559f364353K72439K22333L44087N88771Q89799J189367J456135J682812J867364
$$ -6364353 -6091914 -5869581 -5525494 -4936723 -4046924 -2857557 -1401422 281390 2148754
37550B148754J994742K035241J960755J765257J474259J138367Q16182N54768
$$ 2148754 4143496 6178737 8139492 9904749 11379008 12517375 13333557 13888325
37542A3888325L75602K73684K32762K48337L41279N50216R08340J424127K082192
$$ 13888325 14263927 14537611 14770373 15018710 15359989 15910205 16818545 18242672 20324864
37533B0324864K862586L760525M789508N967749P303278Q790125J0413091J2151634
$$ 20324864 23187450 26947975 31737483 37705232 45008510 53798635 64211726 76363360
37525G6363360J3981292J5878864J7832565J9848675K1944902K4126536K6347080
$$ 76363360 90344652 106223516 124056081 143904756 165849658 189976194 216323274
37518B16323274K8461683L0190876L1115660L0719056K8484808K4059767J7454090
$$ 216323274 244784957 274975833 306091493 336810549 365295357 389355124 406809214
37511D06809214R186921K51131q151339j4992405j9711166k2277720k3053169
$$ 406809214 415996135 416247266 408095927 393103522 373392356 351114636 328061467
37504C28061467k2577416k1394667j9947751j8528809j7275462j6205197j5270153
$$ 328061467 305484051 284089384 264141633 245612824 228337362 212132165 196862012
37497A96862012j4409702j3588005j2811882j2122806j1560792j1118280j0719941
$$ 196862012 182452310 168864305 156052423 143929617 132368825 121250545 110530604
37490A10530604j0251463r620544q805053p857004o870466n944636n161435m574380
$$ 110530604 100279141 90658597 81853544 73996540 67126074 61181438 56020003 51445623
37482E1445623m200557m017860l973456m001166m039318m044267l999706l919617
$$ 51445623 47245066 43227206 39253750 35252584 31213266 27168999 23169293 19249676
37474A9249676l839687l796054l799808l820983l792688l635832l293710k759638
$$ 19249676 15409989 11613935 7814127 3993144 200456 -3435376 -6729086 -9488724
37466i488724k083991j357049o75843j12020L01690N60509O65517O12884M04507
$$ -9488724 -11572715 -12929764 -13605607 -13717627 -13415937 -12855428 -12189911 -11577027 -11172520
37457a1172520O8301l31867p05726r60837j031359r00211o02891k07623K17795
$$ -11172520 -11104219 -11436086 -12141812 -13102649 -14134008 -15034219 -15637110 -15844733 -15626938
37448a5626938O31371J021255J393603J757484K114729K454059K747124K947705
$$ -15626938 -14995567 -13974312 -12580709 -10823225 -8708496 -6254437 -3507313 -559608
37440e59608K998898K852546K497934J984755J420440R35129O31510N48866O58629
$$ -559608 2439290 5291836 7789770 9774525 11194965 12130094 12761604 13310470 13969099
37431A3969099Q85961J140453J343384J446328J437739J335885J173492R84612
$$ 13969099 14855060 15995513 17338897 18785225 20222964 21558849 22732341 23716953
37423B3716953P99256O41656N25985M50473L96005L32772K33646Q9528q2656k50747
$$ 23716953 24516209 25157865 25683850 26134323 26530328 26863100 27096746 27186274 27103618 26852871
37413B6852871l96426n40092p34074j024057j411786j850370k269229k601574
$$ 26852871 26456445 25916353 25182279 24158222 22746436 20896066 18626837 16025263
37405A6025263k797962k830841k696851k413153k005868j500404r23026l07951
$$ 16025263 13227301 10396460 7699609 5286456 3280588 1780184 857158 549207
37397E49207L03194Q71849J373005J797673K147921K426908K624680K705766K611933
$$ 549207 852401 1724250 3097255 4894928 7042849 9469757 12094437 14800203 17412136
37388A7412136K287479J714040R28267P072r66024j923522k809625l563753m119921
$$ 17412136 19699615 21413655 22341922 22348994 21382970 19459448 16649823 13086070 8966149
37379H966149m431218m498700m376396m145353l874979l595880l295783k936035
$$ 8966149 4534931 36231 -4340165 -8485518 -12360497 -15956377 -19252160 -22188195
37371b2188195k478457j909128j246702n31706J93610Q99050J564852K168438
$$ -22188195 -24666652 -26575780 -27822482 -28354188 -28160578 -27261528 -25696676 -23528238
37363b3528238K671760L021751L169947L104733K875285K583544K339610K206149
$$ -23528238 -20856478 -17834727 -14664780 -11560047 -8684762 -6101218 -3761608 -1555459
37355a555459K170490K163192K106262J955808J716263J428675J149414R31473
$$ -1555459 615031 2778223 4884485 6840293 8556556 9985231 11134645 12066118
37347A2066118Q10848P96397Q64098R59568J011914R57306P64755M52668Q5938
$$ 12066118 12876966 13673363 14537461 15497029 16508943 17466249 18231004 18683672 18769610
37338A8769610k48921m80570n81650n72187m97020l95501k85164j66090l5517
$$ 18769610 18520689 18040119 17458469 16886282 16389262 15993761 15708597 15542507 15506990
37329A5506990J01241K28763L25944L73586L62032K94123J80636L2990j38372
$$ 15506990 15608231 15836994 16162938 16536524 16898556 17192679 17373315 17406305 17267933
37320A7267933l19321m91159o40857p74012r13298j077554j257880j412470j485463
$$ 17267933 16948612 16457453 15816596 15042584 14129286 13051732 11793852 10381382 8895919
37311H895919j435498j256016r79795o70699m08319k69948l12656n57122r75675
$$ 8895919 7460421 6204405 5224610 4553911 4145592 3875644 3562988 3005866 2030191
37302B030191j490584j989987k361427k530452k485869k279626k001490j738467
$$ 2030191 539607 -1450380 -3811807 -6342259 -8828128 -11107754 -13109244 -14847711
37294a4847711j535739j378572j207624r61014o17672k14138J75296M81184O76607
$$ -14847711 -16383450 -17762022 -18969646 -19930660 -20548332 -20762470 -20587174 -20105990 -19429383
37285a9429383P86726Q65613R56910J064928J155060J182063J125771J008739
$$ -19429383 -18642657 -17777044 -16820134 -15755206 -14600146 -13418083 -12292312 -11283573
37277a1283573Q83118P96725P64177P64487P65122P52583P47275P94298R38010
$$ -11283573 -10400455 -9603730 -8839553 -8075066 -7309944 -6557361 -5810086 -5015788 -4077778
37268d077778J196036J545557J925388K249007K422954K369056K048006J473941
$$ -4077778 -2881742 -1336185 589203 2838210 5261164 7630220 9678226 11152167
37260A1152167P08082j66512j070084j934081k694512l287750l659201l779859
$$ 11152167 11860249 11693737 10623653 8689572 5995060 2707310 -951891 -4731750
37252d731750l659954l352832k944901k528843k166285j859860j555633j177086
$$ -4731750 -8391704 -11744536 -14689437 -17218280 -19384565 -21244425 -22800058 -23977144
37244b3977144o68148j8894P35149J530442K295734K966512L490394L825647L942340
$$ -23977144 -24645292 -24664186 -23929037 -22398595 -20102861 -17136349 -13645955 -9820308 -5877968
37235e877968L835029L540162L136655K718098K354276K071749J861525J694956
$$ -5877968 -2042939 1497223 4633878 7351976 9706252 11778001 13639526 15334482
37227A5334482J531733J326554J046810O94380L10763m2810l16034m89546n73752
$$ 15334482 16866215 18192769 19239579 19933959 20244722 20201912 19885878 19396332 18822580
37218A8822580n91272n58101m78769l58214k15982q6376m977L794o9736k18904
$$ 18822580 18231308 17673207 17194438 16836224 16620242 16533866 16528889 16532683 16462947 16244043
37208A6244043m15645o10965p52010q09166p91859p39545o96055o87165p14351
$$ 16244043 15828398 15217433 14465423 13656257 12864398 12124853 11428798 10741633 10027282
37199A0027282p62972q15120q59881q99464r50893j040413j189575j399869j646720
$$ 10027282 9264310 8449190 7589309 6689845 5738952 4698539 3508964 2109095 462375
37190D62375j886359k068400k146268k084906j867594j498866j000163m02645
$$ 462375 -1423984 -3492384 -5638652 -7723558 -9591152 -11090018 -12090181 -12492826
37182a2492826K54094R16483J513893J966250K200616K168542J857715J295217
$$ -12492826 -12238732 -11322249 -9808356 -7842106 -5641490 -3472948 -1615233 -320016
37174c20016N42122l18289j193467j990660k621853l008863l093305k851464k306956
$$ -320016 222106 -96183 -1289650 -3280310 -5902163 -8911026 -12004331 -14855795 -17162751
37165a7162751j530358o20415L25491J234407K061414K775180L338827L701054
$$ -17162751 -18693109 -19313524 -18988033 -17753626 -15692212 -12917032 -9578205 -5877151
37157e877151L805402L614344L133882K421496J571302O87162j39723q42301j382901
$$ -5877151 -2071749 1542595 4676477 7097973 8669275 9356437 9216714 8374413 6991512
37148F991512j755476j981238k096228k137953k138530k122534k103323k078402
$$ 6991512 5236036 3254798 1158570 -979383 -3117913 -5240447 -7343770 -9422172
37140i422172k030553j936883j780773j561554j299217j029230p83867n70019
$$ -9422172 -11452725 -13389608 -15170381 -16731935 -18031152 -19060382 -19844249 -20414268
37132b0414268l65806j46204Q2592K74388L71575L47680K29390Q3749j7177l0817
$$ -20414268 -20780074 -20926278 -20843686 -20569298 -20197723 -19850043 -19620653 -19536904 -19554081 -19584898
37122a9584898L9539J51106K44510K71947K19758J16305J9135j5459L6927J60222
$$ -19584898 -19545359 -19394253 -19149743 -18877796 -18658038 -18541733 -18522598 -18538057 -18501130 -18340908
37112a8340908L17282M77658O26820P50938Q18520P84787O22329L55144O7388
$$ -18340908 -18023626 -17545968 -16919148 -16168210 -15349690 -14564903 -13942574 -13587430 -13520042
37103a3520042j23256j12593J48190O33012J247224J856133K328764K582403K607303
$$ -13520042 -13643298 -13755891 -13607701 -12974689 -11727465 -9871332 -7542568 -4960165 -2352862
37094b352862K458713K223734J984475J794214J669300J592585J525433J425221
$$ -2352862 105851 2329585 4314060 6108274 7777574 9370159 10895592 12320813
37086A2320813J261241J021088P05891L20520j32139o47129j205161j761415k247206
$$ 12320813 13582054 14603142 15309033 15629553 15497414 14850285 13645124 11883709 9636503
37077I636503k589504k739879k695013k494596k197708j854166j489651j110919
$$ 9636503 7046999 4307120 1612107 -882489 -3080197 -4934363 -6424014 -7534933
37069g534933p20926l28254N5609M23841P74343J097377J359365J500141J455358
$$ -7534933 -8255859 -8584113 -8528504 -8104663 -7330320 -6232943 -4873578 -3373437 -1918079
37060a918079J195828P56207K28327k77360o71380q98578r28631p48661l71148
$$ -1918079 -722251 33956 262283 -15077 -686457 -1585035 -2513666 -3262327 -3633475
37051c633475J56769P61870J368441J915363K355513K650643K779578K756143
$$ -3633475 -3476706 -2714836 -1346395 568968 2924481 5575124 8354702 11110845
37043A1110845K634025K484235K356937K254284K131457J922509J574447J072500
$$ 11110845 13744870 16229105 18586042 20840326 22971783 24894292 26468739 27541239
37035B7541239M47045k37693r05582j491360j956573k294033k519250k652296
$$ 27541239 27988284 27750591 26845009 25353649 23397076 21103043 18583793 15931497
37027A5931497k699336k644397k457215k115620j633117j075101n46998j53254
$$ 15931497 13232161 10587764 8130549 6014929 4381812 3306711 2759713 2606459
37019B606459M9055O8861m0277k20577m36075o68982q97381j076655j140864j026804
$$ 2606459 2655514 2724375 2684098 2463521 2027446 1358464 461083 -615572 -1756436 -2783240
37009b783240p09103k24038L36576Q59808J251288J455997J455164J251634Q57050
$$ -2783240 -3492343 -3716381 -3379805 -2519997 -1268709 187288 1642452 2894086 3751136
37000C751136K86382m37454j267474k113803k843884l317734l445872l233053
$$ 3751136 4037518 3600064 2332590 218787 -2625097 -5942831 -9388703 -12621756
36992a2621756k777785k229949j734125j385886j213475j185432j237685j305844
$$ -12621756 -15399541 -17629490 -19363615 -20749501 -21962976 -23148408 -24386093 -25691937
36984b5691937j345021j329561j242380j070495q12553m88913j41150J82063M43089
$$ -25691937 -27036958 -28366519 -29608899 -30679394 -31491947 -31980860 -32122010 -31939947 -31496858
36975c1496858O23957P20155P27975O40542M59620K13897l4409k05132k31715
$$ -31496858 -30872901 -30152746 -29424771 -28784229 -28324609 -28110712 -28145121 -28350253 -28581968
36966b8581968r1024J85108N21949Q30072J035813J103073J042340R05612P65617
$$ -28581968 -28672992 -28487884 -27965935 -27135863 -26100050 -24996977 -23954637 -23049025 -22283408
36957b2283408O82927O77073P23226P81503Q38657R27690J105929J405927J797376
$$ -22283408 -21600481 -20923408 -20200182 -19418679 -18580022 -17652332 -16546403 -15140476 -13343100
36948a3343100K190671K479077K585268K477862K154930J622840Q98291L1176
$$ -13343100 -11152429 -8673352 -6088084 -3610222 -1455292 167548 1065839 1097015
36940A097015q80107j704328k319143k652141k697348k503328k147428j714612
$$ 1097015 216908 -1487420 -3806563 -6458704 -9156052 -11659380 -13806808 -15521420
36932a5521420j288906r51473p74276q05934j056725j491377k032281k572255
$$ -15521420 -16810326 -17761799 -18536075 -19342009 -20398734 -21890111 -23922392 -26494647
36924b6494647k997248l216658l189711k932472k501339j965734j387339q13010
$$ -26494647 -29491895 -32708553 -35898264 -38830736 -41332075 -43297809 -44685148 -45498158
36916d5498158k77403J91037N64953Q17460R27806Q90004P18171M46034J22652
$$ -45498158 -45775561 -45584524 -45019571 -44202111 -43274305 -42384301 -41666130 -41220096 -41097444
36907d1097444j95064m55064o25165o99615o89580o04815m43567j98773J29041
$$ -41097444 -41292508 -41747572 -42372737 -43072352 -43761932 -44366747 -44810314 -45009087 -44880046
36898d4880046N27264R77614J461815J956564K423223K808330L062501L165250
$$ -44880046 -44352782 -43375168 -41913353 -39956789 -37533566 -34725236 -31662735 -28497485
36890b8497485L133107L001459K795339K515053K147481J688940J157006N84042
$$ -28497485 -25364378 -22362919 -19567580 -17052527 -14905046 -13216106 -12059100 -11475058
36882a1475058M987n45568j027159j391688j596553j627774j516198j331526j152445
$$ -11475058 -11470071 -12015639 -13042798 -14434486 -16031039 -17658813 -19175011 -20506537 -21658982
36873b1658982j027642r51011q67763p08520m29991l7546M21909Q90370J333414
$$ -21658982 -22686624 -23637635 -24505398 -25213918 -25643909 -25681455 -25259546 -24369176 -23035762
36864b3035762J756862K191517K653231L107886L472424L655314L605553L332707
$$ -23035762 -21278900 -19087383 -16434152 -13326266 -9853842 -6198528 -2592975 739732
36856G39732K888265K331155J706275J044470L72065k82956q89208j409321j797381
$$ 739732 3627997 5959152 7665427 8709897 9081962 8799006 7909798 6500477 4703096
36847D703096k004259j994354j764819j353672q33140k96765J52635M18550M37146
$$ 4703096 2698837 704483 -1060336 -2414008 -3247148 -3543913 -3391278 -2972728 -2535582
36838b535582K07431j96910o50216j022384j221127j205680r75607n57013o43
$$ -2535582 -2328151 -2525061 -3175277 -4197661 -5418788 -6624468 -7600075 -8157088 -8157731
36829h157731O15563J195663J648979J912736J960273J796798J453627R84961
$$ -8157731 -7542168 -6346505 -4697526 -2784790 -824517 972281 2425908 3410869
36821C410869M61150m7260m91261q60228j182243j501747j841100k167754k392593
$$ 3410869 3872019 3824759 3333498 2473270 1291027 -210720 -2051820 -4219574 -6612167
36812f612167k407095k139567j597161q70870j02876N66619J048259J325921J444339
$$ -6612167 -9019262 -11158829 -12755990 -13626860 -13729736 -13163117 -12114858 -10788937 -9344598
36803i344598J473969J476478J487148J513819J543312J549746J503928J382302
$$ -9344598 -7870629 -6394151 -4907003 -3393184 -1849872 -300126 1203802 2586104
36795B586104J172399Q74197M99283O8955l88634q40343j247414j565769j753144
$$ 2586104 3758503 4632700 5131983 5200938 4812304 3971961 2724547 1158778 -594366
36786e94366j782540j654287j401115j086634p95371o07658n62817o35595p52723
$$ -594366 -2376906 -4031193 -5432308 -6518942 -7314313 -7921971 -8484788 -9120383 -9873106
36777i873106q44400q90319r23452r94909j135141j340610j586141j844379k096037
$$ -9873106 -10717506 -11607825 -12531277 -13526186 -14661327 -16001937 -17588078 -19432457 -21528494
36768b1528494k326680k515863k629301k622892k457929k116372j603820r39151
$$ -21528494 -23855174 -26371037 -29000338 -31623230 -34081159 -36197531 -37801351 -38740502
36760c8740502j43899P53037J694798K580040L274941L657275L667513L334051
$$ -38740502 -38884401 -38131364 -36436566 -33856526 -30581585 -26924310 -23256797 -19922746
36752a9922746K759591K081990J432272R04826N44826L52542L00709L57252N04645
$$ -19922746 -17163155 -15081165 -13648893 -12744067 -12199241 -11846699 -11545990 -11188738 -10684093
36743a0684093P48909J113648J618352K248571K934654L556060L975603M089548
$$ -10684093 -9935184 -8821536 -7203184 -4954613 -2019959 1536101 5511704 9601252
36735I601252L867835L362679K682361J947873J256817O67108J96368j71345m72642
$$ 9601252 13469087 16831766 19514127 21462000 22718817 23385925 23582293 23410948 22938306
36726B2938306p44334j003083j240017j435958j583451j693941j782582j845006
$$ 22938306 22193972 21190889 19950872 18514914 16931463 15237522 13454940 11609934
36718A1609934j847758j741259j486011j075759n46966K7380N56175R54077J162564
$$ 11609934 9762176 8020917 6534906 5459147 4912181 4939561 5495736 6449813 7612377
36709G612377J162300R75917O62737L05673q521k09855k59366j55208O6642L37287
$$ 7612377 8774677 9750594 10413331 10719004 10710483 10500628 10241262 10086054 10152696 10489983
36699A0489983N69999O85532O37690M26121R0958l06181p05432j066346j373337
$$ 10489983 11059982 11745514 12383204 12809325 12900283 12594102 11888670 10822324 9448987
36690I448987j629629j847261k039237k213137k363867k469918k500439k432491
$$ 9448987 7819358 5972097 3932860 1719723 -644144 -3114062 -5614501 -8046992
36682h046992k267513k036032j788676j578741j443336j390193j396296j418591
$$ -8046992 -10314505 -12350537 -14139213 -15717954 -17161290 -18551483 -19947779 -21366370
36674b1366370j408720j322325j122449p85535l15506K41573P97884J247095J501354
$$ -21366370 -22775090 -24097415 -25219864 -26005399 -26320905 -26079332 -25281448 -24034353 -22532999
36665b2532999J522618J333569J005807O32675K97981N2762r0842j48705j47626
$$ -22532999 -21010381 -19676812 -18671005 -18038330 -17740349 -17687587 -17778429 -17927134 -18074760
36656a8074760j14570p5575n7419q5184j76870l41403n81977q98618j282655j705076
$$ -18074760 -18189330 -18264905 -18322324 -18407508 -18584378 -18925781 -19507758 -20406376 -21689031 -23394107
36646b3394107k110428k426155k583934k539806k283943j841547j269150o45426
$$ -23394107 -25504535 -27930690 -30514624 -33054430 -35338373 -37179920 -38449070 -39094496
36638c9094496n4479M34041P79615R76208J049334J046031J019308J013137J054535
$$ -39094496 -39148975 -38714934 -37935319 -36959111 -35909777 -34863746 -33844438 -32831301 -31776766
36629c1776766J150492J281571J393969J406305J242025Q71877L34072k84611
$$ -31776766 -30626274 -29344703 -27950734 -26544429 -25302404 -24430527 -24096455 -24381066
36621b4381066q90164j412934j812495k064781k151098k059666j796143j392067
$$ -24381066 -25271230 -26684164 -28496659 -30561440 -32712538 -34772204 -36568347 -37960414
36613c7960414r01829l86572J05956N51303R41562J272300J539912J751343J928878
$$ -37960414 -38862243 -39248815 -39142859 -38591556 -37649994 -36377694 -34837782 -33086439 -31157561
36604c1157561K095775K253477K375976K429928K400225K296015K136129J933809
$$ -31157561 -29061786 -26808309 -24432333 -22002405 -19602180 -17306165 -15170036 -13236227
36596a3236227J694927J424208J126826Q03403M47181N0558l80880q15092j190797
$$ -13236227 -11541300 -10117092 -8990266 -8186863 -7739682 -7689124 -8070004 -8885096 -10075893
36587a0075893j432258j480031j322742j008747o28286k78958l8249M4693n4242
$$ -10075893 -11508151 -12988182 -14310924 -15319671 -15947957 -16226915 -16265164 -16220471 -16274713
36578a6274713l34414p62819j266370j735987k049756k111587j888495j423973
$$ -16274713 -16609127 -17371946 -18638316 -20374303 -22424059 -24535646 -26424141 -27848114
36570b7848114q17454j84151L78196Q01626J047225J105637J000722P85736N23937
$$ -27848114 -28665568 -28849719 -28471523 -27669897 -26622672 -25517035 -24516313 -23730577 -23206640
36561b3206640K59916Q6k80948o09084r77545j340422j640094j844315j959690
$$ -23206640 -22946724 -22946638 -23227586 -23836670 -24814215 -26154637 -27794731 -29639046 -31598736
36552c1598736k012113k016526j965573j844936j657993j437627j237226j108007
$$ -31598736 -33610849 -35627375 -37592948 -39437884 -41095877 -42533504 -43770730 -44878737
36544d4878737j075078j122813j196658j222167j132332q89524m94558J4977N73749
$$ -44878737 -45953815 -47076628 -48273286 -49495453 -50627785 -51517309 -52011867 -51996890 -51423141
36535e1423141J106381J551901J882370K101944K228461K274399K240223K118232
$$ -51423141 -50316760 -48764859 -46882489 -44780545 -42552084 -40277685 -38037462 -35919230
36527c5919230J898967J577048J156295O51629Q6410n10438j102486j640968k064309
$$ -35919230 -34020263 -32443215 -31286920 -30635291 -30548881 -31059319 -32161805 -33802773 -35867082
36518c5867082k307291k319835k089928j658370j110773n43869k4040M34559Q58252
$$ -35867082 -38174373 -40494208 -42584136 -44242506 -45353279 -45897148 -45921188 -45486629 -44628377
36509d4628377J278571J698191K079748K362882K495888K460497K277855J999779
$$ -44628377 -43349806 -41651615 -39571867 -37208985 -34713097 -32252600 -29974745 -27974966
36501b7974966J693771J424255J232381J125336J084262J082645J097128J106179
$$ -27974966 -26281195 -24856940 -23624559 -22499223 -21414961 -20332316 -19235188 -18129009
36493a8129009J089004J031926R32722P94070O14542L91447J34931j20923l20591
$$ -18129009 -17040005 -16008079 -15075357 -14281287 -13666745 -13275298 -13140367 -13261290 -13581881
36484a3581881m03180l26812r1655K54040O35279R87870J284337J530847J744698
$$ -13581881 -13985061 -14311873 -14403528 -14149488 -13514209 -12526339 -11242002 -9711155 -7966457
36475g966457J934871K096821K216504K275816K258022K153810J965330J704850
$$ -7966457 -6031586 -3934765 -1718261 557555 2815577 4969387 6934717 8639567
36467H639567J389844J039679O75409L18520j4914l21557o13344r13398j248742
$$ 8639567 10029411 11069090 11744499 12063019 12048105 11726548 11113204 10199806 8951064
36458H951064j642014k100461k602574l089311l468986l639697l525734l116839
$$ 8951064 7309050 5208589 2606015 -483296 -3952282 -7591979 -11117713 -14234552
36450a4234552k490664j797546j205183q32341p13633q12176j056580j367023
$$ -14234552 -16725216 -18522762 -19727945 -20560286 -21273919 -22086095 -23142675 -24509698
36442b4509698j661953j866058j934615j878708j761491j658886j613729j620184
$$ -24509698 -26171651 -28037709 -29972324 -31851032 -33612523 -35271409 -36885138 -38505322
36434c8505322j646898j673583j709269j782251j915312k105536k318490k496123
$$ -38505322 -40152220 -41825803 -43535072 -45317323 -47232635 -49338171 -51656661 -54152784
36426e4152784k573261k496773k241349j816342j260568o26873L5397O89004J303247
$$ -54152784 -56726045 -59222818 -61464167 -63280509 -64541077 -65167950 -65132553 -64443549 -63140302
36417f3140302J841303K255489K499948K555019K445810K239210K018099J848166
$$ -63140302 -61298999 -59043510 -56543562 -53988543 -51542733 -49303523 -47285424 -45437258
36409d5437258J758743J747489J798769J895959K018483K133122K194892K160727
$$ -45437258 -43678515 -41931026 -40132257 -38236298 -36217815 -34084693 -31889801 -29729074
36401b9729074K005156J726468J342280Q81729L80497j20886n78720r50464j201424
$$ -29729074 -27723918 -25997450 -24655170 -23773441 -23392944 -23513830 -24092550 -25043014 -26244438
36392b6244438j311171j277222j115588q59773n59160k75519p5014j4316j23042
$$ -26244438 -27555609 -28832831 -29948419 -30808192 -31367352 -31642871 -31717885 -31732201 -31855243
36383c1855243l89201p56642j139462j448116j613888j600996j407042j059451
$$ -31855243 -32244444 -33001086 -34140548 -35588664 -37202552 -38803548 -40210590 -41270041
36375d1270041o10731j27674L27485P15019J022572J255915J426856J547750J629689
$$ -41270041 -41880772 -42008446 -41680961 -40965942 -39943370 -38687455 -37260599 -35712849 -34083160
36366c4083160J676366J674644J594021J403824J099667P16630L12818o9120m34064
$$ -34083160 -32406794 -30732150 -29138129 -27734305 -26634638 -25918008 -25605190 -25674310 -26108374
36357b6108374q33785j330734j947439k630929l253253l652465l697421l342666
$$ -26108374 -26942159 -28272893 -30220332 -32851261 -36104514 -39756979 -43454400 -46797066
36349d6797066k641879j715579p00036K89918J172751J896071K427107K741564
$$ -46797066 -49438945 -51154524 -51854560 -51564642 -50391891 -48495820 -46068713 -43327149
36341d3327149K816422K636185K212758J601181Q90571J70021n06693j131029
$$ -43327149 -40510727 -37874542 -35661784 -34060603 -33170032 -33000011 -33506704 -34637733
36333c4637733j718449k274374k772488l157521l366424l353939l111898k676243
$$ -34637733 -36356182 -38630556 -41403044 -44560565 -47926989 -51280928 -54392826 -57069069
36325e7069069k117265j514463r29672l97098O5141M38350P01294Q44689Q86899
$$ -57069069 -59186334 -60700797 -61630469 -62027567 -61962426 -61524076 -60822782 -59978093 -59091194
36316e9091194Q77332Q85710R80428J198941J520467J862246K115041K204495
$$ -59091194 -58213862 -57328152 -56347724 -55148783 -53628316 -51766070 -49651029 -47446534
36308d7446534K137235J995524J882263J855559J896494J926033J853844J626534
$$ -47446534 -45309299 -43313775 -41431512 -39575953 -37679459 -35753426 -33899582 -32273048
36300c2273048J248834P69893K48399k76575p87932j267852j673268j933765j977630
$$ -32273048 -31024214 -30254321 -30005922 -30282497 -31070429 -32338281 -34011549 -35945314 -37922944
36291c7922944j770783j344598p94472k47215J85327M39463N03414L99424J66805
$$ -37922944 -39693727 -41038325 -41832797 -42080012 -41894685 -41455222 -40951808 -40552384 -40385579
36282d0385579j40754m51281o80517p52973o26580l05832J61395O96927J207889
$$ -40385579 -40526333 -40977614 -41658131 -42411104 -43037684 -43343516 -43182121 -42485194 -41277305
36273d1277305J603965J819215J835790J697563J499824J352580J333076J453307
$$ -41277305 -39673340 -37854125 -36018335 -34320772 -32820948 -31468368 -30135292 -28681985
36265b8681985J660601J868118J994124J988740J841907J579696J255569R34897
$$ -28681985 -27021384 -25153266 -23159142 -21170402 -19328495 -17748799 -16493230 -15558333
36257a5558333O70087M74304L11658J16688j63526n29375r16346j217953j330419
$$ -15558333 -14888246 -14413942 -14102284 -13985596 -14149122 -14678497 -15594843 -16812796 -18143215
36248a8143215j196364q29712l13512K28690O76965R54175J041965R71352Q00720
$$ -18143215 -19339579 -20169291 -20482803 -20254113 -19577148 -18622973 -17581008 -16609656 -15808936
36239a5808936N93680M00169K42457J13126j0446j43908k82962m08252n01497
$$ -15808936 -15215256 -14815087 -14572630 -14459504 -14469950 -14613858 -14896820 -15305072 -15806569
36230a5806569n59602n97623o39394p01447p80037q50004q77552q40688p45752
$$ -15806569 -16366171 -16963794 -17603188 -18304635 -19084672 -19934676 -20812228 -21652916 -22398668
36221b2398668o28304n34370m92586m96791n09701m79141l52116q5166L40090
$$ -22398668 -23026972 -23561342 -24053928 -24550719 -25060420 -25539561 -25891677 -25976843 -25636753
36212b5636753Q97150J507439K059007K443480K590021K481339K150764J667149
$$ -25636753 -24739603 -23232164 -21173157 -18729677 -16139656 -13658317 -11507553 -9840404
36204i840404J115425N79313J29149j86681l48477l68396k86423j58525m0032
$$ -9840404 -8724979 -8145666 -8016517 -8203198 -8551675 -8920071 -9206494 -9365019 -9405051
36195i405051L0211L8325p781r0046j91047k98493m07074n21998o59401q35023
$$ -9405051 -9374840 -9336515 -9344296 -9434342 -9625389 -9923882 -10330956 -10852954 -11512355 -12347378
36185a2347378j042874j238687j343473j270565r65811m41664K14958Q70093J392980
$$ -12347378 -13390252 -14628939 -15972412 -17242977 -18208788 -18650452 -18435494 -17565401 -16172421
36176a6172421J700157J769626J624377J304924Q51899L05278k88673q76697j409841
$$ -16172421 -14472264 -12702638 -11078261 -9773337 -8921438 -8616160 -8904833 -9781530 -11191371
36167a1191371j858447k216380k490103k685182k805780k865289k888552k893011
$$ -11191371 -13049818 -15266198 -17756301 -20441483 -23247263 -26112552 -29001104 -31894115
36159c1894115k862734k744007k473779k021213j411565p19142l9259N43008R75298
$$ -31894115 -34756849 -37500856 -39974635 -41995848 -43407413 -44126555 -44165814 -43622806 -42647508
36150d2647508J246770J382856J429848J436004J435384J439358J439343J419069
$$ -42647508 -41400738 -40017882 -38588034 -37152030 -35716646 -34277288 -32837945 -31418876
36142c1418876J366885J278996J155570R99523Q20475O35431M60582L01519J52923
$$ -31418876 -30051991 -28772995 -27617425 -26617902 -25797427 -25161996 -24701414 -24399895 -24246972
36133b4246972R169j21844k09710k03343m7072K93285Q08295J439387K090078
$$ -24246972 -24237803 -24359647 -24569357 -24772700 -24819772 -24526487 -23718192 -22278805 -20188727
36124b0188727K646185L000957L083760K884109K457293J905132J338997Q40557
$$ -20188727 -17542542 -14541585 -11457825 -8573716 -6116423 -4211291 -2872294 -2031737
36116b031737M37371J06235j96930n00873q01402j069134j268580j373055j371728
$$ -2031737 -1594366 -1488131 -1685061 -2185934 -2987336 -4056470 -5325050 -6698105 -8069833
36107h069833j270675j087944q45462n65655k75412q411K02788L39594M02371
$$ -8069833 -9340508 -10428452 -11273914 -11839569 -12114981 -12123392 -11920604 -11581010 -11178639
36098a1178639M04311L63325L00589K44239K29823K91024M42079O62509Q97359
$$ -11178639 -10774328 -10411003 -10110414 -9866175 -9636352 -9345328 -8903249 -8240740 -7343381
36089g343381J076473J140726J057813Q21097M40432o1611o43594j237624j753992
$$ -7343381 -6266908 -5126182 -4068369 -3247272 -2806840 -2868451 -3512045 -4749669 -6503661
36080f503661k103540k227039k113009j795134j336661q13025k95307J66394N52663
$$ -6503661 -8607201 -10834240 -12947249 -14742383 -16079044 -16892069 -17187376 -17020982 -16468319
36071a6468319Q66982J113209J278119J337485J282836J145651R95964R12533
$$ -16468319 -15601337 -14488128 -13210009 -11872524 -10589688 -9444037 -8448073 -7535540
36063g535540R43846J084917J280994J450965J516219J425269J169443P86025
$$ -7535540 -6591694 -5506777 -4225783 -2774818 -1258599 166670 1336113 2122138
36055B122138L47723n7453l49422m77405m34267k57716j7424K04154L29665L04652
$$ 2122138 2469861 2412408 2062986 1585581 1151314 893598 876174 1080328 1409993 1714645
36045A714645J16752j95002n56766q98726j188386j433246j656420j870038k064705
$$ 1714645 1831397 1636395 1079629 180903 -1007483 -2440729 -4097149 -5967187 -8031892
36036h031892k213880k283193k239798k062538j751891j334389q56968l73301
$$ -8031892 -10245772 -12528965 -14768763 -16831301 -18583192 -19917581 -20774549 -21147850
36028b1147850P0156M41977P26952R23764J041538J097477J118359J144269J224749
$$ -21147850 -21077694 -20635717 -19908765 -18985001 -17943463 -16845986 -15727627 -14583358 -13358609
36019a3358609J399008J668714J986017K270502K443535K455913K296295J985831
$$ -13358609 -11959601 -10290887 -8304870 -6034368 -3590833 -1134920 1161375 3147206
36011C147206J568172J097282O23119J80325k12859n44809p98045r44848r56061
$$ 3147206 4715378 5812660 6435779 6616104 6403245 5858436 5060391 4115543 3159482
36002C159482q18307n47584j88487K01228N69649Q80755J113229J256162J308444
$$ 3159482 2341175 1793591 1605104 1806332 2375981 3256736 4369965 5626127 6934571
35993F934571J278248J175239R98027P30024L52405j33137o87757j234148j669514
$$ 6934571 8212819 9388058 10386085 11116109 11468514 11335377 10647620 9413472 7743958
35984G743958j888898j814628j423096p56450Q7761R84513J814619K489400K956541
$$ 7743958 5855060 4040432 2617336 1860886 1948647 2933160 4747779 7237179 10193720
35975A0193720L188130L166408K884360K360009J645016Q13868n7443r05366j681203
$$ 10193720 13381850 16548258 19432618 21792627 23437643 24251511 24194068 23288702 21607499
35966B1607499k351320k899297l323009l622601l789029l806842l671859l408394
$$ 21607499 19256179 16356882 13033873 9411272 5622243 1815401 -1856458 -5264852
35958e264852l068837k713245k383647k090114j812121j507211j122895o15736
$$ -5264852 -8333689 -11046934 -13430581 -15520695 -17332816 -18840027 -19962922 -20578658
35950b0578658K4831P64203J533862K254819K851033L249323L384229L219555
$$ -20578658 -20553827 -19789624 -18255762 -16000943 -13149910 -9900587 -6516358 -3296803
35942c296803K772480K116921J360077O06879o7765o27543j065535j389920j618173
$$ -3296803 -524323 1592598 2952675 3559554 3491789 2864246 1798711 408791 -1209382
35933a209382j779366j910762k042331k183025k325087k460513k587806k701859
$$ -1209382 -2988748 -4899510 -6941841 -9124866 -11449953 -13910466 -16498272 -19200131
35925a9200131k784583k813296k778638k688889k552340k354694k055119j607449
$$ -19200131 -21984714 -24798010 -27576648 -30265537 -32817877 -35172571 -37227690 -38835139
35917c8835139r91737k34612N92425J391767K063644K528496K747647K739217
$$ -38835139 -39826876 -40061488 -39469063 -38077296 -36013652 -33485156 -30737509 -27998292
35909b7998292K577856K368416K200846K112077K079768K050226J978212J851028
$$ -27998292 -25420436 -23052020 -20851174 -18739097 -16659329 -14609103 -12630891 -10779863
35901a0779863J685876J510492J345141J196112J058349R20052P66819N88970
$$ -10779863 -9093987 -7583495 -6238354 -5042242 -3983893 -3063841 -2297022 -1708052
35893a708052L93416K12071R5401R1521K27324N07509R26805J474763K122848
$$ -1708052 -1314636 -1102565 -1007164 -915643 -688319 -180810 745995 2220758 4343606
35884D343606K808201L435600L900119M112843M014323L578276K816916J791004
$$ 4343606 7151807 10587407 14487526 18600369 22614692 26192968 29009884 30800888
35876C0800888O14640n58314j569281k298894k697969k790511k652936k387043
$$ 30800888 31415528 30857214 29287933 26989039 24291070 21500559 18847623 16460580
35868A6460580k099086j882549j798256j856225k012947k191856k319138k356832
$$ 16460580 14361494 12478945 10680689 8824464 6811517 4619661 2300523 -56309
35860e6309k317286k252688k224698k267891k364495k444087k410683k185296
$$ -56309 -2373595 -4626283 -6850981 -9118872 -11483367 -13927454 -16338137 -18523433
35852a8523433j742481j122078m12245K83662Q78145J317483J586034J701722
$$ -18523433 -20265914 -21387992 -21800237 -21516575 -20638430 -19320947 -17734913 -16033191
35844a6033191J706780J655483J599292J570703J570522J566426J507877J352593
$$ -16033191 -14326411 -12670928 -11071636 -9500933 -7930411 -6363985 -4856108 -3503515
35836c503515J090250P49312L84101N2139k03814l61586m16653l77669k62439
$$ -3503515 -2413265 -1663953 -1279852 -1227713 -1431527 -1793113 -2209766 -2587435 -2849874
35827b849874r0939J24035L79607O71252R73881J235003J393454J415242J320598
$$ -2849874 -2940813 -2816778 -2437171 -1765919 -792038 442965 1836419 3251661 4572259
35818D572259J179046J071310J041736J074016J107398J081228R76693Q31346
$$ 4572259 5751305 6822615 7864351 8938367 10045765 11126993 12103686 12935032
35810A2935032P24256P44926R59205J381348J962294K602871L188052L622892
$$ 12935032 13659288 14404214 15363419 16744767 18707061 21309932 24497984 28120876
35802B8120876L849942L845198L607468L156333K538817J832122J132511N33949
$$ 28120876 31970818 35816016 39423484 42579817 45118634 46950756 48083267 48617216
35794D8617216J09522r5257o0312K09889O81557J288580J942873K558936L078307
$$ 48617216 48726738 48631481 48571169 48781058 49462615 50751195 52694068 55253004 58331311
35785E8331311L476798L751429L900277L910975L763324L442128K953649K337502
$$ 58331311 61808109 65559538 69459815 73370790 77134114 80576242 83529891 85867393
35777H5867393J663536J008907M26131p6833n32169r90391j497033k077591k731920
$$ 85867393 87530929 88539836 88965967 88889134 88356965 87366574 85869541 83791950 81060030
35768H1060030l436469m151090m825430n403787n835011o091442o185712o166436
$$ 81060030 77623561 73472471 68647041 63243254 57408243 51316801 45131089 38964653
35760C8964653o088819n979786n822868n571762n182753m648579m016259l375327
$$ 38964653 32875834 26896048 21073180 15501418 10318665 5670086 1653827 -1721500
35752a721500k816424k380838k033107j677115j208901n76438J87841R80524J677949
$$ -1721500 -4537924 -6918762 -8951869 -10628984 -11837885 -12414323 -12226482 -11245958 -9568009
35743i568009K191979K497114K618607K600023K477756K274667K004187J670486
$$ -9568009 -7376030 -4878916 -2260309 339714 2817470 5092137 7096324 8766810
35735H766810J262369P52389J12233o60008j519662k379201l135287l702576m036051
$$ 8766810 10029179 10781568 10893801 10233793 8714131 6334930 3199643 -502933 -4538984
35726d538984m133529m021520l734920l302284k742661k070674j303361m67927
$$ -4538984 -8672513 -12694033 -16428953 -19731237 -22473898 -24544572 -25847933 -26315860
35718b6315860L86700J179348J801829K148821K161021J856133J328889P20107
$$ -26315860 -25929160 -24749812 -22947983 -20799162 -18638141 -16782008 -15453119 -14733012
35710a4733012J69965k23904m25936m54120l53721j71680N6485L07381N63464
$$ -14733012 -14563047 -14786951 -15212887 -15667007 -16020728 -16192408 -16135923 -15828542 -15265078
35701a5265078Q05590J011618J166239J275292J367783J478634J627863J818247
$$ -15265078 -14459488 -13447870 -12281631 -11006339 -9638556 -8159922 -6532059 -4713812
35693d713812K052679K350340K743744L259034L893919M604798N309301N907088
$$ -4713812 -2661133 -310793 2432951 5691985 9585904 14190702 19500003 25407091
35685B5407091O313033O486076O438520O225355N923938N612081N348865N165618
$$ 25407091 31720124 38206200 44644720 50870075 56794013 62406094 67754959 72920577
35677G2920577N073062N075066N167454N314378N425209N364967N004872M282757
$$ 72920577 77993639 83068705 88236159 93550537 98975746 104340713 109345585 113628342
35669A13628342L232935J968384O30497o62002j839577k877899l776997m544178
$$ 113628342 116861277 118829661 119460158 118798156 116958579 114080680 110303683 105759505
35661A05759505n191673n741950o224731o659417p034564p303237p402421p287578
$$ 105759505 100567832 94825882 88601151 81941734 74907170 67603933 60201512 52913934
35653E2913934o963920o496675n990029n539788n184839m890708m578186m174454
$$ 52913934 45950014 39453339 33463310 27923522 22738683 17847975 13269789 9095335
35645I095335l648681l014888k315630j607228r51292m05305j0434K16674K82959
$$ 9095335 5446654 2431766 116136 -1491092 -2442384 -2847689 -2858123 -2641449 -2358490
35636b358490K11965L7866j94886m27788n87902n99072m04965O357N88459J239123
$$ -2358490 -2146525 -2108659 -2303545 -2731333 -3319235 -3918307 -4323272 -4316915 -3728456 -2489333
35626b489333J821153K201332K297904K111895J718278J219927O97875J93019
$$ -2489333 -668180 1533152 3831056 5942951 7661229 8881156 9579031 9772050
35618I772050k74215o69663r26592r57640o92655j22206O79220J568861K387964
$$ 9772050 9497835 8828172 7901580 6943940 6251285 6129079 6808299 8377160 10765124
35609A0765124L024692L451493L715029L888179M018429M105200M113067M002237
$$ 10765124 13789816 17241309 20956338 24844517 28862946 32968146 37081213 41083450
35601D1083450L751591L362173K846800K221422J509677P55782K7723o00277j074539
$$ 41083450 44835041 48197214 51044014 53265436 54775113 55530895 55558618 54958341 53883802
35592E3883802j376026j515181j521647j441416j335867j270059j290147j402858
$$ 53883802 52507776 50992595 49470948 48029532 46693665 45423606 44133459 42730601
35584D2730601j569913j722515j792335j744835j594073j388911j184220j021158
$$ 42730601 41160688 39438173 37645838 35901003 34306930 32918019 31733799 30712641
35576C0712641r24798r06484r58857j048495j119971j115832j002565p86372n08099
$$ 30712641 29787843 28881359 27922502 26874007 25754036 24638204 23635639 22849267 22341168
35567B2341168k20863L2157K22444L24084L03271J24998k26484p29496j320764
$$ 22341168 22120305 22152462 22374906 22698990 23002261 23127259 22900775 22171279 20850515
35558B0850515j906305k382377k659967k686023k456514k018605j458710q74905
$$ 20850515 18944210 16561833 13901866 11215843 8759329 6740724 5282014 4407109
35550D407109l43334J00372M51249P09266Q65502R12101Q59757P39996N89442
$$ 4407109 4063775 4164147 4615396 5324662 6190164 7102265 7962022 8702018 9291460
35541I291460M31971K72330J01551r1582l07367n26192p12731q35823q90301q99785
$$ 9291460 9723431 9995761 10097312 10005730 9698363 9172171 8459440 7623617 6733316 5833531
35531E833531q94429q82015q38022p22861n12908k26173O9024K67824K65463M739
$$ 5833531 4939102 4057087 3219065 2496204 1983296 1757123 1826147 2093971 2359434 2364173
35521B364173m92253j130271j780291k323986k679356k806560k705773k412191
$$ 2364173 1871920 741649 -1038642 -3362628 -6041984 -8848544 -11554317 -13966508
35513a3966508j984215j484763r64993m60028L954L99999O95813Q56325Q52007
$$ -13966508 -15950723 -17435486 -18400479 -18860507 -18856553 -18456554 -17760741 -16904416 -16052409
35504a6052409O71315L33684j05215n65072r69111j273687j478752j611212j693939
$$ -16052409 -15381094 -15047410 -15152625 -15717697 -16686808 -17960495 -19439247 -21050459 -22744398
35495b2744398j723276j669546j497475j190753p64447k59375K73523P84471J225263
$$ -22744398 -24467674 -26137220 -27634695 -28825448 -29589895 -29849270 -29575747 -28791276 -27566013
35486b7566013J546724J705480J680704J488285J181319Q38155N45326L77455
$$ -27566013 -26019289 -24313809 -22633105 -21144820 -19963501 -19125346 -18580020 -18202565
35478a8202565L73861N21216P59334J014437J238929J428373J607393J802958
$$ -18202565 -17828704 -17307488 -16548154 -15533717 -14294788 -12866415 -11259022 -9456064
35470i456064K026595K269170K500800K675346K745704K686626K508203K246937
$$ -9456064 -7429469 -5160299 -2659499 15847 2761551 5448177 7956380 10203317
35462A0203317J942152J619201J292686R82093P20328N43582M70789M92693N81018
$$ 10203317 12145469 13764670 15057356 16039449 16759777 17303359 17774148 18266841 18847859
35453A8847859P06639Q47192R79577J072065J089488J007971Q26871N72105K90988
$$ 18847859 19554498 20401690 21381267 22453332 23542820 24550791 25377662 25949767 26240755
35444B6240755L6557j56913k91590l98136n05706o19046p25968q24581r37465
$$ 26240755 26277312 26120399 25828809 25430673 24924967 24305921 23579953 22755372 21817907
35435B1817907j094590j300008j513521j664737j689495j561495j298053r41016
$$ 21817907 20723317 19423309 17909788 16245051 14555556 12994061 11696008 10754992
35427A0754992n32196j01674L28332P33502J080474J326625J428097J355880J113178
$$ 10754992 10222796 10121122 10449454 11182956 12263430 13590055 15018152 16374032 17487210
35418A7487210P42033L12587r8637m28746o40788p30936p31067o99788o98261
$$ 17487210 18229243 18541830 18443193 18014447 17373659 16642723 15911656 15211868 14513607
35409A4513607p63045q96283j078303j284704j489288j658395j758106j778974
$$ 14513607 13750562 12854279 11775976 10491272 9001984 7343589 5585483 3806509
35401C806509j753876j742921j791426j896077k007650k065014k030179j900480
$$ 3806509 2052633 309712 -1481714 -3377791 -5385441 -7450455 -9480634 -11381114
35393a1381114j699162j462062j231443j051755r58608r64431j052638j183567
$$ -11381114 -13080276 -14542338 -15773781 -16825536 -17784144 -18748575 -19801213 -20984780
35385b0984780j303321j349587j261051r97887n66902l4762M81759Q47442R52679
$$ -20984780 -22288101 -23637688 -24898739 -25896626 -26463528 -26498290 -26016531 -25169089 -24216410
35376b4216410P54980K99917k90305q56795j255687j401797j286632r60141m84811
$$ -24216410 -23461430 -23161513 -23451818 -24308613 -25564300 -26966097 -28252729 -29212870 -29697681
35367b9697681J04709Q01771J587392K389112L081804L536075L680464L535234
$$ -29697681 -29592972 -28791201 -27203809 -24814697 -21732893 -18196818 -14516354 -10981120
35359a0981120L198798K799787K446128K196019K053915J979615J902761J744981
$$ -10981120 -7782322 -4982535 -2536407 -340388 1713527 3693142 5595903 7340884
35351G340884J449334J005269M54743j24616o51429j072490j376308j576831j678645
$$ 7340884 8790218 9795487 10250230 10125614 9474185 8401695 7025387 5448556 3769911
35342C769911j655439j464838j088105n60678K8233N61479R28475J057019R35239
$$ 3769911 2114472 649634 -438471 -999149 -970916 -409437 519038 1576057 2511296
35333B511296O15532J96635k08854n07533o47124o21044m55097j83942J67973
$$ 2511296 3126828 3323463 3114609 2607076 1959952 1338908 883811 699869 867842
35324H67842N89549J071766J593204K111166K559706K854501K907845K654376
$$ 867842 1457391 2529157 4122361 6233527 8793233 11647734 14555579 17209955
35316A7209955K077215J218100J65094r70971k075368l040776l780305m245315
$$ 17209955 19287170 20505270 20670364 19699393 17624025 14583249 10802944 6557629
35308F557629m436493m395538m180376l839116l395301k848020k185907j410075
$$ 6557629 2121136 -2274402 -6454778 -10293894 -13689195 -16537215 -18723122 -20133197
35300b0133197n53442L17853J122959J791049K277099K565674K668607K619527
$$ -20133197 -20686639 -20368786 -19245827 -17454778 -15177679 -12612005 -9943398 -7323871
35292g323871K462672K235983J956668J620096J214937P44857K41244k42108o48334
$$ -7323871 -4861199 -2625216 -668548 951548 2166485 2911342 3152586 2910478 2262144
35283B262144r38502j103348j161179j144322j082121r90668q73560p28425n51453
$$ 2262144 1323642 220294 -940885 -2085207 -3167328 -4157996 -5031556 -5759981 -6311434
35274f311434l39616r5617J64696M09568N97324O87114O49943M80747K10848q8708
$$ -6311434 -6651050 -6746667 -6581971 -6172403 -5575079 -4887965 -4238022 -3757275 -3546427 -3635135
35264c635135l23808m12317l21672r0664J74920L33882K61020r9534p04381j423119
$$ -3635135 -3958943 -4371260 -4692932 -4783596 -4608676 -4274794 -4013774 -4113308 -4817689 -6240808
35254f240808k088888k559690k758886k681987k379759j934475j437405r68568
$$ -6240808 -8329696 -10889386 -13648272 -16330259 -18710018 -20644493 -22081898 -23050466
35246b3050466n82287l04234j39168q1153j19685k41244m26008o38486q17373
$$ -23050466 -23632753 -23936987 -24076155 -24157308 -24276993 -24518237 -24944245 -25582731 -26400104
35237b6400104q78503p39088l52510K68176J051170J887220K659147L269010L655121
$$ -26400104 -27278607 -28017695 -28370205 -28102029 -27050859 -25163639 -22504492 -19235482 -15580361
35228a5580361L793798L687682L351556K808602K100614J301666N18195j33412
$$ -15580361 -11786563 -8098881 -4747325 -1938723 161891 1463557 1981752 1848340
35220A848340n62992p35323o74302m42640j12071K58130O24837R49850J187140
$$ 1848340 1285348 550025 -124277 -566917 -678988 -420858 203979 1153829 2340969
35211B340969J283866J199678R32647N32819R2350k84704n20126n90939n36305
$$ 2340969 3624835 4824513 5757160 6289979 6382329 6097625 5577499 4986560 4450255
35202D450255m37185l79485m21448n79940q34479j139848j442651j701706j906148
$$ 4450255 4013070 3633585 3212137 2632197 1797718 657870 -784781 -2486487 -4392635
35193d392635k077757k251076k444000k641451k801850k874942k814648k584596
$$ -4392635 -6470392 -8721468 -11165468 -13806919 -16608769 -19483711 -22298359 -24882955
35185b4882955k165096j564296q25055k0082P62192J434531J927543K203584K262443
$$ -24882955 -27048051 -28612347 -29437402 -29457484 -28695292 -27260761 -25333218 -23129634 -20867191
35176b0867191K136814J884056J580536J314421J168802J197621J407039J749760
$$ -20867191 -18730377 -16846321 -15265785 -13951364 -12782562 -11584941 -10177902 -8428142
35168h428142K129613K414940K467697K190635J575005P17619k11118j034406
$$ -8428142 -6298529 -3883589 -1415892 774743 2349748 3067367 2856249 1821843
35160A821843j632498j968116k070172k000419j828036j615353j404498j204430
$$ 1821843 189345 -1778771 -3848943 -5849362 -7677398 -9292751 -10697249 -11901679
35152a1901679r90716p23629l72067P2398N93213J151151J690196K151549K492466
$$ -11901679 -12892395 -13616024 -13988091 -13915693 -13322480 -12171329 -10481133 -8329584 -5837118
35143e837118K696918K770075K724015K569434K319605J999027J644070J290599
$$ -5837118 -3140200 -370125 2353890 4923324 7242929 9241956 10886026 12176625
35135A2176625R56846O36214L07846m1576l99932p27736r74283j104063j119064
$$ 12176625 13133471 13769685 14077531 14035955 13636023 12908287 11934004 10829941 9710877
35126I710877j062640j000881r93479j073610j247634j508719j849330k261429
$$ 9710877 8648237 7647356 6653877 5580267 4332633 2823914 974584 -1286845
35118a286845k724846l195071l604612l882986l984002l900430l656539l289175
$$ -1286845 -4011691 -7206762 -10811374 -14694360 -18678362 -22578792 -26235331 -29524506
35110b9524506k836586k341504j856279j434777j111779q87073p29410n97243
$$ -29524506 -32361092 -34702596 -36558875 -37993652 -39105431 -39992504 -40721914 -41319157
35102d1319157m58746k97921j09593J04949L35538N58241P35264Q22474P82426
$$ -41319157 -41777903 -42075824 -42185417 -42080468 -41744930 -41186689 -40451425 -39628951 -38846525
35093c8846525N98915K88423r5884m70347p37491q10344o36515k10212M34500
$$ -38846525 -38247610 -37959187 -38055071 -38525418 -39262909 -40073253 -40709768 -40919980 -40485480
35084d0485480J241278K142917L059785L897958M563350M988951N153878N079061
$$ -40485480 -39244202 -37101285 -34041500 -30143542 -25580192 -20591241 -15437363 -10358302
$$ [...]
##END NTUPLES=NMR SPECTRUM
##END=
