##TITLE=31Pdec_IPACAT-33
  CDCl3
  128 sc
 2.10.2023
##JCAMPDX= 6.0         $$ Bruker NMR JCAMP-DX V2.0
##DATA TYPE= NMR SPECTRUM
##DATA CLASS= NTUPLES
##ORIGIN= UXNMR, Bruker Analytische Messtechnik GmbH
##OWNER= root
$$ XWIN-NMR		Version 3.5
$$ Mon Oct  2 14:39:37 2023 Russian Standard Time (UT+4h)  she@DPX200
##.OBSERVE FREQUENCY= 81.013821
##.OBSERVE NUCLEUS= ^31P
##.ACQUISITION MODE= SIMULTANEOUS
##.ACQUISITION SCHEME= undefined
##.AVERAGES= 128
##.DIGITISER RES= 16
##SPECTROMETER/DATA SYSTEM= spect
##.PULSE SEQUENCE= zgpg30
##.SOLVENT NAME= CDCl3
##.SHIFT REFERENCE= (INTERNAL, CDCl3, 0, 248.564)
##AUDIT TRAIL= $$ (NUMBER, WHEN, WHO, WHERE, WHAT)
$$ ##TITLE= Audit trail, XWIN-NMR		Version 3.5
$$ ##JCAMPDX= 5.01
$$ ##ORIGIN= Bruker BioSpin GmbH
$$ ##OWNER= she
$$ F:/spectra/data/she/nmr/P31/1/pdata/1/auditp.txt
$$ ##AUDIT TRAIL=  $$ (NUMBER, WHEN, WHO, WHERE, WHAT)
(   1,<2023-10-02 14:35:40.87 +0400>,<she>,<DPX200>,
      <created by zg, POWCHK disabled, PULCHK disabled
       configuration hash MD5:
       00 E9 B6 7A A2 85 ED C7 34 08 36 98 17 FE 4E 26
       data hash MD5: 32K
       21 BE 09 09 35 DA 7A D3 9D 5E 78 5D F0 8B CD 8B>)
(   2,<2023-10-02 14:38:47.75 +0400>,<she>,<DPX200>,
      <Start of raw data processing
       efp BC_mod = 2 LB = 5 FT_mod = 6 PKNL = 1 PHC0 = -10649.74 PHC1 = -92.71359 SI = 64K 
       data hash MD5: 64K
       D6 AF CC 9B A2 81 58 FD EE FA 9B 79 47 B7 35 99>)
(   3,<2023-10-02 14:39:06.43 +0400>,<she>,<DPX200>,
      <pk PHC0 = 71.31374 PHC1 = 0 
       data hash MD5: 64K
       9D 48 A6 65 05 56 4C 1A 8A 6B 4B 35 6E BD C5 9C>)
$$ ##END=
$$ 
$$ hash MD5
$$ CD 22 BB 76 B4 D0 15 4B 50 49 A9 42 19 AC 29 9A
##$RELAX= 
##$RELAX= 
##$RELAX= 
##$RELAX= 
##$RELAX= 
##$RELAX= 
##$RELAX= 
##$RELAX= 
##$RELAX= 
$$ Bruker specific parameters
$$ --------------------------
##$DU= <F:/spectra>
##$EXPNO= 1
##$NAME= <P31>
##$PROCNO= 1
##$TYPE= <nmr>
##$USER= <she>
##$AMP= (0..31)
100 100 100 100 100 100 100 100 100 100 100 100 100 100 100 100 100 100 
100 100 100 100 100 100 100 100 100 100 100 100 100 100 
##$AQSEQ= 0
##$AQ_mod= 1
##$AUNM= <au_zg>
##$AUTOPOS= <>
##$BF1= 81.014009
##$BF2= 200.13
##$BF3= 200.13
##$BF4= 200.13
##$BF5= 200.13
##$BF6= 200.13
##$BF7= 200.13
##$BF8= 200.13
##$BYTORDA= 1
##$CFDGTYP= 0
##$CFRGTYP= 5
##$CHEMSTR= <none>
##$CNST= (0..31)
1 1 145 1 1 1 1 1 1 1 1 1 1 1 1 1 1 1 1 1 1 1 1 1 1 1 1 1 1 1 1 1 
##$CPDPRG= <waltz16>
##$CPDPRG1= <>
##$CPDPRG2= <waltz16>
##$CPDPRG3= <>
##$CPDPRG4= <mlev>
##$CPDPRG5= <mlev>
##$CPDPRG6= <mlev>
##$CPDPRG7= <mlev>
##$CPDPRG8= <mlev>
##$CPDPRGB= <>
##$CPDPRGT= <>
##$D= (0..31)
0 1 0 0 0 0 0 0 0 0 0 0.03 2e-05 3e-06 0 0 0 0 0 0 0 0 0 0 0 0 0 0 0 0 
0 0 
##$DATE= 1696242940
##$DBL= (0..7)
120 120 120 11 120 120 24 19 
##$DBP= (0..7)
150 150 150 150 150 150 150 150 
##$DBP07= 0
##$DBPNAM0= <>
##$DBPNAM1= <>
##$DBPNAM2= <>
##$DBPNAM3= <>
##$DBPNAM4= <>
##$DBPNAM5= <>
##$DBPNAM6= <>
##$DBPNAM7= <>
##$DBPOAL= (0..7)
0.5 0.5 0.5 0.5 0.5 0.5 0.5 0.5 
##$DBPOFFS= (0..7)
$$ [...]
##$SUBNAM2= <"">
##$SUBNAM3= <"">
##$SUBNAM4= <"">
##$SUBNAM5= <"">
##$SUBNAM6= <"">
##$SUBNAM7= <"">
##$SUBNAM8= <"">
##$SUBNAM9= <"">
##$SW= 501.771253377433
##$SWIBOX= (0..15)
0 1 3 0 0 0 0 0 0 0 0 0 0 0 0 0 
##$SW_h= 40650.406504065
##$TD= 32768
##$TD0= 1
##$TE= 0
##$TE2= 300
##$TE3= 300
##$TEG= 300
##$TL= (0..7)
0 120 53 12 22 120 120 120 
##$TP= (0..7)
150 150 150 150 150 150 150 150 
##$TP07= 0
##$TPNAME0= <>
##$TPNAME1= <>
##$TPNAME2= <>
##$TPNAME3= <>
##$TPNAME4= <>
##$TPNAME5= <>
##$TPNAME6= <>
##$TPNAME7= <>
##$TPOAL= (0..7)
0.5 0.5 0.5 0.5 0.5 0.5 0.5 0.5 
##$TPOFFS= (0..7)
0 0 0 0 0 0 0 0 
##$TUNHIN= 0
##$TUNHOUT= 0
##$TUNXOUT= 0
##$USERA1= <user>
##$USERA2= <user>
##$USERA3= <user>
##$USERA4= <user>
##$USERA5= <user>
##$V9= 5
##$VALIST= <valist>
##$VCLIST= <CCCCCCCCCCCCCCC>
##$VD= 0
##$VDLIST= <DDDDDDDDDDDDDDD>
##$VPLIST= <PPPPPPPPPPPPPPP>
##$VTLIST= <TTTTTTTTTTTTTTT>
##$WBST= 1024
##$WBSW= 4
##$XGAIN= (0..3)
0 0 0 0 
##$XL= 0
##$YL= 0
##$YMAX_a= 20305
##$YMIN_a= -7130
##$ZGOPTNS= <>
##$ZL1= 120
##$ZL2= 120
##$ZL3= 120
##$ZL4= 120
##$ABSF1= 0
##$ABSF2= 0
##$ABSG= 0
##$ABSL= 0
##$ALPHA= 0
##$AQORDER= 0
##$ASSFAC= 0
##$ASSFACI= 0
##$ASSFACX= 0
##$ASSWID= 0
##$AUNMP= <proc_1d>
##$AZFE= 0.1
##$AZFW= 0.5
##$BCFW= 0
##$BC_mod= 2
##$BYTORDP= 0
##$COROFFS= 0
##$CY= -3
##$DATMOD= 1
##$DC= 0
##$DFILT= <>
##$DTYPP= 0
##$F1P= 0
##$F2P= 0
##$FCOR= 1
##$FTSIZE= 65536
##$FT_mod= 6
##$GAMMA= 0
##$GB= 0
##$INTBC= 1
##$INTSCL= 6.047779e-11
##$ISEN= 30
##$LB= 5
##$LEV0= 0
##$LPBIN= 0
##$MAXI= 10000
##$MC2= 0
##$MEAN= 0
##$ME_mod= 0
##$MI= 50
##$NCOEF= 0
##$NC_proc= -9
##$NLEV= 6
##$NOISF1= 182.463
##$NOISF2= 159.3651
##$NSP= 0
##$NTH_PI= 0
##$NZP= 0
##$OFFSET= 248.5645
##$PC= 4
##$PHC0= -10578.43
##$PHC1= -92.71359
##$PH_mod= 1
##$PKNL= yes
##$PPARMOD= 0
##$PSCAL= 0
##$PSIGN= 0
##$REVERSE= no
##$SF= 81.0140089999694
##$SI= 65536
##$SIGF1= 159.3651
##$SIGF2= -187.1042
##$SINO= 113.3802
##$SIOLD= 16384
##$SREGLST= <1H.CDCl3>
##$SSB= 0
##$STSI= 65536
##$STSR= 0
##$SW_p= 40650.406504065
##$SYMM= 0
##$S_DEV= 0
##$TDeff= 32768
##$TDoff= 0
##$TI= <>
##$TILT= no
##$TM1= 0
##$TM2= 0
##$TOPLEV= 0
##$USERP1= <user>
##$USERP2= <user>
##$USERP3= <user>
##$USERP4= <user>
##$USERP5= <user>
##$WDW= 1
##$XDIM= 65536
##$YMAX_p= 514744146
##$YMIN_p= -116616564
$$ End of Bruker specific parameters
$$ ---------------------------------
##NTUPLES= NMR SPECTRUM
##VAR_NAME=  FREQUENCY,     SPECTRUM/REAL,   SPECTRUM/IMAG
##SYMBOL=    X,             R,               I
##VAR_TYPE=  INDEPENDENT,   DEPENDENT,       DEPENDENT
##VAR_FORM=  AFFN,          ASDF,            ASDF
##VAR_DIM=   65536,         65536,           65536
##UNITS=     HZ,            ARBITRARY UNITS, ARBITRARY UNITS
##FACTOR=    0.620285442955139, 1,           1
##FIRST=     20137.2065510682, 0,            0
##LAST=      -20513.1999529968, 0,           0
##MIN=       -20513.1999529968, -116616564,  0
##MAX=       20137.2065510682, 514744146,    0
$$ Real data points
##PAGE= N=1
##DATA TABLE= (X++(R..R)), XYDATA
$$ [...]
$$ plain form
35636 136444705 147028664 158869346 172027696 186795175 203193995 220539360 237743392
35629 237743392 253890190 268254237 279913206 287737382 290838961 288834098 281717870
35622 281717870 269856269 254271020 236660474 218819586 201977601 186678790 173101486
35615 173101486 161328382 151424257 143449662 137406699 133111769 130204360 128354673 127327863
35607 127327863 126729316 125903923 124414166 122578098 121183565 120540168 120070121 119043123
35599 119043123 117560763 116566593 116891632 118437777 120273336 121341133 121009850 119116829
35591 119116829 115727527 110971812 105072215 98438611 91679534 85477829 80347151 76359875
35583 76359875 73059702 69734731 65878802 61399014 56422695 51085970 45620473 40458008
$$ packed form
35636A36444705J0583959J1840682J3158350J4767479J6398820J7345365J7204032
35629B37743392J6146798J4364047J1658969P824176L101579k004863p116228
35622B81717870j1861601j5585249j7610546j7840888j6841985j5298811j3577304
35615A73101486j1773104r904125p974595o042963m294930k907409j849687j026810
35607A27327863n98547q25393j489757j836068j394533o43397m70047j026998
35599A19043123j482360r94170L25039J546145J835559J067797l31283j893021
35591A19116829l389302m755715n899597o633604o759077o201705n130678l987276
35583G6359875l300173l324971l855929m479788m976319n336725n465497n162465
$$ plain form
35575 40458008 35969555 32120009 28638979 25589976 23523692 22912060 23584768 24888280
35567 24888280 26298183 27702962 29127585 30347163 30854404 30240319 28685303 27069516
35559 27069516 26418478 27094437 28588287 30148642 31447994 32517959 33286265 33554272 33437426
35550 33437426 33510819 34358221 36088808 38328050 40501259 42060416 42675856 42461769 41983706
35541 41983706 41876899 42446020 43751093 46063624 50021967 56141222 64183192 73180316
35533 73180316 82201961 91070224 100299798 110506844 122108525 135518133 151187509
35526 151187509 169114573 188413532 207622049 225391068 240692044 252490142 259635043
35519 259635043 261274137 257245875 248031646 234548887 218108411 200332619 182797049
$$ packed form
35575D0458008m488453l849546l481030l049003k066284o11632O72708J303512
35567B4888280J409903J404779J424623J219578N07241o14085j555016j615787
35559B7069516o51038O75959J493850J560355J299352J069965P68306K68007j16846
35550C3437426P3393Q47402J730587K239242K173209J559157O15440k14087m78063
35541D1983706j06807N69121J305073K312531L958343O119255Q041970Q997124
35533G3180316R021645Q868263R229574J0207046J1601681J3409608J5669376
35526A51187509J7927064J9298959J9208517J7769019J5300976J1798098P144901
35519B59635043J639094m028262r214229j3482759j6440476j7775792j7535570
$$ plain form
35512 182797049 166643662 152496998 140578317 130757298 122586252 115478626 108949893
35505 108949893 102755927 96943381 91825674 87748223 84687140 82085383 79190411 75577314
35497 75577314 71349052 66931735 62751588 59006196 55587418 52195113 48568049 44607546
35489 44607546 40338942 35942901 31913448 28977112 27576953 27413908 27651999 27612340 27197761
35480 27197761 26703126 26386916 26252373 26084127 25597319 24624048 23248635 21764541 20473105
35471 20473105 19509436 18821534 18266275 17721465 17121059 16386292 15390105 14127325 12941185
35462 12941185 12396782 12780927 13821313 15021781 16137385 17117083 17713732 17522655 16514753
35453 16514753 15279746 14564350 14692825 15553293 16982639 18930383 21263397 23610183
$$ packed form
35512A82797049j6153387j4146664j1918681r821019q171046p107626o528733
35505A08949893o193966n812546n117707m077451l061083k601757k894972l613097
35497G5577314m228262m417317m180147l745392l418778l392305l627064l960503
35489D4607546m268604m396041m029453k936336j400159j63045K38091l9659m14579
35480B7197761m94635l16210j34543j68246m86808r73271j375413j484094j291436
35471B0473105r63669o87902n55259n44810o00406p34767r96187j262780j186140
35462A2941185n44403L84145J040386J200468J115604R79698N96649j91077j007902
35453A6514753j235007p15396J28475Q60468J429346J947744K333014K346786
$$ plain form
35445 23610183 25505026 26643614 26949615 26424164 25021936 22759744 19933892 17089901
35437 17089901 14649397 12607356 10716991 8944964 7578636 6825357 6428963 5788900
35429 5788900 4433987 2356690 -33901 -2191460 -3668612 -4173971 -3556766 -1910847
35421 -1910847 278288 2304379 3789252 5018873 6528141 8338630 9784142 10113752
35413 10113752 9098801 7050377 4516177 2108425 408583 -242755 97448 1077348
35405 1077348 2254064 3197715 3599302 3455804 3083968 2817291 2697356 2486265 1897042
35396 1897042 819733 -472166 -1258013 -774639 1066105 3478769 5513490 6835289
35388 6835289 7611792 7854131 7283274 5838207 3926703 2035615 352333 -1102549 -2219812
$$ packed form
35445B3610183J894843J138588L06001n25451j402228k262192k825852k843991
35437A7089901k440504k042041j890365j772027j366328p53279l96394o40063
35429E788900j354913k077297k390591k157559j477152n05359O17205J645919
35421a910847K189135K026091J484873J229621J509268J810489J445512L29610
35413A0113752j014951k048424k534200k407752j699842o51338L40203R79900
35405A077348J176716R43651M01587j43498l71836k66677j19935k11091n89223
35396A897042j077309j291899p85847M83374J840744K412664K034721J321799
35388F835289P76503K42339n70857j445067j911504j891088j683282j454882j117263
$$ plain form
35379 -2219812 -2882556 -3150438 -3156926 -2882984 -2193689 -1086090 230076 1559183 2996712
35370 2996712 4894758 7420834 10106135 12008122 12533592 12045264 11457545 11300072 11441056
35361 11441056 11661267 12041488 12587962 12867616 12416935 11372337 10358862 9811003 9682170
35352 9682170 9761724 9932634 10052584 9891602 9374586 8726379 8225394 7917398 7682288 7461341
35342 7461341 7262411 7019074 6645719 6268837 6251929 6860614 7905852 8782721 8906728
35333 8906728 8143607 6854229 5561279 4580404 3933927 3548353 3464368 3811515 4573972
35324 4573972 5430356 5918215 5833923 5473554 5440316 6193919 7755253 9744342 11595976
35315 11595976 12765844 12876152 11779652 9536496 6411024 2958612 1342 -1737105
$$ packed form
35379b219812o62744k67882o488K73942O89295J107599J316166J329107J437529
35370B996712J898046K526076K685301J901987N25470m88328n87719j57473J40984
35361A1441056K20211L80221N46474K79654m50681j044598j013475n47859j28833
35352I682170P9554J70910J19950j60982n17016o48207n00985l07996k35110k20947
35342G461341j98930k43337l73355l76882j6908O08685J045238Q76869J24007
35333H906728p63121j289378j292950r80875o46477l85574q3985L47147P62457
35324D573972Q56384M87859q4292l60369l3238P53603J561334J989089J851634
35315A1595976J169868J10308j096500k243156l125472l452412k957270j738447
$$ plain form
35307 -1737105 -2105590 -1576875 -792650 -126289 352939 726674 1177121 1927307 3032018
35298 3032018 4252883 5212310 5567182 4961131 3032770 -247712 -4306341 -8278899 -11623183
35289 -11623183 -14278105 -16298664 -17612052 -18176888 -18136658 -17709147 -17089399 -16501494 -16076093
35280 -16076093 -15485579 -13882976 -10477115 -5205659 1209136 7754857 13570574 18085823
35272 18085823 21067154 22666057 23312023 23452749 23393770 23352341 23530851 24014638 24586088
35263 24586088 24719264 23867188 21841121 18947853 15786086 12958054 10958715 10162423
35255 10162423 10697214 12300428 14433109 16610217 18596471 20349250 21934075 23503517
35247 23503517 25166977 26777830 27955422 28383498 27989181 26829030 25042254 23081787
$$ packed form
35307a737105l68485N28715P84225O66361M79228L73735M50447P50186J104711
35298C032018J220865R59427L54872o06051j928361l280482m058629l972558l344284
35289a1623183k654922k020559j313388n64836M0230M27511O19748N87905M25401
35280a6076093N90514J602603L405861N271456O414795O545721N815717M515249
35272A8085823K981331J598903O45966J40726n8979m1429J78510M83787N71450
35263B4586088J33176q52076k026067k893268l161767k828032j999339p96292
35255A0162423N34791J603214K132681K177108J986254J752779J584825J569442
35247B3503517J663460J610853J177592M28076l94317j160151j786776j960467
$$ plain form
35239 23081787 21802623 22014026 23850098 26614675 29199763 30666838 30669237 29579681 28198722
35230 28198722 27180612 26713735 26752504 27342353 28496307 29885304 30965766 31449608 31440562
35221 31440562 31094363 30370540 29170720 27496927 25363282 22733684 19695493 16579770
35213 16579770 13755162 11332057 9152941 7049860 5065479 3442373 2399673 1884234
35205 1884234 1577335 1223884 896002 784315 762261 374485 -666511 -2133709 -3523201
35196 -3523201 -4496289 -4984494 -4999850 -4516712 -3514390 -2034331 -215156 1665173 3217677
35187 3217677 4087568 4103448 3335207 2074235 699182 -596662 -1958161 -3595086 -5329984
35178 -5329984 -6601985 -6992800 -6569481 -5618459 -4264098 -2535165 -618279 1239632 3032572
$$ packed form
35239B3081787j279164K11403J836072K764577K585088J467075K399j089556j380959
35230B8198722j018110m66877L8769N89849J153954J388997J080462M83842r046
35221C1440562l46199p23823j199820j673793k133645k629598l038191l115723
35213A6579770k824608k423105k179116k103081j984381j623106j042700n15439
35205A884234l06899l53451l27882j11687k2054l87776j040996j467198j389492
35196c523201r73088m88205j5356M83138J002322J480059J819175J880329J552504
35187C217677Q69891J5880p68241j260972j375053j295844j361499j636925j734898
35178e329984j272001l90815M23319R51022J354361J728933J916886J857911J792940
$$ plain form
35169 3032572 4950414 6986343 8733194 9621085 9320958 7987136 6212846 4686875
35161 4686875 3749703 3269737 2973977 2773637 2668494 2518206 2168890 1756895 1648060
35152 1648060 2062936 2938109 4119524 5439888 6568364 7047278 6625768 5417612 3642395
35143 3642395 1371793 -1358282 -4351924 -7356538 -10294287 -13231139 -16129976 -18759752
35135 -18759752 -20880574 -22457390 -23654232 -24618011 -25281095 -25430910 -25025857 -24378100 -23889364
35126 -23889364 -23594569 -23092227 -21979722 -20283204 -18456118 -17089049 -16654627 -17329646 -18843278
35117 -18843278 -20512208 -21603947 -21802916 -21370495 -20861764 -20648188 -20634122 -20392682 -19578353
35108 -19578353 -18180053 -16364021 -14208888 -11777961 -9402090 -7627378 -6760358 -6603662
$$ packed form
35169C032572J917842K035929J746851Q87891l00127j333822j774290j525971
35161D686875r37172m79966k95760k00340j05143j50288l49316m11995j08835
35152A648060M14876Q75173J181415J320364J128476M78914m21510j208156j775217
35143C642395k270602k730075k993642l004614k937749k936852k898837k629776
35135a8759752k120822j576816j196842r63779o63084j49815M05053O47757M88736
35126b3889364K94795N02342J112505J696518J827086J367069M34422o75019j513632
35117a8843278j668930j091739j98969M32421N08731K13576J4066K41440Q14329
35108a9578353J398300J816032K155133K430927K375871J774712Q67020J56696
$$ plain form
35100 -6603662 -6729187 -6867349 -6933946 -6865787 -6641915 -6382059 -6221939 -6110647 -5881908 -5510856
35090 -5510856 -5187947 -5200905 -5889925 -7623354 -10526695 -14137801 -17512155 -19812977 -20770390
35081 -20770390 -20610868 -19771544 -18798237 -18287280 -18585279 -19448156 -20109889 -19771864 -18059315
35072 -18059315 -15121710 -11458917 -7676188 -4261163 -1448097 763463 2497605 3941490
35064 3941490 5322906 6784496 8205822 9245732 9657372 9502051 8958914 7999074 6417469
35055 6417469 4194733 1656818 -809905 -3086608 -5263355 -7338759 -9105510 -10307364
35047 -10307364 -10804637 -10584113 -9687770 -8166018 -6105911 -3750033 -1576619 -105171
35039 -105171 511623 623459 677759 765620 752529 770171 1242821 2289621 3327719 3488816
$$ packed form
35100f603662j25525j38162o6597O8159K23872K59856J60120J11292K28739L71052
35090e510856L22909j2958o89020j733429k903341l611106l374354k300822r57413
35081b0770390J59522Q39324R73307N10957k97999q62877o61733L38025J712549
35072a8059315K937605L662793L782729L415025K813066K211560J734142J443885
35064C941490J381416J461590J421326J039910M11640j55321n43137r59840j581605
35055F417469k222736k537915k466723k276703k176747k075404j766751j201854
35047a0307364m97273K20524Q96343J521752K060107K355878K173414J471448
35039a05171O16794J11836N4300Q7861j3091J7642M72650J046800J038098J61097
$$ plain form
35029 3488816 2359002 173591 -2618409 -5777210 -9250399 -12888416 -16276221 -18835816
35021 -18835816 -20108046 -19997372 -18780421 -16888165 -14695782 -12491324 -10527384 -8988398
35013 -8988398 -7902421 -7147482 -6578992 -6147516 -5880592 -5741118 -5538513 -5084064 -4495292
35004 -4495292 -4223389 -4577755 -5213238 -5286226 -4240521 -2357737 -461933 823391 1439887
34995 1439887 1617976 1386887 395004 -1788527 -5146600 -8978337 -12273500 -14371549 -15225589
34986 -15225589 -15096581 -14202567 -12723789 -10907769 -8946533 -6839118 -4562015 -2335911
34978 -2335911 -561390 525599 1069150 1513450 2347882 3763297 5358782 6246747 5668254
34969 5668254 3595990 732450 -1966951 -3676110 -3848970 -2424542 -47898 2106582
$$ packed form
35029C488816j129814k185411k792000l158801l473189l638017l387805k559595
35021a8835816j272230J10674J216951J892256K192383K204458J963940J538986
35013h988398J085977P54939N68490M31476K66924J39474K02605M54449N88772
35004d495292K71903l54366o35483p2988J045705J882784J895804J285324O16496
34995A439887J78089k31089r91883k183531l358073l831737l295163k098049q54040
34986a5225589J29008Q94014J478778J816020J961236K107415K277103K226104
34978b335911J774521J086989N43551M44300Q34432J415415J595485Q87965n78493
34969E668254k072264k863540k699401j709159j72860J424428K376644K154480
$$ plain form
34961 2106582 2959469 2087332 -185767 -3074115 -5742947 -7709108 -9046639 -10197391
34953 -10197391 -11503156 -12862955 -13754229 -13537103 -11888103 -9182096 -6490943 -5012153
34945 -5012153 -5313401 -7045093 -9271311 -10997540 -11554438 -10822193 -9232871 -7413926 -5709725
34936 -5709725 -4097706 -2559438 -1357182 -845697 -1113658 -1894004 -2757548 -3366924 -3679417
34927 -3679417 -4002058 -4751101 -6033717 -7497174 -8671470 -9453170 -10232391 -11592985 -13888576
34918 -13888576 -16968533 -20156105 -22479741 -23070082 -21561546 -18324566 -14344202 -10657222
34910 -10657222 -7671739 -5052871 -2407492 2851 1442094 1540962 675595 -544685
34902 -544685 -1888458 -3469456 -5356843 -7445287 -9573626 -11552508 -13131617 -14105216
$$ packed form
34961B106582Q52887q72137k273099k888348k668832j966161j337531j150752
34953a0197391j305765j359799q91274K17126J649000K706007K691153J478790
34945e012153l01248j731692k226218j726229n56898P32245J589322J818945J704201
34936e709725J612019J538268J202256N11485k67961p80346q63544o09376l12493
34927c679417l22641p49043j282616j463457j174296p81700p79221j360594k295591
34918a3888576l079957l187572k323636n90341J508536L236980L980364L686980
34910a0657222K985483K618868K645379K410343J439243R8868q65367j220280
34902e44685j343773j580998j887387k088444k128339j978882j579109r73599
$$ plain form
34894 -14105216 -14429444 -14166138 -13430876 -12522033 -11945485 -12038997 -12541671 -12719502 -12026570
34885 -12026570 -10632697 -9332559 -8999735 -10073043 -12403207 -15436966 -18464076 -20743130
34877 -20743130 -21662013 -21094135 -19608775 -18054263 -16823711 -15733837 -14676282 -14026614
34869 -14026614 -14148849 -14782874 -15296538 -15363407 -14964001 -13829214 -11463409 -7931054 -4231135
34860 -4231135 -1582690 -514274 -843246 -2295009 -4769372 -8021110 -11395057 -14044586
34852 -14044586 -15368916 -15264969 -14139075 -12796995 -12190627 -12954758 -14943794 -17245737
34844 -17245737 -18873627 -19571264 -19845982 -20152253 -20253883 -19612962 -18243627 -16786132 -15660914
34835 -15660914 -14478234 -12493538 -9453482 -5796484 -2205812 743556 2586614 3010577
$$ packed form
34894a4105216l24228K63306P35262R08843N76548r3512n02674j77831O92932
34885a2026570J393873J300138L32824j073308k330164l033759l027110k279054
34877b0743130r18883N67878J485360J554512J230552J089874J057555O49668
34869a4026614j22235o34025n13664o6869L99406J134787K365805L532355L699919
34860d231135K648445J068416l28972j451763k474363l251738l373947k649529
34852a4044586j324330J03947J125894J342080O06368p64131j989036k301943
34844a7245737j627890o97637k74718l06271j01630O40921J369335J457495J125218
34835a5660914J182680J984696L040056L656998L590672K949368J843058M23963
$$ plain form
34827 3010577 2093591 354578 -1613381 -3555680 -5572683 -7836436 -10421009 -13352840
34819 -13352840 -16610799 -19937454 -22714811 -24178387 -23846411 -21799255 -18650852 -15321650
34811 -15321650 -12703272 -11265079 -10855654 -10986531 -11371368 -12052713 -12927082 -13384204 -12733299
34802 -12733299 -10995057 -9029100 -7755725 -7329199 -7097779 -6253886 -4474398 -2058020
34794 -2058020 404456 2438870 3798999 4294444 3734908 2191732 189864 -1574709
34786 -1574709 -2689190 -3057160 -2610845 -1322054 478252 2152925 3321673 4139311 4849174
34777 4849174 5329781 5360036 5128322 5111041 5495707 6033916 6453559 6710772 6800855 6651065
34767 6651065 6358534 6282086 6660738 7242864 7473195 7016425 6031218 5049748 4692897 5322440
$$ packed form
34827C010577r16986j739013j967959j942299k017003k263753k584573k931831
34819a3352840l257959l326655k777357j463576L31976K047156L148403L329202
34811a5321650K618378J438193M09425j30877l84837o81345q74369m57122O50905
34802a2733299J738242J965957J273375M26526K31420Q43893J779488K416378
34794b058020K462476K034414J360129M95445n59536j543176k001868j764573
34786a574709j114481l67970M46315J288791J800306J674673J168748Q17638P09863
34777D849174M80607L0255k31714j7281L84666N38209M19643K57213R0083j49790
34767F651065k92531p6448L78652N82126K30331m56770r85207r81470l56851O29543
$$ plain form
34757 5322440 6682261 7851812 7780219 6048139 3141793 28999 -2446895 -3832302
34749 -3832302 -4039255 -3357784 -2513301 -2461146 -3830888 -6441746 -9415464 -11854952 -13416364
34740 -13416364 -14199424 -14199376 -13091742 -10632276 -7109356 -3264309 150078 2647258 4054881
34731 4054881 4596522 4891147 5517096 6398780 6810071 6139093 4512545 2560447 788534
34722 788534 -598496 -1472452 -1788346 -1836295 -2153066 -3016592 -4151942 -4980111 -5035130 -4209953
34712 -4209953 -2901646 -1971554 -2191783 -3457069 -4738096 -5079855 -4538770 -3929852 -3803145
34703 -3803145 -3968619 -3972158 -3724529 -3584821 -4006246 -5135091 -6604732 -7721519 -8016811
34694 -8016811 -7623451 -6986883 -6310252 -5539605 -4805928 -4445310 -4431285 -4150508 -3037409
$$ packed form
34757E322440J359821J169551p1593j732080k906346l112794k475894j385407
34749c832302k06953O81471Q44483N2155j369742k610858k973718k439488j561412
34740a3416364p83060M8J107634K459466L522920L845047L414387K497180J407623
34731D054881N41641K94625O25949Q81684M11291o70978j626548j952098j771913
34722G88534j387030q73956l15894m7949l16771q63526j135350q28169n5019Q25177
34712d209953J308307R30092k20229j265286j281027l41759N41085O08918J26707
34703c803145j65474l539K47629J39708m21425j128845j469641j116787k95292
34694h016811L93360O36568O76631P70647P33677L60618J4025K80777J113099
$$ plain form
34685 -3037409 -1262813 407746 1252194 901768 -686410 -3139228 -5643546 -7470814
34677 -7470814 -8669905 -9991233 -12027436 -14622611 -17144735 -19024220 -19883800 -19472156
34669 -19472156 -17830524 -15456426 -13057999 -11167875 -10127730 -10249668 -11580216 -13449643
34661 -13449643 -14656279 -14412456 -12998692 -11294437 -9804199 -8411257 -7003946 -5938034
34653 -5938034 -5664562 -6098265 -6616926 -6667377 -6206248 -5538650 -4872129 -4091467 -2893824
34644 -2893824 -1103138 1080310 3097488 4370847 4729678 4518763 4247998 4104697 3788797
34635 3788797 2799752 892819 -1674130 -4262539 -6218890 -7217442 -7364824 -7029992 -6551541
34626 -6551541 -6058558 -5542192 -5065170 -4824764 -4948077 -5272803 -5445744 -5259215 -4783260
$$ packed form
34685c037409J774596J670559Q44448l50426j588178k452818k504318j827268
34677g470814j199091j321328k036203k595175k522124j879485q59580M11644
34669a9472156J641632K374098K398427J890124J040145j21938j330548j869427
34661a3449643j206636K43823J413764J704255J490238J392942J407311J065912
34653e938034K73472m33703n18661n0451M61129O67598O66521P80662J197643
34644b893824J790686K183448K017178J273359L58831k10915k70765j43301l15900
34635C788797r89045j906933k566949k588409j956351r98552j47382L34832M78451
34626f551541M92983N16366M77022K40406j23313l24726j72941J86529M75955
$$ plain form
34617 -4783260 -4102735 -3011431 -1067663 2068600 6388130 11513821 16784881 21391020
34609 21391020 24617016 26125620 26079842 25022486 23587388 22148973 20588073 18429379
34601 18429379 15349850 11594698 7854864 4772366 2610501 1271787 436651 -258227
34593 -258227 -893443 -1024294 -21336 2087048 4156877 4532615 2280446 -2027619 -6577723
34584 -6577723 -9340382 -9137120 -6142348 -1635169 2705028 5470416 5917485 4117098
34576 4117098 847467 -2845314 -6182647 -8819193 -10598668 -11409245 -11401431 -11127646 -11182730
34567 -11182730 -11696116 -12311869 -12635042 -12555305 -12160214 -11516174 -10629353 -9582893 -8684897
34558 -8684897 -8448932 -9279022 -11023152 -12900132 -14060827 -14282706 -14044540 -13949820 -14202803
$$ packed form
34617d783260O80525J091304J943768L136263M319530N125691N271060M606139
34609B1391020L225996J508604m5778j057356j435098j438415j560900k158694
34601A8429379l079529l755152l739834l082498k161865j338714q35136o94878
34593b58227o35216j30851J002958K108384K069829L75738k252169m308065m550104
34584f577723k762659K03262K994772M507179M340197K765388M47069j800387
34576D117098l269631l692781l337333k636546j779475q10577P814K73785n5084
34567a1182730n13386o15753l23173P9737L95091O44040Q86821J046460Q97996
34558h684897K35965q30090j744130j876980j160695k21879K38166R4720k52983
$$ plain form
34549 -14202803 -14625652 -14987106 -15199288 -15282003 -15246192 -15020656 -14491773 -13648695 -12651514 -11657151
34539 -11657151 -10591538 -9230339 -7543559 -5829861 -4428763 -3393297 -2527748 -1659901
34531 -1659901 -776319 25622 551436 453312 -700199 -3138374 -6558088 -10033836 -12362965
34522 -12362965 -12748294 -11315223 -8909654 -6284404 -3542457 -479194 2659591 5048367
34514 5048367 5991373 5571420 4469204 3284453 2198244 1197484 390004 33409 349199
34505 349199 1314768 2547756 3434454 3550145 3014266 2317025 1758123 1185964 325549
34496 325549 -824431 -2036058 -3119646 -3980584 -4575191 -5070145 -5959602 -7688032 -10053883
34487 -10053883 -12200144 -13333126 -13353764 -12740678 -11988538 -11292218 -10662467 -10157899 -9940463
$$ packed form
34549a4202803m22849l61454k12182q2715L5811K25536N28883Q43078R97181R94363
34539a1657151J065613J361199J686780J713698J401098J035466Q65549Q67847
34531a659901Q83582Q01941N25814r8124j153511k438175l419714l475748k329129
34522a2362965l85329J433071K405569K625250K741947L063263L138785K388776
34514E048367R43006m19953j102216j184751j086209j000760q07480l56595L15790
34505C49199R65569J232988Q86698J15691n35879o97241n58902n72159q60415
34496C25549j149980j211627j083588q60938n94607m94954q89457j728430k365851
34487a0053883k146261j132982k0638O13086P52140O96320O29751N04568K17436
$$ plain form
34478 -9940463 -10111368 -10500839 -10706589 -10468588 -9983660 -9715367 -9922581 -10543078 -11471510
34469 -11471510 -12622849 -13652026 -14004517 -13543751 -12891567 -12795697 -13267184 -13677751 -13684661
34460 -13684661 -13749319 -14679223 -16860215 -19950886 -23105906 -25464885 -26670520 -27047935 -27171924
34451 -27171924 -27221267 -26884729 -25878893 -24311643 -22447730 -20358384 -18011599 -15600241
34443 -15600241 -13578534 -12345484 -11926400 -11911069 -11695440 -10926025 -9808395 -8895452 -8484176
34434 -8484176 -8281434 -7709878 -6444997 -4610323 -2619649 -984100 -155345 -325341 -1322300
34425 -1322300 -2759200 -4239704 -5360684 -5665899 -4855818 -3101161 -1011237 762454
34417 762454 1813878 1914225 883037 -1314390 -4419682 -7980484 -11611878 -15094037
$$ packed form
34478i940463j70905l89471k05750K38001M84928K68293k07214o20497r28432
34469a1471510j151339j029177l52491M60766O52184R5870m71487m10567o910
34460a3684661o4658r29904k180992l090671l155020k358979j205635l77415j23989
34451b7171924m9343L36538J005836J567250J863913K089346K346785K411358
34443a5600241K021707J233050M19084J5331K15629P69415J117630R12943M11276
34434h484176K02742N71556J264881J834674J990674J635549Q28755j69996r96959
34425a322300j436900j480504j120980l05215Q10081J754657K089924J773691
34417G62454J051424J00347j031188k197427l105292l560802l631394l482159
$$ plain form
34409 -15094037 -18221270 -20641763 -21909411 -21717080 -20110499 -17494706 -14397035 -11181993
34401 -11181993 -8027195 -5225236 -3434112 -3441227 -5560645 -9299106 -13652144 -17636684
34393 -17636684 -20484989 -21555368 -20455328 -17425564 -13440517 -9738893 -7224650 -6256177
34385 -6256177 -6746912 -8245346 -10025645 -11395790 -12071305 -12256737 -12407335 -12928282 -13932969
34376 -13932969 -15092447 -15774463 -15526503 -14427221 -12830991 -10841457 -8280249 -5186992
34368 -5186992 -2096953 275248 1462779 1343202 102279 -1740040 -3538813 -5081548
34360 -5081548 -6882386 -9672032 -13538692 -17659123 -20851893 -22338482 -22096040 -20682505
34352 -20682505 -18756680 -16669133 -14474022 -12299625 -10559419 -9706824 -9910748 -11089848
$$ packed form
34409a5094037l127233k420493j267648J92331J606581K615793L097671L215042
34401a1181993L154798K801959J791124p115k119418l738461m353038l984540
34393a7636684k848305j070379J100040L029764L985047L701624K514243R68473
34385f256177m90735j498434j780299j370145o75515j85432j50598n20947j004687
34376a3932969j159478o82016K47960J099282J596230J989534K561208L093257
34368e186992L090039K372201J187531j19577j240923j842319j798773j542735
34360e081548j800838k789646l866660m120431l192770j486589K42442J413535
34352b0682505J925825K087547K195111K174397J740206Q52595k03924j179100
$$ plain form
34344 -11089848 -13087400 -15556630 -17766072 -18876488 -18575768 -17331892 -15977784 -15150611
34336 -15150611 -15071177 -15561578 -16108961 -16103558 -15265562 -13844229 -12306447 -10889962 -9564659
34327 -9564659 -8338572 -7386265 -6808234 -6388760 -5713605 -4534650 -2988779 -1476721 -374719
34318 -374719 130926 11013 -670197 -1733816 -2903423 -3985066 -5041626 -6297505 -7861567
34309 -7861567 -9638411 -11508925 -13420214 -15179191 -16309908 -16385402 -15574256 -14685551 -14483167
34300 -14483167 -14912892 -15055327 -13888226 -11158067 -7616237 -4504058 -2793901 -2769282 -4100412
34291 -4100412 -6139075 -8134819 -9371316 -9380520 -8192043 -6337518 -4478111 -2952537 -1696070
34282 -1696070 -597080 127023 -50716 -1593535 -4542069 -8406588 -12265093 -14987699
$$ packed form
34344a1089848j997552k469230k209442j110416L00720J243876J354108Q27173
34336a5150611P9434m90401n47383N403Q37996J421333J537782J416485J325303
34327i564659J226087R52307N78031M19474O75155J178955J545871J512058J102002
34318c74719N05645j19913o81210j063619j169607j081643j056560j255879j564062
34309g861567j776844j870514j911289j758977j130717p5494Q11146Q88705K02384
34300a4483167m29725j42435J167101K730159L541830L112179J710157K4619j331130
34291d100412k038663j995744j236497r204J188477J854525J859407J525574J256467
34282a696070J098990P24103j77739j542819k948534l864519l858505k722606
$$ plain form
34274 -14987699 -15621897 -13884048 -10438825 -6628761 -3723433 -2212962 -1667217 -1196021
34266 -1196021 -71401 1929751 4521220 7036426 8608961 8506042 6551818 3272736
34258 3272736 -474268 -4072790 -7337551 -10188304 -12264545 -12949600 -11787998 -8928170
34250 -8928170 -5253058 -2060289 -400068 -466386 -1517541 -2433268 -2489900 -1798838 -1165398
34241 -1165398 -1497862 -3134650 -5571803 -7866247 -9375635 -10084572 -10238778 -9881304 -8936471
34232 -8936471 -7605669 -6351976 -5419039 -4605470 -3658671 -2698857 -2022504 -1580426 -949166
34223 -949166 77724 1056647 1228787 247358 -1536771 -3458792 -5039854 -6080046 -6453377
34214 -6453377 -6011534 -4680343 -2522506 301924 3514052 6637861 9122441 10702176
$$ packed form
34274a4987699o34198J737849L445223L810064K905328J510471N45745M71196
34266a196021J124620K001152K591469K515206J572535j02919j954224l279082
34258C272736l747004l598522l264761k850753k076241o85055J161602K859828
34250h928170L675112L192769J660221o6318j051155r15727n6632O91062O33440
34241a165398l32464j636788k437153k294444j509388p08937j54206L57474R44833
34232h936471J330802J253693R32937Q13569R46799R59814O76353M42078O31260
34223i49166J026890R78923J72140r81429j784129j922021j581062j040192l73331
34214f453377M41843J331191K157837K824430L212128L123809K484580J579735
$$ plain form
34206 10702176 11585894 12150738 12439324 12050283 10533741 7816840 4240621 288081 -3665084
34197 -3665084 -7403862 -10773800 -13555962 -15472293 -16391254 -16535977 -16348007 -15998632 -15080205
34188 -15080205 -12970757 -9591106 -5686237 -2228688 410331 2578086 4673437 6546191
34180 6546191 7626086 7505809 6280618 4413183 2410716 576678 -1093448 -2795389
34172 -2795389 -4601685 -6299824 -7676338 -8898293 -10364226 -12120966 -13657515 -14386141
34164 -14386141 -14115343 -12917202 -10803202 -7836501 -4423157 -1155871 1608237 3753572
34156 3753572 5071528 5315096 4656204 3686559 2729760 1441643 -621476 -3252729 -5742103
34147 -5742103 -7635803 -8975866 -9824769 -9987765 -9394773 -8470199 -7839610 -7734528 -7827546
$$ packed form
34206A0702176Q83718N64844K88586l89041j516542k716901l576219l952540l953165
34197c665084l738778l369938k782162j916331r18961j44723J87970L49375R18427
34188a5080205K109448L379651L904869L457549K639019K167755K095351J872754
34180F546191J079895j20277j225191j867435k002467j834038j670126j701941
34172b795389j806296j698139j376514j221955j465933j756740j536549p28626
34164a4386141K70798J198141K114000K966701L413344L267286K764108K145335
34156C753572J317956K43568o58892r69645r56799j288117k063119k631253k489374
34147e742103j893700j340063q48903j62996N92992R24574O30589J05082r3018
$$ plain form
34138 -7827546 -7561145 -6503887 -4515832 -1836005 928511 3063402 4131808 4128851 3315912
34129 3315912 1997995 427654 -1243600 -3005304 -4894658 -6797486 -8426442 -9585325
34121 -9585325 -10398133 -11182893 -12119905 -13093793 -13799741 -13938448 -13420035 -12558469 -12033462
34112 -12033462 -12418775 -13589028 -14639608 -14479904 -12555447 -9135565 -5132053 -1685715
34104 -1685715 335581 743160 28787 -1072762 -2028383 -2597413 -2721229 -2482334 -2039159
34095 -2039159 -1407744 -380562 1145009 2803635 3928773 4062860 3101821 979665 -2446159
34086 -2446159 -7027228 -12065522 -16644814 -20141901 -22318244 -23125523 -22704042 -21503149
34078 -21503149 -20093566 -18753803 -17396313 -15973234 -14802822 -14351276 -14719343 -15422690
$$ packed form
34138g827546K66401J057258J988055K679827K764516K134891J068406k957q12939
34129C315912j317917j570341j671254j761704j889354j902828j628956j158883
34121i585325q12808p84760r37012r73888p05948j38707N18413Q61566N25007
34112a2033462l85313j170253j050580J59704J924457L419882M003512L446338
34104a685715K021296M07579p14373j101549r55621n69030j23816K38895M43175
34095b039159O31415J027182J525571J658626J125138J34087r61039k122156l425824
34086b446159m581069n038294m579292l497087k176343q07279M21481J200893
34078b1503149J409583J339763J357490J423079J170412M51546l68067p03347
$$ plain form
34070 -15422690 -15693463 -15013385 -13417629 -11334981 -9163635 -7053069 -5100928 -3600158
34062 -3600158 -2873721 -2850409 -2998282 -2794781 -2179174 -1481997 -1029343 -910384 -998895 -1026130
34052 -1026130 -689289 124294 1189388 2114576 2648151 2739253 2414658 1827020 1392826
34043 1392826 1570117 2356172 3207987 3601084 3474616 2975131 2027296 493375 -1372961
34034 -1372961 -3029973 -4246355 -5276734 -6340246 -7202637 -7438703 -6903377 -5771216 -4282821
34025 -4282821 -2663448 -1205239 -244529 -65167 -864490 -2649666 -5003711 -7096750 -8217090
34016 -8217090 -8366316 -8222292 -8495430 -9380008 -10580745 -11759098 -12960997 -14661451 -17303405
34007 -17303405 -20680106 -23848728 -25793553 -26138477 -25148165 -23239725 -20774209 -18218101
$$ packed form
34070a5422690k70773O80078J595756K082648K171346K110566J952141J500770
34062c600158P26437K3312j47873K03501O15607O97177M52654J18959q8511k7235
34052a026130L36841Q13583J065094R25188N33575R1102l24595n87638m34194
34043A392826J77291P86055Q51815L93097j26468m99485r47835j533921j866336
34034a372961j657012j216382j030379j063512q62391k36066N35326J132161J488395
34025d282821J619373J458209R60710J79362p99323j785176k354045k093039j120340
34016h217090j49226J44024k73138q84578j200737j178353j201899j700454k641954
34007a7303405l376701l168622j944825l44924R90312J908440K465516K556108
$$ plain form
33999 -18218101 -16095896 -14625307 -13614491 -12824897 -12226389 -11788488 -11276379 -10484876 -9520696
33990 -9520696 -8599489 -7631022 -6256388 -4330449 -2201881 -473941 391597 220269 -937246
33981 -937246 -2837619 -5010655 -6801340 -7576928 -7022738 -5320614 -3020454 -649635 1607233
33972 1607233 3837045 6008218 7716140 8422609 7995971 6926980 5864780 4923123 3595122
33963 3595122 1453228 -1175152 -3366742 -4384599 -4212819 -3462693 -2999287 -3590875 -5513902
33954 -5513902 -8228164 -10585898 -11641905 -11349056 -10451484 -9775385 -9658147 -9878071 -9893552
33945 -9893552 -9152667 -7412325 -4976701 -2668931 -1458889 -1912238 -3814150 -6313914
33937 -6313914 -8578274 -10395098 -12106058 -13971324 -15746992 -16935340 -17292378 -16981512
$$ packed form
33999a8218101K122205J470589J010816P89594N98508M37901N12109P91503R64180
33990i520696R21207R68467J374634J925939K128568J727940Q65538j71328j157515
33981i37246j900373k173036j790685p75588N54190J702124K300160K370819K256868
33972A607233K229812K171173J707922P06469m26638j068991j062200r41657j328001
33963C595122k141894k628380k191590j017857J71780P50126M63406n91588j923027
33954e513902k714262k357734j056007K92849Q97572O76099J17238k19924j5481
33945i893552P40885J740342K435624K307770J210042m53349j901912k499764
33937f313914k264360j816824j710960j865266j775668j188348l57038L10866
$$ plain form
33929 -16981512 -16362326 -15762308 -15323737 -14877832 -14047466 -12711088 -11380639 -10901415 -11658417
33920 -11658417 -13167770 -14519097 -15150066 -15141361 -14853439 -14420844 -13665104 -12466817 -11114603
33911 -11114603 -10163040 -9912968 -10102837 -10132893 -9503065 -8044154 -5976211 -3956960 -2908386
33902 -2908386 -3424919 -5240106 -7460228 -9406692 -11080339 -12749400 -14316625 -15309841
33894 -15309841 -15408927 -14767158 -13787656 -12726304 -11582044 -10291222 -8914435 -7597998 -6412997
33885 -6412997 -5342366 -4477743 -4136985 -4644541 -5985720 -7786126 -9646942 -11377428 -12877580
33876 -12877580 -14010184 -14799144 -15669989 -17219451 -19611725 -22287509 -24363785 -25306037
33868 -25306037 -25219445 -24632611 -24145170 -24210445 -24980920 -26147578 -26968443 -26653472 -24866817
$$ packed form
33929a6981512O19186O00018M38571M45905Q30366J336378J330449M79224p57002
33920a1658417j509353j351327o30969Q705K87922M32595P55740J198287J352214
33911a1114603R51563K50072j89869l0056O29828J458911K067943K019251J048574
33902b908386n16533j815187k220122j946464j673647j669061j567225r93216
33894a5309841r9086O41769R79502J061352J144260J290822J376787J316437J185001
33885f412997J070631Q64623L40758n07556j341179j800406j860816j730486j500152
33876a2877580j132604p88960q70845j549462k392274k675784k076276r42252
33868b5306037Q6592N86834M87441o5275p70475j166658q20865L14971J786655
$$ plain form
33859 -24866817 -21899807 -18411907 -15070656 -12362470 -10503307 -9363249 -8576249 -7915943
33851 -7915943 -7570721 -7912800 -8976049 -10286848 -11257207 -11650827 -11630996 -11473636 -11317716
33842 -11317716 -11103382 -10636472 -9736254 -8384864 -6700017 -4734895 -2421055 178020
33834 178020 2664392 4561772 5766514 6538759 6990236 6794522 5568335 3412474 892007
33825 892007 -1447276 -3361841 -4782207 -5666834 -6042290 -5975548 -5413094 -4259608 -2778321
33816 -2778321 -1719751 -1770424 -2886591 -4341363 -5380264 -5666880 -5226141 -4342521 -3612357
33807 -3612357 -3735479 -4935883 -6674945 -8135816 -8944462 -9305016 -9570652 -9913101 -10367748
33798 -10367748 -10949332 -11622135 -12260716 -12702243 -12797497 -12433706 -11608450 -10512012 -9498777
$$ packed form
33859b4866817K967010L487900L341251K708186J859163J140058P87000O60306
33851g915943L45222l42079j063249j310799r70359l93620J9831J57360J55920
33842a1317716K14334M66910R00218J351390J684847J965122K313840K599075
33834A78020K486372J897380J204742P72245M51477j95714j226187k155861k520467
33825H92007k339283j914565j420366q84627l75456O6742N62454J153486J481287
33816b778321J058570n0673j116167j454772j038901k86616M40739Q83620P30164
33807c612357j23122j200404j739062j460871q08646l60554k65636l42449m54647
33798a0367748n81584o72803o38581m41527r5254L63791Q25256J096438J013235
$$ plain form
33789 -9498777 -8982754 -9347805 -10802922 -13154591 -15760665 -17868955 -19035054 -19181396 -18414466
33780 -18414466 -17034983 -15666661 -15003034 -15214959 -15769598 -16032156 -15991970 -16272391 -17472042
33771 -17472042 -19586380 -22013019 -24013380 -25198598 -25678662 -25799028 -25765610 -25562649 -25159142
33762 -25159142 -24596034 -23797296 -22479715 -20435995 -17840019 -15108976 -12487827 -9909552
33754 -9909552 -7254403 -4601240 -2180248 -159087 1510728 3101755 4923651 6978601
33746 6978601 8781578 9688807 9511793 8714193 7915899 7319044 6772629 6307290 6340955
33737 6340955 7263251 8981629 11001378 12825254 14113242 14567104 13959512 12386913 10327009
33728 10327009 8308649 6583958 5155709 3952683 2831136 1538464 -97026 -1944531
$$ packed form
33789i498777N16023l65051j455117k351669k606074k108290j166099j46342P66930
33780a8414466J379483J368322O63627k11925n54639k62558M0186k80421j199651
33771a7472042k114338k426639k000361j185218m80064j20366L3418K02961M03507
33762b5159142N63108P98738J317581K043720K595976K731043K621149K578275
33754i909552K655149K653163K420992K021161J669815J591027J821896K054950
33746F978601J802977R07229j77014p97600p98294n96855n46415m65339L3665
33737F340955R22296J718378K019749J823876J287988M53862o07592j572599k059904
33728A0327009k018360j724691j428249j203026j121547j292672j635490j847505
$$ plain form
33720 -1944531 -3679615 -5088181 -6142608 -6876080 -7421621 -8151195 -9477105 -11392900 -13407131
33711 -13407131 -15044438 -16230933 -17066889 -17426410 -16997509 -15629193 -13490005 -10977881
33703 -10977881 -8593203 -6751386 -5535019 -4740225 -4329700 -4652415 -5910444 -7514144
33695 -7514144 -8369076 -7909397 -6586865 -5233140 -4167655 -3066141 -1516689 463198
33687 463198 2354572 3457867 3378016 2309685 836718 -506874 -1353381 -1287648 103109
33678 103109 2780661 6094631 9280759 11942064 13854173 14576922 13691694 11402009 8544037
33669 8544037 5911851 3779459 2076371 714550 -376442 -1266483 -1884854 -2044559 -1784893
33660 -1784893 -1511128 -1540987 -1608353 -1120870 20575 1066134 1018477 -479483 -2918652
$$ packed form
33720a944531j735084j408566j054427p33472n45541p29574j325910j915795k014231
33711a3407131j637307j186495q35956l59521M28901J368316K139188K512124
33703a0977881K384678J841817J216367P94794M10525l22715j258029j603700
33695g514144q54932M59679J322532J353725J065485J101514J549452J979887
33687D63198J891374J103295p9851j068331j472967j343592q46507O5733J390757
33678A03109K677552L313970L186128K661305J912109P22749q85228k289685k857972
33669H544037k632186k132392j703088j361821j090992q90041o18371j59705K59666
33660a784893K73765k9859o7366M87483J141445J045559m7657j497960k439169
$$ plain form
33651 -2918652 -5462985 -7531490 -8830764 -9041551 -7799231 -5146089 -1871356 856136
33643 856136 2301137 2542019 2040078 1008923 -636950 -2794026 -4860829 -6057784 -6067950
33634 -6067950 -5353818 -4843702 -5261292 -6664098 -8536258 -10268844 -11563825 -12480329 -13207701
33625 -13207701 -13799404 -14056809 -13681954 -12626383 -11266231 -10103194 -9289463 -8614908 -8007487
33616 -8007487 -7829261 -8506914 -10000322 -11821862 -13496006 -14814594 -15716106 -16169690 -16242052
33607 -16242052 -16129200 -16051422 -16159206 -16478127 -16814980 -16779976 -16094526 -14874699 -13446475
33598 -13446475 -11928132 -10249077 -8589535 -7467198 -7203230 -7519069 -7868443 -8030331 -8200550
33589 -8200550 -8630260 -9349872 -10111117 -10386198 -9548975 -7361842 -4314631 -1277757 1219679
$$ packed form
33651b918652k544333k068505j299274k10787J242320K653142L274733K727492
33643H56136J445001K40882n01941j031155j645873k157076k066803j196955j0166
33634f067950P14132N10116m17590j402806j872160j732586j294981r16504p27372
33625a3207701n91703k57405L74855J055571J360152J163037Q13731O74555O07421
33616h007487J78226o77653j493408j821540j674144j318588r01512m53584p2362
33607a6242052J12852P7778j07784l18921l36853L5004O85450J219827J428224
33598a3446475J518343J679055J659542J122337K63968l15839l49374j61888j70219
33589h200550m29710p19612p61245k75081Q37223K187133L047211L036874K497436
$$ plain form
33580 1219679 3230355 4953097 6301749 6986049 6836649 5936868 4570574 3179002 2280878
33571 2280878 2247088 3072827 4384245 5679627 6586398 6960208 6837872 6377487 5872566
33562 5872566 5751178 6405753 7919558 9982034 12113313 13951876 15362906 16435563
33554 16435563 17458715 18715197 20068979 20799001 20067932 17651881 14176447 10689274
33546 10689274 8061902 6625278 6097551 5871863 5639100 5790011 6976452 9206276 11626765
33537 11626765 13344179 14227484 14720123 15105931 15297947 15261425 15275639 15661427 16445792
33528 16445792 17394668 18232570 18728545 18678109 17940096 16493561 14430307 11958545 9493934
33519 9493934 7703255 7296405 8589026 11128749 13711450 14881897 13680463 10186789
$$ packed form
33580A219679K010676J722742J348652O84300j49400q99781j366294j391572q98124
33571B280878l3790Q25739J311418J295382R06771L73810j22336m60385n04921
33562E872566j21388O54575J513805K062476K131279J838563J411030J072657
33554A6435563J023152J256482J353782P30022p31069k416051l475434l487173
33546A0689274k627372j436624n27727k25688k32763J50911J186441K229824K420489
33537A1626765J717414Q83305M92639L85808J92016l6522J4214L85788P84365
33528A6445792R48876Q37902M95975n0436p38013j446535k063254k471762k464611
33519I493934j790679m06850J292621K539723K582701J170447j201434l493674
$$ plain form
33511 10186789 5489559 1066460 -2028415 -3606377 -4126547 -4095172 -3684806 -2861193 -1693219
33502 -1693219 -403639 784061 1643221 1811143 946781 -774637 -2446156 -2969114 -1922235
33493 -1922235 132987 2205658 3683827 4613537 5272237 5568623 4974547 3163606 715133
33484 715133 -1007920 -919924 763062 2616304 3176613 2050336 -23599 -1996696 -3275431
33475 -3275431 -3812876 -3770812 -3319497 -2700186 -2228236 -2097179 -2274214 -2691566 -3444689 -4649888
33465 -4649888 -6148784 -7513908 -8361751 -8564601 -8214370 -7560807 -6946491 -6509758 -5832061
33456 -5832061 -4135218 -1080824 2711035 6114227 8389656 9485100 9606781 8830702
33448 8830702 7213371 5049911 2846098 1093594 146728 239591 1500519 3909895 7251362
$$ packed form
33511A0186789m697230m423099l094875j577962n20170L1375M10366Q23613J167974
33502a693219J289580J187700Q59160J67922q64362j721418j671519n22958J046879
33493a922235K055222K072671J478169R29710O58700K96386n94076j810941k448473
33484G15133j723053Q7996J682986J853242N60309j126277k073935j973097j278735
33475c275431n37445M2064M51315O19311M71950J31057j77035m17352p53123j205199
33465d649888j498896j365124q47843k02850L50231O53563O14316M36733O77697
33456e832061J696843L054394L791859L403192K275429J095444J21681p76079
33448H830702j617331k163460k203813j752504r46866R2863J260928K409376L341467
$$ plain form
33439 7251362 11118565 15019366 18526503 21316126 23057256 23398722 22263005 20197307
33431 20197307 18286285 17546010 18299110 20046872 21865107 22965965 23061519 22367179 21334647
33422 21334647 20396863 19936564 20353768 21930456 24490932 27274409 29347034 30282791 30435806
33413 30435806 30461942 30540029 30125683 28535737 25731257 22425228 19421386 16950044 14662947
33404 14662947 12129091 9241651 6273150 3716287 2033324 1349439 1275057 1093356 221627
33395 221627 -1458066 -3649246 -5915951 -7883152 -9270247 -9893035 -9758600 -9161183 -8546623
33386 -8546623 -8135810 -7708644 -6903199 -5719491 -4536868 -3598948 -2744739 -1809169 -1010289
33377 -1010289 -585307 -168838 1029193 3329100 6183585 8813246 10959558 12806339
$$ packed form
33439G251362L867203L900801L507137K789623J741130L41466j135717k065698
33431B0197307j911022p40275P53100J747762J818235J100858R5554o94340j032532
33422B1334647r37784m60299M17204J576688K560476K783477K072625R35757J53015
33413C0435806K6136P8087m14346j589946k804480l306029l003842k471342k287097
33404A4662947k533856k887440k968501k556863j682963o83885p4382j81701q71729
33395B21627j679693k191180k266705j967201j387095o22788J34435N97417O14560
33386h546623M10813M27166Q05445J183708J182623R37920Q54209R35570P98880
33377a010289M24982M16469J198031K299907K854485K629661K146312J846781
$$ plain form
33369 12806339 14404357 15500379 15872099 15572569 14846188 14012165 13443569 13443041 14030496
33360 14030496 14957660 15994795 17110990 18328740 19521440 20455429 20975577 21084710 20917153
33351 20917153 20723848 20803058 21284587 21959030 22424143 22440137 22096843 21669888 21432466 21572221
33341 21572221 22044302 22364798 21754885 19791611 16936168 14228256 12412091 11470907 10955423
33332 10955423 10499691 9931824 9148382 8143619 7122148 6444053 6478043 7526719 9711358
33323 9711358 12759868 16028356 18948383 21425627 23650450 25603515 26992493 27688169
33315 27688169 27995566 28406065 29220718 30458263 31944511 33359195 34311196 34540476 34075833
33306 34075833 33168295 32105897 31115090 30371225 30016464 30129110 30647770 31311016 31745763
$$ packed form
33369A2806339J598018J096022L71720k99530p26381q34023n68596n28N87455
33360A4030496R27164J037135J116195J217750J192700R33989N20148J09133j67557
33351B0917153j93305P9210M81529O74443M65113J5994l43294m26955k37422J39755
33341B1572221M72081L20496o09913j963274k855443k707912j816165r41184n15484
33332A0955423m55732n67867p83442j004763j021471o78095L3990J048676K184639
33323I711358L048510L268488K920027K477244K224823J953065J388978O95676
33315B7688169L07397M10499Q14653J237545J486248J414684R52001K29280m64643
33306C4075833r07538j062398r90807p43865l54761J12646N18660O63246M34747
$$ plain form
33297 31745763 31755797 31610233 32040942 33884612 37571954 42777448 48559517 54087921 59425777
33288 59425777 65481893 73025457 81863568 91165637 100425098 109803516 119663166 130208234
33280 130208234 141674240 154538260 169415752 186902426 207223930 229185879 249120547
33273 249120547 261736316 263247982 254129035 238624054 221635871 206295850 194055294
33266 194055294 185941075 182942156 185377749 192350781 201766039 210610117 215445297 213413723
33258 213413723 203529492 187330551 168167256 149452223 133071580 119045649 106489674
33251 106489674 94868244 84463210 75907609 69506613 65006105 61828960 59433309 57536283
33243 57536283 56112349 55186319 54594091 53934837 52731341 50613309 47427157 43327693
$$ packed form
33297C1745763J0034j45564M30709J843670L687342N205494N782069N528404N337856
33288E9425777O056116P543564Q838111R302069R259461R378418R859650J0545068
33280A30208234J1466006J2864020J4877492J7486674K0321504K1961949J9934668
33273B49120547J2615769J511666r118947j5504981j6988183j5340021j2240556
33266A94055294q114219k998919K435593O973032R415258Q844078M835180k031574
33258B13413723r884231j6198941j9163295j8715033j6380643j4025931j2555975
33251A06489674j1621430j0405034q555601o400996m500508l177145k395651j897026
33243E7536283j423934r26030n92228o59254j203496k118032l186152m099464
$$ plain form
33235 43327693 38813684 34559405 31097790 28648283 27202862 26630417 26622817 26684784 26398631
33226 26398631 25771190 25250657 25346007 26217812 27596047 29034279 30259873 31362293 32677550
33217 32677550 34438985 36491220 38348109 39527406 39789898 39068888 37316752 34603725
33209 34603725 31397819 28597063 27109423 27310543 28859704 30978407 32922277 34366093
33201 34366093 35549383 37065976 39321608 42041222 44344382 45431989 45266128 44588063
33193 44588063 44293871 44799562 45938995 47343370 48819531 50369606 51969520 53487555
33185 53487555 54874694 56358203 58393267 61485596 66051669 72179427 79226712 85776691
33177 85776691 90486684 93285989 95580235 99070182 104482757 111585216 120149997 130468899
$$ packed form
33235D3327693m514009m254279l461615k449507j445421n72445p600O1967k86153
33226B6398631o27441n20533R5350Q71805J378235J438232J225594J102420J315257
33217C2677550J761435K052235J856889J179297K62492p21010j752136k713027
33209C4603725l205906k800756j487640K01120J549161K118703J943870J443816
33201C4366093J183290J516593K255632K719614K303160J087607j65861o78065
33193D4588063k94192N05691J139433J404375J476161J550075J599914J518035
33185E3487555J387139J483509K035064L092329M566073O127758P047285O549979
33177H5776691M709993K799305K294246L489947N412575P102459Q564781J0318902
$$ plain form
33169 130468899 142955222 157700850 174642717 193886020 215581657 239608479 265635584
33162 265635584 293472969 323135160 354481163 386886811 419269572 450230891 477952847
33155 477952847 499938321 513122437 514744146 503664985 481189056 450635363 415946089
33148 415946089 380438368 346464205 315689051 289275276 267820133 251400913 239787493
33141 239787493 232485838 228595598 226951054 226667871 227440140 229058419 230683849 230862962
33133 230862962 228337835 222703257 214294523 203739024 191809490 179496761 167859773
33126 167859773 157665139 149194353 142326080 136692858 131835791 127406079 123281516 119436911
33118 119436911 115751333 112058194 108345669 104764246 101450572 98495490 96091118 94536121
$$ packed form
33169A30468899J2486323J4745628J6941867J9243303K1695637K4026822K6027105
33162B65635584K7837385K9662191L1346003L2405648L2382761L0961319K7721956
33155D77952847K1985474J3184116J621709j1079161k2475929l0553693l4689274
33148D15946089l5507721l3974163l0775154k6413775k1455143j6419220j1613420
33141B39787493p301655l890240j644544k83183P72269J618279J625430J79113
33133B30862962k525127n634578q408734j0555499j1929534j2312729j1636988
33126A67859773j0194634q470786o868273n633222m857067m429712m124563l844605
33118A19436911l685578l693139l712525l581423l313674k955082k404372j554997
$$ plain form
33110 94536121 94005989 94365088 95170099 95746701 95351038 93537741 90483750 86816507 83093763
33101 83093763 79624449 76777186 75089615 74812975 75525641 76428411 76914964 76706696 75662896
33092 75662896 73808810 71495967 69202820 67089696 64925740 62483746 59853173 57368086
33084 57368086 55393608 54166257 53633946 53415113 53096935 52618362 52203271 51926398 51604225
33075 51604225 51198770 51047136 51457959 52230865 52819157 52913164 52663353 52370769 52200684
33066 52200684 52272256 52835158 54176373 56366532 59174435 62224266 65225017 68150624
33058 68150624 71336381 75396148 80907419 88108225 96972785 107586422 120227915 134854873
33050 134854873 150544281 165604454 178196199 186696377 189658904 186013665 175719416
$$ packed form
33110I4536121n30132L59099Q05011N76602l95663j813297l053991l667243l722744
33101H3093763l469314k847263j687571k76640P12666R02770M86553k08268j043800
33092G5662896j854086k312843k293147k113124k163956k441994k630573k485087
33084E7368086j974478j227351n32311k18833l18178m78573m15091k76873l22173
33075E1604225m05455j51634M10823P72906N88292R4007k49811k92584j70085
33066E2200684P1572N62902J341215K190159K807903L049831L000751K925607
33058F8150624L185757M059767N511271P200806Q864560J0613637J2641493J4626958
33050A34854873J5689408J5060173J2591745Q500178K962527l645239j0294249
$$ plain form
33043 175719416 160135478 141531159 122200466 103930745 87848195 74337004 63171875
33036 63171875 54015111 46771234 41313931 37084087 33359398 29935645 27236432 25689326
33028 25689326 25203407 25246651 25179722 24522403 23217060 21750818 20825404 20859336 21961448
33019 21961448 24222304 27546595 31131329 33663332 34425750 33970515 33424738 33359140 33579343
33010 33579343 33720655 33615370 33191377 32427982 31470601 30557855 29834798 29422096 29600457
33001 29600457 30666748 32578194 34906096 37141015 38927192 40095871 40691499 40951657
32993 40951657 41094716 41174164 41316263 42020246 43974392 47564114 52702333 58992879 65715079
32984 65715079 71696274 75700713 77271503 77057236 76159612 75290037 74628250 74214855 74170200
$$ packed form
33043A75719416j5583938j8604319j9330693j8269721j6082550j3511191j1165129
33036F3171875r156764p243877n457303m229844l724689l423753k699213j547106
33028B5689326m85919M3244o6929o57319j305343j466242r25414L3932J102112
33019B1961448K260856L324291L584734K532003P62418m55235n45777o5598K20203
33010C3579343J41312j05285m23993p63395r57381r12746p23057m12702J78361
33001B9600457J066291J911446K327902K234919J786177J168679N95628K60158
32993D0951657J43059P9448J42099P03983J954146L589722N138219O290546O722200
32984F5715079N981195M004439J570790k14267q97624q69575o61787m13395m4655
$$ plain form
32975 74170200 74581164 75409608 76573094 78037651 79823530 81937121 84228164 86289174
32967 86289174 87641678 88163645 88275067 88574708 89310885 90286824 91219930 92046105 92861267
32958 92861267 93688564 94358316 94544278 93871769 92072853 89168028 85564162 81955486 79049721
32949 79049721 77263903 76528430 76266106 75586149 73700348 70388533 66135330 61729833
32941 61729833 57687793 54116450 51074886 48781418 47287908 46185796 45025090 44042624
32933 44042624 44112639 45764786 48451526 51023533 52827119 54097296 55313235 56451737
32925 56451737 57003623 56555171 55164740 53212321 51060368 48933506 47026758 45592601
32917 45592601 44875898 44990624 45870343 47316262 49105151 51123446 53454466 56299393
$$ packed form
32975G4170200M10964Q28444J163486J464557J785879K113591K291043K061010
32967H6289174J352504N21967J11422K99641P36177R75939R33106Q26175Q15162
32958I2861267Q27297O69752J85962o72509j798916k904825l603866l608676k905765
32949G9049721j785818p35473k62324o79957j885801l311815m253203m405497
32941F1729833m042040l571343l041564k293468j493510j102112j160706r82466
32933D4042624P0015J652147K686740K572007J803586J270177J215939J138502
32925E6451737N51886m48452j390431j952419k151953k126862j906748j434157
32917D5592601p16703J14726Q79719J445919J788889K018295K331020K844927
$$ plain form
32909 56299393 59714736 63365487 66563913 68646876 69425654 69330867 69099237 69244478 69768484
32900 69768484 70359916 70874181 71652650 73413815 76781742 81750731 87493062 92783117
32892 92783117 96788800 99504256 101428041 103002977 104543298 106495284 109305063 112901958
32884 112901958 116623224 119820688 122315434 124160745 125343915 126031200 126790521 128095202
32876 128095202 129699022 130919555 131541195 132101117 133294156 135440283 138521974 142299033
32868 142299033 146240509 149731554 152603376 155223322 157871884 160272671 161949874 162821264
32860 162821264 163169371 163168384 162679738 161403481 159009203 155233524 150139591 144315507 138658101
32851 138658101 133929410 130549124 128650172 128118953 128626343 129817123 131501198 133579438
$$ packed form
32909E6299393L415343L650751L198426K082963P78778r4787k31630J45241N24006
32900F9768484N91432N14265P78469J761165L367927M968989N742331N290055
32892I2783117M005683K715456J923785J574936J540321J951986K809779L596895
32884A12901958L721266L197464K494746J845311J183170O87285P59321J304681
32876A28095202J603820J220533O21640N59922J193039K146127L081691L777059
32868A42299033L941476L491045K871822K619946K648562K400787J677203Q71390
32860A62821264L48107r87m88646j276257k394278l775679n093933n824084n657406
32851A38658101m728691l380286j898952n31219N07390J190780J684075K078240
$$ plain form
32843 133579438 135842046 137958502 139612086 140540657 140544082 139611258 137966527 135817734 133116753
32834 133116753 129750422 125910630 122051062 118478331 115194399 112150983 109409563 106948464
32826 106948464 104520932 101892231 99153873 96684921 94815085 93547194 92542660 91365305
32818 91365305 89853013 88308041 87216532 86694442 86295550 85476346 84195224 82914085
32810 82914085 81993714 81213697 79984792 77986508 75476492 72953571 70662829 68576390
32802 68576390 66770268 65543526 65039545 64922210 64607990 63732355 62231546 60085513 57275858
32793 57275858 54057523 51029842 48738023 47224316 46027848 44589858 42672774 40528400
32785 40528400 38762096 37958638 38295101 39447713 40865661 42140218 43165140 44052030
$$ packed form
32843A33579438K262608K116456J653584R28571L425r32824j644731k148793k700981
32834A33116753l366331l839792l859568l572731l283932l043416k741420k461099
32826A06948464k427532k628701k738358k468952j869836j267891j004534j177355
32818I1365305j512292j544972j091509n22090l98892q19204j281122j281139
32810H2914085r20371p80017j228905j998284k510016k522921k290742k086439
32802F8576390j806122j226742n03981j17335l14220q75635j500809k146033k809655
32793E7275858l218335l027681k291819j513707j196468j437990j917084k144374
32785D0528400j766304q03458L36463J152612J417948J274557J024922Q86890
$$ plain form
32777 44052030 44968633 46053419 47433212 49231234 51422591 53606603 55020822 54972343
32769 54972343 53350640 50690802 47719630 44867483 42198984 39731188 37742073 36703796
32761 36703796 36840363 37760919 38671710 39047008 38995349 38872680 38689812 38117847 37001012
32752 37001012 35596219 34268271 33161761 32240396 31470686 30893047 30674197 31156869 32660308
32743 32660308 35070135 37710390 39725765 40550194 40050617 38493828 36558309 35177519
32735 35177519 35029138 36064818 37600628 38874608 39534318 39748316 39988046 40616726 41544170
32726 41544170 42327847 42718686 43021428 43764374 45081083 46611204 48008649 49372638 51140874
32717 51140874 53689753 57052208 60847716 64388820 66996065 68406964 68937494 69203075
$$ packed form
32777D4052030R16603J084786J379793J798022K191357K184012J414219m8479
32769E4972343j621703k659838k971172k852147k668499k467796j989115j038277
32761C6703796J36567R20556R10791L75298n1659j22669j82868n71965j116835
32752C7001012j404793j327948j106510r21365p69710n77639k18850M82672J503439
32743C2660308K409827K640255K015375Q24429m99577j556789j935519j380790
32735C5177519j48381J035680J535810J273980O59710K13998K39730O28680R27444
32726D1544170P83677L90839L02742P42946J316709J530121J397445J363989J768236
32717E1140874K548879L362455L795508L541104K607245J410899N30530K65581
$$ plain form
32709 69203075 69630631 70164189 70344428 69661069 67958752 65664255 63662567 62838994 63559084
32700 63559084 65460956 67729622 69618650 70761999 71076477 70535608 69171977 67235767
32692 67235767 65175950 63424581 62283012 61957803 62457929 63344074 63777939 63051547 61075271
32683 61075271 58289460 55199054 52098547 49122185 46344865 43816302 41622306 39927043
32675 39927043 38864086 38372915 38190526 37988344 37527888 36861977 36577514 37776248 41530454
32666 41530454 48105204 56589404 65248760 72347906 76912814 78943024 78936062 77233500
32658 77233500 73978076 69724509 65751420 63389118 63018595 63896672 64905005 65301294
32650 65301294 64877866 63762349 62214365 60479364 58743243 57204577 56024295 55064771
$$ packed form
32709F9203075M27556N33558J80239o83359j702317k294497k001688q23573P20090
32700F3559084J901872K268666J889028J143349L14478n40869j363631j936210
32692F7235767k059817j751369j141569l25209N00126Q86145M33865p26392j976276
32683F1075271k785811l090406l100507k976362k777320k528563k193996j695263
32675C9927043j062957m91171j82389k02182m60456o65911k84463J198734L754206
32666D1530454O574750Q484200Q659356P099146M564908K030210o962j702562
32658G7233500l255424m253567l973089k362302l70523Q78077J008333L96289
32650F5301294m23428j115517j547984j735001j736121j538666j180282r59524
$$ plain form
32642 55064771 53899015 52378603 51009862 50322891 49935636 48793596 46491008 43899669
32634 43899669 42275241 42148805 43305872 45295960 47430261 48652458 48165698 46273206
32626 46273206 44146295 42674299 41879884 41459062 41396231 41787975 42383026 42644553 42204284
32617 42204284 41106186 39736062 38696821 38638422 39933213 42426215 45599296 49013334
32609 49013334 52507672 55957436 58995494 61144748 62204006 62326482 61650393 60041088
32601 60041088 57407360 54173440 51123655 48671220 46474070 43891068 40661188 37035053
32593 37035053 33469063 30445621 28477890 27962936 28904777 30873630 33284469 35711118
32585 35711118 38026876 40339196 42701594 44769466 45844268 45448201 43814065 41619516
$$ packed form
32642E5064771j165756j520412j368741o86971l87255j142040k302588k591339
32634D3899669j624428j26436J157067J990088K134301J222197m86760j892492
32626D6273206k126911j471996p94415m20822o2831L91744N95051K61527m40269
32617D2204284j098098j370124j039241n8399J294791K493002L173081L414038
32609D9013334L494338L449764L038058K149254J059258J22476o76089j609305
32601F0041088k633728l233920l049785k452435k197150k583002l229880l626135
32593C7035053l565990l023442j967731n14954R41841J968853K410839K426649
32585C5711118K315758K312320K362398K067872J074802l96067j634136k194549
$$ plain form
32577 41619516 39248161 36509148 33136353 29407245 26163237 24246463 23902845 24644549
32569 24644549 25651915 26315039 26376662 25642348 23811422 20741345 16707164 12221071 7753845
32560 7753845 3837367 1222540 530565 1746209 4350902 7926697 12279761 16947836
32552 16947836 21010285 23620521 24535776 24037782 22600070 20748478 18944476 17388292
32544 17388292 16121237 15416493 15730082 17019082 18409914 18903199 18259736 16914371 15231248
32535 15231248 13258655 11142043 9352808 8415480 8653363 10200370 12960263 16481452
32527 16481452 20126769 23476719 26418073 28852270 30581356 31538784 31864987 31651512
32519 31651512 30877020 29752747 28864470 28698600 29150402 29715301 30041274 30057465 29697649
$$ packed form
32577D1619516k371355k739013l372795l729108l244008j916774l43618P41704
32569B4644549J007366O63124O1623p34314j830926l070077m034181m486093m467226
32560G753845l916478k614827o91975J215644K604693L575795M353064M668075
32552A6947836M062449K610236R15255m97994j437712j851592j804002j556184
32544A7388292j267055p04744L13589J289000J390832M93285o43463j345365j683123
32535A5231248j972593k116612j789235r37328K37883J547007K759893L521189
32527A6481452L645317L349950K941354K434197J729086R57428L26203k13475
32519C1651512p74492j124273q88277j65870M51802N64899L25973J6191l59816
$$ plain form
32510 29697649 28886233 27876476 27276507 27500518 28326524 29196745 29871100 30552158 31353674
32501 31353674 31898584 31646484 30565092 29308463 28680168 28984975 29913770 30959297 31869750
32492 31869750 32755513 33868651 35328534 37035725 38794515 40449866 41869500 42854974
32484 42854974 43183461 42761792 41673653 40077617 38156809 36166815 34357814 32740139
32476 32740139 31063056 29204087 27537468 26758238 27317893 29092387 31526646 33952913
32468 33952913 35809299 36773961 36816787 36076611 34676535 32749018 30646809 28981220 28321362
32459 28321362 28809933 29995541 30964452 30790290 29213763 27055489 25753996 26221848 28130596
32450 28130596 30394259 32256424 33766803 35325253 37054852 38669771 39696082 39655992
$$ packed form
32510B9697649q11416j009757n99969K24011Q26006Q70221O74355O81058Q01516
32501C1353674N44910k52100j081392j256629o28295L04807R28795J045527R10453
32492C1869750Q85763J113138J459883J707191J758790J655351J419634R85474
32484D2854974L28487m21669j088139j596036j920808j989994j809001j617675
32476C2740139j677083j858969j666619p79230N59655J774494K434259K426267
32468C3952913J856386R64662M2826p40176j400076j927517k102209j665589o59858
32459B8321362M88571J185608R68911j74162j576527k158274j301493M67852J908748
32450B8130596K263663J862165J510379J558450J729599J614919J026311m0090
$$ plain form
32442 39655992 38226523 35522008 32283539 29616663 28377345 28750689 30361862 32680114
32434 32680114 35260344 37701374 39584495 40615388 40829531 40530587 39905543 38717139
32426 38717139 36513721 33230430 29498500 26211025 23770046 21877170 20088001 18414911
32418 18414911 17263196 16884906 17090594 17507041 17966947 18590477 19586780 21034393 22776116
32409 22776116 24459654 25723921 26397014 26504287 26115866 25290957 24193343 23133766 22390109
32400 22390109 22010211 21815750 21522909 20832140 19548625 17776825 15975789 14699981 14222719
32391 14222719 14369687 14627277 14410650 13414287 11864492 10352607 9282810 8553500 7913439
32382 7913439 7508436 7810840 8993541 10603679 11930903 12523074 12287974 11356854 10111038
$$ packed form
32442C9655992j429469k704515l238469k666876j239318L73344J611173K318252
32434C2680114K580230K441030J883121J030893K14143k98944o25044j188404
32426C8717139k203418l283291l731930l287475k440979j892876j789169j673090
32418A8414911j151715l78290K05688M16447M59906O23530R96303J447613J741723
32409B2776116J683538J264267O73093J07273l88421q24909j097614j059577p43657
32400B2390109l79898j94461k92841o90769j283515j771800j801036j275808m77262
32391A4222719J46968K57590k16627r96363j549795j511885j069797p29310o40061
32382G913439m05003L02404J182701J610138J327224N92171k35100r31120j245816
$$ plain form
32373 10111038 9257208 9567113 11343171 14142181 17109160 19664699 21916361 24394169
32365 24394169 27365608 30444406 32908281 34335963 34830365 34655907 33833284 32204925
32357 32204925 29863833 27433547 25839749 25674518 26675514 27869529 28341392 27876117
32349 27876117 26832168 25536558 23997796 22128690 19967348 17626290 15260796 13172429
32341 13172429 11706138 10894272 10394679 9960442 9824616 10441882 11974379 14200300 16772223
32332 16772223 19319205 21401853 22675381 23121187 22892797 21917170 19883684 16699517
32324 16699517 12771463 8764661 5232720 2502534 664707 -487169 -1335237 -2052592
32316 -2052592 -2417471 -2172550 -1500888 -955079 -889670 -1062027 -783172 619539 3409061
$$ packed form
32373A0111038q53830L09905J776058K799010K966979K555539K251662K477808
32365B4394169K971439L078798K463875J427682M94402j74458q22623j628359
32357C2204925k341092k430286j593798j65231J000996J194015M71863m65275
32349B7876117j043949j295610j538762j869106k161342k341058k365494k088367
32341A3172429j466291q11866m99593m34237j35826O17266J532497K225921K571923
32332A6772223K546982K082648J273528M45806k28390r75627k033486l184167
32324A6699517l928054m006802l531941k730186j837827j151876q48068p17355
32316b052592l64879K44921O71662N45809O5409j72357K78855J402711K789522
$$ plain form
32307 3409061 7274122 11436824 15013571 17408878 18445371 18223476 16986553 15116485
32299 15116485 13086042 11270201 9814566 8725165 8023105 7758370 7963964 8707438 10118532
32290 10118532 12203015 14626612 16836741 18446484 19375059 19570542 18781797 16783625
32282 16783625 13764717 10335402 7161154 4701530 3269099 3129982 4376844 6684283
32274 6684283 9243090 11029989 11304293 9978901 7508663 4379178 775941 -3179755
32266 -3179755 -7015092 -9962240 -11463404 -11491614 -10384047 -8526591 -6219102 -3653883
32258 -3653883 -913670 1935411 4744244 7407285 10073196 13002324 16129337 18948830
32250 18948830 20914524 21775019 21499208 20223667 18476295 17103371 16575299 16511510 16225735
$$ packed form
32307C409061L865061M162702L576747K395307J036493k21895j236923j870068
32299A5116485k030443j815841j455635j089401p02060k64735K05594P43474J411094
32290A0118532K084483K423597K210129J609743R28575J95483p88745j998172
32282A6783625l018908l429315l174248k459624j432431j39117J246862K307439
32274F684283K558807J786899K74304j325392k470238l129485l603237l955696
32266c179755l835337k947148j501164k8210J107567J857456K307489K565219
32258c653883K740213K849081K808833K663041K665911K929128L127013K819493
32250A8948830J965694Q60495k75811j275541j747372j372924n28072o3789k85775
$$ plain form
32241 16225735 15557920 14705715 13336980 10536333 5957810 659056 -3600291 -5785776
32233 -5785776 -6133782 -5509266 -4596762 -3726787 -3158389 -3238341 -4188724 -5768254 -7273357
32224 -7273357 -8052326 -8070983 -7862671 -7858358 -7833724 -7028464 -4723792 -774219 4143279 8683778
32214 8683778 11515204 12202078 11481535 10578074 10265231 10582088 11194287 11755362 12030929
32205 12030929 12027785 12110939 12786694 14215999 15978916 17330467 17623375 16560426 14281169
32196 14281169 11335375 8477957 6375204 5465676 5954516 7681185 9948650 11785029
32188 11785029 12661885 12912186 13275778 14094670 15137903 16156315 17307722 18876411 20723569
32179 20723569 22212244 22685780 21967404 20467259 18921207 17973071 17805471 18056327 18168937
$$ packed form
32241A6225735o67815q52205j368735k800647m578523n298754m259347k185485
32233e785776l48006O24516R12504Q69975N68398p9952r50383j579530j505103
32224g273357p78969j8657K08312M313K4634Q05260K304672L949573M917498M540499
32214H683778K831426O86874p20543r03461l12843L16857O12199N61075K75567
32205A2030929l144Q3154O75755J429305J762917J351551K92908j062949k279257
32196A4281169k945794k857418k102753r09528M88840J726669K267465J836379
32188A1785029Q76856K50301L63592Q18892J043233J018412J151407J568689J847158
32179B0723569J488675M73536p18376j500145j546052r48136j67600K50856J12610
$$ plain form
32170 18168937 17945809 17780844 18313924 19862498 22189348 24731584 26946905 28476400
32162 28476400 29149953 28964643 28050556 26624543 25005431 23669472 23163838 23813643 25469973
32153 25469973 27577417 29504918 30852121 31572436 31937137 32356133 33086053 34032593 34871239
32144 34871239 35381462 35632290 35864207 36268607 36868297 37486665 37794502 37532607 36824858
32135 36824858 36219566 36296518 37212412 38639858 40038912 40880940 40743136 39467478 37309265
32126 37309265 34755275 32092893 29286742 26370104 23790302 22165883 21750281 22282306
32118 22282306 23295973 24383163 25209473 25606590 25848301 26666034 28709124 31894980 35336145
32109 35336145 37924372 39015968 38687310 37485590 35970664 34437268 33003579 31852355
$$ packed form
32170A8168937k23128j64965N33080J548574K326850K542236K215321J529495
32162B8476400O73553j85310r14087j426013j619112j335959n05634O49805J656330
32153B5469973K107444J927501J347203P20315L64701M18996P29920R46540Q38646
32144C4871239N10223K50828K31917M04400N99690O18368L07837k61895p07749
32135C6824858o05292P6952R15894J427446J399054Q42028j37804j275658k158213
32126C7309265k553990k662382k806151k916638k579802j624419m15602N32025
32118B2282306J013667J087190Q26310L97117K41711Q17733K043090L185856L441165
32109C5336145K588227J091596l28658j201720j514926j533396j433689j151224
$$ plain form
32101 31852355 31234238 31198477 31448731 31546486 31158592 30055922 28097503 25489597 22994533
32092 22994533 21580634 21763115 23431225 26308147 30290103 35174029 40271827 44567998
32084 44567998 47264514 48117744 47426760 45916554 44511975 43856139 43868279 43879908 43308594
32075 43308594 42180820 41042424 40504283 40870715 41975273 43211489 43860209 43643389 43030998
32066 43030998 42890791 43727823 45227323 46509043 46810911 45986014 44445058 42686217 40887222
32057 40887222 38918187 36664975 34229102 31783914 29336489 26738179 23923624 21092690
32049 21092690 18686285 17216314 17017306 18005693 19675408 21459873 23137780 24792793
32041 24792793 26393033 27622606 28249245 28478400 28710372 29000553 28987310 28381572 27339147
$$ packed form
32101C1852355o18117l5761K50254R7755l87894j102670j958419k607906k495064
32092B2994533j413899J82481J668110K876922L981956M883926N097798M296171
32084D4567998K696516Q53230o90984j510206j404579o55836J2140J1629n71314
32075D3308594j127774j138396n38141L66432J104558J236216O48720k16820o12391
32066D3030998j40207Q37032J499500J281720L01868q24897j540956j758841j798995
32057D0887222j969035k253212k435873k445188k447425k598310k814555k830934
32049B1092690k406405j469971j99008R88387J669715J784465J677907J655013
32041B4792793J600240J229573O26639K29155K31972K90181j3243o05738j042425
$$ plain form
32032 27339147 26287771 25551893 25232712 25291400 25590792 25931403 26177599 26298035 26180319
32023 26180319 25484164 23837700 21200868 17996956 14968525 12956357 12584137 13820814
32015 13820814 15848112 17659710 18915738 20022807 21304757 22356995 22408817 21126722
32007 21126722 18827581 16055403 13252702 10790768 8963673 7790709 6980140 6204210
31999 6204210 5338263 4420537 3532162 2779201 2245832 1870952 1493804 1127359 1077892 1673495
31989 1673495 2965980 4824189 7205267 10123891 13400873 16708979 19964161 23466732
31981 23466732 27455986 31575460 34923418 36638589 36382344 34351659 31060352 27225599
31973 27225599 23732969 21462623 20962799 22195073 24560133 27227621 29592960 31542055
$$ packed form
32032B7339147j051376p35878l19181N8688K99392L40611K46196J20436j17716
32023B6180319o96155j646464k636832l203912l028431k012168l72220J236677
32015A3820814K027298J811598J256028J107069J281950J052238N1822j282095
32007B1126722k299141k772178k802701k461934j827095j172964q10569p75930
31999F204210q65947r17726q88375p52961n33369l74880l77148l66445m9467N95603
31989A673495J292485J858209K381078K918624L276982L308106L255182L502571
31981B3466732L989254M119474L347958J715171k56245k030685l291307l834753
31973B7225599l492630k270346m99824J232274K365060K667488K365339J949095
$$ plain form
31965 31542055 33284084 34913718 36213610 36949437 37231999 37374868 37403377 36956807 35805550
31956 35805550 34274240 32958252 32149673 31768818 31760992 32243107 33229776 34530386 36055783
31947 36055783 37946809 40161690 42162307 43391959 44060117 45121223 47309667 50328782
31939 50328782 53094232 54676686 54930588 54321248 53301576 51884277 49759265 46777869
31931 46777869 43271632 39847398 36890883 34330513 31848396 29201096 26325403 23279043
31923 23279043 20175840 17113978 14109625 11182428 8580754 6835384 6450383 7504397
31915 7504397 9567629 11975439 14192748 16048610 17738793 19568864 21628147 23751278
31907 23751278 25812152 27912508 30168492 32432483 34385789 35824644 36701815 37006442
$$ packed form
31965C1542055J742029J629634J299892P35827K82562J42869K8509m46570j151257
31956C5805550j531310j315988q08579l80855p826M82115R86669J300610J525397
31947C6055783J891026K214881K000617J229652O68158J061106K188444L019115
31939E0328782K765450J582454K53902o09340j019672j417299k125012k981396
31931D6777869l506237l424234k956515k560370k482117k647300k875693l046360
31923B3279043l103203l061862l004353k927197k601674j745370l85001J054014
31915G504397K063232K407810K217309J855862J690183J830071K059283K123131
31907B3751278K060874K100356K255984K263991J953306J438855Q77171L04627
$$ plain form
31899 37006442 36852639 36625477 36724104 37094799 37269846 36938044 36209598 35218698 33794586
31890 33794586 31778703 29430602 27215070 25343241 23850807 23033662 23422144 25243953
31882 25243953 28138162 31411909 34336331 36214867 36574517 35551265 33895607 32348557
31874 32348557 31058305 29719269 28170675 26713408 25914483 26220023 27670982 29840294
31866 29840294 32063610 33831579 34971284 35491673 35453091 35105126 34948700 35377100 36254646
31857 36254646 37030103 37284800 37060369 36700136 36534444 36683252 36941958 36797348 35724539
31848 35724539 33577976 30655129 27429061 24370202 21963958 20585811 20216816 20499054
31840 20499054 21237192 22644526 24861417 27381882 29282405 30070497 30157910 30526228 32077258
$$ packed form
31899C7006442j53803k27162R8627L70695J75047l31802p28446r90900j424112
31890C3794586k015883k348101k215532j871829j492434q17145L88482J821809
31882B5243953K894209L273747K924422J878536L59650j023252j655658j547050
31874C2348557j290252j339036j548594j457267p98925L05540J450959K169312
31866B9840294K223316J767969J139705N20389l8582l47965j56426M28400Q77546
31857C6254646P75457K54697k24431l60233j65692J48808K58706j44610j072809
31848C5724539k146563k922847l226068l058859k406244j378147l68995K82238
31840B0499054P38138J407334K216891K520465J900523P88092Q7413L68318J551030
$$ plain form
31831 32077258 35180984 39470278 43929714 47460394 49640681 50907505 51890699 52662248
31823 52662248 52736371 51656635 49388851 46242067 42693331 39360804 36933291 35924207
31815 35924207 36446097 38178629 40469249 42527047 43771836 44191496 44347560 44963266 46493066
31806 46493066 48984112 52076554 54972983 56625564 56349770 54415632 51922287 49993732
31798 49993732 49102899 49083976 49553518 50189219 50761752 51143507 51351434 51495444 51625549
31789 51625549 51613459 51141423 49801836 47336670 43946083 40378149 37579042 36127012
31781 36127012 35950067 36530064 37308241 37933217 38292115 38450033 38555373 38727691 39015614
31772 39015614 39467794 40183177 41211107 42425809 43598124 44597111 45401693 45860541 45585474
$$ packed form
31831C2077258L103726M289294M459436L530680K180287J266824R83194P71549
31823E2662248P4123j079736k267784l146784l548736l332527k427513j009084
31815C5924207N21890J732532K290620K057798J244789M19660J56064O15706J529800
31806D6493066K491046L092442K896429J652581k75794j934138k493345j928555
31798D9993732q90833j8923M69542O35701N72533L81755K07927J44010J30105
31789E1625549j2090m72036j339587k465166l390587l567934k799107j452030
31781C6127012j76945N79997P78177O24976L58898J57918J05340J72318K87923
31772C9015614M52180P15383J027930J214702J172315R98987Q04582M58848k75067
$$ plain form
31763 45585474 44265805 42078253 39629757 37439269 35571432 33818115 32123065 30745885
31755 30745885 30098049 30503800 32020000 34346414 36951614 39405464 41548880 43241278
31747 43241278 44083346 43688946 42283614 40774172 40051811 40327182 41210478 42242279 43195922
31738 43195922 44068430 45063181 46519658 48585083 50919698 52939040 54426400 55776661
31730 55776661 57603830 60241646 63625866 67432189 71191573 74423538 76843390 78415525
31722 78415525 79134437 78859123 77501750 75308480 72765883 70194453 67559993 64744117
31714 64744117 61903449 59458387 57748527 56794761 56433884 56585571 57226661 58075447 58502621
31705 58502621 57998820 56748960 55571348 55219632 55851982 57195278 59005546 61201693
$$ packed form
31763D5585474j319669k187552k448496k190488j867837j753317j695050j377180
31755C0745885o47836M05751J516200K326414K605200K453850K143416J692398
31747D3241278Q42068l94400j405332j509442p22361K75371Q83296J031801R53643
31738D3195922Q72508R94751J456477K065425K334615K019342J487360J350261
31730E5776661J827169K637816L384220L806323L759384L231965K419852J572135
31722G8415525P18912k75314j357373k193270k542597k571430k634460k815876
31714F4744117k840668k445062j709860r53766l60877J51687O41090Q48786M27174
31705E8502621n03801j249860j177612l51716O32350J343296J810268K196147
$$ plain form
31697 61201693 63686855 66232786 68450526 69685020 69085815 66212428 61772415 57534737
31689 57534737 55210249 55324049 57141881 59511968 61642416 63241282 64268324 64745333
31681 64745333 64746563 64466093 64252880 64514001 65461510 66890620 68249425 68978298 68793471
31672 68793471 67698779 65862192 63571478 61241228 59329586 58198848 58059766 58973736
31664 58973736 60782620 63041405 65182739 66860263 68067855 68857979 69077231 68586754
31656 68586754 67742183 67451118 68626951 71619918 76151243 81589651 87160799 92083856
31648 92083856 95833805 98380382 100076475 101289294 102204408 102907786 103445236 103767381 103827740
31639 103827740 103844701 104282010 105389180 106870912 108205799 109243617 110315555 111798085
$$ packed form
31697F1201693K485162K545931K217740J234494n99205k873387m440013m237678
31689E7534737k324488J13800J817832K370087K130448J598866J027042M77009
31681F4745333J230k80470k13213K61121R47509J429110J358805P28873j84827
31672F8793471j094692j836587k290714k330250j911642j130738j39082R13970
31664E8973736J808884K258785K141334J677524J207592P90124K19252m90477
31656F8586754q44571k91065J175833K992967M531325N438408N571148M923057
31648I2083856L749949K546577J696093J212819R15114P03378N37450L22145O0359
31639A03827740J6961M37309J107170J481732J334887J037818J071938J482530
$$ plain form
31631 111798085 113770911 116100540 118608299 121016712 122866121 123631462 122895989 120411741
31623 120411741 116183909 110669413 104806135 99643989 95881802 93765015 93289654 94305433
31615 94305433 96420841 98963751 101087451 101900427 100698337 97449586 93164367 89463752
31607 89463752 87438590 86912936 86919887 86772734 86499299 86391855 86511325 86738570 87052561
31598 87052561 87554852 88314184 89321350 90533249 91852229 93087218 93963004 94073902 92820607
31589 92820607 89664273 84753206 79283154 74958048 72891333 72982367 74266573 75731172
31581 75731172 76852967 77631762 78311682 79050650 79804117 80555214 81591947 83338665 85817345
31572 85817345 88461271 90639100 92247350 93595373 94805367 95585058 95589936 94762208 93267638
$$ packed form
31631A11798085J972826K329629K507759K408413J849409P65341p35473k484248
31623A20411741m227832n514496n863278n162146l762187k116787m75361J015779
31615I4305433K115408K542910K123700Q12976j202090l248751m285219l700615
31607H9463752k025162n25654O951j47153k73435j07444J19470K27245L13991
31598H7052561N02291P59332J007166J211899J318980J234989Q75786J10898j253295
31589I2820607l156334m911067n470052m325106k066715R1034J284206J464599
31581G5731172J121795P78795O79920P38968P53467P51097J036733J746718K478680
31572H5817345K643926K177829J608250J348023J209994P79691M878q27728j494570
$$ plain form
31563 93267638 91376407 89572654 88544170 88740394 89938972 91445958 92732387 93691981
31555 93691981 94253802 94000302 92403189 89410212 85660793 82112245 79517739 78184786
31547 78184786 78000020 78546916 79329266 80115849 81119731 82684909 84691778 86385614 86979915
31538 86979915 86465239 85724714 85809266 87146716 89439104 92175565 95114774 98311276 101805727
31529 101805727 105352128 108441428 110621817 111859785 112595067 113390648 114494933 115725487
31521 115725487 116701425 117092161 116679046 115381493 113401934 111311585 109822316 109381354
31513 109381354 110024323 111622595 114134072 117474687 121191633 124441856 126406225 126746858
31505 126746858 125738131 124099779 122704570 122205542 122701296 123764768 124924604 126100192
$$ packed form
31563I3267638j891231j803753j028484J96224J198578J506986J286429R59594
31555I3691981N61821k53500j597113k992977l749419l548548k594506j332953
31547G8184786j84766N46896P82350P86583J003882J565178K006869J693836N94301
31538H6979915n14676p40525Q4552J337450K292388K736461K939209L196502L494451
31529A01805727L546401L089300K180389J237968P35282P95581J104285J230554
31521A15725487R75938L90736m13115j297553j979559k090349j489269m40962
31513A09381354O42969J598272K511477L340615L716946L250223J964369L40633
31505A26746858j008727j638352j395209m99028M95754J063472J159836J175588
$$ plain form
31497 126100192 127451259 128861565 129796421 129750315 128683280 126916968 124735186 122248493
31489 122248493 119617615 117278865 115896135 116053857 117866912 120779055 123797032 126069591
31481 126069591 127345177 127963125 128521022 129549739 131306219 133679084 136292780 138773390
31473 138773390 140881364 142383965 142985186 142549210 141289493 139555915 137507780 135189065
31465 135189065 132868209 131072987 130269736 130650519 132131721 134241060 135976025 136146173
31457 136146173 134135088 130271102 125427410 120455511 116003197 112439445 109590672 106752317
31449 106752317 103371523 99750983 96860398 95459767 95549484 96525716 97536537 97711560
31441 97711560 96477915 93952726 90939734 88388426 86847991 86369076 86683447 87347845
$$ packed form
31497A26100192J351067J410306R34856m6106j067035j766312k181782k486693
31489A22248493k630878k338750j382730J57722J813055K912143L017977K272559
31481A26069591J275586O17948N57897J028717J756480K372865K613696K480610
31473A38773390K107974J502601O01221m35976j259717j733578k048135k318715
31465A35189065k320856j795222q03251L80783J481202K109339J734965J70148
31457A36146173k011085l863986m843692m971899m452314l563752k848773k838355
31449A06752317l380794l620540k890585j400631Q9717R76232J010821J75023
31441I7711560j233645k525189l012992k551308j540435m78915L14371O64398
$$ plain form
31433 87347845 87886858 88013953 87724801 87121354 86224611 85069806 83965816 83581482 84719240
31424 84719240 87861634 92696860 98009462 102283030 104719495 105721072 106279467 106949642
31416 106949642 107565636 107865970 108064412 108636802 109734593 111038276 112124144 112764596 112889926
31407 112889926 112529162 111945808 111667857 112137482 113291109 114577263 115382250 115380077 114582077
31398 114582077 113286365 112016952 111264261 111087005 111048691 110671520 109862549 108764831 107326309
31389 107326309 105292786 102664882 99938947 97747998 96327652 95402148 94538382 93570325
31381 93570325 92743364 92501766 93105595 94417451 96046523 97636237 98959917 99862230 100340977
31372 100340977 100731501 101609816 103361721 105899609 108836213 111788529 114412911 116324491
$$ packed form
31433H7347845N39013J27095k89152o03447q96743j154805j103990l84334J137758
31424H4719240L142394M835226N312602M273568K436465J001577N58395O70175
31416A06949642O15994L00334J98442N72390J097791J303683J085868O40452J25330
31407A12889926l60764n83354k77951M69625J153627J286154Q04987k173p98000
31398A14582077j295712j269413p52691j77256l8314l77171q08971j097718j438522
31389A07326309k033523k627904k725935k190949j420346r25504q63766r68057
31381I3570325q26961k41598O03829J311856J629072J589714J323680R02313M78747
31372A00340977L90524Q78315J751905K537888K936604K952316K624382J911580
$$ plain form
31364 116324491 117248222 117274084 116804779 116201800 115571866 114904797 114274325 113786675 113363440
31355 113363440 112682518 111426913 109651618 107897762 106847055 106751000 107161991 107236082 106313170
31346 106313170 104277645 101518773 98636763 96082697 93932868 92043927 90545142 90098638
31338 90098638 91427669 94514746 98469553 102346492 105967567 109763331 113901296 117839632
31330 117839632 120810470 122549740 123401423 123797935 123807355 123196144 121804754 119786391 117517990
31321 117517990 115329018 113313760 111390675 109535223 107909550 106693003 105790490 104828549
31313 104828549 103553107 102209739 101424735 101661700 102815503 104320216 105582507 106315253
31305 106315253 106582219 106628104 106614385 106406316 105630013 104062128 101999373 100120923 98875716
$$ packed form
31364A16324491R23731K5862m69305o02979o29934o67069o30472m87650m23235
31355A13363440o80922j255605j775295j753856j050707r6055M10991P4091r22912
31346A06313170k035525k758872k882010k554066k149829j888941j498785m46504
31338I0098638J329031L087077L954807L876939L621075L795764M137965L938336
31330A17839632K970838J739270Q51683L96512R420o11211j391390k018363k268401
31321A17517990k188972k015258j923085j855452j625673j216547r02513r61941
31313A04828549j275442j343368p85004K36965J153803J504713J262291P32746
31305A06315253K66966M5885j3719k08069p76303j567885k062755j878450j245207
$$ plain form
31296 98875716 98057337 97091860 95716184 94241295 93141067 92560020 92347308 92438470 92964691
31287 92964691 93943729 95019716 95593423 95137166 93384975 90426415 86797590 83372796
31279 83372796 80899089 79522599 78826525 78322891 77797971 77199378 76411098 75318194 74031931
31270 74031931 72890525 72191962 71978999 72107585 72498431 73291037 74696380 76621976 78463709
31261 78463709 79446519 79338587 78790343 78793005 79722280 80973262 81555251 80954555 79384949
31252 79384949 77358259 75214289 73062695 70973055 69067555 67481699 66353255 65840956
31244 65840956 66057329 66967556 68427515 70333746 72651747 75251924 77777745 79738730
31236 79738730 80747007 80716835 79933821 78918859 78075393 77415640 76777125 76370538 76874656
$$ packed form
31296I8875716q18379r65477j375676j474889j100228n81047k12712R1162N26221
31287I2964691R79038J075987N73707m56257j752191k958560l628825l424794
31279H3372796k473707j376490o96074n03634n24920n98593p88280j092904j286263
31270G4031931j141406o98563k12963J28586L90846P92606J405343J925596J841733
31261G8463709R82810j07932n48244K662R29275J250982N81989o00696j569606
31252G9384949k026690k143970k151594k089640j905500j585856j128444n12299
31244F5840956K16373R10227J459959J906231K318001K600177K525821J960985
31236G9738730J008277l0172p83014j014962q43466o59753o38515m06587N04118
$$ plain form
31227 76874656 78735884 81481896 84013728 85570559 86168303 86140948 85672176 84987877 84686995
31218 84686995 85496459 87737439 91231203 95591549 100285797 104460984 107178876 108144289
31210 108144289 108066591 108040802 108561317 109271187 109619829 109518910 109233031 108814130 107946932
31201 107946932 106451065 104764968 103741071 103981470 105515331 108112948 111691530 116251891
31193 116251891 121523224 126887314 131727522 135813114 139381396 142964291 147149358 152362378
31185 152362378 158725224 166067161 174054312 182264632 190134478 196936402 201957984 204795304
31177 204795304 205516457 204615565 202904847 201419480 201154211 202507086 204782644 206375200
31169 206375200 205733939 202354224 196923920 190617732 184338507 178524336 173377910 169052709
$$ packed form
31227G6874656J861228K746012K531832J556831N97744k7355m68772o84299l00882
31218H4686995Q09464K240980L493764M360346M694248M175187K717892R65413
31210A08144289p7698k5789N20515P09870L48642j00919k85879m18901q67198
31201A07946932j495867j686097j023897K40399J533861K597617L578582M560361
31193A16251891N271333N364090M840208M085592L568282L582895M185067N213020
31185A52362378O362846P341937P987151Q210320P869846O801924N021582K837320
31177B04795304P21153r00892j710718j485367k65269J352875K275558J592556
31169B06375200o41261l379715n430304o306188o279225n814171n146426m325201
$$ plain form
31161 169052709 165648657 163180802 161614917 160894603 160900819 161399229 162081908 162753259 163534509
31152 163534509 164800023 166725978 168827565 170080051 169692970 167834894 165545249 163871820
31144 163871820 163070238 162641300 162110103 161638749 161728250 162372455 162807464 162302486 161012196
31135 161012196 159759085 159092767 158957027 159283599 160391686 162456201 164860853 166495404
31127 166495404 166677706 165565675 163737258 161603614 159198840 156314578 152802533 148850416
31119 148850416 144896196 141147700 137331900 133150169 128852601 125018049 121773314 118584391
31111 118584391 114933313 110939998 107225741 104463552 103217532 103866491 106261438 109499523
31103 109499523 112354676 114059018 114621203 114486251 114098829 113801420 113909162 114663613 116080396
$$ packed form
31161A69052709l404052k467855j565885p20314O216M98410O82679O71351P81250
31152A63534509J265514J925955K101587J252486l87081j858076k289645j673429
31144A63871820q01582m28938n31197m71354Q9501O44205M35009n04978j290290
31135A61012196j253111o66318j35740L26572J108087K064515K404652J634551
31127A66495404J82302j112031j828417k133644k404774k884262l512045l952117
31119A48850416l954220l748496l815800m181731m297568l834552l244735l188923
31111A18584391l651078l993315l714257k762189j246020O48959K394947L238085
31103A09499523K855153J704342N62185j34952l87422k97409J07742P54451J416783
$$ plain form
31094 116080396 117889561 119641595 120880747 121270576 120664596 119184212 117254606 115400706
31086 115400706 113785291 111924869 109061281 104962089 100278069 95987938 92541903 89687031
31078 89687031 87100218 84958866 83701554 83295831 82995178 81985292 80190234 78269676
31070 78269676 76841691 75906308 75065697 74037893 72747372 71118315 69124740 67008016
31062 67008016 65086288 63213829 60678271 56850445 51873379 46634674 42175114 39176075
31054 39176075 37788390 37675866 38219185 38869108 39410516 39878005 40241077 40238622 39537512
31045 39537512 38028461 35955076 33741448 31683593 29848390 28306718 27371880 27458278
31037 27458278 28702018 30840255 33458677 36200953 38704813 40535751 41370400 41247131
$$ packed form
31094A16080396J809165J752034J239152L89829o05980j480384j929606j853900
31086A15400706j615415j860422k863588m099192m684020m290131l446035k854872
31078H9687031k586813k141352j257312m05723l00653j009886j795058j920558
31070G8269676j427985r35383q40611j027804j290521j629057j993575k116724
31062F7008016j921728j872459k535558l827826m977066n238705m459560k999039
31054C9176075j387685j12524N43319O49923N41408M67489L63072k455p01110
31045C9537512j509051k073385k213628k057855j835203j541672r34838Q6398
31037B7458278J243740K138237K618422K742276K503860J830938Q34649j23269
$$ plain form
31029 41247131 40604349 40099858 40309209 41360041 42731642 43538045 43160009 41612208 39339260
31020 39339260 36825273 34426532 32309630 30317032 28020784 25186371 22243546 20179631
31012 20179631 19890566 21560651 24502600 27507945 29519920 30213419 30009309 29548045 29238326
31003 29238326 29272630 29756789 30562672 31218241 31273086 30781436 30190236 29732897 29175413 28265161
30993 28265161 27250178 26763837 27187327 28210038 29098709 29451069 29633209 30339667 31730043
30984 31730043 33217227 34200250 34756999 35387472 36260388 37023887 37288562 37006956 36401885
30975 36401885 35800224 35539821 35746118 36124631 36205013 35855584 35340009 34822478 34091407
30966 34091407 32904551 31388870 29952052 28971142 28677384 29117006 30008651 30770052 30896007
$$ packed form
31029D1247131o42782n04491K09351J050832J371601Q06403l78036j547801k272948
31020C9339260k513987k398741k116902j992598k296248k834413k942825k063915
31012B0179631k89065J670085K941949L005345K011975O93499k04110m61264l09719
31003B9238326L4304M84159Q05883O55569N4845m91650n91200m57339n57484r10252
30993B8265161j014983m86341M23490J022711Q88671L52360J82140P06458J390376
30984C1730043J487184R83023N56749O30473Q72916P63499K64675k81606o05071
30975C6401885o01661k60403K06297L78513Q0382l49429n15575n17531p31071
30966C4091407j186856j515681j436818r80910k93758M39622Q91645P61401J25955
$$ plain form
30957 30896007 30279499 29094254 27524865 25767637 24133189 22879042 21938367 20978682
30949 20978682 19736691 18190053 16442351 14599717 12801809 11280056 10318639 10139776
30941 10139776 10784704 12077362 13722553 15424466 16880375 17790904 18120344 18351846 19179331
30932 19179331 20764308 22492219 23645977 24122224 24236777 24009659 23031646 21055561 18408675
30923 18408675 15716740 13424351 11675039 10482994 9894169 10048465 11102799 12968519
30915 12968519 15119832 16869580 17960927 18765738 19779793 21020561 22065299 22636207
30907 22636207 22987808 23647729 24824253 26143655 27016273 27245932 27209505 27425346 28057685
30898 28057685 28907785 29728071 30349890 30605435 30410452 29960245 29600622 29413415 29113697
$$ packed form
30957C0896007o16508j185245j569389j757228j634448j254147r40675r59685
30949B0978682j241991j546638j747702j842634j797908j521753r61417j78863
30941A0139776O44928J292658J645191J701913J455909R10529L29440K31502Q27485
30932A9179331J584977J727911J153758M76247J14553k27118r78013j976085k646886
30923A8408675k691935k292389j749312j192045n88825J54296J054334J865720
30915A2968519K151313J749748J091347Q04811J014055J240768J044738N70908
30907B2636207L51601O59921J176524J319402Q72618K29659l6427K15841O32339
30898B8057685Q50100Q20286O21819K55545j94983m50207l59623j87207k99718
$$ plain form
30889 29113697 28410156 27224243 25466771 22957601 19903463 17255411 16141988 16851442
30881 16851442 18583407 20211742 21074055 21058090 20326620 19223904 18260009 17884407 18254274
30872 18254274 19342814 21205191 23931846 27284817 30526243 32759768 33499597 32935448
30864 32935448 31704743 30470559 29714656 29816049 31128586 33847867 37831429 42631236
30856 42631236 47682453 52413199 56283315 58926629 60300767 60571482 59846719 58218510
30848 58218510 56136225 54506688 54190885 55438566 57919048 61185627 64948870 69041143
30840 69041143 73436764 78377788 84268434 91322537 99395867 108188886 117503246 127317234
30832 127317234 137828484 149519063 162972933 178406483 195413093 213301732 231657931
$$ packed form
30889B9113697p03541j185913j757472k509170l054138k648052j113423P09454
30881A6851442J731965J628335Q62313j5965p31470j102716r63895l75602L69867
30872A8254274J088540J862377K726655L352971L241426K233525P39829n64149
30864C2935448j230705j234184p55903J01393J312537K719281L983562M799807
30856D2631236N051217M730746L870116K643314J374138K70715p24763j628209
30848E8218510k082285j629537l15803J247681K480482L266579L763243M092273
30840F9041143M395621M941024N890646P054103Q073330Q793019R314360R813988
30832A27317234J0511250J1690579J3453870J5433550J7006610J7888639J8356199
$$ plain form
30825 231657931 250465751 269708346 288950558 307285264 323569601 336712844 345886756
30818 345886756 350614368 350745312 346411841 338050494 326421055 312464124 296961885 280190892
30810 280190892 261877045 241624328 219570833 196677095 174311478 153558695 134991157
30803 134991157 118990752 105968196 96074340 88819870 83157708 77934607 72264874 65705705
30795 65705705 58352898 50770395 43637581 37375278 32098802 27787407 24327670 21467348
30787 21467348 18953962 16759058 15033275 13848362 13137836 12875527 13100473 13707180 14397708
30778 14397708 14930007 15251798 15291977 14795994 13540005 11612079 9327518 6946250 4643248
30769 4643248 2694669 1447931 1011570 1118604 1442452 2011923 3176957 5099994 7345715
$$ packed form
30825B31657931J8807820J9242595J9242212J8334706J6284337J3143243R173912
30818C45886756M727612J30944m333471q361347j1629439j3956931j5502239j6770993
30810B80190892j8313847k0252717k2053495k2893738k2365617k0752783j8567538
30803A34991157j6000405j3022556r893856p254470n662162n223101n669733o559169
30795F5705705p352807p582503p132814o262303n276476m311395l459737k860322
30787B1467348k513386k194904j725783j184913p10526k62309K24946O06707O90528
30778A4397708N32299L21791M0179m95983j255989j927926k284561k381268k303002
30769D643248j948579j246738m36361J07034L23848N69471J165034J923037K245721
$$ plain form
30760 7345715 9082970 9732402 9379114 8555432 7731511 7089893 6663929 6470816 6455645
30751 6455645 6436137 6188933 5572516 4618275 3641420 3257531 4074567 6203887 9122031
30742 9122031 12085720 14618309 16556329 17795315 18210680 17838029 16979340 16043156 15301012
30733 15301012 14815168 14565670 14586114 14909557 15365427 15537059 15077578 14093219 13104760
30724 13104760 12584402 12594212 12867030 13115828 13245671 13402315 13840151 14572252 15107648 14774369
30714 14774369 13463363 11865785 10772065 10274585 9857012 9094790 7962167 6545420
$$ packed form
30760G345715J737255O49432l53288q23682q23921o41618m25964j93113j5171
30751F455645j9508k47204o16417r54241r76855l83889Q17036K129320K918144
30742I122031K963689K532589J938020J238986M15365l72651q58689r36184p42144
30733A5301012m85844k49498K0444L23443M55870J71632m59481r84359r88459
30724A3104760n20358R810K72818K48798J29843J56644M37836P32101N35396l33279
30714A4774369j311006j597578j093720m97480m17573p62222j132623j416747
$$ [...]
##END NTUPLES=NMR SPECTRUM
##END=
