##TITLE=31Pdec_IPACAT-33-8
  CD3CN
  24 sc
 6.10.2023
##JCAMPDX= 6.0         $$ Bruker NMR JCAMP-DX V2.0
##DATA TYPE= NMR SPECTRUM
##DATA CLASS= NTUPLES
##ORIGIN= UXNMR, Bruker Analytische Messtechnik GmbH
##OWNER= root
$$ XWIN-NMR		Version 3.5
$$ Fri Oct  6 15:48:57 2023 Russian Standard Time (UT+4h)  she@DPX200
##.OBSERVE FREQUENCY= 81.013821
##.OBSERVE NUCLEUS= ^31P
##.ACQUISITION MODE= SIMULTANEOUS
##.ACQUISITION SCHEME= undefined
##.AVERAGES= 24
##.DIGITISER RES= 16
##SPECTROMETER/DATA SYSTEM= spect
##.PULSE SEQUENCE= zgpg30
##.SOLVENT NAME= CD3CN
##.SHIFT REFERENCE= (INTERNAL, CD3CN, 0, 248.564)
##AUDIT TRAIL= $$ (NUMBER, WHEN, WHO, WHERE, WHAT)
$$ ##TITLE= Audit trail, XWIN-NMR		Version 3.5
$$ ##JCAMPDX= 5.01
$$ ##ORIGIN= Bruker BioSpin GmbH
$$ ##OWNER= she
$$ F:/spectra/data/she/nmr/P31/1/pdata/1/auditp.txt
$$ ##AUDIT TRAIL=  $$ (NUMBER, WHEN, WHO, WHERE, WHAT)
(   1,<2023-10-06 15:47:45.89 +0400>,<she>,<DPX200>,
      <created by zg, POWCHK disabled, PULCHK disabled
       configuration hash MD5:
       00 E9 B6 7A A2 85 ED C7 34 08 36 98 17 FE 4E 26
       data hash MD5: 32K
       F2 60 57 B0 EF A5 BF A5 8A 92 9F BE B9 08 A1 86>)
(   2,<2023-10-06 15:47:48.43 +0400>,<she>,<DPX200>,
      <Start of raw data processing
       efp BC_mod = 2 LB = 5 FT_mod = 6 PKNL = 1 PHC0 = -10748.91 PHC1 = 230.4864 SI = 64K 
       data hash MD5: 64K
       36 A6 FE 11 F7 4F CF 95 4A F7 95 13 BA F1 BB F7>)
(   3,<2023-10-06 15:48:28.03 +0400>,<she>,<DPX200>,
      <pk PHC0 = 74.29453 PHC1 = -163.8 
       data hash MD5: 64K
       8F F7 57 B6 3F CF 77 C9 61 B4 65 42 06 17 BD F6>)
$$ ##END=
$$ 
$$ hash MD5
$$ 53 E2 C7 82 28 B0 E2 4C 5F 75 AB 47 E4 C3 E3 48
##$RELAX= 
##$RELAX= 
##$RELAX= 
##$RELAX= 
##$RELAX= 
##$RELAX= 
##$RELAX= 
##$RELAX= 
##$RELAX= 
$$ Bruker specific parameters
$$ --------------------------
##$DU= <F:/spectra>
##$EXPNO= 1
##$NAME= <P31>
##$PROCNO= 1
##$TYPE= <nmr>
##$USER= <she>
##$AMP= (0..31)
100 100 100 100 100 100 100 100 100 100 100 100 100 100 100 100 100 100 
100 100 100 100 100 100 100 100 100 100 100 100 100 100 
##$AQSEQ= 0
##$AQ_mod= 1
##$AUNM= <au_zg>
##$AUTOPOS= <>
##$BF1= 81.014009
##$BF2= 200.13
##$BF3= 200.13
##$BF4= 200.13
##$BF5= 200.13
##$BF6= 200.13
##$BF7= 200.13
##$BF8= 200.13
##$BYTORDA= 1
##$CFDGTYP= 0
##$CFRGTYP= 5
##$CHEMSTR= <none>
##$CNST= (0..31)
1 1 145 1 1 1 1 1 1 1 1 1 1 1 1 1 1 1 1 1 1 1 1 1 1 1 1 1 1 1 1 1 
##$CPDPRG= <waltz16>
##$CPDPRG1= <>
##$CPDPRG2= <waltz16>
##$CPDPRG3= <>
##$CPDPRG4= <mlev>
##$CPDPRG5= <mlev>
##$CPDPRG6= <mlev>
##$CPDPRG7= <mlev>
##$CPDPRG8= <mlev>
##$CPDPRGB= <>
##$CPDPRGT= <>
##$D= (0..31)
0 1 0 0 0 0 0 0 0 0 0 0.03 2e-05 3e-06 0 0 0 0 0 0 0 0 0 0 0 0 0 0 0 0 
0 0 
##$DATE= 1696592865
##$DBL= (0..7)
120 120 120 11 120 120 24 19 
##$DBP= (0..7)
150 150 150 150 150 150 150 150 
##$DBP07= 0
##$DBPNAM0= <>
##$DBPNAM1= <>
##$DBPNAM2= <>
##$DBPNAM3= <>
##$DBPNAM4= <>
##$DBPNAM5= <>
##$DBPNAM6= <>
##$DBPNAM7= <>
##$DBPOAL= (0..7)
0.5 0.5 0.5 0.5 0.5 0.5 0.5 0.5 
$$ [...]
##$SUBNAM2= <"">
##$SUBNAM3= <"">
##$SUBNAM4= <"">
##$SUBNAM5= <"">
##$SUBNAM6= <"">
##$SUBNAM7= <"">
##$SUBNAM8= <"">
##$SUBNAM9= <"">
##$SW= 501.771253377433
##$SWIBOX= (0..15)
0 1 3 0 0 0 0 0 0 0 0 0 0 0 0 0 
##$SW_h= 40650.406504065
##$TD= 32768
##$TD0= 1
##$TE= 0
##$TE2= 300
##$TE3= 300
##$TEG= 300
##$TL= (0..7)
0 120 53 12 22 120 120 120 
##$TP= (0..7)
150 150 150 150 150 150 150 150 
##$TP07= 0
##$TPNAME0= <>
##$TPNAME1= <>
##$TPNAME2= <>
##$TPNAME3= <>
##$TPNAME4= <>
##$TPNAME5= <>
##$TPNAME6= <>
##$TPNAME7= <>
##$TPOAL= (0..7)
0.5 0.5 0.5 0.5 0.5 0.5 0.5 0.5 
##$TPOFFS= (0..7)
0 0 0 0 0 0 0 0 
##$TUNHIN= 0
##$TUNHOUT= 0
##$TUNXOUT= 0
##$USERA1= <user>
##$USERA2= <user>
##$USERA3= <user>
##$USERA4= <user>
##$USERA5= <user>
##$V9= 5
##$VALIST= <valist>
##$VCLIST= <CCCCCCCCCCCCCCC>
##$VD= 0
##$VDLIST= <DDDDDDDDDDDDDDD>
##$VPLIST= <PPPPPPPPPPPPPPP>
##$VTLIST= <TTTTTTTTTTTTTTT>
##$WBST= 1024
##$WBSW= 4
##$XGAIN= (0..3)
0 0 0 0 
##$XL= 0
##$YL= 0
##$YMAX_a= 5038
##$YMIN_a= -4006
##$ZGOPTNS= <>
##$ZL1= 120
##$ZL2= 120
##$ZL3= 120
##$ZL4= 120
##$ABSF1= 0
##$ABSF2= 0
##$ABSG= 0
##$ABSL= 0
##$ALPHA= 0
##$AQORDER= 0
##$ASSFAC= 0
##$ASSFACI= 0
##$ASSFACX= 0
##$ASSWID= 0
##$AUNMP= <proc_1d>
##$AZFE= 0.1
##$AZFW= 0.5
##$BCFW= 0
##$BC_mod= 2
##$BYTORDP= 0
##$COROFFS= 0
##$CY= -3
##$DATMOD= 1
##$DC= 0
##$DFILT= <>
##$DTYPP= 0
##$F1P= 0
##$F2P= 0
##$FCOR= 1
##$FTSIZE= 65536
##$FT_mod= 6
##$GAMMA= 0
##$GB= 0
##$INTBC= 1
##$INTSCL= 6.047779e-11
##$ISEN= 30
##$LB= 5
##$LEV0= 0
##$LPBIN= 0
##$MAXI= 10000
##$MC2= 0
##$MEAN= 0
##$ME_mod= 0
##$MI= 50
##$NCOEF= 0
##$NC_proc= -8
##$NLEV= 6
##$NOISF1= 182.463
##$NOISF2= 159.3651
##$NSP= 0
##$NTH_PI= 0
##$NZP= 0
##$OFFSET= 248.5645
##$PC= 4
##$PHC0= -10674.62
##$PHC1= 66.6864
##$PH_mod= 1
##$PKNL= yes
##$PPARMOD= 0
##$PSCAL= 0
##$PSIGN= 0
##$REVERSE= no
##$SF= 81.0140089999694
##$SI= 65536
##$SIGF1= 159.3651
##$SIGF2= -187.1042
##$SINO= 113.3802
##$SIOLD= 16384
##$SREGLST= <1H.CDCl3>
##$SSB= 0
##$STSI= 65536
##$STSR= 0
##$SW_p= 40650.406504065
##$SYMM= 0
##$S_DEV= 0
##$TDeff= 32768
##$TDoff= 0
##$TI= <>
##$TILT= no
##$TM1= 0
##$TM2= 0
##$TOPLEV= 0
##$USERP1= <user>
##$USERP2= <user>
##$USERP3= <user>
##$USERP4= <user>
##$USERP5= <user>
##$WDW= 1
##$XDIM= 65536
##$YMAX_p= 427852478
##$YMIN_p= -43710039
$$ End of Bruker specific parameters
$$ ---------------------------------
##NTUPLES= NMR SPECTRUM
##VAR_NAME=  FREQUENCY,     SPECTRUM/REAL,   SPECTRUM/IMAG
##SYMBOL=    X,             R,               I
##VAR_TYPE=  INDEPENDENT,   DEPENDENT,       DEPENDENT
##VAR_FORM=  AFFN,          ASDF,            ASDF
##VAR_DIM=   65536,         65536,           65536
##UNITS=     HZ,            ARBITRARY UNITS, ARBITRARY UNITS
##FACTOR=    0.620285442955139, 1,           1
##FIRST=     20137.2065510682, 0,            0
##LAST=      -20513.1999529968, 0,           0
##MIN=       -20513.1999529968, -43710039,   0
##MAX=       20137.2065510682, 427852478,    0
$$ Real data points
##PAGE= N=1
##DATA TABLE= (X++(R..R)), XYDATA
$$ [...]
40719 -2744208 -2508306 -2242164 -2008326 -1797964 -1485522 -926552 -113984 775901 1500199
40710 1500199 1910873 2006344 1848898 1472825 899755 224091 -362522 -652046 -520803 28599
40700 28599 872806 1797883 2578668 3094528 3376630 3516238 3528918 3337563 2892324 2274966
40690 2274966 1661309 1190834 888943 703325 579070 479910 367437 213793 46821 -64715
40680 -64715 -108257 -176774 -366459 -637584 -838880 -879943 -824291 -793187 -834894 -925517 -1049822
40669 -1049822 -1229959 -1503977 -1920339 -2519428 -3258225 -3966519 -4437407 -4567250 -4375016
40660 -4375016 -3910371 -3210945 -2348986 -1446481 -614539 78305 565921 776756 707398 461965
40650 461965 172951 -97356 -353353 -602972 -842558 -1082779 -1341905 -1612193 -1857789 -2042873
40640 -2042873 -2151645 -2202592 -2260406 -2400806 -2627220 -2845192 -2957805 -2964757 -2921722 -2824103
40630 -2824103 -2599897 -2227701 -1802860 -1456720 -1244697 -1137244 -1089685 -1089768 -1148072 -1258320
40620 -1258320 -1359275 -1338158 -1103846 -677321 -198218 160989 270124 52793 -497204 -1255784
40610 -1255784 -1961815 -2349335 -2327005 -2032864 -1723991 -1609346 -1736958 -1981442 -2136832 -2060240
40600 -2060240 -1745129 -1259475 -648135 60919 773421 1322210 1579119 1554241 1376199 1200954
40590 1200954 1138913 1214207 1349479 1410656 1307693 1056376 736996 423036 179618 98713
40580 98713 265442 661335 1127875 1451987 1489795 1218467 703576 42577 -669338 -1348202
40570 -1348202 -1925568 -2365875 -2683219 -2915182 -3052703 -3012777 -2730905 -2295943 -1947720 -1893724
40560 -1893724 -2132246 -2479232 -2755231 -2916506 -3021866 -3131930 -3264105 -3399488 -3482552 -3423989
40550 -3423989 -3151977 -2683434 -2131502 -1629434 -1245145 -958684 -701034 -412183 -88221
40541 -88221 203419 359777 316451 103438 -165083 -353584 -368527 -191348 116055 430574
40531 430574 619540 612337 443261 219006 24896 -148875 -387005 -755818 -1239800 -1768938
40521 -1768938 -2275956 -2690973 -2895175 -2744687 -2188663 -1357154 -507457 122067 418856
40512 418856 409439 210505 -54927 -349996 -750021 -1350076 -2136919 -2969636 -3682896 -4183768
40502 -4183768 -4458501 -4537052 -4471057 -4306763 -4048618 -3668657 -3163719 -2569836 -1906763 -1165196
40492 -1165196 -398561 217003 495214 418094 149937 -134021 -392787 -700763 -1148874 -1786339
40482 -1786339 -2602050 -3511896 -4380563 -5085226 -5550424 -5724090 -5577049 -5176147 -4729009
40473 -4729009 -4486193 -4565943 -4877086 -5203741 -5354067 -5255594 -4954621 -4534959 -4019730 -3358102
40463 -3358102 -2532969 -1671452 -1004555 -697797 -739499 -996401 -1340744 -1700685 -2020769 -2225233
40453 -2225233 -2237609 -2028803 -1647912 -1213404 -864797 -702300 -756333 -993795 -1325229 -1605428
40443 -1605428 -1679522 -1492440 -1164694 -919932 -902841 -1067825 -1251695 -1339552 -1342861 -1330490
40433 -1330490 -1323888 -1286210 -1199779 -1111371 -1069121 -1024450 -839325 -424664 132428 603373 791117
40422 791117 668532 359241 10126 -305802 -583556 -820507 -979050 -1017912 -948109 -833182
40412 -833182 -717000 -565490 -309237 55412 436059 720855 853920 823009 616899 240269
40402 240269 -245034 -733627 -1124077 -1322139 -1222009 -756326 8406 864626 1576321 1981847
40392 1981847 2001081 1620582 921258 68804 -798000 -1662971 -2568120 -3466788 -4203409 -4652673
40382 -4652673 -4832926 -4865180 -4859577 -4861608 -4869561 -4865543 -4839797 -4804988 -4778119 -4745014 -4674405 -4588167
40370 -4588167 -4583739 -4742014 -5021754 -5285304 -5430435 -5460288 -5416983 -5291895 -5037080 -4642966
40360 -4642966 -4163186 -3663206 -3175340 -2701056 -2208653 -1605060 -763317 347374 1555786
40351 1555786 2574497 3223656 3538357 3639021 3551971 3212983 2614620 1877699 1175017
40342 1175017 639560 350161 337564 560841 905558 1234033 1425651 1375476 1013767 368064
40332 368064 -423539 -1197685 -1851526 -2337389 -2628399 -2741978 -2764609 -2785405 -2800276 -2719597
40322 -2719597 -2464669 -2021773 -1420902 -720077 -9791 630562 1201939 1760950 2298655
40313 2298655 2689542 2803758 2646256 2344970 2009722 1633740 1136624 486770 -229644
40304 -229644 -875144 -1413496 -1979642 -2747117 -3706102 -4606823 -5139795 -5137100 -4594996 -3595938
40294 -3595938 -2302520 -982335 96943 849952 1389727 1825414 2101009 2077937 1718045
40285 1718045 1111694 359040 -482759 -1324208 -2002632 -2375250 -2421190 -2211440 -1809432 -1256886
40275 -1256886 -648843 -158471 50131 -77733 -478054 -1026752 -1586769 -2028747 -2256388
40266 -2256388 -2227638 -1938222 -1389511 -600669 339891 1264826 1999950 2450855 2621232 2571758
40256 2571758 2383581 2142499 1913444 1712574 1523902 1353923 1246013 1218467 1204185 1083289
40246 1083289 779018 304607 -276437 -897563 -1477656 -1894849 -2021571 -1803851 -1294478
40237 -1294478 -603857 168371 950093 1669898 2243697 2598617 2706339 2595345 2341851
40228 2341851 2050208 1820776 1705414 1677750 1652689 1546551 1322593 987040 567299 115743
40218 115743 -284527 -568316 -769461 -1030926 -1499528 -2200535 -3013031 -3746421 -4226450 -4340222
40208 -4340222 -4060324 -3460588 -2703153 -1993688 -1526657 -1428593 -1707327 -2250658 -2899320 -3527012
40198 -3527012 -4042275 -4347824 -4367177 -4132211 -3796614 -3526842 -3398547 -3405958 -3514920 -3657199
40188 -3657199 -3713826 -3585711 -3297670 -2986824 -2762847 -2594713 -2338977 -1861971 -1141874 -290840
40178 -290840 500754 1061346 1314109 1285836 1068522 783738 555975 470725 529842 643881
40168 643881 667382 456958 -54435 -792829 -1561196 -2165299 -2539513 -2747442 -2886123 -3019771
40158 -3019771 -3173275 -3322698 -3394959 -3349105 -3278369 -3360792 -3659863 -4021907 -4227660 -4218156
40148 -4218156 -4118937 -4062863 -4047847 -3963391 -3697310 -3200833 -2498326 -1671749 -825204 -46244
40138 -46244 598975 1044116 1228331 1140060 841392 436455 21582 -336950 -608114 -810028
40128 -810028 -1013007 -1297072 -1683829 -2107481 -2452354 -2613594 -2529894 -2192504 -1657286 -1039949
40118 -1039949 -454058 72829 603823 1198133 1836332 2460654 3052149 3615188 4103407
40109 4103407 4430485 4569219 4580620 4513144 4319532 3913766 3277058 2466843 1551209 587542
40099 587542 -344077 -1136952 -1702467 -2007227 -2082250 -2019563 -1936071 -1899198 -1900212 -1940803 -2124551
40088 -2124551 -2589925 -3332322 -4148341 -4796540 -5191710 -5425836 -5638452 -5900410 -6190731
40079 -6190731 -6432442 -6550794 -6534727 -6452975 -6391366 -6371351 -6345613 -6266440 -6124817 -5911223
40069 -5911223 -5573850 -5057836 -4386400 -3671743 -3028670 -2489218 -2009003 -1535274 -1048482
40060 -1048482 -559648 -111030 217416 348170 285228 136207 30233 18789 62504 86645
40050 86645 27057 -142626 -372416 -526547 -467344 -174725 245504 691379 1171625 1745153
40040 1745153 2363223 2818681 2890138 2542007 1965341 1408612 977462 615759 264202 -17136
40030 -17136 -111962 3411 222666 413334 517750 549894 534442 471720 343476 133147
40020 133147 -155256 -487947 -805636 -1032944 -1099182 -994586 -828355 -781968 -938248 -1165267
40010 -1165267 -1234944 -1074869 -858072 -827587 -1073781 -1499818 -1953409 -2347584 -2673967 -2937200
40000 -2937200 -3083935 -3004418 -2635532 -2067211 -1504994 -1103752 -861496 -674368 -436377 -64235
39990 -64235 496659 1214313 1949734 2560744 3009485 3314005 3426309 3249596 2794566 2255748
39980 2255748 1899580 1893205 2220429 2696515 3056150 3108353 2872471 2550783 2339756 2271831
39970 2271831 2228164 2054836 1659954 1076895 499987 217558 417157 1021024 1732485 2247513
39960 2247513 2412754 2217770 1711778 960760 44180 -958113 -1982325 -2966433 -3821217
39951 -3821217 -4439109 -4751652 -4778514 -4604558 -4294155 -3829187 -3142967 -2215577 -1123186
39942 -1123186 3157 1036374 1854460 2323539 2349355 1972727 1378390 765729 206477
39933 206477 -356150 -978762 -1613888 -2129868 -2401275 -2370299 -2054395 -1527162 -878276 -158028
39923 -158028 640056 1518653 2403890 3167047 3724746 4081156 4253215 4192336 3820697 3131706
39913 3131706 2222641 1240116 327751 -385406 -802914 -900171 -730723 -382478 54555 473954
39903 473954 748935 793616 641776 446889 383250 529165 826201 1133812 1316833 1293590
39893 1293590 1041482 610345 142906 -176014 -259475 -206668 -199185 -296707 -378980 -306044 -88746
39882 -88746 129307 214970 126523 -111037 -445793 -818162 -1193354 -1579801 -1973157 -2286240
39872 -2286240 -2401285 -2322050 -2219138 -2269628 -2476210 -2694050 -2817730 -2880841 -2970480 -3114993
39862 -3114993 -3299230 -3546461 -3920343 -4443304 -5051823 -5638008 -6103449 -6366911 -6362523 -6067364
39852 -6067364 -5519077 -4778471 -3877438 -2825619 -1671448 -539439 407357 1053760 1400805
39843 1400805 1558340 1654492 1734675 1753472 1665058 1487748 1251878 918308 414032 -236680
39833 -236680 -857729 -1222634 -1199984 -807097 -161055 609737 1439244 2328533 3257057 4095773
39823 4095773 4667196 4919904 4992625 5061865 5163942 5207952 5111531 4848731 4395481 3724942
39813 3724942 2869874 1914351 902324 -177087 -1283827 -2277125 -3030446 -3559506 -3984520
39804 -3984520 -4388832 -4756580 -5022539 -5129496 -5047732 -4793877 -4444510 -4100162 -3821990 -3609408
39794 -3609408 -3420085 -3183345 -2816074 -2285675 -1680932 -1191373 -986648 -1102211 -1413003
39785 -1413003 -1685189 -1679084 -1285231 -613115 79731 594610 939582 1268594 1692343 2163314
39775 2163314 2521160 2616323 2400181 1940121 1370586 814910 332848 -69536 -397351 -652909
39765 -652909 -857836 -1060290 -1301807 -1580274 -1845383 -2013895 -1984183 -1667974 -1054812 -260774
39755 -260774 513020 1104369 1484650 1728460 1897187 1967797 1873388 1587022 1147858 624250
39745 624250 85041 -392293 -723691 -859986 -818744 -652828 -388495 -14014 465552 978418
39735 978418 1403178 1634441 1636615 1456883 1207258 1024618 1008626 1160384 1371749 1491014
39725 1491014 1422106 1177623 849360 535734 289755 112618 -21653 -131713 -206356 -219046
39715 -219046 -173676 -122735 -113195 -115560 -42426 139539 334076 372678 135070 -400414 -1189376
39704 -1189376 -2140308 -3087660 -3807783 -4141238 -4134199 -4041086 -4144935 -4534997 -5041598 -5392098
39694 -5392098 -5436846 -5224433 -4877205 -4441748 -3887501 -3213606 -2502336 -1874724 -1441196 -1288410
39684 -1288410 -1442187 -1804378 -2165667 -2321912 -2169355 -1693600 -938776 -39931 771260
39675 771260 1285362 1443383 1294409 844602 34147 -1114002 -2396696 -3532673 -4330052
39666 -4330052 -4733296 -4771112 -4529212 -4148049 -3763369 -3413971 -3031889 -2536837 -1924566 -1261033
39656 -1261033 -617483 -33411 464218 833790 1042561 1129877 1220764 1430364 1740485 1997762
39646 1997762 2049061 1861085 1512907 1128793 849727 807968 1041905 1433376 1789740 2006897
39636 2006897 2122085 2214533 2305552 2356132 2292810 2006075 1392035 467546 -575419 -1488562
39626 -1488562 -2143819 -2563373 -2797821 -2840388 -2678922 -2376546 -2047565 -1761585 -1508684 -1267620
39616 -1267620 -1082506 -1047561 -1214462 -1524162 -1829264 -1972063 -1845019 -1414846 -739194 25053
39606 25053 662475 991597 945716 586197 55486 -497441 -996384 -1481089 -2062735 -2814413
39596 -2814413 -3704132 -4627720 -5467999 -6100876 -6395429 -6282766 -5830667 -5200738 -4521429
39587 -4521429 -3843565 -3220054 -2756334 -2533183 -2522843 -2641744 -2867813 -3243588 -3754482 -4249382
39577 -4249382 -4506361 -4371747 -3860266 -3174049 -2625564 -2462457 -2693166 -3089054 -3399355
39568 -3399355 -3567253 -3715963 -3948376 -4219891 -4417863 -4502585 -4514475 -4465329 -4288074 -3920519
39558 -3920519 -3410864 -2908018 -2539804 -2298343 -2036294 -1582709 -897880 -146470 388765
39549 388765 503118 215723 -257815 -664853 -858481 -834316 -690613 -566324 -568629 -710375
39539 -710375 -920175 -1137974 -1387947 -1718798 -2071550 -2254625 -2087035 -1558878 -839916 -153758
39529 -153758 334621 540514 437238 47753 -552310 -1237717 -1842931 -2191921 -2168651 -1788950
39519 -1788950 -1188934 -521021 131813 731118 1205783 1451891 1424788 1203755 942691 763893
39509 763893 707617 764647 926967 1199449 1577494 2022667 2454965 2771712 2899517 2854525
39499 2854525 2748542 2706864 2760917 2828310 2802554 2641713 2355734 1944291 1408139 829103
39489 829103 379946 207150 315565 586535 877163 1068961 1065667 833995 469797 166033
39479 166033 76091 229187 578881 1062809 1562884 1865598 1767214 1248527 507507 -189274
39469 -189274 -660176 -843064 -771111 -559147 -352238 -212680 -62839 221867 676265 1231938
39459 1231938 1804547 2325733 2697857 2807615 2630663 2267723 1822495 1283013 591866
39450 591866 -182823 -826310 -1154986 -1171401 -1018995 -825974 -633865 -451139 -316202 -286578
39440 -286578 -389878 -608205 -909915 -1280866 -1705937 -2118033 -2400552 -2489401 -2476723 -2565029
39430 -2565029 -2886149 -3386095 -3900574 -4295374 -4491793 -4410171 -3989585 -3279704 -2442048 -1627743
39420 -1627743 -904608 -333053 -46400 -174422 -689919 -1382310 -1995187 -2370637 -2474972
39411 -2474972 -2337378 -1997806 -1509816 -975320 -548785 -364495 -433099 -630254 -817395 -958705
39401 -958705 -1087354 -1182785 -1156054 -984921 -810221 -839171 -1154215 -1645048 -2124992 -2492508
39391 -2492508 -2789073 -3134445 -3611102 -4176086 -4661319 -4885196 -4806412 -4576792 -4422066 -4463134
39381 -4463134 -4661756 -4919579 -5178355 -5413313 -5594958 -5715860 -5816410 -5906381 -5870694 -5538656
39371 -5538656 -4873517 -4031255 -3206464 -2485936 -1883989 -1429013 -1127074 -897021 -651220
39362 -651220 -427405 -341945 -404957 -473073 -413322 -240654 -64137 29385 -5278 -197099 -527496
39351 -527496 -897754 -1187006 -1344196 -1402410 -1422292 -1439263 -1431124 -1305009 -949842 -350836
39341 -350836 353491 954048 1303455 1366386 1191736 879466 544358 263185 67348 7885
39331 7885 180400 626433 1235749 1809110 2206984 2389351 2351676 2128145 1868978 1804055
39321 1804055 2052689 2504562 2931479 3184150 3249481 3169723 2980203 2723983 2474911 2324386
39311 2324386 2350788 2582695 2959436 3330702 3529792 3473686 3202830 2834046 2472712 2144247
39301 2144247 1790021 1344801 843376 444946 323070 516053 888751 1241045 1449142
39292 1449142 1511366 1482947 1387189 1189015 836426 310856 -358887 -1108624 -1851896 -2501871
39282 -2501871 -3012243 -3402363 -3725889 -4010340 -4237750 -4381067 -4439830 -4435015 -4385690 -4302650
39272 -4302650 -4199069 -4096193 -4004876 -3884436 -3626546 -3128867 -2427946 -1735448 -1280787 -1101227
39262 -1101227 -1021267 -848679 -558583 -279001 -139667 -159957 -253588 -313840 -310557 -323606 -471233
39251 -471233 -801969 -1272995 -1814972 -2355659 -2767991 -2876365 -2587284 -1991393 -1288706 -635790
39241 -635790 -107938 231285 313836 137739 -204116 -595650 -972991 -1319839 -1621306 -1844686
39231 -1844686 -1955112 -1943303 -1844594 -1721449 -1608853 -1485681 -1323260 -1156109 -1079111 -1172715
39221 -1172715 -1441157 -1808621 -2156669 -2388000 -2489721 -2528736 -2567523 -2611780 -2666761 -2789996
39211 -2789996 -3010249 -3220128 -3247574 -3047140 -2733119 -2398674 -2000816 -1490430 -977589 -662304
39201 -662304 -613736 -693914 -708186 -584501 -402783 -292303 -315246 -428770 -549080 -647190
39191 -647190 -756440 -876380 -915505 -778202 -490911 -197105 -36050 -64825 -280113 -646801
39181 -646801 -1081928 -1463418 -1710417 -1862442 -2063676 -2455487 -3061433 -3750238 -4307029 -4560287
39171 -4560287 -4463408 -4086999 -3577823 -3132357 -2941367 -3077358 -3426902 -3776293 -3974160 -3992015
39161 -3992015 -3854293 -3577077 -3188112 -2748002 -2313872 -1905800 -1523579 -1164729 -812778
39152 -812778 -448674 -100854 147605 230704 160491 10610 -116863 -92661 198795 745448
39142 745448 1360046 1817336 2043778 2134752 2209099 2313567 2460307 2663613 2888049 3007360
39132 3007360 2869147 2397650 1633831 725519 -93247 -576980 -616871 -336989 -2367 194500
39122 194500 252416 281815 343569 381797 294827 45430 -308978 -689215 -1077812 -1508647
39112 -1508647 -1980685 -2423822 -2777506 -3075714 -3410172 -3808878 -4177177 -4354594 -4207809
39103 -4207809 -3694127 -2903385 -2063267 -1448854 -1221097 -1337543 -1625176 -1925995 -2169298
39094 -2169298 -2346595 -2464924 -2519694 -2476840 -2276630 -1882820 -1341665 -782249 -351551 -144872
39084 -144872 -178534 -406974 -769321 -1232180 -1777258 -2335875 -2762775 -2913627 -2744169 -2308604
39074 -2308604 -1686429 -968589 -305775 119657 227979 116350 -39184 -130227 -143600 -103370
39064 -103370 -60907 -122885 -402886 -908456 -1504152 -1997096 -2240841 -2183410 -1891507 -1553518
39054 -1553518 -1391376 -1501930 -1791129 -2088038 -2298423 -2422115 -2469346 -2435553 -2354634 -2302335
39044 -2302335 -2312216 -2333889 -2318472 -2318714 -2447362 -2725156 -3011350 -3125852 -3044470 -2946706 -3037809
39033 -3037809 -3309431 -3492681 -3281152 -2621406 -1782811 -1137566 -874426 -913958 -1057193 -1169927
39023 -1169927 -1226659 -1235175 -1178708 -1041463 -858759 -714743 -691531 -830880 -1139852 -1611093
39013 -1611093 -2217722 -2888600 -3509053 -3971550 -4238916 -4354153 -4384015 -4365695 -4326989 -4346461
39003 -4346461 -4542029 -4953349 -5441003 -5745532 -5672113 -5211433 -4488462 -3643855 -2807320 -2155080
38993 -2155080 -1907304 -2209920 -3017174 -4097645 -5139590 -5854753 -6050368 -5697865 -4968623
38984 -4968623 -4157384 -3506788 -3079232 -2795785 -2586845 -2490739 -2614386 -3017760 -3637535 -4309144
38974 -4309144 -4863597 -5219675 -5389626 -5394054 -5191301 -4727851 -4062158 -3390171 -2906516 -2660074
38964 -2660074 -2585894 -2655391 -2918423 -3373036 -3865650 -4196294 -4309190 -4318308 -4342068 -4370398
38954 -4370398 -4313702 -4129174 -3861106 -3599283 -3451693 -3529723 -3880585 -4408657 -4906823 -5193251
38944 -5193251 -5195469 -4897885 -4271005 -3316619 -2166360 -1068489 -249543 186420 217847 -178530
38934 -178530 -1010240 -2166018 -3382999 -4367488 -4964151 -5203513 -5194302 -4996178 -4607409 -4045544
38924 -4045544 -3393594 -2754606 -2186755 -1699633 -1293348 -974723 -741227 -574901 -463525
38915 -463525 -424413 -505240 -751929 -1149775 -1583188 -1880443 -1933339 -1770436 -1493505 -1158954
38905 -1158954 -758269 -303064 130279 465983 699741 870426 982750 987937 826330 464392
38895 464392 -88646 -757828 -1399643 -1872046 -2140658 -2303527 -2486664 -2710215 -2865248 -2825432
38885 -2825432 -2579065 -2249519 -1988382 -1852633 -1781290 -1672196 -1467544 -1180869 -868753 -572507
38875 -572507 -259340 175763 807008 1558205 2220632 2618155 2734133 2660992 2470849 2186593
38865 2186593 1856775 1596088 1538985 1779972 2343982 3158051 4036138 4737850 5084592 5032168
38855 5032168 4659812 4132306 3660874 3423833 3469849 3708396 4006915 4271846 4433131 4413478
38845 4413478 4169291 3740482 3215811 2664493 2141739 1738078 1550735 1577555 1674742 1653330
38835 1653330 1420840 1040952 689981 564491 785962 1335265 2054202 2722400 3163828
38826 3163828 3322106 3274498 3183385 3201892 3378381 3621077 3748189 3583425 3031284 2101765
38816 2101765 899448 -400581 -1589566 -2483121 -2984836 -3111940 -2955161 -2602431 -2092163
38807 -2092163 -1429871 -637592 218661 1044092 1745773 2239255 2429023 2213582 1558452
38798 1558452 584618 -452712 -1329136 -2008991 -2620212 -3276733 -3951943 -4514679 -4836967
38789 -4836967 -4856957 -4600104 -4184673 -3762257 -3386575 -2949516 -2299335 -1424646 -481926 356665
38779 356665 1037077 1602392 2093862 2502720 2784949 2889531 2794217 2550617 2287531 2134323
38769 2134323 2123641 2173850 2167774 2043562 1813230 1509959 1138216 688862 197435 -235116
38759 -235116 -491736 -495926 -214412 357140 1159473 2022912 2709170 3039592 2981608 2610719
38749 2610719 2015983 1261046 418318 -390561 -1008549 -1318618 -1329202 -1184142 -1065666 -1079821
38739 -1079821 -1239806 -1528954 -1926198 -2373948 -2791036 -3152867 -3510694 -3888649 -4199113
38730 -4199113 -4310234 -4174939 -3850198 -3416693 -2937272 -2477735 -2095777 -1789778 -1501333
38721 -1501333 -1182457 -831905 -475930 -168122 -6656 -70775 -296480 -475943 -449742 -279124
38711 -279124 -170629 -237514 -387199 -448667 -364013 -234704 -211641 -365990 -647510 -931577
38701 -931577 -1095379 -1069272 -845932 -458419 55651 681761 1416873 2215821 2958574 3504719
38691 3504719 3793878 3870145 3798483 3590807 3240551 2798450 2364967 2008359 1724185 1476738
38681 1476738 1246396 1025013 790428 503502 124570 -363455 -927656 -1478877 -1916468
38672 -1916468 -2188872 -2296082 -2238178 -2001898 -1622204 -1229714 -997185 -1032206 -1328998 -1804182
38662 -1804182 -2345679 -2829720 -3136351 -3192737 -3012148 -2681474 -2305228 -1958448 -1675476 -1450291
38652 -1450291 -1227985 -921122 -487616 -14006 315928 381837 251490 108732 54129 10088
38642 10088 -171965 -553316 -1080013 -1673430 -2297539 -2933639 -3516635 -3911002 -3960395 -3594079
38632 -3594079 -2912935 -2153268 -1524512 -1068482 -687248 -300608 45103 216748 114938
38623 114938 -242803 -726105 -1166300 -1451287 -1569686 -1565901 -1462181 -1242435 -902353 -481277
38613 -481277 -42480 335873 532981 402607 -113532 -884406 -1647251 -2192717 -2482599 -2584889
38603 -2584889 -2530411 -2270853 -1770694 -1099551 -409046 166093 558987 734438 648182 272936
38593 272936 -351301 -1123556 -1936833 -2707874 -3365843 -3854632 -4162579 -4323333 -4369972 -4308434
38583 -4308434 -4148308 -3928347 -3680668 -3389649 -3021429 -2581639 -2104964 -1595884 -1034308
38574 -1034308 -458890 3419 235084 235814 94884 -125231 -416115 -717311 -844837 -602813
38564 -602813 14153 762409 1319922 1518034 1415643 1184755 957091 768794 606066 471850
38554 471850 410990 481763 698623 994133 1242264 1336335 1262556 1110867 1013064 1046264 1163760
38543 1163760 1209027 1015406 515999 -228589 -1093432 -1962375 -2746051 -3366273 -3761080 -3916824
38533 -3916824 -3889799 -3790100 -3730710 -3765767 -3857376 -3903956 -3816242 -3580617 -3259950 -2934472 -2625242
38522 -2625242 -2258618 -1719332 -970542 -126635 616736 1131950 1424909 1569757 1632883 1673615
38512 1673615 1753951 1888488 2011557 2051456 2031212 2047687 2146011 2250853 2231325 2018424
38502 2018424 1674693 1378852 1314531 1503634 1731769 1692462 1247529 539206 -151607 -627579
38492 -627579 -869364 -985343 -1113886 -1331723 -1595250 -1769038 -1741048 -1511598 -1164301 -779751
38482 -779751 -408811 -107618 53297 31777 -152888 -438514 -761986 -1078426 -1343320 -1482960
38472 -1482960 -1404220 -1065881 -545502 -3774 438153 770863 1044906 1290705 1520915 1774702
38462 1774702 2100741 2491498 2864572 3109329 3135146 2899740 2443315 1901920 1442810 1158527
38452 1158527 1034189 1018954 1103473 1317777 1676324 2140211 2620056 3006949 3217234 3227296
38442 3227296 3072038 2815387 2527584 2279302 2134830 2139381 2308171 2610642 2952409 3193604
38432 3193604 3221359 3014542 2629072 2128339 1541731 875283 139577 -617474 -1279127 -1688152
38422 -1688152 -1764646 -1602020 -1404318 -1321861 -1380400 -1551203 -1807500 -2082180 -2245385 -2198422
38412 -2198422 -1974567 -1705854 -1504743 -1403330 -1375003 -1369786 -1346315 -1313670 -1334060 -1448607
38402 -1448607 -1607809 -1704418 -1661603 -1461689 -1119405 -685241 -267359 14231 120453 112238
38392 112238 73193 47724 56976 127479 277810 499777 764898 1027531 1221876 1295256 1258255
38381 1258255 1168154 1050042 871595 610347 299327 -22884 -363594 -741647 -1152031 -1625945
38371 -1625945 -2285571 -3241907 -4422890 -5578943 -6497084 -7157708 -7643235 -7954734 -8003480
38362 -8003480 -7769912 -7378944 -6975502 -6580747 -6132650 -5643763 -5244047 -5048365 -5038002 -5114987
38352 -5114987 -5236976 -5439828 -5733770 -6037278 -6243053 -6325544 -6361843 -6452719 -6619253 -6753533
38342 -6753533 -6676132 -6287461 -5685189 -5101541 -4699634 -4453319 -4239009 -3997709 -3763342 -3569051
38332 -3569051 -3392234 -3187552 -2920879 -2573825 -2179921 -1878919 -1874158 -2270025 -2942841 -3591471
38322 -3591471 -3929713 -3860152 -3510747 -3122213 -2868054 -2746714 -2638469 -2459587 -2246596 -2104805
38312 -2104805 -2113646 -2278532 -2516417 -2664337 -2565189 -2214653 -1812902 -1624287 -1785655 -2270518
38302 -2270518 -2997144 -3893552 -4851927 -5701148 -6289944 -6589719 -6690727 -6708939 -6716829 -6751884
38292 -6751884 -6858678 -7097211 -7493239 -7969494 -8339276 -8408298 -8117624 -7590911 -7029782 -6555513
38282 -6555513 -6145844 -5710348 -5209689 -4694703 -4241235 -3878254 -3608944 -3489101 -3625901
38273 -3625901 -4057435 -4658380 -5211851 -5569860 -5708215 -5643935 -5372317 -4909296 -4332699 -3726704
38263 -3726704 -3111990 -2473733 -1833443 -1241670 -714532 -239785 144570 337937 285277 73721
38253 73721 -115219 -147713 -20962 170519 315002 337579 228781 63396 -20275 90249
38243 90249 375606 671224 787269 662284 405872 201433 181369 388278 814406 1431561
38233 1431561 2169726 2892076 3429770 3669613 3615180 3353853 2961173 2452490 1836234 1184676
38223 1184676 609561 170377 -150529 -371807 -459389 -382344 -192324 -7489 71778 8404
38213 8404 -184234 -464165 -790779 -1173734 -1668315 -2266048 -2810591 -3109659 -3152736 -3141344
38203 -3141344 -3257514 -3461069 -3569900 -3484706 -3254684 -2953813 -2592427 -2164550 -1697331 -1210780
38193 -1210780 -688224 -143427 315518 549024 513459 297216 42511 -137044 -186243 -129293
38183 -129293 -90389 -241213 -664117 -1261124 -1828603 -2231841 -2496933 -2743299 -3053695 -3403127
38173 -3403127 -3669244 -3694617 -3387707 -2820536 -2220715 -1815295 -1658202 -1625504 -1576509 -1483020
38163 -1483020 -1389976 -1296502 -1126803 -816266 -393992 30093 349750 538145 658519 808829
38153 808829 1051499 1387053 1770691 2119127 2302608 2192338 1780210 1246533 852067 727976
38143 727976 778690 797930 674188 494282 470699 760607 1317011 1901402 2264307 2323264
38133 2323264 2147375 1782428 1157089 200558 -988731 -2147697 -3013646 -3455855 -3480918
38124 -3480918 -3188773 -2741095 -2304278 -1961219 -1685576 -1429137 -1219985 -1141923 -1219220 -1354155
38114 -1354155 -1399807 -1293995 -1116679 -1013266 -1059170 -1202929 -1346781 -1466903 -1620173 -1827549
38104 -1827549 -1999503 -2023993 -1906559 -1761084 -1652825 -1514198 -1260350 -946263 -741056 -745790
38094 -745790 -887858 -1006971 -1001550 -875043 -691690 -533519 -469239 -503812 -553783 -510491 -332389
38083 -332389 -49851 301814 691938 1028242 1154588 974491 554732 69244 -335488 -588171
38073 -588171 -655772 -540598 -310916 -54879 230857 660540 1331712 2199197 3085628 3778404
38063 3778404 4106139 3991136 3502160 2847143 2261163 1886115 1761733 1888456 2238685
38054 2238685 2717999 3184501 3537579 3763786 3890663 3930205 3875852 3716066 3433289 3024728
38044 3024728 2547385 2112454 1808384 1652408 1637271 1785705 2109446 2532246 2911208 3148658
38034 3148658 3251361 3272876 3236367 3140040 3013143 2922262 2903512 2898766 2780395 2458357 1969931
38023 1969931 1459470 1071524 874179 873718 1052334 1351357 1644094 1788389 1730492 1535993
38013 1535993 1310335 1108741 922935 720166 478878 214009 -14267 -145646 -203278 -314011
38003 -314011 -610412 -1110930 -1708886 -2261008 -2660338 -2844660 -2794317 -2552880 -2226167 -1923379
37993 -1923379 -1680871 -1438361 -1093879 -603185 -46581 409855 643679 670977 601940 515948
37983 515948 409607 256698 66612 -136141 -345056 -545693 -685458 -716405 -658467 -574867
37973 -574867 -478545 -300662 25915 462834 853160 1010065 840906 421128 -52609 -418718
37963 -418718 -677280 -940980 -1256458 -1512509 -1551105 -1342522 -1019408 -754716 -634382 -629661
37953 -629661 -649690 -620863 -554252 -547407 -690408 -953304 -1184346 -1232102 -1059282 -742764 -400181
37942 -400181 -134181 -7631 -20250 -109287 -212803 -348283 -604145 -1030382 -1543004 -1951217
37932 -1951217 -2083208 -1891160 -1454835 -905161 -342360 196849 714529 1197939 1584782
37923 1584782 1780143 1704582 1315573 589183 -470195 -1746171 -2946627 -3710286 -3857459
37914 -3857459 -3539869 -3107069 -2822436 -2726511 -2741151 -2822842 -2980343 -3201588 -3433443 -3629279
37904 -3629279 -3766380 -3800151 -3634113 -3172839 -2417756 -1501259 -601694 198200 964801 1804383
37894 1804383 2701984 3500306 4049827 4347876 4506336 4607707 4620433 4433503 3942882 3128667
37884 3128667 2100307 1071285 249118 -273344 -521139 -561032 -460110 -302547 -181979
37875 -181979 -144119 -159531 -171259 -157718 -152787 -233071 -479286 -896243 -1346031 -1603631 -1523041
37864 -1523041 -1141122 -607992 -50790 467338 896095 1166996 1215140 1005158 554544 -27073
37854 -27073 -540044 -808865 -834244 -808070 -945803 -1297922 -1719156 -2003123 -2046942 -1911510
37844 -1911510 -1739697 -1611071 -1474253 -1226586 -847705 -432076 -97652 104973 192163 198130
37834 198130 149130 62133 -49880 -150420 -148240 59076 462391 887880 1134049 1178195
37824 1178195 1203799 1401051 1770524 2142752 2355249 2373669 2266226 2118262 1982720 1868696
37814 1868696 1743377 1557231 1289523 964079 607756 205478 -281246 -853093 -1452107
37805 -1452107 -2009685 -2499567 -2928421 -3278250 -3475238 -3434442 -3149146 -2734416 -2361736 -2131530
37795 -2131530 -2012528 -1913102 -1793880 -1685286 -1609674 -1534220 -1416854 -1263791 -1119683 -1034905
37785 -1034905 -1077027 -1342160 -1890711 -2661439 -3492882 -4248361 -4887866 -5401386 -5717768 -5735035
37775 -5735035 -5439219 -4952930 -4451005 -4046314 -3762098 -3582580 -3494483 -3479387 -3493845 -3476708
37765 -3476708 -3373817 -3152566 -2808590 -2383309 -1980669 -1740661 -1754657 -1978103 -2231732 -2327027
37755 -2327027 -2232643 -2122828 -2224428 -2580069 -2967611 -3078949 -2781069 -2195645 -1557053 -1046312
37745 -1046312 -751328 -699762 -871723 -1219841 -1730222 -2431437 -3281872 -4075857 -4552304 -4618303
37735 -4618303 -4402843 -4069994 -3652762 -3121922 -2557088 -2160641 -2102683 -2407238 -2991704 -3759910
37725 -3759910 -4628290 -5495883 -6234720 -6730534 -6943668 -6936941 -6830464 -6705679 -6548823 -6294905
37715 -6294905 -5915286 -5443147 -4924503 -4376121 -3793810 -3169495 -2485030 -1717959 -890260
37706 -890260 -118731 402137 500264 152756 -453856 -1002648 -1241113 -1148606 -928573 -835733
37696 -835733 -1005286 -1423463 -2015002 -2723979 -3509392 -4276065 -4825806 -4915347 -4423001 -3488036
37686 -3488036 -2454324 -1628109 -1075252 -652537 -206260 292801 787495 1242470 1681352
37677 1681352 2134435 2573040 2898518 3000913 2845947 2509902 2116105 1734107 1356116
37668 1356116 973713 652384 510729 631757 999402 1505556 2005091 2377671 2563843
37659 2563843 2560462 2392006 2088078 1669044 1128323 441015 -364625 -1132843 -1627829 -1705401
37649 -1705401 -1435210 -1039381 -732058 -625207 -721775 -919273 -1037088 -929864 -607490 -199861
37639 -199861 206871 639570 1121955 1558516 1793435 1751940 1476892 1063110 619015 270883
37629 270883 125296 202515 439934 761636 1106372 1396978 1551201 1557172 1501520 1490538
37619 1490538 1559575 1666954 1737972 1693386 1481006 1133360 780498 553348 459097 376894
37609 376894 187904 -106339 -402860 -617821 -765663 -906938 -1027679 -1006596 -739016 -289736
37599 -289736 116382 274398 151939 -134241 -441562 -670473 -763936 -720025 -617280 -577254
37589 -577254 -672679 -883039 -1136071 -1364618 -1526680 -1614902 -1668006 -1743715 -1855221 -1946436
37579 -1946436 -1936094 -1762277 -1384441 -801523 -117503 445302 671354 511352 95084 -399688
37569 -399688 -840844 -1112391 -1086940 -713521 -120753 438883 784683 936133 1042742 1211170
37559 1211170 1415574 1556068 1575208 1512198 1455459 1447037 1428757 1281357 922946 378011
37549 378011 -236193 -771833 -1094793 -1101139 -750979 -130042 530172 942206 923423 498115
37539 498115 -141726 -762166 -1180925 -1287060 -1043761 -515650 125582 670729 976050 1007713
37529 1007713 811061 470564 92774 -225280 -447438 -597934 -681633 -626269 -345103 147909
37519 147909 721692 1222300 1540091 1586246 1282459 641834 -165103 -896521 -1414317 -1749737
37509 -1749737 -2001381 -2218398 -2404399 -2585748 -2814971 -3105551 -3401597 -3623598 -3722392 -3683568
37499 -3683568 -3509146 -3216842 -2839400 -2398915 -1892566 -1337618 -837417 -570010 -675941
37490 -675941 -1146904 -1826966 -2520404 -3101272 -3540211 -3855112 -4055273 -4140308 -4148026 -4174817
37480 -4174817 -4304909 -4502180 -4604979 -4469836 -4117905 -3711260 -3390871 -3174622 -3012135
37471 -3012135 -2878468 -2770203 -2643487 -2419680 -2065696 -1639055 -1244559 -964972 -827528
37462 -827528 -796915 -783292 -693924 -517480 -349768 -306007 -407436 -573745 -716517 -804624
37452 -804624 -836305 -789267 -617516 -259964 372161 1359486 2644190 3938104 4844628 5128724
37442 5128724 4854567 4255942 3525179 2752488 1992815 1293109 657512 62106 -472427
37433 -472427 -867835 -1063232 -1064339 -910768 -647176 -351873 -140378 -84348 -138688 -182410
37423 -182410 -123165 53541 301993 532944 626120 488641 136682 -290475 -610244 -695970
37413 -695970 -525106 -174345 219659 531758 725973 868859 1037087 1191716 1167220 831424
37403 831424 264612 -269792 -573873 -706577 -882114 -1206103 -1580632 -1857558 -1994527 -2038982
37393 -2038982 -2055563 -2130263 -2364516 -2767818 -3191224 -3454460 -3522996 -3487946 -3399143 -3216494
37383 -3216494 -2925785 -2597946 -2296833 -2008302 -1709881 -1452965 -1322775 -1347991 -1482825 -1648730
37373 -1648730 -1777560 -1863685 -2002834 -2324761 -2837886 -3376114 -3742178 -3867548 -3789698 -3527233
37363 -3527233 -3064763 -2450097 -1821556 -1309904 -957193 -749934 -688662 -790819 -1041297 -1367474
37353 -1367474 -1673047 -1905087 -2093710 -2308011 -2551665 -2718122 -2686311 -2466315 -2224103 -2149680
37343 -2149680 -2306740 -2599921 -2861603 -2971074 -2923738 -2807796 -2703901 -2594007 -2374807 -1973465
37333 -1973465 -1452025 -989961 -751855 -761261 -902847 -1051683 -1192435 -1399359 -1712769 -2069235
37323 -2069235 -2359496 -2524437 -2584637 -2612508 -2695337 -2882459 -3122419 -3271907 -3212894 -2959667
37313 -2959667 -2623907 -2289727 -1961089 -1622143 -1300379 -1052107 -904227 -817141 -703388 -508600
37303 -508600 -297811 -230860 -405774 -738971 -1039190 -1180041 -1157099 -1017372 -825555 -690061
37293 -690061 -700964 -784518 -701531 -268999 450329 1221839 1846277 2236176 2357417 2216720
37283 2216720 1911422 1591586 1326543 1059727 731817 412379 273635 449831 937914
37274 937914 1606626 2270082 2768195 3023145 3054534 2955258 2851017 2857669 3033705 3341459
37264 3341459 3654050 3821288 3752122 3450540 2984309 2430492 1860167 1365441 1057428 988587
37254 988587 1074608 1137048 1051073 833008 570874 308022 35694 -224565 -391347 -390954 -223255
37243 -223255 51340 366876 685148 998754 1318810 1650306 1969901 2230596 2383403 2385354
37233 2385354 2205318 1862782 1469831 1193696 1135070 1239178 1341778 1307879 1129999 909031
37223 909031 753094 684335 623302 458381 141513 -270215 -659049 -937105 -1114759 -1300197
37213 -1300197 -1623658 -2129046 -2717415 -3205395 -3463207 -3514262 -3508903 -3597338 -3806982 -4018661
37203 -4018661 -4059249 -3836351 -3397730 -2862380 -2302124 -1705304 -1050667 -384046 204133 670208
37193 670208 1062458 1463122 1887109 2240825 2380763 2214581 1757188 1116863 456929 -36771
37183 -36771 -211859 -39406 338646 680454 782023 556647 26334 -698229 -1426244 -1955685
37173 -1955685 -2206049 -2278318 -2351341 -2527840 -2800830 -3132318 -3498353 -3854399 -4123589 -4262051
37163 -4262051 -4304178 -4296743 -4195220 -3868953 -3230033 -2342736 -1390510 -539940 158196 757402
37153 757402 1348519 2017334 2822951 3752190 4679634 5418698 5855353 6027033 6056279 6029735
37143 6029735 5965687 5865315 5735182 5559890 5311116 5004190 4697673 4408876 4079247 3673471
37133 3673471 3275003 3006503 2850436 2612658 2095203 1273194 286964 -690548 -1535730
37124 -1535730 -2162281 -2505359 -2550552 -2361973 -2068076 -1817323 -1721199 -1793986 -1930525 -1970123
37114 -1970123 -1818520 -1527895 -1270138 -1229743 -1484388 -1939547 -2378262 -2624897 -2688640 -2719217
37104 -2719217 -2802218 -2837286 -2659746 -2255187 -1796976 -1473361 -1325780 -1261125 -1165418 -974474
37094 -974474 -680174 -331782 -37379 77208 -56396 -409398 -895508 -1451247 -2071374 -2757238
37084 -2757238 -3439682 -3987558 -4317093 -4472433 -4563930 -4636631 -4636610 -4502146 -4245343 -3942222
37074 -3942222 -3691707 -3594050 -3706214 -3974930 -4251845 -4416052 -4451716 -4372483 -4120755 -3611442
37064 -3611442 -2851947 -1944503 -969951 67494 1176129 2321113 3444296 4474606 5297209
37055 5297209 5784646 5915906 5830215 5715156 5656932 5617924 5513019 5263168 4818051 4196621
37045 4196621 3494360 2793342 2072035 1260192 380477 -424056 -1010217 -1324560 -1369285 -1165958
37035 -1165958 -809316 -496498 -415672 -603392 -951241 -1333937 -1682729 -1959743 -2147852 -2294086
37025 -2294086 -2503978 -2850971 -3319216 -3853300 -4413981 -4944597 -5333737 -5491780 -5465359 -5416622
37015 -5416622 -5472380 -5628616 -5803236 -5927275 -5959149 -5856993 -5586350 -5144526 -4547860 -3803211
37005 -3803211 -2917449 -1936802 -967690 -157758 363667 575677 618891 716662 993040 1370754
36995 1370754 1667580 1770294 1685776 1455773 1085760 564333 -90917 -817414 -1505697 -2011960
36985 -2011960 -2216812 -2099631 -1746707 -1287027 -832918 -457092 -170643 87695 397231
36976 397231 772478 1162761 1531388 1880186 2180688 2348395 2334604 2196985 2017788 1779648
36966 1779648 1390336 827733 200408 -350131 -762091 -1047471 -1211650 -1219852 -1044937 -730377
36956 -730377 -395549 -173563 -135964 -266397 -489059 -708178 -834783 -815477 -659151 -430165
36946 -430165 -217185 -124876 -274753 -742877 -1451479 -2152988 -2571232 -2570688 -2201767 -1637048
36936 -1637048 -1094021 -756792 -686112 -800990 -990930 -1233233 -1554088 -1898306 -2114378 -2081901
36926 -2081901 -1800848 -1352141 -837809 -377925 -86464 14056 18025 18298 -25406 -253157
36916 -253157 -736535 -1371533 -1947158 -2315208 -2501986 -2663370 -2923700 -3255412 -3523222 -3629812
36906 -3629812 -3580417 -3408204 -3100255 -2643235 -2110880 -1650674 -1375112 -1281414 -1263774 -1182400
36896 -1182400 -945787 -578372 -220123 -24200 -26775 -122343 -175563 -148080 -107054 -123526 -190430
36885 -190430 -250932 -280881 -302976 -319184 -282688 -177799 -92300 -142494 -322754 -487283 -499866
36874 -499866 -350663 -95964 265898 799426 1523462 2336032 3045893 3464364 3492383 3156441
36864 3156441 2558521 1774866 820340 -268391 -1345168 -2198575 -2690357 -2836628 -2776174
36855 -2776174 -2692786 -2739964 -2967218 -3290151 -3565881 -3723838 -3812597 -3921466 -4089945 -4304344
36845 -4304344 -4542731 -4785298 -4992910 -5110745 -5104136 -4978236 -4753683 -4428224 -3976648 -3403984
36835 -3403984 -2799516 -2315529 -2067091 -2049397 -2160440 -2293701 -2391460 -2421486 -2344922 -2136767
36825 -2136767 -1833718 -1544094 -1394120 -1443541 -1634997 -1827605 -1898871 -1828489 -1690020 -1571249
36815 -1571249 -1508288 -1484098 -1471989 -1477346 -1541814 -1701051 -1931710 -2148885 -2266712 -2259265 -2166097
36804 -2166097 -2060917 -2018141 -2066698 -2137745 -2082824 -1794765 -1310609 -760701 -230158 269778
36794 269778 685633 853577 617862 11445 -721368 -1291451 -1547597 -1520234 -1334924 -1108083
36784 -1108083 -905866 -757231 -666970 -608585 -529300 -389123 -199669 -20749 73921 28254
36774 28254 -167548 -449153 -692901 -796629 -756853 -656499 -588884 -610959 -739660 -936241
36764 -936241 -1092613 -1093776 -929813 -721388 -611315 -646056 -766146 -870744 -863144 -669284
36754 -669284 -270195 265387 797104 1180050 1335398 1275369 1059146 710779 191057 -522160
36744 -522160 -1336304 -2073290 -2608452 -2945661 -3151867 -3275076 -3355564 -3457065 -3615742 -3766728
36734 -3766728 -3769137 -3512797 -2993046 -2313350 -1650536 -1187414 -1013636 -1072400 -1225979 -1375436
36724 -1375436 -1502928 -1620518 -1724525 -1808516 -1892120 -2024022 -2262310 -2635801 -3095444 -3507821
36714 -3507821 -3729362 -3704671 -3492583 -3206635 -2937683 -2712203 -2500157 -2269523 -2041003 -1865581
36704 -1865581 -1740846 -1602119 -1435584 -1341356 -1399313 -1495118 -1377836 -910292 -189542 595999
36694 595999 1336423 1974249 2393978 2452549 2129822 1588687 1062527 700108 516010 462862
36684 462862 533266 779617 1216561 1712094 2027225 2008154 1731304 1435225 1318634 1414763
36674 1414763 1623335 1808356 1861850 1723449 1385771 900985 386721 8073 -94528 95373
36664 95373 440247 742609 885807 894024 876541 922714 1023256 1061674 891362 452807 -175537
36653 -175537 -845795 -1443169 -1906285 -2181907 -2224384 -2060452 -1813686 -1621090 -1521088 -1438914
36643 -1438914 -1288394 -1086017 -960950 -1044706 -1345720 -1738246 -2076159 -2300900 -2429154 -2467274
36633 -2467274 -2384407 -2169230 -1865539 -1525655 -1160343 -777249 -462232 -373054 -613063 -1112327
36623 -1112327 -1659118 -2066217 -2305975 -2483644 -2698440 -2949593 -3162041 -3262911 -3218759 -3027563
36613 -3027563 -2700750 -2241932 -1626693 -819041 166754 1221993 2173655 2856441 3162079
36604 3162079 3061659 2624442 2008403 1390676 880460 488088 159323 -162887 -469933
36595 -469933 -649039 -551883 -160882 324678 626241 616455 378925 64542 -233313 -457124
36585 -457124 -538946 -445815 -236349 -26306 80164 8706 -277083 -732287 -1230955 -1663131
36575 -1663131 -2010819 -2295157 -2502591 -2639234 -2826448 -3239164 -3918142 -4693162 -5308334
36566 -5308334 -5592621 -5530666 -5247748 -4942679 -4760224 -4684787 -4601965 -4487053 -4470137 -4670733
36556 -4670733 -5025100 -5339183 -5471158 -5392705 -5106184 -4603968 -3931680 -3216081 -2579665 -2052775
36546 -2052775 -1589283 -1131837 -633973 -57428 597566 1262259 1839640 2282907 2605195
36537 2605195 2803373 2810146 2561686 2107470 1616819 1259092 1090740 1065154 1122008 1230858
36527 1230858 1353677 1405495 1277810 898236 269578 -527698 -1357722 -2065993 -2515733 -2611361
36517 -2611361 -2325553 -1743407 -1073747 -560540 -335393 -350603 -455143 -516159 -472023 -323866
36507 -323866 -123199 48984 128576 92272 -70870 -366729 -730042 -991005 -989823 -728881
36497 -728881 -341585 102760 682493 1466317 2342089 3085550 3577004 3874761 4078269 4200029
36487 4200029 4204450 4104831 3949210 3726235 3355370 2801160 2165583 1632768 1332594 1287702
36477 1287702 1482776 1924343 2585890 3322125 3910434 4210383 4251054 4131389 3861656 3349746
36467 3349746 2542490 1540367 558963 -198716 -630547 -751126 -674699 -572950 -592726 -776696
36457 -776696 -1062677 -1354811 -1571120 -1624708 -1418126 -919053 -238683 414064 875856 1107323
36447 1107323 1138854 998833 728130 414106 141160 -86507 -317981 -545104 -668771 -596662
36437 -596662 -336636 33646 457849 922633 1400360 1809309 2048507 2073317 1946400 1817739
36427 1817739 1830281 2016950 2290532 2547136 2770783 3017841 3305235 3540560 3573092 3303276
36417 3303276 2739261 1963512 1063628 99065 -877445 -1784880 -2513430 -2961577 -3078099
36408 -3078099 -2885944 -2481119 -1993132 -1509462 -1022667 -463568 213611 998400 1862870
36399 1862870 2772909 3627717 4239986 4453651 4289726 3927173 3523534 3088122 2541111
36390 2541111 1848364 1056661 223662 -625783 -1455056 -2163976 -2620276 -2742655 -2529343
36381 -2529343 -2005176 -1185111 -135010 949942 1804179 2282917 2476195 2592735 2737428
36372 2737428 2836197 2771872 2550636 2324005 2278717 2516422 3008520 3640317 4302965 4946145
36362 4946145 5533977 5972184 6135205 5989735 5652511 5284660 4938948 4534297 3965526
36353 3965526 3215359 2380695 1627890 1113711 901852 930468 1070124 1221000 1355331 1489579
36343 1489579 1650831 1870303 2173015 2549801 2946358 3287078 3505188 3556370 3420447 3089278
36333 3089278 2540985 1742976 719196 -383355 -1338919 -1980467 -2276710 -2271961 -2001015
36324 -2001015 -1501343 -870505 -249521 247433 544177 560281 238696 -339983 -913107 -1169324
36314 -1169324 -946932 -303115 582074 1534597 2432989 3183774 3698428 3906194 3781964
36305 3781964 3357338 2708337 1936716 1155143 465880 -68304 -430643 -618207 -619318 -455060
36295 -455060 -240076 -152282 -301187 -633233 -987848 -1239251 -1370907 -1435489 -1482916 -1532983
36285 -1532983 -1588087 -1649422 -1717900 -1779066 -1792224 -1719675 -1590261 -1519611 -1627641 -1916320 -2237860
36274 -2237860 -2393507 -2271855 -1915749 -1483305 -1141313 -966361 -927177 -953905 -1011837 -1107749
36264 -1107749 -1260351 -1497637 -1857030 -2334442 -2835452 -3229605 -3467998 -3608198 -3713941
36255 -3713941 -3779261 -3772865 -3703680 -3595124 -3424829 -3139247 -2718327 -2191495 -1600826 -981113
36245 -981113 -368732 198824 686943 1047501 1218270 1176577 987714 761664 553307 329810
36235 329810 43867 -276616 -512380 -513896 -190979 426407 1202396 1973526 2612205 3026117
36225 3026117 3147284 2971717 2598800 2182921 1826945 1530068 1221873 816778 253793
36216 253793 -457603 -1204198 -1804389 -2098931 -2019715 -1611453 -1035780 -535781 -314109 -396586
36206 -396586 -636992 -875402 -1064852 -1227690 -1332195 -1266104 -936966 -377211 258617 808251
36196 808251 1232927 1638969 2150224 2758237 3323391 3721044 3944185 4051856 4070497 3985888
36186 3985888 3795012 3514809 3156778 2740471 2324938 1980547 1724592 1524019 1376820
36177 1376820 1364119 1602524 2147636 2930779 3755861 4353620 4489026 4080485 3248381 2246878
36167 2246878 1324878 610125 80101 -377303 -859475 -1371010 -1823303 -2101888 -2136556 -1917311
36157 -1917311 -1462055 -790702 59302 1004273 1924754 2714346 3308278 3663863 3745613 3566090
36147 3566090 3235973 2933834 2799490 2855559 3027877 3226003 3405526 3576070 3761446 3944413
36137 3944413 4052786 4018737 3856356 3667472 3573000 3652122 3927781 4360211 4842394 5249091
36127 5249091 5524114 5695033 5779158 5708618 5389137 4818277 4112263 3430587 2910530 2657495
36117 2657495 2727090 3063835 3465346 3653313 3435131 2840883 2113303 1540498 1275908 1312902
36107 1312902 1602500 2130014 2846821 3582562 4102918 4271798 4134423 3847751 3555327
36098 3555327 3315732 3107519 2889486 2674720 2544390 2566452 2706025 2846231 2900466 2880015
36088 2880015 2855241 2887138 3006211 3220557 3511731 3826638 4085845 4204750 4129283 3888119
36078 3888119 3613049 3466897 3521341 3715595 3940069 4127470 4239572 4209286 3972088 3574568
36068 3574568 3195935 3003055 2987893 2990080 2885626 2709635 2575686 2535543 2586398 2782766
36058 2782766 3232599 3942412 4739324 5408676 5870473 6173172 6367742 6470566 6523792 6592793
36048 6592793 6684866 6742132 6738079 6716932 6709060 6673470 6574887 6470879 6462287 6579806 6772557
36037 6772557 6997348 7267696 7607063 7987290 8324669 8522214 8522419 8348972 8110113 7946163
36027 7946163 7951900 8127922 8383562 8582297 8613350 8453522 8165836 7827060 7453946 7001968
36017 7001968 6431049 5773062 5146312 4701677 4530707 4614535 4877361 5291858 5899985 6712218
36007 6712218 7621667 8460261 9131197 9657028 10115422 10576792 11106489 11768997 12584857
35998 12584857 13499121 14427172 15334502 16253812 17222005 18213977 19142647 19918522 20515539
35989 20515539 21001027 21516030 22212037 23172892 24374917 25724211 27140803 28601863 30098315
35980 30098315 31571099 32931349 34165229 35403201 36856029 38665442 40812807 43171609
35972 43171609 45650832 48296449 51263316 54693740 58625823 63017490 67849663 73200422
35964 73200422 79231631 86122548 94017129 103022672 113260366 124935739 138373473 153985528
35956 153985528 172205503 193435408 217982900 245924222 276885435 309808621 342784905
35949 342784905 373067260 397445097 413066806 418420646 413866234 401316638 383310405
35942 383310405 362128402 339399189 316136626 292930535 270139798 248068009 227062320
35935 227062320 207454507 189407326 172866151 157711391 143946951 131682018 120909227
35928 120909227 111362343 102669029 94646167 87386924 81041096 75572208 70776254 66481214
35920 66481214 62630865 59168801 55937844 52767139 49636354 46709199 44217016 42334213
35912 42334213 41122463 40505881 40267750 40125454 39873372 39473868 39019532 38635513 38420733
35903 38420733 38424644 38620316 38913698 39235010 39628866 40213311 41042256 42051879 43162049
35894 43162049 44394073 45865087 47698140 49961009 52654975 55719956 59068982 62660670
35886 62660670 66542256 70815079 75592501 81024871 87332026 94757814 103509940 113800924
35878 113800924 125937727 140300303 157208690 176852665 199358984 224857625 253394986
35871 253394986 284691721 317829780 350988405 381440736 406020392 421984509 427852478
35864 427852478 423781294 411348641 392912720 370843748 346953627 322356641 297701314
35857 297701314 273452355 249992739 227621878 206601110 187200615 169634051 153953714
35850 153953714 140063207 127815429 117032173 107441726 98699932 90541922 82903050
35843 82903050 75877328 69576089 64022385 59136179 54792046 50898953 47422773 44315600
35835 44315600 41447948 38671329 35965628 33480688 31400940 29782087 28514703 27393475
35827 27393475 26198063 24774024 23127688 21458836 20043687 19032379 18345196 17761872
35819 17761872 17097739 16285491 15311993 14139414 12751650 11280407 10012953 9198694 8842165
35810 8842165 8725965 8636576 8521910 8422518 8316130 8087471 7634038 6964113 6205506 5552906
35800 5552906 5184900 5165121 5393442 5685302 5934142 6190449 6562136 7046847 7491413 7724817
35790 7724817 7709814 7548143 7356633 7172421 6977304 6765616 6546949 6300501 5979130 5578208
35780 5578208 5176973 4898115 4845377 5084166 5632455 6411435 7213154 7790760 8041023 8091272
35770 8091272 8165302 8348456 8500751 8405759 7982719 7342053 6663940 6061596 5555534 5129925
35760 5129925 4776704 4493829 4268839 4076684 3891921 3702336 3511007 3325473 3151507
35751 3151507 3002744 2903237 2859190 2828762 2738624 2533586 2199896 1755445 1252299 783674
35741 783674 435271 205700 19499 -139476 -136588 217160 967992 1935785 2819442 3376289
35731 3376289 3536761 3402480 3149359 2914319 2765712 2763876 2988702 3457371 4048110 4576233
35721 4576233 4948778 5188659 5302032 5195056 4776073 4119145 3485968 3175364 3340693
35712 3340693 3920211 4717780 5549985 6321297 6974790 7424123 7586875 7466402 7136579
35703 7136579 6639721 5964687 5153436 4370014 3810195 3566469 3617386 3918781 4452653 5189630
35693 5189630 6039248 6840247 7388562 7509176 7163333 6508768 5830065 5379344 5255287
35684 5255287 5386598 5586187 5635076 5386764 4855167 4212563 3679117 3391756 3360405 3519840
35674 3519840 3786530 4054038 4173446 4006643 3534138 2886965 2238350 1670433 1166473
35665 1166473 706823 318887 28409 -189112 -383565 -583488 -787947 -971131 -1069576 -992181
35655 -992181 -681527 -169059 437688 1011677 1451392 1707906 1801007 1796675 1741308 1619667
35645 1619667 1392101 1066019 713795 420433 221743 94489 10570 6624 182308 594091
35635 594091 1146142 1622344 1849344 1816702 1638627 1431267 1234967 1013801 705938 307871
35625 307871 -65221 -237441 -125970 183283 532163 820881 1010774 1057053 924278 662417
35615 662417 396578 222539 150503 150520 200389 274529 333448 353469 342134 306939 233161 110459
35603 110459 -35951 -154177 -194371 -128717 31347 224874 365881 394882 308095 145919
35593 145919 -29709 -153496 -181271 -107823 47174 262223 504033 708941 815310 826964
35583 826964 821230 885227 1059938 1341412 1702322 2100048 2488713 2838142 3129026 3332529
35573 3332529 3421333 3401088 3297224 3104938 2793006 2376176 1945989 1597209 1342416 1117315
35563 1117315 840218 441406 -124632 -834440 -1562459 -2136536 -2442827 -2463360 -2223490 -1738940
35553 -1738940 -1016085 -66104 1097661 2448596 3912739 5366045 6688467 7808949
35545 7808949 8678920 9223124 9364714 9117680 8625906 8075649 7567745 7095825 6648621
35536 6648621 6296600 6140127 6173292 6233859 6117539 5743652 5198252 4618940 4056476 3456639
35526 3456639 2755666 1961423 1138026 345257 -376088 -973182 -1377657 -1550864 -1514813 -1323430
35516 -1323430 -1013018 -589430 -51733 581022 1254439 1881835 2381338 2732026 2990716
35507 2990716 3240558 3521277 3804117 4013215 4062533 3896805 3522276 2994725 2373315 1703299
35497 1703299 1042174 455655 -43983 -518162 -1014385 -1482250 -1824819 -2010423 -2071038 -2002886
35487 -2002886 -1752583 -1330777 -877162 -564991 -465063 -521030 -612877 -606421 -377893 144612
35477 144612 938948 1888708 2823561 3584382 4104147 4443885 4706241 4889713 4874471 4590563
35467 4590563 4158822 3811673 3695383 3793035 4010661 4272462 4539284 4801755 5071381 5327852
35457 5327852 5457202 5292174 4756275 3960555 3148049 2551317 2282196 2297254 2437213 2534698
35447 2534698 2527335 2466123 2404353 2299600 2042574 1560000 865206 31800 -837666 -1613375
35437 -1613375 -2148118 -2324459 -2115892 -1618841 -1021047 -499832 -111399 216800 557122
35428 557122 847000 911372 624424 24474 -732045 -1488794 -2139919 -2608269 -2838789 -2825273
35418 -2825273 -2610473 -2246703 -1777357 -1262963 -795016 -457991 -282249 -238711 -260169 -257462
35408 -257462 -146933 93489 389087 616450 708097 715486 774692 1008854 1439406 1964654
35398 1964654 2428852 2737642 2914690 3038762 3135830 3153717 3033838 2775101 2423360 2032314
35388 2032314 1651592 1323676 1060511 829802 586121 316962 50756 -173441 -335308
35379 -335308 -441876 -520605 -600927 -689504 -753179 -716583 -475662 57985 880919 1851663
35369 1851663 2750507 3415617 3824126 4047617 4158639 4191515 4157153 4058852 3905909 3739124
35359 3739124 3628694 3611821 3633648 3577807 3357778 2961446 2423432 1802217 1196433 734135
35349 734135 492503 423464 385317 263210 55995 -154826 -306894 -409486 -492541 -526621
35339 -526621 -426060 -143247 253553 606017 764541 670323 371723 -24152 -438116 -874634
35329 -874634 -1366942 -1846886 -2112020 -1986471 -1513164 -928488 -426925 4153 491426 1067810
35319 1067810 1616099 2009574 2253869 2465099 2730656 3017042 3211654 3236684 3114500 2935283
35309 2935283 2783023 2694396 2655762 2602904 2432374 2064658 1532339 993786 630777 521275
35299 521275 603446 734382 762117 570442 119637 -518199 -1178172 -1684676 -1924131 -1849733
35289 -1849733 -1459346 -814918 -73325 564830 979181 1184014 1233152 1101983 723298 142830
35279 142830 -425303 -749577 -782275 -697946 -751348 -1102833 -1729363 -2439961 -2974707 -3142662
35269 -3142662 -2914078 -2409187 -1822495 -1350025 -1119123 -1113067 -1171863 -1135760 -1012872 -970067
35259 -970067 -1153117 -1563889 -2117712 -2733585 -3300288 -3613394 -3464975 -2834539 -1941209 -1070361
35249 -1070361 -363264 216757 746413 1202690 1454053 1376888 985255 446952 -44495 -424842
35239 -424842 -785381 -1256284 -1888063 -2639582 -3423543 -4115388 -4545326 -4558276 -4124834 -3380333
35229 -3380333 -2537338 -1766481 -1156498 -743266 -532435 -503332 -633757 -933761 -1429824 -2103145
35219 -2103145 -2860970 -3575771 -4132166 -4433821 -4413998 -4094160 -3631150 -3261217 -3160035 -3337665
35209 -3337665 -3645524 -3868564 -3836816 -3504660 -2956675 -2333784 -1745499 -1249135 -886236 -695093
35199 -695093 -678401 -794837 -1008870 -1332271 -1793916 -2373296 -2969035 -3415668 -3530714 -3197457
35189 -3197457 -2463509 -1560530 -774650 -251598 85454 435132 945840 1625624 2372344
35180 2372344 3052170 3552215 3796318 3753957 3457476 3004831 2520335 2091131 1735552 1429918
35170 1429918 1153976 901241 655113 377339 37897 -335851 -644960 -779005 -722067 -601639
35160 -601639 -601037 -799940 -1108910 -1363331 -1453928 -1355872 -1085602 -696397 -307120 -66301
35150 -66301 -54771 -245254 -556847 -902530 -1171758 -1233108 -1017817 -587350 -81312 384451
35140 384451 737941 913312 879514 724570 647340 817536 1256291 1861048 2506641 3098491
35130 3098491 3576618 3930271 4201958 4430125 4586676 4614479 4536734 4486884 4600216 4890986
35120 4890986 5247795 5521345 5594322 5402298 4951049 4331743 3681971 3100963 2613389 2229916
35110 2229916 2016080 2055213 2333937 2698954 2954844 2993324 2811153 2430277 1854594 1116304
35100 1116304 316113 -427970 -1065600 -1625036 -2149702 -2645506 -3072802 -3350056 -3370198 -3068923
35090 -3068923 -2511980 -1892118 -1404118 -1115855 -958406 -813683 -591199 -246633 225140
35081 225140 793163 1390199 1911081 2223914 2229563 1957028 1593450 1373886 1416441 1668781
35071 1668781 1998957 2296838 2483293 2480585 2233715 1759064 1137883 458590 -209246 -783867
35061 -783867 -1155041 -1237958 -1048826 -714396 -402617 -244036 -303815 -595942 -1099675 -1764344
35051 -1764344 -2513498 -3250791 -3863453 -4235422 -4283339 -3994460 -3428226 -2679599 -1840338 -980768
35041 -980768 -148443 612787 1224340 1564733 1542633 1195052 680922 152781 -343506 -826892
35031 -826892 -1283236 -1659446 -1938143 -2162710 -2374984 -2557998 -2655457 -2645630 -2611068 -2738826
35021 -2738826 -3194565 -3931052 -4643587 -4995148 -4904992 -4571578 -4221054 -3906880 -3557785 -3113367
35011 -3113367 -2549564 -1851703 -1056435 -287917 325893 758840 1054061 1220768 1244349 1185393
35001 1185393 1179094 1316537 1587621 1947607 2362410 2759305 3008399 3013645 2788669 2407500
34991 2407500 1929607 1428601 1052232 963541 1197367 1610205 1985662 2179424 2188339 2132317
34981 2132317 2172640 2391482 2715904 2986847 3132071 3246385 3459467 3730810 3819782 3478512
34971 3478512 2658297 1528853 343112 -682850 -1406473 -1778017 -1872269 -1860038 -1889945
34962 -1889945 -1988584 -2087401 -2126995 -2108599 -2064774 -2025892 -2017041 -2046281 -2079520 -2054402 -1937241
34951 -1937241 -1753134 -1556243 -1390057 -1275300 -1202339 -1125178 -1001674 -864510 -819142 -937958
34941 -937958 -1183831 -1477437 -1808769 -2211890 -2629056 -2883270 -2842426 -2569142 -2237158 -1904465
34931 -1904465 -1443999 -744219 56854 596557 560997 -75346 -1050541 -1988365 -2562229 -2587004
34921 -2587004 -2075180 -1235716 -351469 406649 1049785 1652590 2198580 2575513 2701354
34912 2701354 2604115 2368057 2041964 1633770 1183617 805417 629944 699311 918974 1116646
34902 1116646 1153918 996607 708081 403189 200850 170449 271911 340188 165536 -362955
34892 -362955 -1159640 -1973717 -2528575 -2668052 -2419161 -1955071 -1502524 -1241857 -1229590 -1378774
34882 -1378774 -1528973 -1571106 -1519559 -1468351 -1501394 -1660856 -1958483 -2343664 -2652777 -2668384
34872 -2668384 -2296571 -1674231 -1060906 -625076 -351752 -132131 102241 331714 489727
34863 489727 530325 470659 376584 297102 214020 71843 -140775 -353978 -465358 -417767 -231993
34852 -231993 22817 286290 544114 819463 1137701 1506448 1914130 2310540 2577500 2559718
34842 2559718 2169747 1463208 597867 -263861 -1003201 -1551543 -1917272 -2197253 -2500382
34833 -2500382 -2849356 -3203484 -3579281 -4078644 -4754295 -5485099 -6033807 -6226962 -6065744
34824 -6065744 -5682059 -5210390 -4693501 -4095121 -3398485 -2675470 -2036428 -1531216 -1146687
34815 -1146687 -892555 -818921 -925935 -1122276 -1316496 -1495471 -1660388 -1735444 -1613891 -1276957
34805 -1276957 -812290 -335997 53498 286657 379101 468517 700476 1050854 1327965 1371885
34795 1371885 1189683 883166 534853 213140 1578 -68427 -70334 -77449 -23112 245987
34785 245987 767489 1386660 1904621 2244893 2444101 2536759 2512193 2369859 2160375 1950560
34775 1950560 1764566 1568060 1301440 929408 475155 14982 -372792 -667208 -905946
34766 -905946 -1110973 -1221250 -1135851 -843287 -477272 -201375 -44486 104962 329107 542398
34756 542398 547233 205078 -463361 -1307747 -2125129 -2719549 -2958315 -2833153 -2476461 -2088217
34746 -2088217 -1809018 -1640880 -1491865 -1305417 -1135758 -1080688 -1157104 -1280669 -1365326 -1393714
34736 -1393714 -1374790 -1288783 -1119134 -901606 -688593 -485052 -265600 -28181 229876 565892
34726 565892 1035830 1575288 2021941 2293314 2470761 2657320 2820777 2856811 2766615 2676842
34716 2676842 2682911 2751204 2793772 2770323 2682018 2523587 2299014 2056144 1847425 1658461
34706 1658461 1419783 1096279 729860 385420 95842 -112774 -179898 -53684 223268 524927
34696 524927 766948 983792 1238063 1473096 1512214 1219749 633224 -67689 -683766 -1082213
34686 -1082213 -1231752 -1222443 -1230866 -1389553 -1658552 -1853824 -1820281 -1559956 -1193026 -839870
34676 -839870 -569756 -425657 -439628 -616257 -933988 -1369139 -1887203 -2398594 -2759965 -2860539
34666 -2860539 -2706268 -2395708 -2016240 -1592145 -1140941 -747132 -544132 -618773 -945924 -1417109
34656 -1417109 -1924492 -2420296 -2908967 -3391023 -3817931 -4106843 -4200229 -4102672 -3859806 -3520854
34646 -3520854 -3130135 -2725005 -2308316 -1837555 -1282822 -697028 -191091 169027 407600
34637 407600 575728 685005 721856 683763 570762 382975 170992 52101 109948 282025
34627 282025 399578 344518 130862 -153416 -418170 -575014 -545742 -321958 15741 382719
34617 382719 775044 1230664 1718639 2107182 2251406 2106353 1772882 1453836 1339404 1481317
34607 1481317 1755040 1954912 1933940 1658700 1165787 514729 -207247 -871657 -1339491 -1526791
34597 -1526791 -1459850 -1282307 -1196016 -1358967 -1813416 -2499746 -3318733 -4160435 -4890912 -5363540
34587 -5363540 -5478873 -5231688 -4697600 -3994591 -3266102 -2664536 -2295952 -2157022 -2139678 -2118032
34577 -2118032 -2041325 -1948275 -1896986 -1883931 -1831278 -1653064 -1334597 -952237 -624874 -445728
34567 -445728 -438894 -555855 -717901 -891459 -1131665 -1523901 -2059957 -2592852 -2947073 -3067553
34557 -3067553 -3031553 -2925343 -2764136 -2556802 -2396412 -2416068 -2648938 -2980081 -3258088 -3420848
34547 -3420848 -3487446 -3468793 -3353374 -3186112 -3095526 -3188060 -3429483 -3673259 -3806876 -3833463
34537 -3833463 -3802780 -3711625 -3519153 -3242871 -2981051 -2815697 -2725263 -2627006 -2491708 -2379492
34527 -2379492 -2360458 -2439416 -2583313 -2790966 -3078531 -3379941 -3508729 -3284571 -2725928 -2095466
34517 -2095466 -1715959 -1719115 -1969224 -2220776 -2332523 -2336997 -2354150 -2487373 -2788113 -3250570
34507 -3250570 -3795616 -4286242 -4608404 -4748109 -4775969 -4762488 -4719876 -4600980 -4316925 -3773638
34497 -3773638 -2957567 -2012308 -1183966 -642375 -361442 -189292 -6779 211165 450749
34488 450749 702077 930420 1053459 989191 727250 343520 -55446 -408911 -734496 -1075934
34478 -1075934 -1400868 -1563725 -1407457 -914590 -239831 409181 906851 1244380 1488137
34469 1488137 1725713 2004146 2269427 2375736 2187885 1678052 923254 51906 -768438
34460 -768438 -1334451 -1491972 -1256237 -813436 -376668 -55013 140850 221365 189463 62361
34450 62361 -123986 -328230 -489508 -504767 -260690 286767 1064629 1906925 2614460 3015110
34440 3015110 3025508 2695088 2181997 1660515 1240701 964195 841018 857367 955263 1037302
34430 1037302 1005591 792132 368040 -235563 -898989 -1442781 -1734794 -1779345 -1679869 -1511558
34420 -1511558 -1258341 -887286 -450897 -70725 182570 356443 544592 771462 976669
34411 976669 1104935 1181711 1298692 1553409 2008736 2670086 3461892 4237325 4848774 5218832
34401 5218832 5332840 5185890 4789588 4242929 3746493 3498117 3569895 3884222 4272782 4541218
34391 4541218 4533765 4212446 3679344 3075603 2452679 1777799 1054362 371013 -186673 -609384
34381 -609384 -909569 -1050742 -998112 -813577 -628477 -514181 -426337 -283540 -59401 209339
34371 209339 459369 625475 668202 608925 520504 467076 473747 562996 774915 1108423 1465794
34360 1465794 1704513 1742360 1577334 1219642 671746 3432 -610102 -995278 -1132089 -1165297
34350 -1165297 -1256115 -1442172 -1637850 -1731843 -1666779 -1460952 -1194372 -959731 -780224 -566440
34340 -566440 -192247 362748 965238 1441368 1726268 1895083 2075594 2352901 2725881 3102019
34330 3102019 3332517 3299105 2993844 2505572 1933944 1345036 803270 385884 124006 -43048
34320 -43048 -211088 -414571 -615438 -776446 -903702 -1006507 -1047780 -960217 -707114 -322112
34310 -322112 97550 429505 579513 528922 339893 97898 -168280 -505998 -959383 -1464577
34300 -1464577 -1849100 -1969749 -1857459 -1705928 -1708915 -1919167 -2256894 -2612309 -2913355 -3125439
34290 -3125439 -3236677 -3254819 -3199575 -3095467 -2980461 -2901834 -2871189 -2832189 -2715074 -2534098
34280 -2534098 -2397137 -2399913 -2533080 -2705640 -2828669 -2851115 -2741418 -2475490 -2039937 -1423029
34270 -1423029 -617625 323884 1233355 1872218 2073075 1839559 1308792 644278 -18036
34261 -18036 -560047 -892817 -1016657 -1052870 -1181456 -1527658 -2092998 -2767523 -3387645 -3802476
34251 -3802476 -3938290 -3837335 -3627411 -3424974 -3253818 -3059539 -2798173 -2500447 -2256282
34242 -2256282 -2158562 -2265977 -2590333 -3084276 -3635447 -4093868 -4327684 -4269542 -3932716 -3408144
34232 -3408144 -2847788 -2417997 -2225898 -2268165 -2449877 -2655167 -2802805 -2854186 -2805992 -2697624
34222 -2697624 -2603278 -2570940 -2552761 -2424269 -2103751 -1647195 -1202124 -871008 -645874 -475674
34212 -475674 -355238 -319431 -380540 -518792 -723008 -979002 -1198157 -1220902 -960024 -531982
34202 -531982 -194700 -150586 -443570 -1023839 -1817404 -2688146 -3414905 -3814650 -3892950 -3812785
34192 -3812785 -3716844 -3639430 -3586258 -3608276 -3745431 -3948311 -4106842 -4131150 -3981195 -3674956
34182 -3674956 -3327626 -3137143 -3233387 -3519901 -3715574 -3577968 -3079441 -2400253 -1810573 -1543952
34172 -1543952 -1690234 -2149497 -2707682 -3177948 -3457841 -3476664 -3174044 -2577817 -1855307 -1226799
34162 -1226799 -825988 -650219 -607872 -589948 -540079 -499047 -551762 -690289 -762710 -611568
34152 -611568 -244101 182551 518775 701138 694390 448832 -46144 -709345 -1388625 -1900704
34142 -1900704 -2061979 -1771814 -1127188 -413182 84962 267839 225202 116705 96956 298904
34132 298904 780616 1456663 2137524 2676342 3059937 3343596 3526205 3517187 3217440 2616477
34122 2616477 1816090 971739 209193 -414252 -887220 -1212875 -1417396 -1568837 -1745051
34113 -1745051 -1962619 -2145258 -2167637 -1932810 -1438071 -812819 -293437 -100543 -285966 -702170
34103 -702170 -1142306 -1499304 -1773876 -1962384 -1997737 -1815923 -1444800 -999675 -599336 -298504
34093 -298504 -97560 -9049 -101906 -449697 -1009019 -1572462 -1901083 -1926053 -1786352 -1650963
34083 -1650963 -1550551 -1428644 -1320835 -1399251 -1810923 -2515051 -3314079 -4022080 -4568576 -4953730
34073 -4953730 -5160627 -5153932 -4955144 -4677081 -4454112 -4340253 -4284920 -4193549 -3989161 -3631990
34063 -3631990 -3134519 -2585528 -2128075 -1876887 -1861953 -2059120 -2436867 -2937380 -3446581 -3844672
34053 -3844672 -4083557 -4168345 -4073675 -3745198 -3197876 -2550358 -1929130 -1382326 -912129 -531965
34043 -531965 -237804 34080 349707 687912 963816 1136453 1237639 1288715 1246886 1065279
34033 1065279 770967 445647 140666 -157928 -476473 -789238 -1028765 -1159430 -1210986 -1209436
34023 -1209436 -1096670 -789094 -349091 -38967 -123904 -617305 -1269300 -1809169 -2153678 -2378264
34013 -2378264 -2556899 -2684434 -2728920 -2704019 -2671758 -2683702 -2722978 -2708908 -2573695 -2336211
34003 -2336211 -2082381 -1870523 -1679458 -1454277 -1167622 -811939 -364356 188087 778856
33994 778856 1247814 1420136 1207356 651085 -97661 -830823 -1354318 -1572451 -1541122 -1424749
33984 -1424749 -1363392 -1367188 -1352346 -1275820 -1200172 -1213944 -1333736 -1530689 -1823846 -2271972 -2852943
33973 -2852943 -3405847 -3735237 -3753432 -3497516 -3041136 -2443390 -1782111 -1179558 -747081 -502368
33963 -502368 -362007 -224005 -48931 142383 326738 501619 655445 761159 824636 898807
33953 898807 997377 1012475 785101 278227 -361548 -933524 -1335902 -1572400 -1661805 -1598858
33943 -1598858 -1384736 -1036973 -562849 30470 683126 1285419 1778669 2239210 2810546
33934 2810546 3526990 4227010 4668524 4720922 4423377 3881761 3174773 2378816 1613077 983450
33924 983450 491211 47769 -427318 -969262 -1610669 -2378323 -3210891 -3929276 -4340239 -4371745
33914 -4371745 -4112611 -3758488 -3525549 -3553821 -3830284 -4199576 -4465937 -4491678 -4231851 -3743532
33904 -3743532 -3186184 -2754008 -2547172 -2512005 -2519877 -2476525 -2343840 -2110786 -1794843 -1450846
33894 -1450846 -1140463 -903326 -765867 -732811 -744119 -698383 -573359 -482017 -548821 -757044
33884 -757044 -966098 -1040906 -912064 -572297 -118173 232241 284479 55341 -262495 -530000
33874 -530000 -768110 -1026735 -1263663 -1413545 -1491583 -1553657 -1609612 -1645578 -1686285 -1760463 -1832105
33863 -1832105 -1839414 -1794614 -1785185 -1873342 -2038823 -2222765 -2388391 -2533026 -2673663 -2830595
33853 -2830595 -3001416 -3139578 -3172090 -3052307 -2805813 -2536446 -2379641 -2414547 -2598903 -2805223
33843 -2805223 -2938710 -3010062 -3085585 -3186600 -3251822 -3180532 -2901941 -2428745 -1867485 -1363703
33833 -1363703 -1015486 -834822 -775185 -763250 -712494 -565286 -345733 -124410 93095 384629
33823 384629 774192 1131934 1281979 1183089 938794 653186 347575 -978 -430761 -1011900
33813 -1011900 -1790803 -2660837 -3346813 -3584555 -3305637 -2628139 -1717015 -709488 255381
33804 255381 1024252 1494545 1676117 1664266 1550394 1364741 1102908 795361 533974 420879
33794 420879 497073 727058 1040014 1369421 1664647 1895129 2054687 2151931 2197692 2211936
33784 2211936 2227805 2257122 2252506 2138189 1893284 1585279 1315296 1153454 1129645 1243882
33774 1243882 1450502 1650322 1734258 1643465 1388737 1038534 712045 559836 697222 1123475
33764 1123475 1701422 2215791 2462086 2323398 1820222 1107656 393414 -185577 -624553
33755 -624553 -984469 -1260117 -1327849 -1047914 -427509 334210 981828 1382453 1567855 1629920
33745 1629920 1616122 1521517 1325634 998771 495939 -214850 -1113772 -2127973 -3152650
33736 -3152650 -4055632 -4687365 -4937609 -4804140 -4396748 -3873894 -3382937 -3038225 -2905439
33727 -2905439 -2977197 -3171938 -3369114 -3450166 -3329712 -2989994 -2500260 -1976353 -1501561 -1099535
33717 -1099535 -785719 -603641 -576743 -653079 -749767 -851948 -1025826 -1328516 -1749488 -2258410
33707 -2258410 -2861324 -3561366 -4287653 -4918725 -5377276 -5651974 -5714337 -5474842 -4877259 -4014978
33697 -4014978 -3093804 -2267997 -1553144 -912517 -376628 -26966 119242 154580 206556 356982
33687 356982 637838 1042525 1490347 1817596 1885500 1722695 1519751 1454572 1542802 1667801
33677 1667801 1711605 1618351 1373423 1007556 644152 477362 636242 1064457 1553605 1888621
33667 1888621 1948467 1696940 1143304 355970 -498809 -1183766 -1514928 -1504309 -1387011 -1467322
33657 -1467322 -1882024 -2488402 -2988568 -3166893 -3012446 -2656265 -2259718 -1972055 -1905727 -2056505
33647 -2056505 -2256417 -2289403 -2090442 -1792566 -1561391 -1437311 -1375472 -1379821 -1516027 -1805463
33637 -1805463 -2183957 -2583004 -2994708 -3430542 -3861425 -4232437 -4511275 -4703874 -4853842
33628 -4853842 -5036772 -5293563 -5519494 -5467385 -4943571 -4009824 -2952466 -2062025 -1482089
33619 -1482089 -1237191 -1303533 -1608571 -2025000 -2433876 -2792212 -3119909 -3439420 -3744580 -4001315
33609 -4001315 -4150572 -4123883 -3879698 -3427649 -2829621 -2208095 -1745305 -1606779 -1817598 -2238529
33599 -2238529 -2697057 -3121043 -3525661 -3922034 -4301227 -4683390 -5107772 -5558214 -5939913
33590 -5939913 -6138548 -6072062 -5696290 -5023398 -4163276 -3305874 -2619309 -2161959 -1892434 -1742452
33580 -1742452 -1676176 -1707636 -1870053 -2136996 -2359832 -2327092 -1940935 -1344243 -849405 -721961
33570 -721961 -1016118 -1589760 -2248582 -2869336 -3403756 -3802917 -3985891 -3904806 -3612680 -3226060
33560 -3226060 -2826512 -2434060 -2066501 -1764698 -1539723 -1349777 -1172748 -1069529 -1130783 -1377653
33550 -1377653 -1748424 -2158556 -2530437 -2790840 -2911403 -2961966 -3062174 -3251237 -3451853 -3595150
33540 -3595150 -3729730 -3940292 -4176440 -4243994 -4007371 -3567320 -3197686 -3111545 -3307327 -3621052
33530 -3621052 -3877752 -3975534 -3866347 -3516477 -2913698 -2107685 -1234451 -491766 -60003 606
33520 606 -196413 -423099 -483291 -330923 -65563 174693 316061 362958 333092 199957 -81157
33509 -81157 -481696 -849378 -976609 -733754 -139637 673458 1521564 2194016 2485726 2289292
33499 2289292 1684720 915296 250345 -144504 -241257 -112368 121615 352383 550950 790377
33489 790377 1178198 1744354 2392265 2960162 3326879 3465297 3421314 3273917 3121994 3075914
33479 3075914 3209953 3494619 3789382 3932849 3852414 3580508 3174240 2653725 2037069 1404809
33469 1404809 880690 536125 335352 179741 -17512 -300415 -662704 -1029981 -1279274
33460 -1279274 -1340209 -1290282 -1311035 -1531126 -1930327 -2388371 -2774915 -2978077 -2918806 -2613232
33450 -2613232 -2202347 -1850018 -1597313 -1358400 -1066295 -775641 -597227 -559998 -561692 -442922
33440 -442922 -106255 406227 931477 1298664 1442418 1398297 1197111 811523 233776 -432267
33430 -432267 -1008924 -1378423 -1561444 -1677720 -1856492 -2171196 -2614786 -3114229 -3578013 -3941233
33420 -3941233 -4172563 -4255325 -4173793 -3904410 -3410473 -2673214 -1759205 -836763 -76403 476856
33410 476856 910460 1328310 1754500 2134345 2365877 2308605 1828416 915300 -232366 -1281672
33400 -1281672 -1953574 -2156425 -1972641 -1558982 -1058404 -554837 -59418 469537 1067215
33391 1067215 1693995 2216093 2466476 2351561 1922836 1352652 829658 456078 226470
33382 226470 96070 64141 178688 449434 772783 983873 1005079 922076 888993 974954
33372 974954 1129568 1275254 1383283 1463734 1541388 1663158 1870740 2110690 2196626 1923203
33362 1923203 1241097 312622 -596018 -1272163 -1654335 -1841228 -2013610 -2295780 -2650223
33353 -2650223 -2904786 -2891537 -2566669 -2017430 -1374367 -703007 51018 1007711 2208396
33344 2208396 3508656 4625374 5293475 5387219 4951344 4189081 3401519 2830749 2498797
33335 2498797 2237532 1906973 1536130 1223415 982569 771348 617173 594540 672881 689613
33325 689613 515999 186520 -170972 -475486 -719970 -906283 -1010202 -994299 -816483 -439556
33315 -439556 129987 808948 1457527 1935571 2158561 2145917 2030218 1971064 2015915 2060850
33305 2060850 1968895 1697980 1291353 794879 248557 -261440 -617165 -759284 -734608 -651837
33295 -651837 -620344 -726239 -1018370 -1488042 -2070235 -2664768 -3144179 -3360771 -3193945 -2615232
33285 -2615232 -1706954 -634152 385054 1124678 1448787 1394229 1117887 736271 238761
33276 238761 -430485 -1236803 -2021294 -2581814 -2777335 -2585651 -2092951 -1426819 -690581 34925
33266 34925 639580 974673 927108 512529 -97873 -648216 -943007 -976054 -906372 -858500
33256 -858500 -754813 -404780 236934 966978 1500940 1675196 1466038 914818 125467 -714508
33246 -714508 -1412453 -1879903 -2125361 -2169629 -2028709 -1748820 -1371850 -869653 -201293 542292
33236 542292 1133794 1406821 1421370 1396906 1515476 1817469 2230604 2619414 2815287 2686132
33226 2686132 2234874 1607579 957375 293613 -502918 -1493843 -2527190 -3296354 -3567846
33217 -3567846 -3354085 -2879424 -2397610 -2026769 -1713021 -1327285 -813072 -254287 208485
33208 208485 513018 683228 705469 477883 -53299 -742762 -1300254 -1498977 -1306332 -848414
33198 -848414 -312123 137193 434550 654743 933420 1319360 1723706 2015424 2127059 2059668
33188 2059668 1834936 1475000 1003493 445146 -153567 -694701 -1058984 -1193521 -1144448 -980489
33178 -980489 -713002 -321121 171212 688659 1174222 1635684 2116512 2635665 3155793 3595076
33168 3595076 3865959 3914460 3740192 3399830 3003969 2691887 2565875 2621958 2748186 2801611
33158 2801611 2691236 2398864 1944032 1346745 631738 -127221 -785814 -1206225 -1400878
33149 -1400878 -1578970 -1989828 -2693249 -3495206 -4104606 -4336947 -4192423 -3793366 -3258951
33140 -3258951 -2607461 -1772844 -739147 357458 1305073 1982089 2389406 2528201 2335703
33131 2335703 1779331 952231 38238 -764467 -1261377 -1295793 -857433 -132911 613360 1197533
33121 1197533 1538822 1600591 1396054 1017361 561747 24625 -659592 -1458478 -2186578 -2632031
33111 -2632031 -2702050 -2445384 -1990472 -1485383 -1054280 -770136 -662247 -737490 -974590 -1316565
33101 -1316565 -1709396 -2145458 -2634325 -3133004 -3536021 -3730053 -3636279 -3231087 -2585712 -1879636
33091 -1879636 -1312948 -987795 -904838 -1054016 -1434755 -1975576 -2506502 -2851775 -2916886 -2679619
33081 -2679619 -2164683 -1466237 -739506 -111594 382043 749594 976868 1058566 1068411 1139528
33071 1139528 1361014 1701792 2018386 2127928 1915245 1414899 783651 172175 -364522
33062 -364522 -827003 -1192590 -1424450 -1539031 -1617231 -1744234 -1953079 -2206979 -2413441 -2486370
33052 -2486370 -2439882 -2406986 -2519650 -2773166 -3046376 -3247459 -3390011 -3517415 -3599012 -3525410
33042 -3525410 -3179747 -2499235 -1502581 -297421 939726 2014659 2766519 3092475 2958259
33033 2958259 2409135 1565308 583880 -395705 -1282220 -2014793 -2519436 -2703642 -2527196
33024 -2527196 -2088794 -1613113 -1318004 -1285348 -1451483 -1686386 -1862661 -1895191 -1781677 -1606585
33014 -1606585 -1453060 -1293360 -999896 -475288 264334 1143152 2105187 3094097 3989391
33005 3989391 4632606 4934555 4927448 4704580 4337530 3859346 3288215 2630894 1881444 1066519
32995 1066519 307191 -204990 -345931 -187579 31460 81343 -110093 -468165 -888324 -1306975
32985 -1306975 -1670010 -1887468 -1869377 -1616288 -1251270 -932275 -716280 -513884 -191370 280620
32975 280620 789949 1191559 1431797 1556280 1620200 1618956 1497237 1197830 706691 87569
32965 87569 -513587 -927734 -1055265 -899149 -507031 89072 850100 1673153 2414270 2994405
32955 2994405 3461625 3917862 4375183 4688286 4635457 4087697 3135533 2068929 1208165
32946 1208165 708316 499831 407014 307031 168864 -16674 -270359 -567027 -802034 -873882
32936 -873882 -791202 -658515 -561829 -507635 -474740 -478975 -559073 -717265 -890744 -971887 -858968
32925 -858968 -521554 -38985 443203 817785 1076940 1275306 1462690 1665928 1899633 2147984
32915 2147984 2332227 2324641 2018537 1401809 576476 -301806 -1130841 -1913350 -2681145 -3383482
32905 -3383482 -3911147 -4244593 -4500593 -4771850 -4976013 -4948648 -4660754 -4253801 -3862626 -3502326
32895 -3502326 -3158666 -2887769 -2735880 -2599993 -2262703 -1591534 -669945 281159 1089179
32886 1089179 1727720 2250299 2659187 2869371 2810730 2535620 2185176 1854029 1528415 1161100
32876 1161100 760545 385515 92090 -84185 -126530 -52781 90986 287023 574073 980106
32866 980106 1442799 1838901 2085015 2171451 2110518 1912334 1628362 1366196 1219098 1198621
32856 1198621 1261034 1376786 1538250 1711233 1824681 1824771 1712484 1508372 1205505 799030
32846 799030 366975 81683 100821 439787 959461 1473470 1861923 2106645 2258244 2378855
32836 2378855 2490039 2560482 2556055 2500664 2456937 2431790 2331218 2042152 1554396 985636
32826 985636 498723 211205 159882 298691 504984 612653 487172 108561 -403576 -864583
32816 -864583 -1160006 -1324368 -1477815 -1687689 -1915883 -2098856 -2230373 -2335812 -2404588 -2399484
32806 -2399484 -2319881 -2210234 -2109046 -2029252 -1986466 -1999598 -2050821 -2086464 -2081603 -2072528 -2092764
32795 -2092764 -2091680 -1949258 -1578606 -1002131 -320924 389328 1147749 2023831 3016841 3991466
32785 3991466 4750327 5166814 5240773 5055680 4730795 4412467 4244553 4285063 4445392 4533068
32775 4533068 4369272 3887382 3158441 2346310 1619359 1066344 671239 355454 39821
32766 39821 -311769 -662710 -890694 -825653 -345608 526566 1592749 2537443 3055929 3000281
32756 3000281 2450038 1641172 813715 118735 -369700 -627185 -692112 -648816 -535655 -285157
32746 -285157 193822 875154 1594378 2168125 2503757 2605397 2536403 2405665 2346006 2449116
32736 2449116 2711354 3055438 3397578 3681075 3862698 3905807 3808536 3627164 3443193 3285087
32726 3285087 3083726 2728284 2182360 1529762 882258 255687 -420554 -1160594 -1828449
32717 -1828449 -2220610 -2228940 -1903448 -1383275 -811784 -309391 35634 192973 191327 71169
32707 71169 -148066 -435820 -714116 -899839 -983758 -1028058 -1073175 -1081203 -992594 -808432 -581655
32696 -581655 -343143 -77693 225929 541494 841519 1139384 1463406 1796099 2071782 2251227
32686 2251227 2384754 2577006 2879670 3229263 3503549 3636533 3668705 3694748 3789299 3986211
32676 3986211 4287314 4645678 4944001 5031228 4810063 4293088 3578383 2783533 2005673 1331604
32666 1331604 864986 711448 900255 1317153 1760504 2102342 2370168 2629985 2816758
32657 2816758 2751753 2337257 1671484 939790 237510 -461808 -1195477 -1914432 -2490119 -2797016
32647 -2797016 -2801999 -2588669 -2276272 -1900145 -1390180 -670758 254127 1318874 2430175
32638 2430175 3437991 4139944 4411681 4330161 4099775 3853200 3582494 3262481 2961606
32629 2961606 2793824 2809234 2966563 3181451 3382050 3558749 3786716 4157905 4653159 5115767
32619 5115767 5395104 5489893 5501041 5464208 5295005 4912910 4371653 3840990 3484657 3371601
32609 3371601 3473769 3709857 3990215 4245888 4431924 4507614 4423716 4144967 3691655 3153783
32599 3153783 2659717 2328672 2237438 2398434 2747536 3174794 3609430 4078853 4643302 5252211
32589 5252211 5703204 5783815 5438328 4764886 3879221 2843873 1724172 628793 -356849
32580 -356849 -1235748 -2042175 -2734749 -3198350 -3361395 -3280328 -3098581 -2945266 -2881879 -2915261
32570 -2915261 -3018194 -3120984 -3105868 -2854887 -2338805 -1661520 -998636 -484889 -165896 -41238
32560 -41238 -106203 -320795 -562205 -658724 -499751 -117351 334557 675276 788766 662379
32550 662379 372751 42407 -211651 -323337 -300572 -211023 -139239 -147551 -256641 -431093
32540 -431093 -573985 -571776 -386228 -96059 185314 430733 705915 1057613 1436275 1741928
32530 1741928 1912588 1953936 1917902 1873029 1862993 1867070 1824580 1716310 1588164 1470312 1316568
32519 1316568 1071314 767214 500372 319980 192495 68067 -65359 -183920 -221393 -56345
32509 -56345 418984 1166395 1967983 2564745 2825579 2779983 2529772 2167208 1757916 1356493
32499 1356493 1017756 784989 649204 521699 288913 -72586 -455074 -721876 -832118
32490 -832118 -830502 -732630 -479115 -26002 551086 1072804 1372024 1388757 1170101 801296
32480 801296 340818 -188402 -757751 -1298875 -1726462 -1999074 -2149052 -2245378 -2326794 -2367435
32470 -2367435 -2299326 -2070959 -1699741 -1272769 -877392 -511531 -73119 530210 1246670 1872174
32460 1872174 2200937 2195790 2014703 1877047 1898499 2025695 2100396 1992715 1708020 1386388
32450 1386388 1187238 1157422 1208363 1215709 1122582 942245 692960 368940 -24034 -435478
32440 -435478 -793696 -1058746 -1243977 -1386466 -1501577 -1569713 -1567266 -1504144 -1423382 -1367321 -1353828
32429 -1353828 -1378533 -1415755 -1409237 -1285792 -1001742 -574637 -65103 463267 973078 1477521
32419 1477521 2046447 2743994 3526142 4236114 4745287 5062863 5243825 5223131 4848756 4105636
32409 4105636 3218069 2470563 1977293 1674105 1475171 1355991 1310623 1316137 1352685 1402448
32399 1402448 1417385 1334758 1135478 847698 493449 92302 -261528 -395526 -206103 194158
32389 194158 520121 520739 143473 -477317 -1154498 -1765544 -2269680 -2650349 -2878762 -2956871
32379 -2956871 -2973832 -3056571 -3226444 -3339149 -3225366 -2896626 -2569273 -2462938 -2596067 -2791916
32369 -2791916 -2854456 -2705402 -2373283 -1923004 -1447661 -1099886 -1047118 -1343729 -1871460 -2452160
32359 -2452160 -3010177 -3576860 -4141148 -4570339 -4720635 -4573977 -4207780 -3673950 -3003770
32350 -3003770 -2336335 -1935638 -1994883 -2439111 -2967108 -3286143 -3294927 -3083013 -2818535 -2637807
32340 -2637807 -2579629 -2577034 -2517005 -2329139 -2020541 -1627603 -1154070 -579345 66163 643850
32330 643850 943982 807203 236908 -593307 -1439773 -2100070 -2447477 -2407454 -1961765 -1203463
32320 -1203463 -360239 294967 602407 597978 434236 226838 -5172 -262705 -491500 -630569
32310 -630569 -708217 -825064 -1032319 -1277512 -1485164 -1634291 -1722928 -1713859 -1580890 -1381745
32300 -1381745 -1217088 -1120751 -1046657 -967372 -934743 -1035696 -1334751 -1865880 -2622799 -3526011
32290 -3526011 -4433689 -5209938 -5762523 -6021018 -5944358 -5586170 -5101445 -4631994 -4202537 -3763577
32280 -3763577 -3305964 -2881804 -2527446 -2222715 -1937109 -1678336 -1477315 -1346057 -1269531 -1237762
32270 -1237762 -1274270 -1410718 -1613561 -1758329 -1737144 -1612716 -1610938 -1906828 -2431748 -2920369
32260 -2920369 -3121694 -2936123 -2397759 -1607593 -693466 224129 1062091 1766620 2290125
32251 2290125 2604276 2720932 2663192 2429187 2031478 1571569 1230630 1169795 1444753 1982863
32241 1982863 2599117 3070360 3278932 3295364 3263875 3211182 3042075 2724659 2379350 2140876
32231 2140876 2015548 1932706 1857893 1768319 1572184 1167364 586783 4908 -427759 -716698
32221 -716698 -979752 -1302537 -1637659 -1819376 -1688645 -1247756 -701396 -318108 -237937 -407629
32211 -407629 -659262 -812400 -744375 -455871 -94349 147564 202411 179775 232783 396996
32201 396996 570564 614158 443047 59303 -445598 -908227 -1151884 -1070511 -679508 -97038
32191 -97038 524145 1063257 1458240 1694588 1788169 1781610 1740225 1732536 1806274 1969488 2170005
32180 2170005 2293561 2229371 1981470 1698527 1549162 1569427 1668226 1769658 1883443 2010399
32170 2010399 2039620 1806617 1251539 487345 -282366 -886419 -1245748 -1371470 -1341436 -1262713
32160 -1262713 -1217889 -1219979 -1210645 -1112539 -907282 -675615 -544284 -566995 -658610 -672527 -555547
32149 -555547 -411856 -400233 -572385 -814824 -936060 -808760 -461372 -70162 150291 107237
32139 107237 -79277 -160265 35943 474072 984662 1435566 1806047 2122018 2380919 2559598
32129 2559598 2659311 2717135 2791714 2950929 3240521 3624926 3964525 4087828 3911397 3499618
32119 3499618 3017742 2624285 2381548 2243518 2127971 2002638 1889919 1791282 1648270 1414521
32109 1414521 1150781 1007997 1106378 1443511 1910080 2367046 2711572 2908028 2982503 2983289
32099 2983289 2940614 2868231 2793484 2759919 2792431 2877506 2988139 3116423 3273577 3470266
32089 3470266 3708879 3985487 4277014 4514008 4577591 4358426 3854345 3211847 2640485 2267289
32079 2267289 2086291 2044180 2120797 2287415 2436392 2440253 2292944 2128640 2071882 2118455
32069 2118455 2200306 2319146 2546850 2899809 3272769 3518535 3558590 3397913 3076976 2668199
32059 2668199 2312430 2183301 2354146 2716330 3082499 3373093 3651789 3971007 4256523
32050 4256523 4397300 4393274 4329744 4225930 4005783 3645788 3281800 3126091 3313892 3842721
32040 3842721 4587688 5318878 5764818 5768722 5415236 4965670 4647255 4506990 4439885 4309575
32030 4309575 4043532 3666781 3281425 3004455 2904559 2985188 3206631 3506196 3815922 4103121
32020 4103121 4411123 4847632 5522496 6484886 7680964 8932249 9976759 10605034 10800486
32011 10800486 10730864 10582354 10412301 10161256 9765527 9230564 8633223 8105018 7794617
32002 7794617 7769113 7908587 7930811 7576776 6797010 5761456 4708334 3805097 3130176
31993 3130176 2715444 2551705 2571704 2686977 2866074 3152449 3585427 4115912 4609323 4915432
31983 4915432 4936465 4678170 4282690 3984443 3955063 4151216 4337073 4282715 3942216 3454227
31973 3454227 3012901 2751100 2697872 2794428 2954854 3141958 3383420 3700973 4049182 4362882
31963 4362882 4654544 5021142 5550926 6256951 7093996 7977938 8763039 9259664 9338324 9008799
31953 9008799 8370201 7516149 6537022 5578971 4802303 4245843 3792830 3324987 2887469
31944 2887469 2659104 2765529 3144626 3583878 3871685 3938791 3895444 3929877 4137917 4445769
31934 4445769 4718180 4934354 5227734 5759924 6600746 7738871 9142249 10733887 12307782
31925 12307782 13532901 14105424 13933933 13193824 12205239 11239638 10405428 9675421 8991061
31916 8991061 8336226 7742922 7267716 6971703 6893911 7015685 7249187 7469032 7559368 7448319
31906 7448319 7134173 6694327 6233729 5779405 5232547 4474148 3542361 2678537 2166185
31897 2166185 2125553 2471408 3038388 3698404 4358190 4912220 5267829 5419023 5447738 5423577
31887 5423577 5318068 5038353 4537167 3873245 3169643 2529412 1989936 1542774 1190815
31878 1190815 987891 1016388 1318625 1858511 2559797 3364326 4225056 5050086 5697429 6053734
31868 6053734 6110504 5952098 5675189 5317911 4845084 4192923 3350933 2421326 1589325 1019758
31858 1019758 783026 870564 1237269 1792163 2369292 2765420 2844083 2613818 2211935 1804676
31848 1804676 1463627 1103242 552634 -273079 -1266089 -2204115 -2921998 -3385908 -3634721
31839 -3634721 -3719042 -3701866 -3640944 -3520746 -3243763 -2740303 -2067238 -1363791 -740056 -252169
31829 -252169 53927 162533 161130 213556 409711 673519 853748 881975 818292 780855 878994
31818 878994 1191347 1736152 2429724 3103571 3597973 3845626 3866256 3701135 3376332 2928144
31808 2928144 2436500 2000476 1666619 1392777 1100064 759246 415543 142429 4409
31799 4409 65436 383006 949740 1653417 2329596 2857359 3197706 3374182 3465410 3601117
31789 3601117 3886774 4282437 4582817 4565040 4167190 3515523 2794455 2117483 1519336 1030075
31779 1030075 710556 600365 652975 757640 837261 903003 993387 1076460 1040332 779243
31769 779243 278196 -363371 -957967 -1303904 -1302909 -1034782 -686511 -391007 -155369 67473
31759 67473 308480 612155 1061027 1687532 2376035 2915639 3158275 3097883 2820121 2432196
31749 2432196 2031181 1664071 1286188 806307 213690 -357531 -712580 -731745 -422017 123497
31739 123497 787256 1476230 2148752 2788578 3334846 3659249 3650493 3321658 2809042 2266480
31729 2266480 1782604 1391406 1121294 1019062 1155449 1620103 2469399 3635885 4903958
31720 4903958 6019174 6833991 7340530 7595359 7668545 7656394 7658528 7686912 7635442 7395953
31710 7395953 6996172 6590581 6331720 6281255 6415110 6651839 6875810 6991760 6984534 6907180
31700 6907180 6814781 6740160 6717251 6764320 6825699 6781456 6552256 6178858 5786927 5493258
31690 5493258 5343739 5304157 5296349 5265690 5218994 5185891 5171812 5188447 5297162 5557771 5960559
31679 5960559 6486111 7196010 8136131 9143903 9900450 10248857 10367738 10573306 11047780
31670 11047780 11819673 12881867 14200430 15667557 17157340 18609105 20013517 21394981
31662 21394981 22877494 24686757 27006622 29906217 33468319 37878567 43311207 49873493
31654 49873493 57795680 67559895 79727586 94756715 112929990 133826463 155212688
31647 155212688 172730806 181761258 180398047 170650953 156646929 141813735 127663447
31640 127663447 114462720 102225384 91032476 80973533 72131066 64537954 58062344
31633 58062344 52425319 47376128 42792677 38638025 34926238 31726596 29095699 26976926
31625 26976926 25211040 23628814 22093039 20506353 18860461 17253890 15805950 14587591
31617 14587591 13665642 13121259 12941242 12966862 13045615 13172536 13392445 13633438 13746667 13661816
31607 13661816 13408300 13041138 12646035 12353106 12225987 12181138 12125594 12130369 12365218 12916510
31597 12916510 13775283 14929633 16319376 17740777 18955231 19903974 20718477 21542345 22441264
31588 22441264 23452124 24616227 25997375 27751492 30103821 33135459 36650587 40372393
31580 40372393 44220951 48334777 52978498 58597613 65832150 75268666 87261453 102159297
31572 102159297 120582098 143323665 171140101 204537427 242760687 281878221 314209176
31565 314209176 331437015 329790074 312388382 286353878 257868636 229872603 203163121
31558 203163121 178128769 155205133 134647136 116561911 101015250 87887410 76811063
31551 76811063 67408818 59461570 52791989 47172082 42422014 38433345 35026636 31943485
31543 31943485 29050365 26417038 24138270 22201319 20561118 19193996 18009472 16835431
31535 16835431 15571487 14279039 13080254 12049237 11215783 10563243 9985851 9352580 8661187
31526 8661187 8049971 7630412 7392014 7289729 7323971 7497255 7781330 8168895 8679909 9273463
31516 9273463 9817086 10188695 10382130 10512611 10756014 11249189 11967432 12707557 13264424
31507 13264424 13612066 13849382 14023880 14135198 14299772 14778381 15800304 17424048 19561875
31498 19561875 22070682 24859962 28021339 31839960 36598671 42419984 49386482 57728310
31490 57728310 67790058 79950793 94640595 111928850 130378153 146353778 155415943
31483 155415943 155235523 147206135 135024177 121875805 109088448 96854379 85327817
31476 85327817 74817855 65481302 57273586 50109115 43899326 38534207 33948102 30124411
31468 30124411 26958123 24201939 21624512 19155942 16831540 14681528 12747897 11141010
31460 11141010 9986338 9315990 9041445 9014547 9096683 9187164 9202092 9043839 8646050 8082911
31450 8082911 7568281 7259902 7088225 6852093 6449476 5920794 5297623 4545063 3681956
31441 3681956 2846989 2190007 1764846 1561557 1569890 1764484 2079457 2432677 2733544 2857993
31431 2857993 2689476 2225635 1597612 956991 385772 -80591 -421639 -654723 -813995
31422 -813995 -865118 -716110 -368821 12293 259195 378994 499476 682147 880698 1060600
31412 1060600 1256206 1493908 1745712 2001967 2330553 2799698 3348163 3768992 3841514 3494563
31402 3494563 2863481 2196500 1687535 1370645 1147131 891223 535530 102129 -298937
31393 -298937 -500763 -354017 184507 1013546 1926973 2699749 3174040 3315099 3213657 3023642
31383 3023642 2863590 2749427 2614331 2399529 2126852 1875584 1693834 1556630 1417117
31374 1417117 1262535 1087661 845402 488227 63268 -296984 -515214 -661767 -864144
31365 -864144 -1146457 -1403294 -1525211 -1507285 -1427239 -1353009 -1292588 -1215933 -1104673 -982891
31355 -982891 -909059 -938840 -1095142 -1372046 -1749050 -2175285 -2542170 -2709745 -2592290 -2215519
31345 -2215519 -1680918 -1094170 -549918 -155437 -1613 -85781 -303126 -544141 -769750 -962491
31335 -962491 -1053376 -973357 -773873 -626817 -680189 -952141 -1366543 -1819027 -2172338 -2261037
31325 -2261037 -1988755 -1416368 -711389 -27177 533614 883681 969021 830537 580943 298600
31315 298600 -9154 -324974 -562483 -625419 -491616 -206346 179781 631540 1102906 1520710
31305 1520710 1797222 1859787 1691676 1355872 958290 576870 247037 15927 -40478 105665
31295 105665 361843 556625 550865 303525 -129709 -618831 -1006544 -1197725 -1219175 -1160446
31285 -1160446 -1051327 -832131 -454777 22131 464328 774560 961500 1108480 1278900
31276 1278900 1433180 1432174 1151178 615986 11580 -469027 -775930 -980778 -1119967 -1106358
31266 -1106358 -818718 -256111 419497 986205 1301620 1371797 1323641 1311516 1421061 1646480
31256 1646480 1957347 2360529 2856422 3338937 3596530 3456822 2927380 2194367 1518988
31247 1518988 1141673 1205337 1671849 2307453 2821559 3058413 3039263 2840208 2507737 2121582
31237 2121582 1857455 1888933 2217226 2643474 2924227 2944558 2763201 2536836 2408888 2432584
31227 2432584 2567353 2744077 2935494 3165878 3469520 3856267 4303048 4748524 5094571
31218 5094571 5242525 5148249 4840491 4388732 3865571 3334951 2850867 2451224 2155314 1965079
31208 1965079 1860661 1807195 1794802 1874981 2126124 2560904 3077892 3517434 3764188 3810511
31198 3810511 3759287 3774091 3973782 4320493 4618978 4666188 4406322 3925564 3327700 2673484
31188 2673484 2034647 1527382 1243276 1178005 1258417 1404918 1534150 1551282 1420837 1245373
31178 1245373 1203546 1376934 1670187 1918433 2035119 2028076 1907181 1626956 1125044 398201
31168 398201 -458090 -1277646 -1911095 -2316396 -2569920 -2782377 -3009257 -3242850 -3459886 -3639862
31158 -3639862 -3737130 -3665367 -3334468 -2721144 -1927526 -1175316 -699447 -589703 -722343 -872361
31148 -872361 -905708 -851586 -793432 -723734 -529332 -109944 506512 1168407 1715058 2088542
31138 2088542 2341033 2552149 2762981 2984323 3219291 3438864 3562580 3519577 3334929 3118297
31128 3118297 2960832 2872682 2811725 2712362 2468442 1962762 1191514 345796 -298851 -605959
31118 -605959 -683505 -772156 -1042502 -1477109 -1898695 -2097867 -1971743 -1580708 -1083139 -615559
31108 -615559 -236024 39249 192998 227851 201689 191615 209618 185177 53269 -167062
31098 -167062 -421434 -733104 -1200211 -1840805 -2480245 -2853896 -2820378 -2430944 -1800008 -982288
31088 -982288 -11627 1001495 1884872 2511142 2848751 2921257 2769169 2455513 2053204 1590776
31078 1590776 1033189 350918 -386933 -998304 -1277339 -1126454 -642844 -87786 267330
31069 267330 318464 181906 72514 121685 302508 512904 710772 958519 1343469 1873679
31059 1873679 2461891 2995526 3396750 3621586 3646368 3484904 3195774 2840616 2446953 2036109
31049 2036109 1663299 1382427 1176971 977889 763579 598884 552517 608912 685847 713566
31039 713566 678146 619341 611639 710567 870931 936702 764707 365779 -108195 -520886 -869852
$$ [...]
##END NTUPLES=NMR SPECTRUM
##END=
