##TITLE=31Pdec_IPACAT-33-7
  DMF-d7
  24 sc
 6.10.2023
##JCAMPDX= 6.0         $$ Bruker NMR JCAMP-DX V2.0
##DATA TYPE= NMR SPECTRUM
##DATA CLASS= NTUPLES
##ORIGIN= UXNMR, Bruker Analytische Messtechnik GmbH
##OWNER= root
$$ XWIN-NMR		Version 3.5
$$ Fri Oct  6 15:57:18 2023 Russian Standard Time (UT+4h)  she@DPX200
##.OBSERVE FREQUENCY= 81.013821
##.OBSERVE NUCLEUS= ^31P
##.ACQUISITION MODE= SIMULTANEOUS
##.ACQUISITION SCHEME= undefined
##.AVERAGES= 24
##.DIGITISER RES= 16
##SPECTROMETER/DATA SYSTEM= spect
##.PULSE SEQUENCE= zgpg30
##.SOLVENT NAME= DMF
##.SHIFT REFERENCE= (INTERNAL, DMF, 0, 248.564)
##AUDIT TRAIL= $$ (NUMBER, WHEN, WHO, WHERE, WHAT)
$$ ##TITLE= Audit trail, XWIN-NMR		Version 3.5
$$ ##JCAMPDX= 5.01
$$ ##ORIGIN= Bruker BioSpin GmbH
$$ ##OWNER= she
$$ F:/spectra/data/she/nmr/P31/1/pdata/1/auditp.txt
$$ ##AUDIT TRAIL=  $$ (NUMBER, WHEN, WHO, WHERE, WHAT)
(   1,<2023-10-06 15:55:27.28 +0400>,<she>,<DPX200>,
      <created by zg, POWCHK disabled, PULCHK disabled
       configuration hash MD5:
       00 E9 B6 7A A2 85 ED C7 34 08 36 98 17 FE 4E 26
       data hash MD5: 32K
       41 2A 82 95 EC 39 FF BF 3A 6F 83 E1 3C 33 73 C9>)
(   2,<2023-10-06 15:55:55.54 +0400>,<she>,<DPX200>,
      <Start of raw data processing
       efp BC_mod = 2 LB = 5 FT_mod = 6 PKNL = 1 PHC0 = -10674.62 PHC1 = 66.68639 SI = 64K 
       data hash MD5: 64K
       2E A2 A1 5E 92 3F 50 77 7B F8 A1 03 8C 86 D0 48>)
(   3,<2023-10-06 15:56:17.28 +0400>,<she>,<DPX200>,
      <pk PHC0 = -12.56968 PHC1 = 0 
       data hash MD5: 64K
       6A A6 59 8F 8D F8 81 E8 DF DE BB 2F 98 09 7D 09>)
(   4,<2023-10-06 15:56:48.98 +0400>,<she>,<DPX200>,
      <pk PHC0 = -2.960679 PHC1 = 9.399999 
       data hash MD5: 64K
       04 B7 9A 6D 87 D8 86 FE CD F3 CE 79 18 42 69 18>)
$$ ##END=
$$ 
$$ hash MD5
$$ 8F 84 8E 1C 95 FD 23 E7 FE A6 36 CA DE 4F 7E 6B
##$RELAX= 
##$RELAX= 
##$RELAX= 
##$RELAX= 
##$RELAX= 
##$RELAX= 
##$RELAX= 
##$RELAX= 
##$RELAX= 
$$ Bruker specific parameters
$$ --------------------------
##$DU= <F:/spectra>
##$EXPNO= 1
##$NAME= <P31>
##$PROCNO= 1
##$TYPE= <nmr>
##$USER= <she>
##$AMP= (0..31)
100 100 100 100 100 100 100 100 100 100 100 100 100 100 100 100 100 100 
100 100 100 100 100 100 100 100 100 100 100 100 100 100 
##$AQSEQ= 0
##$AQ_mod= 1
##$AUNM= <au_zg>
##$AUTOPOS= <>
##$BF1= 81.014009
##$BF2= 200.13
##$BF3= 200.13
##$BF4= 200.13
##$BF5= 200.13
##$BF6= 200.13
##$BF7= 200.13
##$BF8= 200.13
##$BYTORDA= 1
##$CFDGTYP= 0
##$CFRGTYP= 5
##$CHEMSTR= <none>
##$CNST= (0..31)
1 1 145 1 1 1 1 1 1 1 1 1 1 1 1 1 1 1 1 1 1 1 1 1 1 1 1 1 1 1 1 1 
##$CPDPRG= <waltz16>
##$CPDPRG1= <>
##$CPDPRG2= <waltz16>
##$CPDPRG3= <>
##$CPDPRG4= <mlev>
##$CPDPRG5= <mlev>
##$CPDPRG6= <mlev>
##$CPDPRG7= <mlev>
##$CPDPRG8= <mlev>
##$CPDPRGB= <>
##$CPDPRGT= <>
##$D= (0..31)
0 1 0 0 0 0 0 0 0 0 0 0.03 2e-05 3e-06 0 0 0 0 0 0 0 0 0 0 0 0 0 0 0 0 
0 0 
##$DATE= 1696593326
##$DBL= (0..7)
120 120 120 11 120 120 24 19 
##$DBP= (0..7)
150 150 150 150 150 150 150 150 
##$DBP07= 0
##$DBPNAM0= <>
$$ [...]
##$SUBNAM2= <"">
##$SUBNAM3= <"">
##$SUBNAM4= <"">
##$SUBNAM5= <"">
##$SUBNAM6= <"">
##$SUBNAM7= <"">
##$SUBNAM8= <"">
##$SUBNAM9= <"">
##$SW= 501.771253377433
##$SWIBOX= (0..15)
0 1 3 0 0 0 0 0 0 0 0 0 0 0 0 0 
##$SW_h= 40650.406504065
##$TD= 32768
##$TD0= 1
##$TE= 0
##$TE2= 300
##$TE3= 300
##$TEG= 300
##$TL= (0..7)
0 120 53 12 22 120 120 120 
##$TP= (0..7)
150 150 150 150 150 150 150 150 
##$TP07= 0
##$TPNAME0= <>
##$TPNAME1= <>
##$TPNAME2= <>
##$TPNAME3= <>
##$TPNAME4= <>
##$TPNAME5= <>
##$TPNAME6= <>
##$TPNAME7= <>
##$TPOAL= (0..7)
0.5 0.5 0.5 0.5 0.5 0.5 0.5 0.5 
##$TPOFFS= (0..7)
0 0 0 0 0 0 0 0 
##$TUNHIN= 0
##$TUNHOUT= 0
##$TUNXOUT= 0
##$USERA1= <user>
##$USERA2= <user>
##$USERA3= <user>
##$USERA4= <user>
##$USERA5= <user>
##$V9= 5
##$VALIST= <valist>
##$VCLIST= <CCCCCCCCCCCCCCC>
##$VD= 0
##$VDLIST= <DDDDDDDDDDDDDDD>
##$VPLIST= <PPPPPPPPPPPPPPP>
##$VTLIST= <TTTTTTTTTTTTTTT>
##$WBST= 1024
##$WBSW= 4
##$XGAIN= (0..3)
0 0 0 0 
##$XL= 0
##$YL= 0
##$YMAX_a= 5137
##$YMIN_a= -2464
##$ZGOPTNS= <>
##$ZL1= 120
##$ZL2= 120
##$ZL3= 120
##$ZL4= 120
##$ABSF1= 0
##$ABSF2= 0
##$ABSG= 0
##$ABSL= 0
##$ALPHA= 0
##$AQORDER= 0
##$ASSFAC= 0
##$ASSFACI= 0
##$ASSFACX= 0
##$ASSWID= 0
##$AUNMP= <proc_1d>
##$AZFE= 0.1
##$AZFW= 0.5
##$BCFW= 0
##$BC_mod= 2
##$BYTORDP= 0
##$COROFFS= 0
##$CY= -3
##$DATMOD= 1
##$DC= 0
##$DFILT= <>
##$DTYPP= 0
##$F1P= 0
##$F2P= 0
##$FCOR= 1
##$FTSIZE= 65536
##$FT_mod= 6
##$GAMMA= 0
##$GB= 0
##$INTBC= 1
##$INTSCL= 6.047779e-11
##$ISEN= 30
##$LB= 5
##$LEV0= 0
##$LPBIN= 0
##$MAXI= 10000
##$MC2= 0
##$MEAN= 0
##$ME_mod= 0
##$MI= 50
##$NCOEF= 0
##$NC_proc= -8
##$NLEV= 6
##$NOISF1= 182.463
##$NOISF2= 159.3651
##$NSP= 0
##$NTH_PI= 0
##$NZP= 0
##$OFFSET= 248.5645
##$PC= 4
##$PHC0= -10690.15
##$PHC1= 76.0864
##$PH_mod= 1
##$PKNL= yes
##$PPARMOD= 0
##$PSCAL= 0
##$PSIGN= 0
##$REVERSE= no
##$SF= 81.0140089999694
##$SI= 65536
##$SIGF1= 159.3651
##$SIGF2= -187.1042
##$SINO= 113.3802
##$SIOLD= 16384
##$SREGLST= <1H.CDCl3>
##$SSB= 0
##$STSI= 65536
##$STSR= 0
##$SW_p= 40650.406504065
##$SYMM= 0
##$S_DEV= 0
##$TDeff= 32768
##$TDoff= 0
##$TI= <>
##$TILT= no
##$TM1= 0
##$TM2= 0
##$TOPLEV= 0
##$USERP1= <user>
##$USERP2= <user>
##$USERP3= <user>
##$USERP4= <user>
##$USERP5= <user>
##$WDW= 1
##$XDIM= 65536
##$YMAX_p= 305385194
##$YMIN_p= -85565430
$$ End of Bruker specific parameters
$$ ---------------------------------
##NTUPLES= NMR SPECTRUM
##VAR_NAME=  FREQUENCY,     SPECTRUM/REAL,   SPECTRUM/IMAG
##SYMBOL=    X,             R,               I
##VAR_TYPE=  INDEPENDENT,   DEPENDENT,       DEPENDENT
##VAR_FORM=  AFFN,          ASDF,            ASDF
##VAR_DIM=   65536,         65536,           65536
##UNITS=     HZ,            ARBITRARY UNITS, ARBITRARY UNITS
##FACTOR=    0.620285442955139, 1,           1
##FIRST=     20137.2065510682, 0,            0
##LAST=      -20513.1999529968, 0,           0
##MIN=       -20513.1999529968, -85565430,   0
##MAX=       20137.2065510682, 305385194,    0
$$ Real data points
##PAGE= N=1
##DATA TABLE= (X++(R..R)), XYDATA
$$ [...]
35120c228468K64387L18056K67922J70609J00938Q1101R0026J25835K00291K75620
35110a333683K78104J96270J06247O9053N5169J0523n0877p8574q3293j34294
35100i65355k48510l34066k83515j13648J9209l4892k56513m55504m48152k31090
35090c352036L1505J77599J77345J10939P3035J18427K53366M31929N74838O30205
35080g72848O15413N77281N19985L99064J82897j02150l80384n57622n60417l91654
35070d70435j54465K2674J11138K09830M25274P36673R92389J028222P94034M06759
35060D102093R8884O4213K92599N60345O22649M17544O8137k72858n20789o34290
35050D798527n99044m72707l71410l55172l71626l60215l60385m46693n91061
$$ plain form
35120 -3228468 -2964081 -2646025 -2378103 -2207494 -2106556 -2025455 -1935429 -1809594 -1609303 -1333683
35110 -1333683 -1055579 -859309 -753062 -684009 -628840 -618317 -669194 -747768 -831061 -965355
35100 -965355 -1213865 -1547931 -1831446 -1945094 -1925885 -1960777 -2217290 -2672794 -3120946 -3352036
35090 -3352036 -3320531 -3142932 -2965587 -2854648 -2781613 -2663186 -2409820 -1977891 -1403053 -772848
35080 -772848 -157435 419846 939831 1338895 1521792 1419642 1039258 481636 -78781 -470435
35070 -470435 -624900 -602226 -491088 -281258 144016 880689 1873078 2901300 3695334 4102093
35060 4102093 4200977 4265190 4557789 5118134 5740783 6158327 6226464 5953606 5432817 4798527
35050 4798527 4199483 3726776 3355366 3000194 2628568 2268353 1907968 1461275 870214
35041H70214o74257o29517m97546l32340j35882Q0552K47925L18600L48066M21137
35031A6952N13170N03840L46181J54950P9494J26390J68986J26898P2096J24290
35021B233247K82323M12944L97677K41895L6025j36546k30517k34256j88064j76937
35011B637791k45385l28200l21275k22703j48261j90267l07508l78318l23440
35002A72434j49742Q7309L16649M61229M62277L14939P6764j58704l03415l16601
34992I63139k23102q0090Q0816K61282M42806N61003N64202M82307M05811L95266
34982C853440M26536M22130L27182J64100K0813l0449j2649j9148r2318j59386
34972D900251j27851j9875M9189K9666J2868J13059L13467M74898M82015L44551
$$ plain form
35041 870214 195957 -433560 -931106 -1263446 -1399328 -1318776 -1070851 -752251 -404185 16952
35031 16952 530122 1033962 1380143 1535093 1614587 1740977 1909963 2036861 2108957 2233247
35021 2233247 2515570 2928514 3326191 3568086 3604111 3467565 3237048 3002792 2814728 2637791
35011 2637791 2392406 2064206 1742931 1520228 1371967 1181700 874192 495874 172434
35002 172434 22692 110001 426650 887879 1350156 1665095 1741859 1583155 1279740 963139
34992 963139 740037 659947 740763 1002045 1444851 2005854 2570056 3052363 3458174 3853440
34982 3853440 4279976 4702106 5029288 5193388 5214201 5183752 5171103 5151955 5059637 4900251
34972 4900251 4772400 4752525 4801714 4831380 4844248 4957307 5270774 5745672 6227687 6572238
34962F572238J66364N8165P8623K06271L38841L56053K27402M9680n2123n1699
34952G949815k1383k4336n6839r5713j41311j87323j98640j60026j11431r2742
34942F860071q2699l7681L3359Q0355P7218K6278p6341k14019l04676k65090j32291
34931E964484m8409j00771k38337l67094m56064n09304n03229m18871k98921k12324
34921B811160j80567j78495j79021j52802n2252J48777M05775O28946P48174P35584
34911D735279O01546M07535K47074J60669R1247k8498j70949k50486k40579j89329
34901E363509j36985r5158j06248k37958m84520p26525q21085p02394l91034L7764
34891A699366M67892P72936Q78900P93660N78875L24106J34886P6474J03916J02643
$$ plain form
34962 6572238 6738602 6796767 6875390 7081661 7420502 7776555 8003957 8053637 8001514 7949815
34952 7949815 7928432 7904096 7847257 7751544 7610233 7422910 7224270 7064244 6952813 6860071
34942 6860071 6777372 6739691 6773050 6853405 6930623 6956901 6880560 6666541 6361865 6096775 5964484
34931 5964484 5916075 5815304 5576967 5209873 4753809 4244505 3741276 3322405 3023484 2811160
34921 2811160 2630593 2452098 2273077 2120275 2068023 2216800 2622575 3251521 3999695 4735279
34911 4735279 5336825 5744360 5991434 6152103 6243350 6214852 6043903 5793417 5552838 5363509
34901 5363509 5226524 5131366 5025118 4787160 4302640 3576115 2755030 2052636 1661602 1699366
34891 1699366 2167258 2940194 3819094 4612754 5191629 5515735 5650621 5727095 5831011 5933654
34881E933654K9574l5191q481Q0323J41302J42637J19601J08194J40302K69565
34871F921480N07014P32100P65642N71376L16073J77683J41654M5389k04183n17881
34861I456347p20257p05827m98116k06078N0950K01207K32633J54011l8275l24096
34851G602499n99867p14416o01721l51424j18631J1024M1813L14q8963j80053
34841E000575k31660k65666l35852m19788m07147k38045q363J10480L3838j82917
34831C055455m16137n55003n41614l93053j93349l5055L8371L4438j0778l7985
34821I45290J0115J26370K29537K60398K63232L25078M55210N74981O09926N41009
34811D341146L83627J78512k427j03196j43014j81833k31192k48957k10196j20522
$$ plain form
34881 5933654 5963228 5928037 5919556 5999879 6141181 6283818 6403419 6511613 6651915 6921480
34871 6921480 7428494 8160594 8926236 9497612 9813685 9991368 10133022 10178411 9974228 9456347
34861 9456347 8736090 8030263 7532147 7326069 7377019 7578226 7810859 7964870 7926595 7602499
34851 7602499 7002632 6288216 5686495 5335071 5216440 5227464 5269277 5269591 5180628 5000575
34841 5000575 4768915 4503249 4167397 3747609 3340462 3102417 3094054 3204534 3238372 3055455
34831 3055455 2639318 2084315 1542701 1149648 956299 921244 959615 994053 983275 945290
34821 945290 955405 1081775 1311312 1571710 1834942 2160020 2615230 3190211 3800137 4341146
34811 4341146 4724773 4903285 4900858 4797662 4654648 4472815 4241623 3992666 3782470 3661948
34801C661948K8069K31480L99905M05036K35722K8688r5207j51613k07925k64121
34791D271982k92785l30004m24638n19980m77236k28551J44901M86896O74356
34782C304941O62089M79652K07698o3552k65950l56597l30919k55441k41238l32146
34772B808537m42510m54748l57289k32709j31881l3867O8171J21222R1148L7147
34762A473221N7655J75550L07877L47453K60007J02163m7970j67368k78309l63913
34752A866366l38840j48703J21549K95892K72980J04226r6486k64776l76269l74795
34742A061144j84193J88235N93980Q27577P85985N45952K80950J04194m651j36386
34732D062787l48478o22307q76027r92470q78958n61241k11723k9388p2378k28821
$$ plain form
34801 3661948 3690017 3921497 4321402 4726438 4962160 4990848 4895641 4744028 4536103 4271982
34791 4271982 3979197 3649193 3224555 2704575 2227339 1998788 2143689 2630585 3304941
34782 3304941 3967030 4446682 4654380 4590828 4324878 3968281 3637362 3381921 3140683 2808537
34772 2808537 2366027 1911279 1553990 1321281 1189400 1155533 1223704 1344926 1436074 1473221
34762 1473221 1530876 1706426 2014303 2361756 2621763 2723926 2675956 2508588 2230279 1866366
34752 1866366 1527526 1378823 1500372 1796264 2069244 2173470 2076984 1812208 1435939 1061144
34742 1061144 876951 1065186 1659166 2486743 3272728 3818680 4099630 4203824 4199173 4062787
34732 4062787 3714309 3092002 2215975 1223505 344547 -216694 -428417 -457805 -530183 -759004
34722g59004l42561l28682j79818O4180L15496M64767M75866M43897N05893O82262
34712A342296Q38479Q18999O03253L19191J16269L7979J1354n9477k03916l79589
34702C444838n28062o16598o37579n95814n04791l79867k30590p6622K6307R527
34692h9251j28048k76862k96606j54997L7089J47553J60659J66490K29737L17278
34682A13042L69976L97589M50781N11683M69024K29153j67355n55932p67948p46172
34672C03841n70508l83120k70883k08425j21559L933J04306J23645P7569K2755
34662i18446L595M3674J43771K60736L33331L66296M43272O03150P41868P09280
34652B730527M92443K38767J00535J16904K45907M31898O05058O72272N68900
$$ plain form
34722 -759004 -1101565 -1430247 -1610065 -1545885 -1230389 -765622 -289756 154141 660034 1342296
34712 1342296 2180775 2999774 3603027 3922218 4038487 4076466 4087820 4028343 3824427 3444838
34702 3444838 2916776 2300178 1662599 1066785 561994 182127 -48463 -125085 -98778 -89251
34692 -89251 -217299 -494161 -790767 -945764 -908675 -761122 -600463 -433973 -204236 113042
34682 113042 483018 880607 1331388 1843071 2312095 2541248 2373893 1817961 1050013 303841
34672 303841 -266667 -649787 -920670 -1129095 -1250654 -1246721 -1142415 -1018770 -941201 -918446
34662 -918446 -914851 -871177 -727406 -466670 -133339 232957 676229 1279379 2021247 2730527
34652 2730527 3222970 3461737 3562272 3679176 3925083 4356981 4962039 5634311 6203211
34643F203211L17983K3170j89836k39880j48688m9530r3153l07437n63531o96465
34633D255844o42694m57194k38228o6666P678l5117j84927l99885o01500o91772
34623I45539o18799m35593k59512j62395j36537j71250k91948m75020n82373m69447
34613b657335j58093J61744L17748L02512K31391K03113K22976K24432J36213
34604a015299m6949k32746k92420j86447j5355R0333J22056J90417L63432N57053
34594d65925O21517N04769K86792P3475q6350j82588k15401k22041k81557m34704
34584d02013o13211o93542o20855m53605k95966k16600k24374k84969l50460l88239
34574d543834l81971l02642j09322J92447N16366P56312Q67999Q63617P58197
$$ plain form
34643 6203211 6521194 6544364 6354528 6114648 5965960 5916430 5823277 5515840 4952309 4255844
34633 4255844 3613150 3155956 2917728 2851062 2858740 2823623 2638696 2238811 1637311 945539
34623 945539 326740 -108853 -368365 -530760 -667297 -838547 -1130495 -1605515 -2187888 -2657335
34613 -2657335 -2815428 -2653684 -2335936 -2033424 -1802033 -1598920 -1375944 -1151512 -1015299
34604 -1015299 -1062248 -1294994 -1587414 -1773861 -1789216 -1698883 -1576827 -1386410 -1022978 -465925
34594 -465925 155592 660361 947153 1020628 934278 751690 536289 314248 32691 -402013
34584 -402013 -1015224 -1708766 -2329621 -2783226 -3079192 -3295792 -3520166 -3805135 -4155595 -4543834
34574 -4543834 -4925805 -5228447 -5337769 -5145322 -4628956 -3872644 -3004645 -2141028 -1382831
34565a382831N70657L53127J59461r85j21767j38808K939K28718L77958L91332
34555D39801L67013M01150M62519M73370M29632L73838L15404K47486J87157J29967
34545C827337J8644j66222l30738l65118k81155j73851q5865m365L8992j7739
34535B459920j46751k29399k03266j30973r9360j24892j79849k29572k08506m0999
34525H66353K56134N48245P11344P36498O64351M87776K02120r4853k61448k77634
34515C838886k70494l48454m69974n08422l99210j84775M5051K03008K18119P2637
34505B196372j49646k95930k64046p9835J52524L38264M03447K79547k9090l63096
34495B188511m90657l27316k5584J95521K62150K44726K10687J66317J20929J12971
$$ plain form
34565 -1382831 -812174 -459047 -299586 -300571 -422338 -561146 -558207 -329489 48469 439801
34555 439801 806814 1207964 1670483 2143853 2573485 2947323 3262727 3510213 3697370 3827337
34545 3827337 3845981 3679759 3349021 2983903 2702748 2528897 2443032 2438667 2477659 2459920
34535 2459920 2313169 2083770 1880504 1749531 1650171 1525279 1345430 1115858 907352 866353
34525 866353 1122487 1670732 2382076 3118574 3782925 4270701 4472821 4377968 4116520 3838886
34515 3838886 3568392 3219938 2749964 2241542 1842332 1657557 1702608 1905616 2123735 2196372
34505 2196372 2046726 1750796 1486750 1406915 1559439 1897703 2301150 2580697 2551607 2188511
34495 2188511 1697854 1370538 1344954 1540475 1802625 2047351 2258038 2424355 2545284 2658255
34485B658255J49090J75459J34263J3669j66984l81008n85264p14044p01947n18302
34475F3187k04986J02273K35719J38142p1050k19417k46636j91982o3593J69422
34465b88921M54628O45501O62522N81820N14441M76356M38472M27575M84377N58944
34455D955715N37732L70573J10013j67416m18644o11612p06720o94101o28102
34446B747438n95272o32804o74370n95288l41357o233K54015L75094M06714L96158
34436A334095L33564K29886J53732J34412J05814J6047p5592r4062p9201j16474
34426A942221j76830j44055M460J55311K14180K08677K11727K47428L03682L58589
34416C325390L56596K35612K8845j27831j53083j32388k03028l62922m72285m37738
$$ plain form
34485 2658255 2807345 2982804 3117067 3130736 2963752 2582744 1997480 1283436 581489 63187
34475 63187 -141799 -39526 196193 334335 263285 43868 -202768 -394750 -458343 -288921
34465 -288921 165707 811208 1473730 2055550 2569991 3046347 3484819 3912394 4396771 4955715
34455 4955715 5493447 5864020 5974033 5806617 5387973 4776361 4069641 3375540 2747438
34446 2747438 2152166 1519362 844992 249704 -91653 -97886 156129 531223 937937 1334095
34436 1334095 1667659 1897545 2051277 2185689 2291503 2307550 2231958 2137896 2058695 1942221
34426 1942221 1765391 1621336 1625796 1781107 1995287 2203964 2415691 2663119 2966801 3325390
34416 3325390 3681986 3917598 3946443 3818612 3665529 3533141 3330113 2967191 2494906 2057168
34406B057168l25083k72874l40386m64182n38457n15696m37498l81032l76979
34397a595019l76972k99158j05057J60064L92125N00672M75222L79609K66819
34388b01695J11003j44132m70716p32183p94147o34964l33637J3740L33302N65266
34378b288163O80685P17794P58066Q35294Q82559P95424N50702K48582K7978n7625
34368C151296p5001j23633k21414k85850k31801q5176J0465q1861l49959o24775
34358A082291p34785o62790n27385m21926l22119j64100M7673K58465M44805O09925
34348c89946P17612P07835N89990M57859L88154L74102L82821M20849M92417N29258
34338D670951M29939J80086j00833k52197k12097p1971L363p7394k54495l89298
$$ plain form
34406 2057168 1732085 1459211 1118825 654643 116186 -399510 -837008 -1218040 -1595019
34397 -1595019 -1971991 -2271149 -2376206 -2216142 -1824017 -1323345 -848123 -468514 -201695
34388 -201695 -90692 -234824 -705540 -1437723 -2231870 -2866834 -3200471 -3186731 -2853429 -2288163
34378 -2288163 -1607478 -889684 -131618 703676 1586235 2381659 2932361 3180943 3208921 3151296
34368 3151296 3076295 2952662 2731248 2445398 2213597 2128421 2138886 2057025 1707066 1082291
34358 1082291 347506 -315284 -842669 -1264595 -1586714 -1750814 -1703141 -1444676 -999871 -389946
34348 -389946 327666 1035501 1625491 2083350 2471504 2845606 3228427 3649276 4141693 4670951
34338 4670951 5100890 5280976 5180143 4927946 4715849 4643878 4647241 4569847 4315352 3926054
34328C926054m06037l41530k65243j97890j26832n6952q413O530l6353j89126
34318B304208m67195p68316r16435q22358n77485l58537k47511j67634L737K79103
34308a738423N30684O12548N02185L17801K07784K35024L54032M64809M78948
34299A965392L69984J96416O4456L3214N3460K5602p8866j82378j99605j43817
34289B103858j11392j77731l37742n38697p29561q65230r02212q29498o90716
34280c078921n38647l69350j37033J58171M32454N89526O09475N50717M81360
34271a302248M19968L23288J25904j72598m44865n09358l08640J9485K89285M42963
34261a116816N25151N38682M35558K45534R9708Q6033J61907K46716L16224L52848
$$ plain form
34328 3926054 3520017 3178487 2913244 2715354 2588522 2531570 2523157 2529687 2493334 2304208
34318 2304208 1837013 1068697 152262 -670096 -1247581 -1606118 -1853629 -2021263 -2017526 -1738423
34308 -1738423 -1207739 -595191 -93006 224795 432579 667603 1021635 1486444 1965392
34299 1965392 2335376 2531792 2596248 2629462 2682922 2708524 2629658 2447280 2247675 2103858
34289 2103858 1992466 1814735 1476993 938296 208735 -656495 -1558707 -2388205 -3078921
34280 -3078921 -3617568 -3986918 -4123951 -3965780 -3533326 -2943800 -2334325 -1783608 -1302248
34271 -1302248 -882280 -558992 -433088 -605686 -1050551 -1559909 -1868549 -1849064 -1559779 -1116816
34261 -1116816 -591665 -52983 382575 628109 727817 813850 975757 1222473 1538697 1891545
34251A891545K93479J21868m1771n2089P3406J69894J32571K6427k6968N402P2181
34240B665945J24071J41817J12326L3595o0549j18907j23851j04821r7411j04023
34230B468192j00651p1670k9113m773l5842j52518l51170n62456o73322o25006
34220a38329m90778m15662m60392n29072m64246j92221K25932O41779Q95320Q91324
34210c6345O55311L12121j1543k56713m13782m90687n26699n79069o39646o04854
34200b591906l94055p4118J93961L09450K73470J16599j14697l05492l17908j30316
34190c035012J40544L83740N83501P34303P64219O19279L61303J01005j24477
34181E28405l33352n02457n83515n97150o10061o07825m84990k02477J15924L00502
$$ plain form
34251 1891545 2185024 2306892 2265121 2213032 2286438 2456332 2588903 2615330 2588362 2593764 2665945
34240 2665945 2790016 2931833 3044159 3077754 3017205 2898298 2774447 2669626 2572215 2468192
34230 2468192 2367541 2295871 2266758 2261985 2226143 2073625 1722455 1159999 486677 -138329
34220 -138329 -629107 -1044769 -1505161 -2034233 -2498479 -2690700 -2464768 -1822989 -927669 -36345
34210 -36345 618966 931087 919544 662831 249049 -241638 -768337 -1347406 -1987052 -2591906
34200 -2591906 -2985961 -3060079 -2866118 -2556668 -2283198 -2166599 -2281296 -2586788 -2904696 -3035012
34190 -3035012 -2894468 -2510728 -1927227 -1192924 -428705 190574 551877 652882 528405
34181 528405 195053 -307404 -890919 -1488069 -2098130 -2705955 -3190945 -3393422 -3277498 -2976996
34171b976996L09663K40378J96742K00643K19753K32718K54499L21854M58239
34162e42507O34111P63734P66989O41563M55124K65835Q4857o6260j07803K3113
34152B918756K48674L67275K40719n9448l28972m33772l95908l01070j92033p1810
34142A992411M7792J43789J95918J70693L0227j96231l84853m30634l78003l64459
34132H26650m24312m28210k59965J3988K23307L04443L48384M39018N23386M78826
34122B045515K63165m1317l10673m77044n60462o27286p09116p57619p03561n64742
34112b443140m47727m10805l68732j86255J58467N54360Q74060J046100J036791
34103a86881Q57583O07259M17559L15033K07208M6910p2131n5517K6108J4578
$$ plain form
34171 -2976996 -2667333 -2426955 -2230213 -2029570 -1809817 -1577099 -1322600 -1000746 -542507
34162 -542507 91604 855338 1622327 2263890 2719014 2984849 3069706 3003446 2895643 2918756
34152 2918756 3167430 3534705 3775424 3715976 3387004 2953232 2557324 2256254 2064221 1992411
34142 1992411 2040203 2183992 2379910 2550603 2580830 2384599 1999746 1569112 1191109 826650
34132 826650 402338 -25872 -285837 -271849 -48542 255901 604285 1043303 1566689 2045515
34122 2045515 2308680 2267363 1956690 1479646 919184 291898 -417218 -1174837 -1878398 -2443140
34112 -2443140 -2890867 -3301672 -3670404 -3856659 -3698192 -3143832 -2269772 -1223672 -186881
34103 -186881 670702 1277961 1695520 2010553 2217761 2264671 2192540 2137023 2163131 2177709
34093B177709j22626k57083k72367j81798o6936J0241N323j15362l22929n11346
34083C42826n81033n16697l68972k02941q4787o2958j17196j62230j42890r3847
34073a990725o8093m6856K3989J35885K20837K46025K46893K60922K80138K85376
34063d05609K87416L11529L63475M22093M45542L84405K22904J8975j30843j87177
34053A732710j98386k11039j87660o6778J11712K13275J65883N1451j1014k8676
34043A571478r8463k18928k48811j10779M9016J4569k10721l80636k95681k4232
34033D6812K12315K95927K79834K56480K58118K84112L40144M16565M71511M59845
34023C321663L53022J28025k14760n96827q64178q91533o84973l67122p2333J32554
$$ plain form
34093 2177709 2055083 1798000 1525633 1343835 1276899 1287140 1292463 1177101 854172 342826
34083 342826 -238207 -754904 -1123876 -1326817 -1411604 -1474562 -1591758 -1753988 -1896878 -1990725
34073 -1990725 -2058818 -2105674 -2081685 -1945800 -1724963 -1478938 -1232045 -971123 -690985 -405609
34063 -405609 -118193 193336 556811 978904 1424446 1808851 2031755 2050730 1919887 1732710
34053 1732710 1534324 1323285 1135625 1068847 1180559 1393834 1559717 1611168 1600154 1571478
34043 1571478 1473015 1254087 1005276 894497 943513 958082 747361 366725 71044 46812
34033 46812 259127 555054 834888 1091368 1349486 1633598 1973742 2390307 2861818 3321663
34023 3321663 3674685 3802710 3587950 2991123 2126945 1235412 550439 183317 110984 243538
34013B43538K50580L15589L50011L35541K23946N47k59737m29651m42849l52128
34003B35387k56038j92578j45110j36008k39893m64452o67706o62354m00906j5378
33993b945036L18795N10215N52108M71656L16797J47627l072j39762k52624k92724
33983a316020k32321j14561l16J04265K18815L17789L55842L54339L91007M88000
33973E66839N66905N39352M00345K10970K9721j10773j90666j98846j30319K0734
33963A704262K40809M65690O09341O41651N98754M98875L02030o305l44591o15390
33953D095126q22599j024911j177966j118041p50704k05972K41736L90275K36871
33944a36185n3011k54774k10737O0969L64048M84779L86271K19285J32909J17801
$$ plain form
34013 243538 494118 809707 1159718 1495259 1719205 1719752 1460015 1030364 587515 235387
34003 235387 -20651 -213229 -358339 -494347 -734240 -1198692 -1866398 -2528752 -2929658 -2945036
33993 -2945036 -2626241 -2116026 -1563918 -1092262 -775465 -627838 -630910 -770672 -1023296 -1316020
33983 -1316020 -1548341 -1662902 -1663218 -1558953 -1340138 -1022349 -666507 -312168 78839 566839
33973 566839 1133744 1673096 2073441 2284411 2314132 2203359 2012693 1813847 1683528 1704262
33963 1704262 1945071 2410761 3020102 3661753 4260507 4759382 5061412 5055107 4710516 4095126
33953 4095126 3272527 2247616 1069650 -48391 -799095 -1005067 -763331 -373056 -136185
33944 -136185 -189196 -443970 -654707 -593738 -229690 255089 641360 860645 993554 1111355
33934A111355O1841q8229k81116m56535o10348p38847p75226o40090l47257k0175
33924b784627K04119K72982K34148J87975K21937L48799M83356N03779L66461
33915C8929J52863j7078j03441j47700j67778j08020P5045L13127M65533M58955
33905I60435L48042K25290J07756n7067k92920n38497o93371p03550o01685m73837
33895a719404l80499k98219j49849R2141L51123N24698O00999O48503O90578O51508
33885A011579M59431J58964j21797k87378l15607k13511k233K45247M06209L84282
33875A725186J78542j18730l73711m80761m37481l66307m14345n98254p74205
33866a660066p86810o19273l66945r9310J89264M95209P41011Q40559Q07880P57426
$$ plain form
33934 1111355 1173196 1084967 803851 347316 -263032 -1001879 -1777105 -2417195 -2764452 -2784627
33924 -2784627 -2580508 -2307526 -2073378 -1885403 -1663466 -1314667 -831311 -327532 38929
33915 38929 191792 174714 71273 -76427 -244205 -352225 -277180 35947 501480 960435
33905 960435 1308477 1533767 1641523 1584456 1291536 753039 59668 -643882 -1245567 -1719404
33895 -1719404 -2099903 -2398122 -2547971 -2455830 -2104707 -1580009 -979010 -330507 360071 1011579
33885 1011579 1471010 1629974 1508177 1220799 905192 691681 689448 934695 1340904 1725186
33875 1725186 1903728 1784998 1411287 930526 493045 126738 -287607 -885861 -1660066
33866 -1660066 -2446876 -3066149 -3433094 -3532404 -3343140 -2847931 -2106920 -1266361 -458481 298945
33856B98945P83507Q54219Q36992O28950K60904j21375l69907m30907l50871k14572
33846B175885q5056J3897Q2443J26638J56725J93178K53723L18892L23912K17825
33836C778062M0738q5356o7512O6234K01948K51201K03487Q5301q2993k69890
33826D121220m07053m23031l07995j27032L7056J44495J97334J89467Q3796j33969
33816C374288l77489m76701l24896j5526K11814J93590q185j98510k60001k31055
33806A887329k02273k09404k46687l20422m33685n42016n74927n04017l66575
33797a512677k30756j59738j91373l12606m53327n34949n25565m28615k43689
33788d593295N457K12066K37526O8848j19141j13856J33203M80499P45861Q47144
$$ plain form
33856 298945 1082452 1936671 2773663 3402613 3663517 3542142 3172235 2741328 2390457 2175885
33846 2175885 2090829 2104726 2187169 2313807 2470532 2663710 2917433 3236325 3560237 3778062
33836 3778062 3818800 3733444 3665932 3732166 3934114 4185315 4388802 4474103 4391110 4121220
33826 4121220 3714167 3291136 2983141 2856109 2893165 3037660 3234994 3424461 3508257 3374288
33816 3374288 2996799 2520098 2195202 2179676 2391490 2585080 2576895 2378385 2118384 1887329
33806 1887329 1685056 1475652 1228965 908543 474858 -67158 -642085 -1146102 -1512677
33797 -1512677 -1743433 -1903171 -2094544 -2407150 -2860477 -3395426 -3920991 -4349606 -4593295
33788 -4593295 -4587838 -4375772 -4138246 -4069398 -4188539 -4302395 -4169192 -3688693 -2942832 -2095688
33778b095688Q23158P72055P70748Q13704Q20776P27838N65681M24292L51004
33769C973568L21314L00591K82406K58558K06806J36571J02434J31182J61454
33760E874884R7164q8299l27489n22202o02376n42273l67047j51770J8202J02215
33750C491009J12659Q0703M0425L4838Q9408J67947K00208J77607J74220K25951
33740D794975K28858L7959l29244o66145p95614p64042p63546q93498j063982
33731b14279j126109j028537q26035n91765l65836j62720J4882J69971L01730
33722c828698M07705M98545N84391O32289N69797L62350O7335k13960m11301m85064
33712a816611m00699j76090O6693J85961J71772J36194J30515O6858j10043k52181
$$ plain form
33778 -2095688 -1272530 -500475 270273 1083977 1904753 2632591 3198272 3622564 3973568
33769 3973568 4294882 4595473 4877879 5136437 5343243 5479814 5582248 5713430 5874884
33760 5874884 5972048 5883749 5556260 5034058 4431682 3889409 3522362 3370592 3388794 3491009
33750 3491009 3603668 3684371 3724796 3759634 3849042 4016989 4217197 4394804 4569024 4794975
33740 4794975 5023833 5061792 4732548 4066403 3270789 2506747 1743201 849703 -214279
33731 -214279 -1340388 -2368925 -3194960 -3786725 -4152561 -4315281 -4300399 -4130428 -3828698
33722 -3828698 -3420993 -2922448 -2338057 -1705768 -1135971 -773621 -706286 -920246 -1331547 -1816611
33712 -1816611 -2217310 -2393400 -2326707 -2140746 -1968974 -1832780 -1702265 -1635407 -1745450 -1997631
33702a997631j30602K74905P07459Q90012P90152N92581M61267L94483L09934
33693B292560K12730K22383M12495O50565O63792L13456k19837n81784n76793
33684C389567l10741j5661J79920K70660K58466J24867r7823l21585m90524o11993
33674B375153o82081o48168m92195l03215k01622k00914j96215r6913O6877J85982
33664a93311J96582J41021J06829J18299J02735k3817k41996m22778m46446l11434
33654i74316j13527O0047J88629K82778L26854K72532Q5183k01961m80746o36840
33644a191367o44281n77924n13590m32867k51604P2856M90596Q95068J171088
33635i82025J226628J041985P06798L67718J17517m3378j41465j78984j66688
$$ plain form
33702 -1997631 -2128233 -1853328 -1145869 -255857 534295 1126876 1588143 1982626 2292560
33693 2292560 2505290 2727673 3140168 3790733 4454525 4767981 4548144 3966360 3389567
33684 3389567 3078826 3063165 3243085 3513745 3772211 3897078 3799255 3477670 2987146 2375153
33674 2375153 1693072 1044904 552709 249494 47872 -153042 -349257 -446170 -379293 -193311
33664 -193311 3271 144292 251121 369420 472155 448338 206342 -216436 -662882 -974316
33654 -974316 -1087843 -1027796 -839167 -556389 -229535 42997 128180 -73781 -554527 -1191367
33644 -1191367 -1835648 -2413572 -2927162 -3360029 -3611633 -3538777 -3048181 -2153113 -982025
33635 -982025 244603 1286588 1993386 2361104 2478621 2435243 2293778 2114794 1948106
33626A948106j56887j99645k83765l49280l47958k80959j98590j71166k28514
33617b68658l14441l35144k66875j73463r7563J0738K15822M95448P70916R95662
33607A032442J144746J146159R14670M73626j5341l71493n20723n11060m50589
33598B842437m33499m77162n11081m55864l18335j76162p1153L1153J61454K77900
33588H69688L10944K44097J16872k8544j69703k88401l67939m06036m08046l65446
33578d92514k59794r8271O0654J28770M7338j64680m13934n78581n57986l13957
33568b642955R2648N11249Q01704R46633J020725J032119Q69771M74176R82k90517
33558B816535l04117j72861n9469P105O6797J07098R0749N0230O4434J47878K26035
$$ plain form
33626 1948106 1791219 1591574 1307809 958529 610571 329612 131022 -40144 -268658
33617 -268658 -583099 -918243 -1185118 -1358581 -1456144 -1445406 -1229584 -734136 36780 1032442
33607 1032442 2177188 3323347 4238017 4711643 4696302 4324809 3804086 3293026 2842437
33598 2842437 2408938 1931776 1420695 964831 646496 470334 399181 430334 591788 869688
33588 869688 1180632 1424729 1541601 1513057 1343354 1054953 687014 280978 -127068 -492514
33578 -492514 -752308 -850579 -789925 -661155 -613817 -778497 -1192431 -1771012 -2328998 -2642955
33568 -2642955 -2550307 -2039058 -1237354 -290721 730004 1762123 2631894 3106070 3107052 2816535
33558 2816535 2512418 2339557 2280088 2287193 2353990 2461088 2551837 2602067 2666501 2814379 3040414
33547C040414K30027J74476J24386J05367O8346m4189j93141k28018k0150L76677
33537C634195P27578Q00548N48235J22250k59358m63310n10371n21625n79079
33528C499063o35165n82223l98587j76103k314J21325K22023K80192K58801J68169
33518B755181N2296o9006k07492l71612n50742p17501q26963q34750p31210n35677
33508b037476k58155Q3000L94833N35622M60420K91366J83244J54607J13941K5224
33498e3374k5698O6910L04878N60719O44048M19860p7024o36712j021150j130577
33488i48120j025075q20041n96531l78611j40429J50374M45287N90073M57438
33479b265635J13198k07677l14904k24082j01401q3576j57661j85883m4023K37144
$$ plain form
33547 3040414 3270441 3444917 3569303 3674670 3743016 3698827 3505686 3277668 3257518 3634195
33537 3634195 4361773 5162321 5710556 5832806 5573448 5110138 4599767 4078142 3499063
33528 3499063 2863898 2281675 1883088 1706985 1704671 1825996 2048019 2328211 2587012 2755181
33518 2755181 2807477 2738471 2530979 2159367 1608625 891124 64161 -770589 -1501799 -2037476
33508 -2037476 -2295631 -2212631 -1817798 -1282176 -821756 -530390 -347146 -192539 -78598 -53374
33498 -53374 -79072 -12162 292716 853435 1497483 1917343 1840319 1203607 182457 -948120
33488 -948120 -1973195 -2793236 -3389767 -3768378 -3908807 -3758433 -3313146 -2723073 -2265635
33479 -2265635 -2152437 -2360114 -2675018 -2899100 -3000501 -3084077 -3241738 -3427621 -3471644 -3234500
33469c234500M70212M83197K93236Q0608K46N8038J60252K21414K04708J09709
33459a152880l5768j84411k92171l31630k90011j75097j9159J47994L26429N19383
33449a487321O84808P48996O73050M78848K13546p2783l10019m14711l46682j52171
33439A5561N5957J58011R3082r2733k65534l14977k61567k24513k73693l45638
33429a456044l23903j77835K451J02745J04206J05131K19864M54217O92474Q07339
33419E30645P56147N67674K92589R421j69465j70591l0199J52027L05199L83511
33409B626958L16933O5786k77050n33580o16608n92886n64484n70869o22917p25872
33399a494589q07759p12926l59938J27657N14327O55338N71311L75177J95571
$$ plain form
33469 -3234500 -2764288 -2281091 -1987855 -1907247 -1907001 -1848963 -1688711 -1467297 -1262589 -1152880
33459 -1152880 -1188648 -1373059 -1665230 -1996860 -2286871 -2461968 -2481127 -2333133 -2006704 -1487321
33449 -1487321 -802513 -53517 619533 1098381 1311927 1239144 929125 514414 167732 15561
33439 15561 71518 229529 322611 229878 -35656 -350633 -612200 -836713 -1110406 -1456044
33429 -1456044 -1779947 -1957782 -1955331 -1852586 -1748380 -1643249 -1423385 -969168 -276694 530645
33419 530645 1286792 1854466 2147055 2156476 1987011 1816420 1786221 1938248 2243447 2626958
33409 2626958 2943891 3009677 2732627 2199047 1582439 989553 425069 -145800 -768717 -1494589
33399 -1494589 -2302348 -3015274 -3375212 -3247555 -2733228 -2077890 -1506579 -1131402 -935831
33390i35831J40202K46999M48110O16418O60439N73289M19478K94541K59521K77788
33380C000954K46417J26147L747k3658O403m2307k33514m82221o52062o78630
33370A271276n87035m32135k46154k9004K19580M53826N82031N35633L33035O2032
33360B163085j82851l29039l29982j95624j5882R1147O8910n2308k00412k95127
33350G21917k57402n8184K11130L65877K82801K7584k02236k65169j84653p0947
33340E70718K1657J16092K13447K54275K20192K07632L10613M50979M30463J79648
33330B975716j30423k72260j87831K0163K44233M29268N20312M62059K63117M304
33320D328658k14191k97463j77482R7632L14788K47110j15718n59280q77766j030969
$$ plain form
33390 -935831 -795629 -548630 -100520 515898 1176337 1749626 2169104 2463645 2723166 3000954
33380 3000954 3247371 3373518 3377265 3353607 3360010 3317703 3084189 2601968 1949906 1271276
33370 1271276 684241 252106 5952 -23052 196528 650354 1232385 1768018 2101053 2163085
33360 2163085 1980234 1651195 1321213 1125589 1109707 1200854 1269764 1217456 1017044 721917
33350 721917 464515 406331 617461 983338 1266139 1293723 1091487 826318 641665 570718
33340 570718 592375 708467 921914 1176189 1396381 1604013 1914626 2365605 2796068 2975716
33330 2975716 2845293 2573033 2385202 2405365 2649598 3078866 3599178 4061237 4324354 4328658
33320 4328658 4114467 3817004 3639522 3737154 4051942 4299052 4183334 3624054 2746288 1715319
33310A715319j054841r37566o67465l24023j6448K36919M81202O97053P87517
33301I17667O97109M74389K07998l4185j93002k26094j75136j67999k88272m62203
33291G50272n26129l97399j39837J22739L03319L68290L29269K51135K16392K33823
33281A511874K13468Q0568j07862k12594j64819j4343J63312L33427M62442M95454
33271B760927M29494L57572L73917M59822N19304N07633M63877M24530L70174
33262F667250K72691J46126K7243o3991j28738j78659k29246k77522k81665j96484
33252E757005m1794R5442J43327J03886K0896p0548j35675j21525r48J71547K92949
33241F214562L10499K58450J89362J02053l9117k34911m33187n76638o43140o41455
$$ plain form
33310 1715319 660478 -277088 -944553 -1268576 -1285024 -1048105 -566903 130150 917667
33301 917667 1614776 2089165 2297163 2262978 2069976 1843882 1668746 1500747 1212475 750272
33291 750272 224143 -173256 -313093 -190354 112965 481255 810524 1061659 1278051 1511874
33281 1511874 1725342 1805910 1698048 1485454 1320635 1306292 1469604 1803031 2265473 2760927
33271 2760927 3190421 3547993 3921910 4381732 4901036 5408669 5872546 6297076 6667250
33262 6667250 6939941 7086067 7113310 7049319 6920581 6741922 6512676 6235154 5953489 5757005
33252 5757005 5715211 5810653 5953980 6057866 6078762 6008214 5872539 5751014 5750066 5921613 6214562
33241 6214562 6525061 6783511 6972873 7074926 7035809 6800898 6367711 5791073 5147933 4506478
33231D506478o03499n94218o83231q54537r62652q47737n19253j79207k8938q1832
33221h48626j90375k12141j01682J16444L78896N85080O44165N54313L94287K19903
33211A540264J9003k06708l75163l95682k75693j01390O4090J98610K49166J33116
33201H49613j38554l91446m19145j96428P8699J76619N4528j23815j64271j9075
33191b93275J97378L39033L65009L58141M16335N29242N74980M49471J86040o9732
33181C052622j86923j23829R4983M00559O57492O96217M47577L8408k96170m00647
33171D380289k83708n3147J72203K97219K75251J39392j8469j23265j59546j45879
33161D480340j08708r3239j56788l19191n36636p37090q57893q45523o70170l79561
$$ plain form
33231 4506478 3902979 3308761 2625530 1770993 808341 -39396 -558649 -737856 -766794 -848626
33221 -848626 -1039001 -1251142 -1352824 -1236380 -857484 -272404 371761 926074 1320361 1540264
33211 1540264 1559267 1352559 977396 581714 306021 204631 268721 467331 716497 849613
33201 849613 711059 319613 -99532 -295960 -217261 -40642 13886 -109929 -274200 -293275
33191 -293275 -95897 243136 608145 966286 1382621 1911863 2486843 2936314 3122354 3052622
33181 3052622 2865699 2741870 2836853 3237412 3894904 4591121 5038698 5077106 4780936 4380289
33171 4380289 4096581 4043434 4215637 4512856 4788107 4927499 4909030 4785765 4626219 4480340
33161 4480340 4371632 4278393 4121605 3802414 3265778 2528688 1670795 825272 155102 -224459
33151b24459j05570L3978L9306J0454L6904J29163K40019L11508L00754J98585
33141I70642M5006q2224j05535J3402K43988M78719N84834N11812L53376K70981
33131C285001L40844M86624N57425M49769J61409k27821n98947q39829q88952
33122B725523p56604n13246k59314q2879o646L2618J19111K51238L24717K47557
33112B082075M8715j61707l19472m40250n29430n28145l94797j98476o2907j6757
33102e21151M1908K05451M22775N50928N25382M28116L70073L42404K22621p5917
33092B512590m90104q48564j003516r12455o26047k46593R6535K82471K63172
33083i72511J00768p5954j57637j02421O8057K82653M40063M62324L53796J92204
$$ plain form
33151 -224459 -330029 -296051 -256745 -246291 -209387 -80224 159795 471303 772057 970642
33141 970642 1015648 933424 827889 841291 1085279 1563998 2148832 2660644 3014020 3285001
33131 3285001 3625845 4112469 4669894 5119663 5281072 5053251 4454304 3614475 2725523
33122 2725523 1968919 1455673 1196359 1113480 1106834 1139452 1258563 1509801 1834518 2082075
33112 2082075 2130790 1969083 1649611 1209361 679931 151786 -243011 -441487 -504394 -521151
33102 -521151 -479243 -273792 148983 699911 1225293 1653409 2023482 2365886 2588507 2512590
33092 2512590 2022486 1173922 170406 -742049 -1368096 -1614689 -1518154 -1235683 -972511
33083 -972511 -871743 -947697 -1105334 -1207755 -1139698 -857045 -416982 45342 399138 591342
33073E91342N6779j1920J3294J51238L50196M64602L72270J28305n2308k586K23690
33062B284902M09007L90650K08593N1770P9679K89632N29662O23619M94242J95511
33052E557267j43143l97042n01922m73928l88769l18761k69444j85975l7187J17537
33042B958633J73427J01213K377K3524K18353N01578P24191P74817O27688L46617
33032F452418O6189p2740k1368J43367L08021M29129N14632N24970L73200N1802
33022H769620l04465n37879o16971o13844n62462m18079j70152P4477J74867J01880
33012E896992m0360j35193j61144j70685j95923k13256j96377j59485j21954o3935
33002D438680L5556J31936J48845R0827O1788J35814K57364L16226K82357K09178
$$ plain form
33073 591342 648121 636201 649495 800733 1150929 1615531 1987801 2116106 2063798 2061212 2284902
33062 2284902 2693909 3084559 3293152 3344922 3424601 3714233 4243895 4867514 5361756 5557267
33052 5557267 5414124 5017082 4515160 4041232 3652463 3333702 3064258 2878283 2841096 2958633
33042 2958633 3132060 3233273 3235650 3259174 3477527 3979105 4703296 5478113 6105801 6452418
33032 6452418 6518607 6445867 6424499 6567866 6875887 7305016 7819648 8344618 8717818 8769620
33022 8769620 8465155 7927276 7310305 6696461 6133999 5715920 5545768 5620245 5795112 5896992
33012 5896992 5856632 5721439 5560295 5389610 5193687 4980431 4784054 4624569 4502615 4438680
33002 4438680 4474236 4606172 4755017 4845844 4907632 5043446 5300810 5617036 5899393 6108571
32992F108571J35874O5249L3656J14718L12858N09419N70193M86359L65567K89754
32982H992218K20723O2674j97212m33923m88210l28887r3923M8203O3219M8347
32972G893229P5439Q7916j8883k47011m70557n60017m95264l37720j22147J72277
32962E977262N29352Q22357Q95688P28858M75318L13555K86322L06144K82811
32953A0617667K03493J06824K9873p895K393O1130J50411K16872J81586J6263
32943A1578617j74471k07975j8934K33990L23496J98588N792j23031k12001l38675
32933A1265396m71301m89343l52191j82999j49746k70761l67780k45496P9442
32924H815221L69122M09822K30693M4319J6036J49266L50427N08473N21696L54512
$$ plain form
32992 6108571 6244445 6309694 6343350 6458068 6770926 7280345 7850538 8336897 8702464 8992218
32982 8992218 9212941 9275615 9078403 8644480 8156270 7827383 7733460 7781663 7844882 7893229
32972 7893229 7968668 8056584 8037701 7790690 7320133 6760116 6264852 5927132 5804985 5977262
32962 5977262 6506614 7328971 8224659 8953517 9428835 9742390 10028712 10334856 10617667
32953 10617667 10821160 10927984 10957857 10949962 10952355 11013485 11163896 11380768 11562354 11578617
32943 11578617 11404146 11196171 11177237 11411227 11734723 11933311 11939103 11816072 11604071 11265396
32933 11265396 10794095 10304752 9952561 9769562 9619816 9349055 8981275 8735779 8815221
32924 8815221 9184343 9594165 9824858 9869177 9885213 10034479 10384906 10893379 11415075 11769587
32914A1769587R9708r3813j85537k65822l91838m91339m82527m09851l84040m38126
32904H726402n18298n83081o35678o70188o48089n34393l29922q1797J19191J90313
32894E034460J44745R2851J08447J21391n170l04195o49521q54411p99381n03450
32884B385766j22715J45120K12544J61414J31215J76053K55167L10135K96263
32875C950962J84532O054j34669j63509j31254j35887j81836k01409j86072j83740
32865B823172j70150n2670J57119K89134K10350N272j10574j2924K47836N33694
32855C920259P23231P62637O82018N59924M39168K91864Q7162j42694l35951m61538
32845F526080n04810m37775k69198j01673o5146j82892l49182m44362m30604l33258
$$ plain form
32914 11769587 11869295 11775482 11589945 11324123 10932285 10440946 9958419 9548568 9164528 8726402
32904 8726402 8208104 7625023 6989345 6319157 5671068 5136675 4806753 4724956 4844147 5034460
32894 5034460 5179205 5272056 5380503 5501894 5496724 5192529 4543008 3688597 2889216 2385766
32884 2385766 2263051 2408171 2620715 2782129 2913344 3089397 3344564 3654699 3950962
32875 3950962 4135494 4141548 4006879 3843370 3712116 3576229 3394393 3192984 3006912 2823172
32865 2823172 2653022 2600352 2757471 3046605 3256955 3262227 3151653 3138729 3386565 3920259
32855 3920259 4643490 5406127 6088145 6648069 7087237 7379101 7466263 7323569 6987618 6526080
32845 6526080 6021270 5583495 5314297 5212624 5147478 4964586 4615404 4171042 3740438 3407180
32835C407180j81436M802J98170L64900M76359N12976M70576L73599K75022K33055
32825F135203K76989L77304M43970L83155J89202k4301j10133q565K17796M41549
32815H322169N40648M55128K44449Q3939J26871L34569M92673M32435J94484o2178
32805A1165187k57336m22942n72597o41496n88533m88077m60495n31424n98219
32796F604068n30763k90050L6839L02266M14255M04066L67482L40774K73904J41589
32786H064430K4987K7368J36975K36172K38327J57120M3326p6499j74652j98202
32776H479352j20238J1677J15264J44523R6535k4838k09294m08199n36658n23288
32766G024836l58510j03218J44594L05560L54239K99851J47648r0095l49828n33044
$$ plain form
32835 3407180 3225744 3230546 3428716 3793616 4269975 4782951 5253527 5627126 5902148 6135203
32825 6135203 6412192 6789496 7233466 7616621 7805823 7781522 7671389 7662824 7880620 8322169
32815 8322169 8862817 9317945 9562394 9646333 9773204 10107773 10600446 11032881 11227365 11165187
32805 11165187 10907851 10484909 9912312 9270816 8682283 8194206 7733711 7202287 6604068
32796 6604068 6073305 5783255 5820094 6122360 6536615 6940681 7308163 7648937 7922841 8064430
32786 8064430 8089417 8116785 8253760 8489932 8728259 8885379 8928705 8852206 8677554 8479352
32776 8479352 8359114 8370791 8486055 8630578 8727113 8702275 8492981 8084782 7548124 7024836
32766 7024836 6666326 6563108 6707702 7013262 7367501 7667352 7815000 7724905 7375077 6842033
32756F842033n91174n59434m81121l37941j00936J72872L50376L38449J65279
32747E798403n2244j98709k23486j47247k5262R4879J81689K04922J47134L3040
32737E813119r5509k50241m88387p91306j002029r61254o92838l80366j52698
32728I98491L5885K83959N67417P48609P39716N98535M49431L46064K42240Q7849
32718E098196q1103j68650j22753P950J17614J27995M2904n2135n2843O1455J87245
32707E165875J98498Q8744l5143r2612q6323j3527J67092M16979N64384M73002
32697F846969K08485n6421k43468l63777l70897j82875J43516M12235N06525M87767
32687G388059M31825K96993M0972k31578l50017k61340n3210J64822L30142M16598
$$ plain form
32756 6842033 6250859 5691425 5210304 4872363 4771427 4944299 5294675 5633124 5798403
32747 5798403 5746159 5547450 5323964 5176717 5151455 5246334 5428023 5632945 5780079 5813119
32737 5813119 5717610 5467369 4978982 4187676 3185647 2224393 1531555 1151189 998491
32728 998491 1034376 1318335 1885752 2634361 3374077 3972612 4422043 4768107 5010347 5098196
32718 5098196 5017093 4848443 4725690 4733640 4851254 4979249 5022153 4970018 4917175 4978630 5165875
32707 5165875 5364373 5453117 5417974 5325362 5239039 5225512 5392604 5809583 6373967 6846969
32697 6846969 7055454 6999033 6755565 6391788 6020891 5838016 5981532 6393767 6900292 7388059
32687 7388059 7819884 8116877 8157849 7926271 7576254 7314914 7261704 7426526 7756668 8173266
32677H173266M35673M34874M38244M04496K90006J29900J0747j3550N9949K10412
32667A0574017L85161M98742N02940M37218L56656K40522L9716k09212l97033
32658A2428727m65103m45778l81784k78761j46477j4504J12261K46990L49195
32649A1404766L37465K21830J56767K84927N53530P56970P62081O33557N20102
32640A5631995M67404L91813K27107M1273l3311L0131J04843N2727j24570l09113
32630A6480299m03598l90843k84339j03866Q1957J63444R2079o2210k00137l12305
32620A5060481m65815o88783r09526j003167q70209m91645M0481N45631Q59952
32611A2077400R49696R09010Q46944Q03642P71495P41992O99057O07402M61128
$$ plain form
32677 8173266 8608939 9043813 9482057 9886553 10176559 10306459 10317206 10303656 10363605 10574017
32667 10574017 10959178 11457920 11960860 12398078 12754734 12995256 13034972 12825760 12428727
32658 12428727 11963624 11517846 11136062 10857301 10710824 10696320 10808581 11055571 11404766
32649 11404766 11742231 11964061 12120828 12405755 12959285 13716255 14478336 15111893 15631995
32640 15631995 16099399 16491212 16718319 16759592 16726281 16756412 16861255 16913982 16789412 16480299
32630 16480299 16076701 15685858 15401519 15297653 15379610 15543054 15635133 15572923 15372786 15060481
32620 15060481 14594666 13905883 12996357 11993190 11122981 10631336 10671817 11217448 12077400
32611 12077400 13027096 13936106 14783050 15586692 16358187 17100179 17799236 18406638 18867766
32602A8867766L30321L02470L61080L63627J79570j51806m22885m30484j56034
32593A9243625K16125M57188M78951L74183K91478K94120L46436L99144M38222
32584B2539472M54069M19403L31668K50167K55389L75465N64340P31945P81534
32575B6703452O60263M29224K68126L37094O02882Q47239Q88123P67496O81436
32566C2185335P46454Q92122R89877J024988J089875J230921J363245J356242
32558D0879059J169618Q83244O20720M72852M70096N77105P07700P86818Q20271
32549D7387483Q84381J036991J259740J491011J678658J781497J760588J621158
32541E8901507J462136J441657J651144J991176K165417J853098R80829j42655
$$ plain form
32602 18867766 19198087 19500557 19861637 20225264 20404834 20253028 19830143 19399659 19243625
32593 19243625 19459750 19916938 20395889 20770072 21061550 21355670 21702106 22101250 22539472
32584 22539472 22993541 23412944 23744612 23994779 24250168 24625633 25189973 25921918 26703452
32575 26703452 27363715 27792939 28061065 28398159 29001041 29848280 30736403 31503899 32185335
32566 32185335 32931789 33823911 34813788 35838776 36928651 38159572 39522817 40879059
32558 40879059 42048677 42931921 43552641 44025493 44495589 45072694 45780394 46567212 47387483
32549 47387483 48271864 49308855 50568595 52059606 53738264 55519761 57280349 58901507
32541 58901507 60363643 61805300 63456444 65447620 67613037 69466135 70446964 70304309
32533G0304309j016817j327428j134799p06585k46778J76483N41023Q38115J121699
32524F8549222J493961K012785K651399L342790M019011M622985N139053N601972
32516I7433178O016846O275287O203203N682558M690638L286512J674311K51160
32508A31513693n69183o52349j94983N29714J366051K191025K803303L044579
32500A40031850K978575K833066K766935K733640K510137J795967L85374j589160
32492A54446384l569100m855685n079016m405580l332494k340814j694577j408698
32484A27760420j305819j161393r22155q48301j402619k894841n141293p469532
32476A06614467r133485r786639r570085q805409p723245o503257n398095m634624
$$ plain form
32533 70304309 69287492 67960064 66825265 66118680 65871902 66048385 66589408 67427523 68549222
32524 68549222 70043183 72055968 74707367 78050157 82069168 86692153 91831206 97433178
32516 97433178 103450024 109725311 115928514 121611072 126301710 129588222 131262533 131513693
32508 131513693 130944510 130292161 130097178 130626892 131992943 134183968 136987271 140031850
32500 140031850 143010425 145843491 148610426 151344066 153854203 155650170 156035544 154446384
32492 154446384 150877284 146021599 140942583 136537003 133204509 130863695 129169118 127760420
32484 127760420 126454601 125293208 124371053 123522752 122120133 119225292 114083999 106614467
32476 106614467 97480982 87694343 78124258 69318849 61595604 55092347 49694252 45059628
32468D5059628m212082l920814l571914l137065k690778k322939k107379k043621
32460B1053036j999960j809325j463258j132928r56892q83866p75873n94004m09178
32451A1027752k75272j69853m8359R8097K35365L02353K47098Q1942j02193j99786
32441A1197144j63792j0359K16105M55176O34871P05423O70853N76653M80400
32432A4762474M35720M59304M82022L76964R6258k35862m26234m11185l01900
32423A5237561k28449j98751j38885j7927J22049K36043L20514L89301M52908
32414A6174364N34690O67748Q45789R96586J035680R47623P99258O73308N97736
32405B3272782N35326M32172K81182J48568J33358K88629N81370R29681J263743
$$ plain form
32468 45059628 40847546 36926732 33354818 30217753 27526975 25204036 23096657 21053036
32460 21053036 19053076 17243751 15780493 14647565 13690673 12806807 12030934 11436930 11027752
32451 11027752 10752480 10582627 10534268 10632365 10867730 11170083 11417181 11499123 11396930 11197144
32441 11197144 11033352 11022993 11239098 11694274 12329145 13034568 13705421 14282074 14762474
32432 14762474 15198194 15657498 16139520 16516484 16612742 16376880 15950646 15539461 15237561
32423 15237561 15009112 14810361 14671476 14653549 14775598 15011641 15332155 15721456 16174364
32414 16174364 16709054 17376802 18222591 19219177 20254857 21202480 22001738 22675046 23272782
32405 23272782 23808108 24240280 24521462 24670030 24803388 25092017 25673387 26603068 27866811
32396B7866811J537381J697553J677619J439314J021597N45525J59845m2706o8772
32387C5834167K0872J89620M28303O91909R03009J055450J260237J628548K129348
32378D4141463K591809K803592K581446J851012P77873k29051p86345q27497n50105
32369E2354197j11107M93256J258359K056312K759382L369377L970946M649281
32361G0800003N481820O489299P546683Q466898R243168J0114602J1350792J3071981
32353A42565246J5279262J7886743K0673150K3316162K5337179K5613253K2045173
32346B92716168J2669026k009944j7987289k9945899l4938788l3885315k9753183
32339A56864776k4943408k0445273j6519633j3269684j0638077q453507o658845
$$ plain form
32396 27866811 29404192 31101745 32779364 34218678 35240275 35785800 35945645 35902939 35834167
32387 35834167 35855039 36044659 36472962 37164871 38067880 39123330 40383567 42012115 44141463
32378 44141463 46733272 49536864 52118310 53969322 54747195 54518144 53731799 52904302 52354197
32369 52354197 52243090 52736346 53994705 56051017 58810399 62179776 66150722 70800003
32361 70800003 76281823 82771122 90317805 98784703 108027871 118142473 129493265 142565246
32353 142565246 157844508 175731251 196404401 219720563 245057742 270670995 292716168
32346 292716168 305385194 303375250 285387961 255442062 220503274 186617959 156864776
32339 156864776 131921368 111476095 94956462 81686778 71048701 62595194 55936349
32332E5936349n298417m306125l521086k885597k432760k108520j791162j464293
32324C2128389j201552j003973q13117o57298o19018o75647p34996q13193j002669
32315B4606926j253803j356413j177180p87735l40090N3445L06784L80814L58339
32306B0791087L63518L67998K17462r7628l46264l18906o6103K14234M14253N31195
32296B2070846N45586M33609K70233J97620K82658M73548O81493Q36009Q76773
32287B6668375P73289N69919L62974K19791J45604J19680J26808J59238K24827
32278B9370505L51779N51192P72289R24692R53727Q76871P46053N95200M30904
32269C5573212K57713R7377k0664q8529j34188j91848k48048k23990k6730L68059
$$ plain form
32332 55936349 50637932 46331807 42810721 39925124 37492364 35383844 33592682 32128389
32324 32128389 30926837 29922864 29109747 28452449 27833431 27157784 26422788 25609595 24606926
32315 24606926 23353123 21996710 20819530 20031795 19691705 19745150 20051934 20432748 20791087
32306 20791087 21154605 21522603 21740065 21642437 21296173 20977267 20911164 21125398 21539651 22070846
32296 22070846 22616432 23050041 23320274 23517894 23800552 24274100 24955593 25791602 26668375
32287 26668375 27441664 28011583 28374557 28594348 28739952 28859632 28986440 29145678 29370505
32278 29370505 29722284 30273476 31045765 31970457 32924184 33801055 34547108 35142308 35573212
32269 35573212 35830925 35928302 35907638 35819109 35684921 35493073 35245025 35021035 34994305 35362364
32259C5362364Q73945J335409J629280J739370J727404J632914J429379J095337
32251D6825402O97930L66577J89728J60330K06610K49269K53191K65897L86018
32242D9600952O44112R34844J132915J260809J448088J707781J857624J727964
32234F0315089J371423R83810O74739M23784K41190K43307N15536R74432J432808
32225F7176118J769476J975109K041130J871144J351523N08506m35285j190116
32217G5067605j595471j685110j571900j312775r14282m26693M6408M46321P99736
32208F8853839J111085J250936J016398L11521p55722j936496k957152l596784
32200F3297625l747345l465080k942667k382659j881244j422999r56331m70362
$$ plain form
32259 35362364 36236309 37571718 39200998 40940368 42667772 44300686 45730065 46825402
32251 46825402 47523332 47889909 48079637 48239967 48446577 48695846 48949037 49214934 49600952
32242 49600952 50245064 51179908 52312823 53573632 55021720 56729501 58587125 60315089
32234 60315089 61686512 62670322 63345061 63768845 64010035 64253342 64768878 65743310 67176118
32225 67176118 68945594 70920703 72961833 74832977 76184500 76693006 76257721 75067605
32217 75067605 73472134 71787024 70215124 68902349 67988067 67561374 67607782 68054103 68853839
32208 68853839 69964924 71215860 72232258 72543779 71788057 69851561 66894409 63297625
32200 63297625 59550280 56085200 53142533 50759874 48878630 47455631 46499300 46028938
32192D6028938m4484J59311R513m48343j005818j497945j939080k389640k760832
32183C6111620k879318k728510k491822k328075k214146k047160j791082j460857
32175A8170650j061885o29019k51511K2067K37967M17185M55382K49027j28495
32166A7481368m84935p05333p83959p09152m69122j76955l7506j28344l10911
32157A3675151m07816l79958k83681j54892j7506O4738L9232o3659j78704k94578
32147A1998327m24113n10837m53759k46267k9877L5361n8398j50853p3048J83761
32137A0270297M61956N89863N20078L22021R1266r0738j49114n0445J43584L12336
32127A2421104L77749L29384J66375r7857l54320m22137k30023P1408K40416J56276
$$ plain form
32192 46028938 45984454 46143765 46153278 45704935 44699117 43201172 41262092 38872452 36111620
32183 36111620 33232302 30503792 28011970 25683895 23469749 21422589 19631507 18170650
32175 18170650 17108765 16479746 16228235 16250302 16488269 16905454 17360836 17609863 17481368
32166 17481368 16996433 16291100 15507141 14797989 14328867 14151912 14114406 13986062 13675151
32157 13675151 13267335 12887377 12603696 12448804 12431298 12496036 12535268 12471609 12292905 11998327
32147 11998327 11574214 11063377 10609618 10363351 10333474 10368835 10310437 10159584 10086536 10270297
32137 10270297 10732253 11322116 11842194 12164215 12255481 12164743 12015629 11965184 12108768 12421104
32127 12421104 12798853 13128237 13294612 13196755 12842435 12420298 12190275 12261683 12502099 12658375
32117A2658375j39611n51176r82798j305199j370830j118946o44199j41135K17473
32108F621954L71570L88158L92940M61064N63430O20724N88872M73511K92985
32099A0775208P5759j14171k03930j87725j53290k10971l90820n96510o55148
32090H338402m48949m4061L20961M25746K61623Q423j72978k70580l37896l62880
32080G717811k87134j12298R7453L10149N32500O96690O35731K59446k81380o96031
32070H872937q23417p38857n98674m67186l26797j68147O829K19636M66657O56119
32060G099100O74615N21307L16253J73485J21912J46960K31336L26217L47486
32051I958671K50679Q0177q6696k16019l11923l64751l39190k08706M930K11236
$$ plain form
32117 12658375 12518764 11967588 10984790 9679591 8308761 7189815 6545616 6404481 6621954
32108 6621954 6993524 7381682 7774622 8235686 8799116 9419840 10008712 10482223 10775208
32099 10775208 10850967 10736796 10532866 10345141 10191851 9980880 9590060 8993550 8338402
32090 8338402 7889453 7845392 8166353 8592099 8853722 8862145 8689167 8418587 8080691 7717811
32080 7717811 7430677 7318379 7415832 7725981 8258481 8955171 9590902 9850348 9568968 8872937
32070 8872937 8049520 7310663 6711989 6244803 5918006 5749859 5756688 5976324 6442981 7099100
32060 7099100 7773715 8295022 8611275 8784760 8906672 9053632 9284968 9611185 9958671
32051 9958671 10209350 10289527 10202831 9986812 9674889 9310138 8970948 8762242 8767172 8978408
32041H978408K81162J44832j28233l86172n43110o28018o81086o71182n55507
32032E811094l64430j71945j6795J00225J76535K20553K78252L88218N17403N82841
32022G521951N27000L42741N7277k56401m80427n38232m82758m38305m42102l95155
32012E415589j89029J60558N28326P94907R25669R58151R35120Q46774O39625
32003A1015690K97501q9788l62726m05872k20384R8560M23692O41507O87135N71527
31993A2656842L70256J69274J6001q4794j43704j64366j45663j01260o7560p8669
31983A2426357j34234k05467k66424k96017k62832j60718o6942r9167k76663m78799
31973A0179094n86948o07207n85809m69413j68251K56996N92293O80848N46858
$$ plain form
32041 8978408 9259570 9404402 9276169 8889997 8346887 7718869 7037783 6366601 5811094
32032 5811094 5446664 5274719 5257924 5358149 5534684 5755237 6033489 6421707 6939110 7521951
32022 7521951 8048951 8391692 8448969 8192568 7712141 7173909 6691151 6252846 5810744 5415589
32012 5415589 5226560 5387118 5915444 6710351 7636020 8594171 9529291 10376065 11015690
32003 11015690 11313191 11223403 10860677 10454805 10234421 10332981 10756673 11398180 12085315 12656842
31993 12656842 13027098 13196372 13212373 13127579 12983875 12819509 12673846 12572586 12505026 12426357
31983 12426357 12292123 12086656 11820232 11524215 11261383 11100665 11033723 10934556 10657893 10179094
31973 10179094 9592146 8984939 8399130 7929717 7761466 8018462 8610755 9291603 9838461
31964I838461K94297q46k44692k96780j11443J46998K53665J78766R4973J30123
31954A0283522K16957K20082J16846j4933j25760k25241l07471l31429k93913
31945I538660k61312k90232l46452l40735k36538r5768j9110n6469j69940k67415
31935G454689k77985k13468j53429j53219j74826j33787r314J26044J92787J88312
31925F845804J71293J88806K33301K51570J92513P6071J3908J08156L10015M37090
31915H828527L70271J80366J2409r3473j90572k90486l49650l73054m15414m65900
31905G213024m43703l43715k74217k81366k36268m240L30110N23442M48619K17578
31895G149264L2688M312J25227L27749N14329N98937N87558N88616O85176Q10936
$$ plain form
31964 9838461 10132758 10131912 9887220 9590440 9478997 9625995 9879660 10058426 10153399 10283522
31954 10283522 10500479 10720561 10837407 10822474 10696714 10471473 10164002 9832573 9538660
31945 9538660 9277348 8987116 8640664 8299929 8063391 7967623 7948513 7892044 7722104 7454689
31935 7454689 7176704 6963236 6809807 6656588 6481762 6347975 6338661 6464705 6657492 6845804
31925 6845804 7017097 7205903 7439204 7690774 7883287 7959358 7973266 8081422 8391437 8828527
31915 8828527 9198798 9379164 9391573 9298100 9107528 8817042 8467392 8094338 7678924 7213024
31905 7213024 6769321 6425606 6151389 5870023 5633755 5629515 5959625 6483067 6931686 7149264
31895 7149264 7181952 7186264 7311491 7639240 8153569 8752506 9340064 9928680 10613856 11424792
31885A1424792Q08734O16324L48122J75500J59247K21868K54982K15523J27878
31876A4352970L9572n649J5840P9764J08031K3224j77536m14189n91493o61679
31866A2768855o21332m78563k56453k5579J05513O9423q8302k47570l47525m62034
31856A0416433p01648j043491j310924j347649j168906r02460o26017l35150n3527
31847B926661J21085J24629L0052l755J32431M30167P86385J051740J091255Q68990
31837G559640M93666J49697l8344p3979l9187n484P316J8409N4764J19989J73237
31826H419724J41323k3343k75361m71773m64381k23080J28403M02021M65866K91921
31816H391320n7784m44669o85906o55687l86519l6198K59059M62142N66100N26286
$$ plain form
31885 11424792 12233526 12849850 13197972 13373472 13532719 13754587 14009569 14225092 14352970
31876 14352970 14392542 14386893 14402733 14482497 14590528 14613752 14436216 14022027 13430534 12768855
31866 12768855 12147523 11668960 11412507 11386928 11492441 11561864 11473562 11225992 10878467 10416433
31856 10416433 9714785 8671294 7360370 6012721 4843815 3941355 3315338 2980188 2926661
31847 2926661 3047746 3172375 3202427 3198672 3331103 3761270 4547655 5599395 6690650 7559640
31837 7559640 8053306 8203003 8164659 8090680 8051493 8046009 8053325 8071734 8126498 8246487 8419724
31826 8419724 8561047 8537704 8262343 7790570 7326189 7103109 7231512 7633533 8099399 8391320
31816 8391320 8333536 7888867 7202961 6547274 6160755 6124557 6383616 6845758 7411858 7938144
31806G938144L21778M1442j69618k52876k76043l25261m01464m37287l84237k66238
31796E788340j65109j57815k44072l27950k95871j28789P7030K09809K45316K38851
31786E239740K37048K28827J83272J04754K6091m4022j36855k72807m12089m77997
31776D675962m22861k51992M932L07064N80090P24168O81585M88506K43268L5490
31766G066212q6453j13701q3009p2314j46192k87761l97037l66842j69386J09480
31756E452997L12537L19115J48445m7668j19107m7652N6273O0851r4333l66275
31746E675183o19578o93149n17817j76858J81801M82237P27157Q89707Q83930
31737F832613O78868L86336J78962J30917J65932J51819K8886j43919k54602k50493
$$ plain form
31806 7938144 8259922 8301364 8131746 7878870 7602827 7277566 6876102 6438815 6054578 5788340
31796 5788340 5623231 5465416 5221344 4893394 4597523 4468734 4545764 4755573 5000889 5239740
31786 5239740 5476788 5705615 5888887 5993641 6019732 5975710 5838855 5566048 5153959 4675962
31776 4675962 4253101 4001109 4006041 4313105 4893195 5617363 6298948 6787454 7030722 7066212
31766 7066212 6979759 6866058 6783049 6710735 6564543 6276782 5879745 5512903 5343517 5452997
31756 5452997 5765534 6084649 6233094 6185426 6066319 6018667 6074940 6135791 6041458 5675183
31746 5675183 5055605 4362456 3844639 3667781 3849582 4331819 5058976 5948683 6832613
31737 6832613 7511481 7897817 8076779 8207696 8373628 8525447 8554333 8410414 8155812 7905319
31727G905319j82335j32980j30720j65458k56181m27764o20277p05256o30673
31718D653675m88461l93203l46760k77042j65715o8242k5624j6341Q146Q4694
31708B965127K30899M37708O66739Q70365R99246R85894P75483M12745M7105k06738
31698H184573l72220n16933o13590n90346m78462l87463l42264k75516k00095
31689D407684k48062m72107p23910q19307p38985n77744l79506j38584R1356K20030
31679F20865K40936K24488J96883J27357M2275M9452K12587M69563P01498Q27177
31669C713081Q22569P23136O30694O46570P65553Q92629R75110J030391J016199
31660A1215932P93168L10497k48558o15712o92922n69513l41908n2651K05243
$$ plain form
31727 7905319 7722984 7590004 7459284 7293826 7037645 6609881 5989604 5284348 4653675
31718 4653675 4165214 3772011 3425251 3148209 2982494 2914252 2888628 2872287 2880433 2965127
31708 2965127 3196026 3633734 4300473 5170838 6170084 7155978 7931461 8344206 8391311 8184573
31698 8184573 7812353 7295420 6681830 6091484 5613022 5225559 4883295 4607779 4407684
31689 4407684 4159622 3687515 2963605 2144298 1405313 827569 448063 309479 400835 620865
31679 620865 861801 1086289 1283172 1410529 1452804 1502256 1714843 2184406 2885904 3713081
31669 3713081 4535650 5258786 5889480 6536050 7301603 8194232 9169342 10199733 11215932
31660 11215932 12009100 12319597 12071039 11455327 10762405 10192892 9850984 9798333 10003576
31651A0003576K84171J51230m0064j28680j33862j89495l39586m84634n15965
31642H606691m29159k97831j91343j36690j25635j36312j54426j71134j55781
31633F808380o0149J15636K80863L26115K38176J04217L330n9262j06468j39171
31623G511667j62371k10158k95170l62441l44510k49759j51471r4342n1465K5368
31613E615348J44817K66468L29170L00324K24652J99994K55286K72783J05972
31604G714814k18968m96707n64803m59651l13943j83053m8380P4736J41776J68956
31594E814777K14795K69606K59149J76259J14960J33392J64730J20478J4608q0209
31584G202545j37629j51743n1149K41087O43644R10712Q50915N14778J27734j26568
$$ plain form
31651 10003576 10287747 10438977 10398913 10270233 10136371 9946876 9607290 9122656 8606691
31642 8606691 8177532 7879701 7688358 7551668 7426033 7289721 7135295 6964161 6808380
31633 6808380 6748231 6863867 7144730 7470845 7709021 7813238 7816568 7757306 7650838 7511667
31623 7511667 7349296 7139138 6843968 6481527 6137017 5887258 5735787 5641445 5589980 5615348
31613 5615348 5760165 6026633 6355803 6656127 6880779 7080773 7336059 7608842 7714814
31604 7714814 7495846 6999139 6434336 5974685 5660742 5477689 5429309 5504045 5645821 5814777
31594 5814777 6029572 6299178 6558327 6734586 6849546 6982938 7147668 7268146 7282754 7202545
31584 7202545 7064916 6913173 6862024 7103111 7746755 8657467 9508382 10023160 10150894 10024326
31574A0024326k18622k12280j67657j14976o8035k2190M4621J37885K18312K33497
31564I854881J79097J04115M8757L676n2151r8099q8000j0368R5783J80969K15560
31553A0434220J89135J18771O3048Q7103J91249K99080L35409K95998K28220J74802
31543A2417035J63893K26456L77102N73566P20437P22559N35935J89659k16632
31534A5710010n49857p15595p10887o02121m55214k96296j29369L0191J43807
31525A2424669J62014N4180j54911l72349m76368l91865j47078J38370L37027
31516A1573689M06468M00201L79565L33995K16637M0503j13508j91804k22385
31507A2823361k56392l01353l35443l39371k80644j16424J37173L75180M97574
$$ plain form
31574 10024326 9805704 9593424 9425767 9310791 9242756 9220566 9265187 9403072 9621384 9854881
31564 9854881 10033978 10138093 10186850 10190526 10138375 10040276 9952276 9941908 10037691 10218660 10434220
31553 10434220 10623355 10742126 10805174 10892277 11083526 11382606 11718015 12014013 12242233 12417035
31543 12417035 12580928 12807384 13184486 13758052 14478489 15201048 15736983 15926642 15710010
31534 15710010 15160153 14444558 13733671 13131550 12676336 12380040 12250671 12280862 12424669
31525 12424669 12586683 12640863 12485952 12113603 11637235 11245370 11098292 11236662 11573689
31516 11573689 11980157 12380358 12759923 13093918 13310555 13351058 13237550 13045746 12823361
31507 12823361 12566969 12265616 11930173 11590802 11310158 11193734 11330907 11706087 12203661
31498A2203661N07328M68565M05409L07559K00786J18869J0995k21966n62993
31489A3438213q24582q12590n13195r3776K41556L77754L27940K01568J18297
31480A2461185J23496J94195L17448N05950P14447Q07052O75112L67807N3345
31471A6220037j41916k17128k37023k46195k57882k88266l68826n23562p36934
31462A3202305r41969j049120j003519q20247n67345l27169j74966j62685k86018
31453G869267m64551n79628n51331l86217j59399M3496J76564K43567K64744K35635
31443F692147J29408m9147k19762k62222j18498J37501L46958L95707K94405J29448
31433G475945l7670j91117l07029l50526l46003l81839m90703n71878n01857k97043
$$ plain form
31498 12203661 12710989 13179554 13584963 13892522 14093308 14212177 14223172 14001206 13438213
31489 13438213 12613631 11801041 11287846 11194070 11435626 11813380 12141320 12342888 12461185
31480 12461185 12584681 12778876 13096324 13602274 14316721 15123773 15798885 16166692 16220037
31471 16220037 16078121 15860993 15623970 15377775 15119893 14831627 14462801 13939239 13202305
31462 13202305 12260336 11211216 10207697 9387450 8820105 8492936 8317970 8155285 7869267
31453 7869267 7404716 6825088 6273757 5887540 5728141 5771637 5948201 6191768 6456512 6692147
31443 6692147 6821555 6772408 6552646 6290424 6171926 6309427 6656385 7052092 7346497 7475945
31433 7475945 7438275 7247158 6940129 6589603 6243600 5861761 5371058 4799180 4297323 4000280
31423D000280r5574J0294N2060J01430J88903L13979M50512N11837L94285J13534
31413F041540j59293k59315j92095r3395o8398j22766k10945k83351l04453k87048
31403D060481k99983l85267m72268m32983k32216K6408K20619L34052M33637N49619
31393C802099O16653N44597L35973J13727J6484O8870J68746J92870R0104j15007
31383E835116l56519n52096o47503o67151o80215o90378o10240l87702j07971
31374A135341R2998J86827K60203L79472N09181N65623N05793L61797K16467J34216
31364D347918R5036L0211m9912k9049J43458L13502K68100K285k76707m16574
31354D428268m65451n13783n22155m01706j82673R533J13562J71128K14937K04293
$$ plain form
31423 4000280 3904706 3915000 3967060 4068490 4257393 4571372 5021884 5533721 5928006 6041540
31413 6041540 5882247 5622932 5430837 5337442 5269044 5146278 4935333 4651982 4347529 4060481
31403 4060481 3760498 3375231 2902963 2469980 2237764 2264172 2484791 2818843 3252480 3802099
31393 3802099 4418752 4963349 5299322 5413049 5429533 5498403 5667149 5860019 5950123 5835116
31383 5835116 5478597 4926501 4278998 3611847 2931632 2241254 1631014 1243312 1135341
31374 1135341 1228339 1415166 1675369 2054841 2564022 3129645 3635438 3997235 4213702 4347918
31364 4347918 4442954 4473165 4423253 4394204 4537662 4851164 5119264 5121549 4844842 4428268
31354 4428268 3962817 3449034 2926879 2525173 2342500 2352033 2465595 2636723 2851660 3055953
31344C055953J00072m0692p4560J23055N42800J009890J291636J276968J050581
31335H335703P78361N49420L60583K10378J23484P1701n1999l21511o61800q90682
31325H503638q76356o28609k46368J72461N40573P41493O52879K44067l65332
31316H738446r60008j336499j376494j082597n91751j18844J82642L19031L93428
31307D167354M64288N10710N13520M89386M29636K85861O6352j09477j20741R554
31297F706443J29222J09579m9201k46124l68574l62647k64411j75576j77687k51373
31287E049651k90935k06262o099K14538L57239L91472L54680K91392K08013J03311
31277F467000K2681K6995Q9424P9143r5201l47153m76273l74929j30727P8340
$$ plain form
31344 3055953 3156025 3115333 3040773 3163828 3706628 4716518 6008154 7285122 8335703
31335 8335703 9114064 9663484 10024067 10234445 10357929 10429630 10377631 10056120 9394320 8503638
31325 8503638 7627282 6998673 6752305 6924766 7465339 8206832 8859711 9103778 8738446
31316 8738446 7778438 6441939 5065445 3982848 3391097 3272253 3454895 3773926 4167354
31307 4167354 4631642 5142352 5655872 6145258 6574894 6860755 6927107 6817630 6696889 6706443
31297 6706443 6835665 6945244 6896043 6649919 6281345 5918698 5654287 5478711 5301024 5049651
31287 5049651 4758716 4552454 4546355 4760893 5118132 5509604 5864284 6155676 6363689 6467000
31277 6467000 6489681 6516676 6606100 6685243 6590042 6242889 5766616 5391687 5260960 5339300
31267E339300J43687P1283p2973k12181k79021k48265j63722r8568o7057N071
31257D417554J98439M96604P85082R47257R37671P69798M82257J45786j34675
31248I045773k79513k96196k50741j87476j14694n7031o2729j45282k65171l79668
31238G007272m53105m04081j34067L16854P03390P70854N15953J77087l0149q2948
31228H387060n2409M9070K42589M68345N96390N54962L92529K08778O6692k5354
31218A0888652q9400j51766k10002k11061q8804J59681M54597P03440Q69172R55835
31208A3280344R60631Q82998P72147P17808P71459Q99547J040473J201919J475119
31199B2002445J932857K516937L056792L428576L671945L874310L911992L403109
$$ plain form
31267 5339300 5482987 5554270 5481297 5269116 4990095 4741830 4578108 4479540 4412483 4417554
31257 4417554 4615993 5112597 5897679 6844936 7782607 8552405 9034662 9180448 9045773
31248 9045773 8766260 8470064 8219323 8031847 7917153 7860122 7797393 7652111 7386940 7007272
31238 7007272 6554167 6150086 6016019 6332873 7036263 7807117 8323070 8500157 8470008 8387060
31228 8387060 8334651 8383721 8626310 9094655 9691045 10246007 10638536 10847314 10914006 10888652
31218 10888652 10799252 10647486 10437484 10226423 10137619 10297300 10751897 11455337 12324509 13280344
31208 13280344 14240975 15123973 15896120 16613928 17385387 18284934 19325407 20527326 22002445
31199 22002445 23935302 26452239 29509031 32937607 36609552 40483862 44395854 47798963
31191D7798963K052713O3250j891061l146743l474224l058227k224987j286130
31183C4833554n10387k7752K71065O15364J098857J619681K046438K279696K114272
31174D4340788J255663l30200k159753l520748m051760l942157l583478l175759
31166B4832596k714869k206082j740213j389352j135345r20996p19618n39967
31158A3466154l97451k96868k26468j58874o7887M5220J40005J56244O0801j08326
31148A2612550k53627l02768k89877l25661m65873o26709o59139n05905k60468
31139H922523n9555O7869K24143N10445Q81668J148713J132088Q13113L42602
31130A3983609p6803l09837l28656j92674j1285J03503R0847l3588k07650l78335
$$ plain form
31191 47798963 49851676 49914926 48023865 44877122 41402898 38344671 36119684 34833554
31183 34833554 34323167 34295415 34566480 35181844 36280701 37900382 39946820 42226516 44340788
31174 44340788 45596451 45266251 43106498 39585750 35533990 31591833 28008355 24832596
31166 24832596 22117727 19911645 18171432 16782080 15646735 14725739 14006121 13466154
31158 13466154 13068703 12771835 12545367 12386493 12318606 12363826 12503831 12660075 12720876 12612550
31148 12612550 12358923 12056155 11766278 11440617 10974744 10348035 9688896 9182991 8922523
31139 8922523 8862968 8930837 9154980 9665425 10547093 11695806 12827894 13641007 13983609
31130 13983609 13906806 13596969 13268313 13075639 13064354 13167857 13258704 13225116 13017466 12639131
31120A2639131n26240o44229p09580o86295n50667l13238k7116K20228L47977
31111I749971L49557L16765L57467M76153N73104N79254N36910M98023L99398
31102A3836602J38626k37803n37984o57562p13429q73008j121498j289925j269917
31093G274102j100425q62086n98015l59180k26806k27290k74850k49302j04279
31084C271869J25133L73759N60210N90867M25324J51636m6088k7359J91163M56831
31074F073345O11981O13759N37286M70018M19096L31722J78819k2041k53995n11251
31064H448739p43961q47966p56627n20946k60606m5792J48304L85907O94659J025193
31054G526904J254880J248800R61295M87639l87l68223n63983n85726m49653j90951
$$ plain form
31120 12639131 12112891 11468662 10759082 10072787 9522120 9208882 9181766 9401994 9749971
31111 9749971 10099528 10416293 10773760 11249913 11823017 12402271 12939181 13437204 13836602
31102 13836602 13975228 13737425 13199441 12541879 11828450 10955442 9833944 8544019 7274102
31093 7274102 6173677 5311591 4713576 4354396 4127590 3900300 3625450 3376148 3271869
31084 3271869 3397002 3770761 4330971 4921838 5347162 5498798 5452710 5425351 5616514 6073345
31074 6073345 6685326 7299085 7836371 8306389 8725485 9057207 9236026 9213985 8959990 8448739
31064 8448739 7704778 6856812 6100185 5579239 5318633 5272841 5421145 5807052 6501711 7526904
31054 7526904 8781784 10030584 10991879 11479518 11479131 11110908 10546925 9961199 9511546 9320595
31044I320595J34139M52677O74164P13498N53389K71463l1782l16056n68264p14188
31034A0489635o51435l90982q7236J20432K39076L46364M44629M71287M23783
31025A1405553L83169M05913M62688N01954N13682N02077M43474L07764R7014
31016A5023288j54947l90783n25212m79465k56180M7275L26043N36885O58853
31007A4785757O41664M57447J78476o3937j96249k29719j85177o2377J03736K26409
30997A5656030K49576K10978J89266K13106K47044K41914J75002O3405l9398q1062
30987A7125861o5732n2915q5871j45697j89257j93723j38349R461K34945M30733
30977A6929456M76174L63264J97142P2117n563o8718j16651j15063l4966J25836
$$ plain form
31044 9320595 9454734 9907411 10581575 11295073 11848462 12119925 12088143 11772087 11203823 10489635
31034 10489635 9838200 9447218 9359982 9480414 9719490 10065854 10510483 10981770 11405553
31025 11405553 11788722 12194635 12657323 13159277 13672959 14175036 14618510 14926274 15023288
31016 15023288 14868341 14477558 13952346 13472881 13216701 13263976 13590019 14126904 14785757
31007 14785757 15427421 15884868 16063344 15999407 15803158 15573439 15388262 15325885 15429621 15656030
30997 15656030 15905606 16116584 16305850 16518956 16766000 17007914 17182916 17246321 17206923 17125861
30987 17125861 17060129 17007214 16921343 16775646 16586389 16392666 16254317 16263778 16498723 16929456
30977 16929456 17405630 17768894 17966036 18038153 18032590 17963872 17847221 17732158 17697192 17823028
30967A7823028L29849M93439N29017M23781K60366J42447J17631J79293K99063
30958B0597914M18257M39844K93933K3207k35397l70014l71514k91204j68074
30949B0336952l0835O4782O5864n53k9634M8703J82718K53714J99400M9724j41985
30938B0998850l50471n53273p03716p59645p13289n74530l63418j54330q5876
30929A6740302k51619n68658q07133p85982n30408k31408p2359j02352k46176
30920A3144207l99660n07220n63465n67107n05342l96966l21736l60538m96093
30911I026080o03701n63606l74417j45045J5638Q8405J27312J68562J72618P2020
30901G983866j27686l24522m15144l89160l02643j85146k1789J82024L76934N25601
$$ plain form
30967 17823028 18152877 18646316 19175333 19599114 19859480 20001927 20119558 20298851 20597914
30958 20597914 21016171 21456015 21749948 21773155 21537758 21167744 20796230 20505026 20336952
30949 20336952 20306117 20370899 20436763 20436210 20406576 20455279 20637997 20891711 21091111 21140835 20998850
30938 20998850 20648379 20095106 19391390 18631745 17918456 17343926 16980508 16826178 16740302
30929 16740302 16488683 15920025 15112892 14326910 13796502 13565094 13492735 13390383 13144207
30920 13144207 12744547 12237327 11673862 11106755 10601413 10204447 9882711 9522173 9026080
30911 9026080 8422379 7858773 7484356 7339311 7354949 7443354 7570666 7739228 7911846 7983866
30901 7983866 7856180 7531658 7116514 6727354 6424711 6239565 6217776 6399800 6776734 7302335
30891G302335O33578P00330O84193N53633L43449J21391q0275k65231m27983n51408
30881I014012o34435o76490o46683n26263l82680l30984l88795m28123l24285
30872D675274j10603P9775J94825K96466M11443M54946L61356K12840J44503J58790
30862F879615J37120L2466n8664n3669j6518n7648j64444k23553j84863j13836
30852F176006q3739r9135j40028k00337k45118k01038n3890Q5765Q7547l6070
30842E289963j33531r1448M0689J24825R2182j1359j10945j75973k00327j69013
30832D655063r4434n8119j46387l26683m38345l44682p4782K06406L45084L02262
30822D025383J58268N7162J08350K78343L88995K79299k7673l55138n51747n87161
$$ plain form
30891 7302335 7935913 8636243 9320436 9874069 10217518 10338909 10258634 9993403 9565420 9014012
30881 9014012 8379577 7703087 7056404 6530141 6147461 5816477 5427682 4999559 4675274
30872 4675274 4564671 4644446 4839271 5135737 5547180 6002126 6363482 6576322 6720825 6879615
30862 6879615 7016735 7049201 6990537 6936868 6920350 6862702 6698258 6474705 6289842 6176006
30852 6176006 6092267 5993132 5853104 5652767 5407649 5206611 5152721 5238486 5326033 5289963
30842 5289963 5156432 5064984 5105673 5230498 5322680 5311321 5200376 5024403 4824076 4655063
30832 4655063 4560629 4502510 4356123 4029440 3591095 3246413 3171631 3378037 3723121 4025383
30822 4025383 4183651 4240813 4349163 4627506 5016501 5295800 5268127 4912989 4361242 3774081
30812C774081m92854l02329p7071Q8053J43575J31115J09447P1606k0605j45930
30802C279088k11793j27499J24279M60178P20095P58440N56376K34302o2707k66348
30792E464411l66773l59472k66246j66773j36455j62123j75586j63103j83521
30783C484359k73921l89741m53235m23430l08512j47725J561Q7700R6946N4528
30773A728530k502l5039L752J46545L77156O41321Q88542J070913J106883R04567
30763F830668M58545r9708n81522q72591r83170r89905r50152q71118p48412o16182
30753E76453n28743m75311l50360p1872K68795M46113L36408P6747o5362L4624
30743B47492K62158M25574M45795L65195K34591N9852j52814l61067n16388n94409
$$ plain form
30812 3774081 3281227 2978898 2901827 2989880 3133455 3264570 3374017 3445623 3425018 3279088
30802 3279088 3067295 2939796 3064075 3524253 4244348 5002788 5559164 5793466 5730759 5464411
30792 5464411 5097638 4738166 4471920 4305147 4168692 4006569 3830983 3667880 3484359
30783 3484359 3210438 2820697 2367462 1944032 1635520 1487795 1489356 1577056 1674002 1728530
30773 1728530 1726028 1690989 1694741 1841286 2218442 2859763 3748305 4819218 5926101 6830668
30763 6830668 7289213 7189505 6607983 5735392 4752222 3762317 2812165 1941047 1192635 576453
30753 576453 47710 -427601 -777961 -849833 -581038 -134925 201483 278230 212868 247492
30743 247492 509650 935224 1381019 1746214 1980805 2040657 1887843 1526776 1010388 415979
30733D15979n77035m41443k03053N4310K38375L36626M06477M80223N28519N30472
30723A769450N25407N55269N91045N64947M60348L26144K08027J06379O122q4880
30713E028258j38550j32733p7219k8159n9124j85990l33427m18758m64045n67734
30703B622519p43692q39872o68903k11882L37104P27594Q41596P44973N84618
30694C394055M44823K93730N9286k53673n34291o52357n63624l37756j10235r307
30684A730651q6379k75613m29227m26797k60634p265K67665N44297P96859R59726
30674B813283R75382Q46295O03926K53836j90214o23836q85053r20188q67306
30665B006125r01133j008128r89825p06735k58695J11281K50030J96364R1155
$$ plain form
30733 415979 -161056 -602499 -805552 -751242 -512867 -176241 230236 710459 1238978 1769450
30723 1769450 2294857 2850126 3441171 4006118 4466466 4792610 5000637 5107016 5113138 5028258
30713 5028258 4889708 4756975 4679756 4651597 4592473 4406483 4073056 3654298 3190253 2622519
30703 2622519 1878827 1038955 370052 158170 495274 1222868 2064464 2809437 3394055
30694 3394055 3838878 4132608 4191894 3938221 3403930 2751573 2187949 1850193 1739958 1730651
30684 1730651 1644272 1368659 939432 512635 252001 244736 512401 1056698 1853557 2813283
30674 2813283 3788665 4634960 5238886 5492722 5302508 4678672 3793619 2873431 2006125
30665 2006125 1104992 96864 -892961 -1599696 -1858391 -1747110 -1497080 -1300716 -1209561
30656a209561L8945M4228L5642n4295k07530l14206k62605l3995K92113N97538
30646a073726P73025P51056N50494K82619O5005p6363j87523k80287l00480k14156
30636B89664p1028N6114J63270K99160M60625N45777M42489J63497j30344k68130
30626A951094k31281j53447j54364k13858k36593j97605j62870j79002k06828
30617B15246j80439r0643O917L9583k8542j53700k18225j24499R2601K75440K90507
30606A24246J56158K0587K7479J94529L95133M64827L56981J84217P2360J858
30596A998375j37353l50227m98307m85360l85238l24165l11024k61650j39500
30587h94449P924J16503J32092K938k59727n14855n70133l54620K7783M11989
$$ plain form
30656 -1209561 -1170616 -1126388 -1090746 -1145041 -1352571 -1666777 -1929382 -1963377 -1671264 -1073726
30646 -1073726 -300701 450355 1000849 1283468 1348473 1272110 1084587 804300 503820 289664
30636 289664 218636 274750 438020 737180 1197805 1743582 2186071 2349568 2219224 1951094
30626 1951094 1719813 1566366 1412002 1198144 961551 763946 601076 422074 215246
30617 215246 34807 -55836 -48919 -9336 -37878 -191578 -409803 -534302 -441701 -166261 124246
30606 124246 280404 300991 328470 522999 918132 1382959 1739940 1924157 1996517 1998375
30596 1998375 1861022 1510795 1012488 527128 141890 -182275 -493299 -754949 -894449
30587 -894449 -886525 -770022 -637930 -634992 -894719 -1409574 -1979707 -2334327 -2306544 -1894555
30577a894555O82968P81550O84123M21736Q4845k21005m15505m55904l58064k06778
30567h96589r1010j1918J01273K71794M24112M77900M45143L93461L42640K40191
30557A696997L5663k37583m51634m68790k76905m0882L3166r5075k71216l35118
30547d11377k76565j77396q1028R807O7556P1747Q3730J90240L63103M58116L79194
30536F77127J80760j4715j36617j73417j28333k8733N6244P0811M3332O5071J94702
30525H06232L96670N62560N83057M21262J36601j71090m39753o44097p35310o58884
30515B57248m62692l08109k98756l45416k85243j04633N2514Q7762N1439K3691
30505a332195K656k9124j7522Q8083K15191K20143O0192j54052k87626l08873
$$ plain form
30577 -1894555 -1211587 -430037 254086 675822 760667 539662 124157 -331747 -689811 -896589
30567 -896589 -987599 -999517 -898244 -626450 -202338 275562 720705 1114166 1456806 1696997
30557 1696997 1732660 1495077 1043443 574653 297748 256866 290032 194957 -76259 -411377
30547 -411377 -687942 -865338 -946366 -936559 -869003 -797256 -713526 -523286 -160183 297933 677127
30536 677127 857887 843172 706555 533138 404805 376072 432316 503127 546459 611530 806232
30525 806232 1202902 1765462 2348519 2769781 2906382 2735292 2295539 1651442 916132 257248
30515 257248 -205444 -513553 -812309 -1157725 -1442968 -1547601 -1495087 -1407325 -1355886 -1332195
30505 -1332195 -1329539 -1358663 -1376185 -1288102 -1072911 -852768 -792576 -946628 -1234254 -1543127
30495a543127k70500k07538r3734J02444L38862M97403M78194K94425N5404j38767
30485d86934k55661k94262k53309j61269q0860l8327J0678J02404K01159K71203
30475i85178L60322N24018O92782P12185N18776J95949j44997m46801o56810p05068
30465F5178n91088m18484k81820j73544n3695N1831R2099Q0144O3538M0140j7071
30454a142772p4010o2802J849J4331q6486k29038k89361k29600j34088j21502
30444b353479k21476l21066k52092K6986L45126M63893L11356K6748k19839l77921
30434b571764m67567m68203l33456q0604K07916M62580O48489P19713O27137L99913
30424h55846J67506N6342P9766J50083J76379J29615M1641j9878R894J33126K60712
$$ plain form
30495 -1543127 -1813627 -2021165 -2114899 -2012455 -1673593 -1176190 -697996 -403571 -348167 -486934
30485 -486934 -742595 -1036857 -1290166 -1451435 -1532295 -1570622 -1559944 -1457540 -1256381 -985178
30475 -985178 -624856 -100838 591944 1304129 1822905 2018854 1873857 1427056 770246 65178
30465 65178 -525910 -944394 -1226214 -1399758 -1453453 -1401622 -1309523 -1229379 -1165841 -1125701 -1142772
30454 -1142772 -1216782 -1279584 -1277735 -1263404 -1349890 -1578928 -1868289 -2097889 -2231977 -2353479
30444 -2353479 -2574955 -2896021 -3148113 -3121127 -2776001 -2312108 -2000752 -1974004 -2193843 -2571764
30434 -2571764 -3039331 -3507534 -3840990 -3921594 -3713678 -3251098 -2602609 -1882896 -1255759 -855846
30424 -855846 -688340 -631998 -552232 -402149 -225770 -96155 -54514 -74392 -64498 68628 329340
30413C29340K76891J48672m1577j71617j72988p0302K6799k1257k64823n65503
30403e26365o72283m57371n3911K84520M33290M59033M76363N32490O32575P84201
30393A892542R66605J101363J096747R08750N59517J37152k23102m26029n18873
30384E494672o55641r19615j218893j388598j352011j146224q43571n08216j95829
30375b733926O7195K91075M68341N42148M80138L48717K47614J88992J12932J6370
30365B9596j2846Q4786K39435K98614J54085j71264n23001p07400o36446l94195
30355a638636j33460P2086K22953K78635J60094j02245l17898l04267o5313K37127
30345a590924M42770M86695L98141K74885K22114K49030K47011J24834o4223j93616
$$ plain form
30413 329340 606231 754903 713326 541709 368721 298419 325218 303961 39138 -526365
30403 -526365 -1198648 -1656019 -1709930 -1425410 -992120 -533087 -56724 475766 1108341 1892542
30393 1892542 2859147 3960510 5057257 5966007 6525524 6662676 6439574 6013545 5494672
30384 5494672 4839031 3919416 2700523 1311925 -40086 -1186310 -2029881 -2538097 -2733926
30375 -2733926 -2666731 -2375656 -1907315 -1365167 -885029 -536312 -288698 -99706 13226 29596
30365 29596 16750 101536 340971 639585 793670 622406 99405 -607995 -1244441 -1638636
30355 -1638636 -1772096 -1700010 -1477057 -1198422 -1038328 -1140573 -1458471 -1762738 -1828051 -1590924
30345 -1590924 -1148154 -661459 -263318 11567 233681 482711 729722 854556 790333 596717
30335E96717k28466k30958k16579j19758O0718J81863J01002j50488m06232n37372
30325i49553n14099l36556j8530L42554N83576O30582N79608N60115N63004M78451
30315A919152K71285K3885j91708l80790n34740n76482m73230l30174k70275k55670
30305g98747j35557J29970L95041N02574M47633L25676J96113O3289o0011j49710
30295I16271k14371k77966l21867k96233j93048o3640M6447J45923K68191M13709
30285D23416N24909N02622K64799j65011o21259q95482r03481p38500n50950m08279
30275b567216k89054j68259n9172R459J1260p0801k07393l01252k63010j19833
30265d025271Q148N7173Q0516J27146J41167O4527j5703N9296L00000N29885N97572
$$ plain form
30335 596717 368251 137293 -79286 -199044 -138326 43537 144539 -5949 -412181 -949553
30325 -949553 -1463652 -1800208 -1818738 -1476184 -892608 -262026 317582 877697 1440701 1919152
30315 1919152 2190437 2214322 2022614 1641824 1107084 530602 57372 -272802 -543077 -798747
30305 -798747 -934304 -804334 -409293 93281 540914 866590 1062703 1125992 1065981 916271
30295 916271 701900 423934 102067 -194166 -387214 -450854 -404407 -258484 9707 423416
30285 423416 948325 1450947 1715746 1550735 929476 33994 -869487 -1607987 -2158937 -2567216
30275 -2567216 -2856270 -3024529 -3083701 -3074242 -3062982 -3133783 -3341176 -3642428 -3905438 -4025271
30265 -4025271 -4017123 -3959950 -3879434 -3752288 -3611121 -3546594 -3562297 -3503001 -3203001 -2673116 -2075544
30254b075544N34779M53402L72700K36339N6674n2477L914J93060L65900L63005
30244D51752J48951j20198k07441l3087K25780L29971K34612P7218n0328k02587
30234H54643m45845p32655r55093j044422r75581p50604m39961j82492p1695o5279
30224d808984n1365K9744J72084L61901N73200P23783P13806N27501K55316L225
30214a499789j89632l37634m46276m85139m20170k68639j13393m0611n8288j00854
30204c960425j16102j02188m2920J23252M01259O48815O85225N01966K86928K05044
30194a369146K13883J45161p2291l34972n00268n36979n15193m86131m21657k75561
30184d153154o6463J27525K42103K67352K22495J26339O491q7530j02950j0206
$$ plain form
30254 -2075544 -1540765 -1087363 -714663 -478324 -421650 -474127 -470213 -277153 88747 451752
30244 451752 600703 480505 273064 239977 465757 795728 1030340 1107558 1057230 854643
30234 854643 408798 -323857 -1278950 -2323372 -3298953 -4049557 -4489518 -4672010 -4743705 -4808984
30224 -4808984 -4860349 -4830605 -4658521 -4296620 -3723420 -2999637 -2285831 -1758330 -1503014 -1499789
30214 -1499789 -1689421 -2027055 -2473331 -2958470 -3378640 -3647279 -3760672 -3801283 -3859571 -3960425
30204 -3960425 -4076527 -4178715 -4221635 -4098383 -3697124 -3048309 -2363084 -1861118 -1574190 -1369146
30194 -1369146 -1155263 -1010102 -1082393 -1417365 -1917633 -2454612 -2969805 -3455936 -3877593 -4153154
30184 -4153154 -4219617 -4092092 -3849989 -3582637 -3360142 -3233803 -3227312 -3314842 -3417792 -3427998
30174c427998J89527M55964O91247P57452N59337J33820l40505o30852n79631
30165b191639k01232L17786P30800Q77025P45935M40268J15462p3764o1876M6354
30155G45119M5235j55315m14617n20227m27562k68576j52460o6932N663q801j69754
30144a388227l75108m25199k45414J6996J43104N3512j51140l24757m05190m12866
30134c514289l70829k70891j16584L9835J33480J54880J61052K09996K89417L19794
30124b964139K37760P7130n1786q1225o6239j11186k25424l04162k66085j56859
30114c912215q2189q1349j10350j14719o7285L8283J71787K60116K56446K06022
30104c435453J81643J64147O7461j05976k22965j78546l0548Q3003J12206J15813
$$ plain form
30174 -3427998 -3238471 -2782507 -2091260 -1333808 -774471 -640651 -981156 -1612008 -2191639
30165 -2191639 -2392871 -2075085 -1344285 -467260 278675 718943 834405 760641 698765 745119
30155 745119 790354 635039 220422 -299805 -727367 -995943 -1148403 -1215335 -1209672 -1218473 -1388227
30144 -1388227 -1763335 -2188534 -2433948 -2416952 -2273848 -2220336 -2371476 -2696233 -3101423 -3514289
30134 -3514289 -3885118 -4156009 -4272593 -4232758 -4099278 -3944398 -3783346 -3573350 -3283933 -2964139
30124 -2964139 -2726379 -2649249 -2701035 -2782260 -2848499 -2959685 -3185109 -3489271 -3755356 -3912215
30114 -3912215 -3994404 -4075753 -4186103 -4300822 -4368107 -4329824 -4158037 -3897921 -3641475 -3435453
30104 -3435453 -3253810 -3089663 -3022202 -3128178 -3351143 -3529689 -3560237 -3477234 -3365028 -3249215
30094c249215J45768J82363J78248J10414j1736j40668j90031q9106J46101M27288
30084b490574O80842Q78361R81023R25912P14069M59561K76212J28803j29260
30075B424949n51011r84964j206419j131250q71792o10211m51798l77571k88762
30066d048829r5099K00693M89219O39954O03406M25139J91595j107o3324J6747
30056a641606J08272K8482k57426n83216p66611p84293p13761n81113l67797j26773
30046e685842K7211M9303n778q8132j80171j99947j0794L81005P27607P61325
30036d224213M88353J62795j5466p0270j07451j22901k8399J93940M51634O44357
30026b627621P41330P53895O91191N71370M40235L38991K57095J35913p9966l93875
$$ plain form
30094 -3249215 -3103447 -2921084 -2742836 -2632422 -2644158 -2784826 -2974857 -3063963 -2917862 -2490574
30084 -2490574 -1809732 -931371 49652 975564 1689633 2149194 2425406 2554209 2424949
30075 2424949 1873938 888974 -317445 -1448695 -2320487 -2930698 -3382496 -3760067 -4048829
30066 -4048829 -4143928 -3943235 -3454016 -2814062 -2210656 -1785517 -1593922 -1595029 -1658353 -1641606
30056 -1641606 -1533334 -1504852 -1762278 -2345494 -3112105 -3896398 -4610159 -5191272 -5559069 -5685842
30046 -5685842 -5658631 -5609328 -5615106 -5703238 -5883409 -6083356 -6094150 -5713145 -4985538 -4224213
30036 -4224213 -3735860 -3573065 -3588531 -3658801 -3766252 -3889153 -3917552 -3723612 -3271978 -2627621
30026 -2627621 -1886291 -1132396 -441205 130165 570400 909391 1166486 1302399 1222433 828558
30016H28558p36444r79781j001661p78169m13649m9509K59355N51519Q45935J063919
30006d09927J085572Q62129M61915L4196k61651l38928k44262j23788r4888j53099
29996H17269k13344k09123j22609L9573K34300L57223L02718P8508j73672k96715
29986H14128k47773j14347k7793n8015j59357k10746j31318M0146J96444K77893
29976C79262L03564L00863K59457J69092N7734l5057r7982j43929j87468k37440
29966G68096k90171l21622l07533k55268j93980j37625q7335o0263o9750q1112
29956a036563m6761P266K150n5862l4756J58513M19697N34335M13107J77753J4844
29945E53723K929R2473J92900K33424J65227l6832l42248o44463q06994p60593
$$ plain form
30016 828558 92114 -887667 -1889328 -2667497 -3081146 -3130655 -2871300 -2319781 -1473846 -409927
30006 -409927 675645 1537774 1999689 2033885 1772234 1433306 1189044 1065256 970368 817269
29996 817269 603925 394802 272193 311766 546066 903289 1206007 1284515 1110843 814128
29986 814128 566355 452008 424215 366200 206843 -3903 -135221 -95075 101369 379262
29976 379262 682826 983689 1243146 1412238 1469972 1434915 1336933 1193004 1005536 768096
29966 768096 477925 156303 -151230 -406498 -600478 -738103 -825438 -885701 -955451 -1036563
29956 -1036563 -1083324 -1076058 -1073908 -1129770 -1164526 -1006013 -586316 -51981 361126 538879 553723
29945 553723 556652 649125 842025 1075449 1240676 1203844 861596 217133 -589861 -1350454
29935a350454n59142l29740j71288j06745j05106j11082o9211K6189J01573Q0623
29925b594383L344O308J50663L27816L88634L22967K45988K29717K20568J35022
29915e63356j4029j16552p9531O8952J92218J72111K6422j13579j36870l7451
29905f01665J18407K46353K55966R2007j78219l75614l81234k69900k10562k62973
29895a567434l46572l91622m28782n04740n78262n51137l83960j51023K7331J10610
29885d765591J88290L71289O28282P85582P23315N13745L10794J63183K2232j13203
29875a172082j79956j77085j92134k60841k85969j50852J33629M32276O01233
29866a251781N85884M50612L31144L17924L73688L97273L52426K75599J82680
$$ plain form
29935 -1350454 -1909596 -2239336 -2410624 -2517369 -2622475 -2733557 -2802768 -2776579 -2675006 -2594383
29925 -2594383 -2591039 -2584731 -2434068 -2106252 -1717618 -1394651 -1148663 -918946 -698378 -563356
29915 -563356 -577385 -693937 -773468 -704516 -512298 -340187 -313765 -427344 -564214 -601665
29905 -601665 -483258 -236905 19061 111068 -67151 -442765 -823999 -1093899 -1304461 -1567434
29895 -1567434 -1914006 -2305628 -2734410 -3239150 -3817412 -4368549 -4752509 -4903532 -4876201 -4765591
29885 -4765591 -4577301 -4206012 -3577730 -2792148 -2068833 -1555088 -1244294 -1081111 -1058879 -1172082
29875 -1172082 -1352038 -1529123 -1721257 -1982098 -2268067 -2418919 -2285290 -1853014 -1251781
29866 -1251781 -665897 -215285 115859 433783 807471 1204744 1557170 1832769 2015449
29857B015449P2035K5751J78211N15869Q03259P99405N01112J11943j71388k77430
29847D574216k35867j36767q8759j34601k15811k69562l21161m14471m98192m80101
29837A778924l77078l12187l55740m52509n16859n20061m66294l62047k43387
29828a827238j71091j62708j75346j75670j70865j47718n0779J28682K92376L22210
29818b138147K02925J8787j37752k08230j57941n90J62893J93415L8940k03867
29808b229567l68881l60183k22185r0415p4832j77170l11136l90042l76913k60047
29798d861371l3873K56024M81465N14872L68043K13001K29040M28066O42911O87522
29788a074300N23538K73800Q6521K544m0669r9407j55545j60801j07921k7677
$$ plain form
29857 2015449 2087484 2113235 2291446 2807315 3610574 4409979 4911091 5023034 4851646 4574216
29847 4574216 4338349 4201582 4112823 3978222 3762411 3492849 3171688 2757217 2259025 1778924
29837 1778924 1401846 1089659 733919 281410 -235449 -755510 -1221804 -1583851 -1827238
29828 -1827238 -1998329 -2161037 -2336383 -2512053 -2682918 -2830636 -2881415 -2752733 -2460357 -2138147
29818 -2138147 -1935222 -1916435 -2054187 -2262417 -2420358 -2420948 -2258055 -2064640 -2025700 -2229567
29808 -2229567 -2598448 -2958631 -3180816 -3271231 -3346063 -3523233 -3834369 -4224411 -4601324 -4861371
29798 -4861371 -4895244 -4639220 -4157755 -3642883 -3274840 -3061839 -2832799 -2404733 -1761822 -1074300
29788 -1074300 -550762 -276962 -190441 -187897 -228566 -327973 -483518 -644319 -752240 -779917
29778g79917N9884J51299K25961K47459K02678J06020l8389k36063m46731n74840
29768a082639n57497m39168l16053k18519r4972Q7952K79641M00407M25371L87688
29758a127789L29460K85133K89063L45854L87710L09465P9309k02967l87975m18053
29748a10790l73024l77886m79657o14422o75395o01184m13065j91790j9344Q3769
29738c772788J81767L65416O41520Q86397R40226P52536M11881M0266k92173n36492
29728c81444o20630n05855k65096l7686R8464J63922J95562J93445J62158J35146
29718h62014J19772P4821p241m6571K2255J21623R1781j05303l14984l62869k51886
29707a520616j34051j04554q1238Q8503M25902P58221Q68305O98189L95205J62846
$$ plain form
29778 -779917 -720033 -568734 -342773 -95314 107364 213384 174995 -61068 -507799 -1082639
29768 -1082639 -1640136 -2079304 -2395357 -2613876 -2708848 -2620896 -2341255 -1940848 -1515477 -1127789
29758 -1127789 -798329 -513196 -224133 121721 509431 818896 898205 695238 307263 -110790
29748 -110790 -483814 -861700 -1341357 -1955779 -2631174 -3232358 -3645423 -3837213 -3856557 -3772788
29738 -3772788 -3591021 -3225605 -2584085 -1697688 -757462 -4926 406955 447221 155048 -381444
29728 -381444 -1002074 -1507929 -1773025 -1810711 -1712247 -1548325 -1352763 -1159318 -997160 -862014
29718 -862014 -742242 -667421 -674662 -721233 -698978 -577355 -485574 -590877 -905861 -1268730 -1520616
29707 -1520616 -1654667 -1759221 -1840459 -1751956 -1326054 -567833 300472 998661 1393866 1556712
29697A556712Q1155O9687k710j89526m24893n80071n67470m11846k17695n5347
29687g42004J03459L13275N40038O66518O16582M32027K13907L2864p3617n9946
29677B043103J05151L67754N85476O27067M72802K12192m2298k25643l19594l21096
29667C504914k44663j52969j44296k69467m61858n82883n57017m49961l97410
29658B44390m61018n65626n75240m20444j51622J19174L12781M16666M46283M10294
29648b24362L28958K54344K27994K19895J50332j0012j87839k76431k43729j57155
29638H1995j13981j60211k64427l54576l84427l69034l45530l03971j89729J0478
29628b393413K17626L26287L02552J88996L6657j24270k56415l08028k47099p9267
$$ plain form
29697 1556712 1637867 1707554 1704844 1515318 1090425 510354 -57116 -468962 -686657 -742004
29687 -742004 -638545 -325270 214768 881286 1497868 1929895 2143802 2176666 2103049 2043103
29677 2043103 2148254 2516008 3101484 3728551 4201353 4413545 4371247 4145604 3826010 3504914
29667 3504914 3260251 3107282 2962986 2693519 2231661 1648778 1091761 641800 244390
29658 244390 -216628 -782254 -1357494 -1777938 -1929560 -1810386 -1497605 -1080939 -634656 -224362
29648 -224362 104596 358940 586934 806829 957161 947149 759310 482879 239150 81995
29638 81995 -31986 -192197 -456624 -811200 -1195627 -1564661 -1910191 -2214162 -2403891 -2393413
29628 -2393413 -2175787 -1849500 -1546948 -1357952 -1321295 -1445565 -1701980 -2010008 -2257107 -2336374
29618b336374J59058L83204M43830K06837k92139p98522j000148p60886k06859
29609d201999L81115P41956P59345N04788J88771K5664R0901K85788M37321M36613
29599c49737K99248J16131m3039j78876l19016m42550m82829m22153l49507l78544
29589b550872n13894o38487o35387m83819k31906P0542L78117O29363P72371Q01994
29579b401978P37810N81513L42964J01528k2925O243Q3434O4151q7444k79548
$$ plain form
29618 -2336374 -2177316 -1794112 -1350282 -1143445 -1435584 -2234106 -3234254 -3995140 -4201999
29609 -4201999 -3820884 -3078928 -2319583 -1814795 -1626024 -1600360 -1509459 -1223671 -786350 -349737
29599 -349737 -50489 65642 22603 -156273 -475289 -917839 -1400668 -1822821 -2172328 -2550872
29589 -2550872 -3064766 -3703253 -4338640 -4822459 -5054365 -4983823 -4605706 -3976343 -3203972 -2401978
29579 -2401978 -1664168 -1082655 -739691 -638163 -661088 -654845 -571411 -507260 -594704 -874252
$$ [...]
##END NTUPLES=NMR SPECTRUM
##END=
