##TITLE=31Pdec_IPACAT-33-6
  CD3CN
  24 sc
 6.10.2023
##JCAMPDX= 6.0         $$ Bruker NMR JCAMP-DX V2.0
##DATA TYPE= NMR SPECTRUM
##DATA CLASS= NTUPLES
##ORIGIN= UXNMR, Bruker Analytische Messtechnik GmbH
##OWNER= root
$$ XWIN-NMR		Version 3.5
$$ Fri Oct  6 14:23:39 2023 Russian Standard Time (UT+4h)  she@DPX200
##.OBSERVE FREQUENCY= 81.013821
##.OBSERVE NUCLEUS= ^31P
##.ACQUISITION MODE= SIMULTANEOUS
##.ACQUISITION SCHEME= undefined
##.AVERAGES= 24
##.DIGITISER RES= 16
##SPECTROMETER/DATA SYSTEM= spect
##.PULSE SEQUENCE= zgpg30
##.SOLVENT NAME= CDCl3
##.SHIFT REFERENCE= (INTERNAL, CDCl3, 0, 248.564)
##AUDIT TRAIL= $$ (NUMBER, WHEN, WHO, WHERE, WHAT)
$$ ##TITLE= Audit trail, XWIN-NMR		Version 3.5
$$ ##JCAMPDX= 5.01
$$ ##ORIGIN= Bruker BioSpin GmbH
$$ ##OWNER= she
$$ F:/spectra/data/she/nmr/P31/1/pdata/1/auditp.txt
$$ ##AUDIT TRAIL=  $$ (NUMBER, WHEN, WHO, WHERE, WHAT)
(   1,<2023-10-06 14:21:37.34 +0400>,<she>,<DPX200>,
      <created by zg, POWCHK disabled, PULCHK disabled
       configuration hash MD5:
       00 E9 B6 7A A2 85 ED C7 34 08 36 98 17 FE 4E 26
       data hash MD5: 32K
       21 72 0B 2B 7A 45 43 B7 00 E9 43 20 4D A8 97 89>)
(   2,<2023-10-06 14:21:43.82 +0400>,<she>,<DPX200>,
      <Start of raw data processing
       efp BC_mod = 2 LB = 5 FT_mod = 6 PKNL = 1 PHC0 = -10828.61 PHC1 = 66.68633 SI = 64K 
       data hash MD5: 64K
       C2 F4 BD 25 C9 05 DB 49 6D 52 0D 8B 8C 1E B9 7E>)
(   3,<2023-10-06 14:22:05.40 +0400>,<she>,<DPX200>,
      <pk PHC0 = 79.70469 PHC1 = 163.8001 
       data hash MD5: 64K
       BC 3B F7 3A F5 09 A9 B7 C7 EA 83 17 EF C1 5A 7B>)
(   4,<2023-10-06 14:22:08.76 +0400>,<she>,<DPX200>,
      <abs ABSG = 5 
       data hash MD5: 64K
       DA 3E 30 10 D4 9E F6 D8 99 2A EC AD 89 60 8D AB>)
(   5,<2023-10-06 14:22:48.42 +0400>,<she>,<DPX200>,
      <pk PHC0 = 0 PHC1 = 0 
       data hash MD5: 64K
       DA 3E 30 10 D4 9E F6 D8 99 2A EC AD 89 60 8D AB>)
(   6,<2023-10-06 14:22:54.89 +0400>,<she>,<DPX200>,
      <abs ABSG = 5 
       data hash MD5: 64K
       43 E1 4A B2 DA E4 70 43 F1 84 5D 7C 51 8F 87 FA>)
$$ ##END=
$$ 
$$ hash MD5
$$ 4A FC 95 94 B2 50 3E 1E 6C 10 D7 A7 22 3D 8F 96
##$RELAX= 
##$RELAX= 
##$RELAX= 
##$RELAX= 
##$RELAX= 
##$RELAX= 
##$RELAX= 
##$RELAX= 
##$RELAX= 
$$ Bruker specific parameters
$$ --------------------------
##$DU= <F:/spectra>
##$EXPNO= 1
##$NAME= <P31>
##$PROCNO= 1
##$TYPE= <nmr>
##$USER= <she>
##$AMP= (0..31)
100 100 100 100 100 100 100 100 100 100 100 100 100 100 100 100 100 100 
100 100 100 100 100 100 100 100 100 100 100 100 100 100 
##$AQSEQ= 0
##$AQ_mod= 1
##$AUNM= <au_zg>
##$AUTOPOS= <>
##$BF1= 81.014009
##$BF2= 200.13
##$BF3= 200.13
##$BF4= 200.13
##$BF5= 200.13
##$BF6= 200.13
##$BF7= 200.13
##$BF8= 200.13
##$BYTORDA= 1
##$CFDGTYP= 0
##$CFRGTYP= 5
##$CHEMSTR= <none>
##$CNST= (0..31)
1 1 145 1 1 1 1 1 1 1 1 1 1 1 1 1 1 1 1 1 1 1 1 1 1 1 1 1 1 1 1 1 
##$CPDPRG= <waltz16>
##$CPDPRG1= <>
##$CPDPRG2= <waltz16>
##$CPDPRG3= <>
##$CPDPRG4= <mlev>
##$CPDPRG5= <mlev>
$$ [...]
##$SUBNAM3= <"">
##$SUBNAM4= <"">
##$SUBNAM5= <"">
##$SUBNAM6= <"">
##$SUBNAM7= <"">
##$SUBNAM8= <"">
##$SUBNAM9= <"">
##$SW= 501.771253377433
##$SWIBOX= (0..15)
0 1 3 0 0 0 0 0 0 0 0 0 0 0 0 0 
##$SW_h= 40650.406504065
##$TD= 32768
##$TD0= 1
##$TE= 0
##$TE2= 300
##$TE3= 300
##$TEG= 300
##$TL= (0..7)
0 120 53 12 22 120 120 120 
##$TP= (0..7)
150 150 150 150 150 150 150 150 
##$TP07= 0
##$TPNAME0= <>
##$TPNAME1= <>
##$TPNAME2= <>
##$TPNAME3= <>
##$TPNAME4= <>
##$TPNAME5= <>
##$TPNAME6= <>
##$TPNAME7= <>
##$TPOAL= (0..7)
0.5 0.5 0.5 0.5 0.5 0.5 0.5 0.5 
##$TPOFFS= (0..7)
0 0 0 0 0 0 0 0 
##$TUNHIN= 0
##$TUNHOUT= 0
##$TUNXOUT= 0
##$USERA1= <user>
##$USERA2= <user>
##$USERA3= <user>
##$USERA4= <user>
##$USERA5= <user>
##$V9= 5
##$VALIST= <valist>
##$VCLIST= <CCCCCCCCCCCCCCC>
##$VD= 0
##$VDLIST= <DDDDDDDDDDDDDDD>
##$VPLIST= <PPPPPPPPPPPPPPP>
##$VTLIST= <TTTTTTTTTTTTTTT>
##$WBST= 1024
##$WBSW= 4
##$XGAIN= (0..3)
0 0 0 0 
##$XL= 0
##$YL= 0
##$YMAX_a= 9254
##$YMIN_a= -7878
##$ZGOPTNS= <>
##$ZL1= 120
##$ZL2= 120
##$ZL3= 120
##$ZL4= 120
##$ABSF1= 248.5645
##$ABSF2= -253.2056
##$ABSG= 5
##$ABSL= 3
##$ALPHA= 0
##$AQORDER= 0
##$ASSFAC= 0
##$ASSFACI= 0
##$ASSFACX= 0
##$ASSWID= 0
##$AUNMP= <proc_1d>
##$AZFE= 0.1
##$AZFW= 0.5
##$BCFW= 0
##$BC_mod= 2
##$BYTORDP= 0
##$COROFFS= 0
##$CY= -3
##$DATMOD= 1
##$DC= 0
##$DFILT= <>
##$DTYPP= 0
##$F1P= 0
##$F2P= 0
##$FCOR= 1
##$FTSIZE= 65536
##$FT_mod= 6
##$GAMMA= 0
##$GB= 0
##$INTBC= 1
##$INTSCL= 6.047779e-11
##$ISEN= 30
##$LB= 5
##$LEV0= 0
##$LPBIN= 0
##$MAXI= 10000
##$MC2= 0
##$MEAN= 0
##$ME_mod= 0
##$MI= 50
##$NCOEF= 0
##$NC_proc= -8
##$NLEV= 6
##$NOISF1= 182.463
##$NOISF2= 159.3651
##$NSP= 0
##$NTH_PI= 0
##$NZP= 0
##$OFFSET= 248.5645
##$PC= 4
##$PHC0= -10748.91
##$PHC1= 230.4864
##$PH_mod= 1
##$PKNL= yes
##$PPARMOD= 0
##$PSCAL= 0
##$PSIGN= 0
##$REVERSE= no
##$SF= 81.0140089999694
##$SI= 65536
##$SIGF1= 159.3651
##$SIGF2= -187.1042
##$SINO= 113.3802
##$SIOLD= 16384
##$SREGLST= <1H.CDCl3>
##$SSB= 0
##$STSI= 65536
##$STSR= 0
##$SW_p= 40650.406504065
##$SYMM= 0
##$S_DEV= 0
##$TDeff= 32768
##$TDoff= 0
##$TI= <>
##$TILT= no
##$TM1= 0
##$TM2= 0
##$TOPLEV= 0
##$USERP1= <user>
##$USERP2= <user>
##$USERP3= <user>
##$USERP4= <user>
##$USERP5= <user>
##$WDW= 1
##$XDIM= 65536
##$YMAX_p= 440808591
##$YMIN_p= -42462804
$$ End of Bruker specific parameters
$$ ---------------------------------
##NTUPLES= NMR SPECTRUM
##VAR_NAME=  FREQUENCY,     SPECTRUM/REAL,   SPECTRUM/IMAG
##SYMBOL=    X,             R,               I
##VAR_TYPE=  INDEPENDENT,   DEPENDENT,       DEPENDENT
##VAR_FORM=  AFFN,          ASDF,            ASDF
##VAR_DIM=   65536,         65536,           65536
##UNITS=     HZ,            ARBITRARY UNITS, ARBITRARY UNITS
##FACTOR=    0.620285442955139, 1,           1
##FIRST=     20137.2065510682, 0,            0
##LAST=      -20513.1999529968, 0,           0
##MIN=       -20513.1999529968, -42462804,   0
##MAX=       20137.2065510682, 440808591,    0
$$ Real data points
##PAGE= N=1
##DATA TABLE= (X++(R..R)), XYDATA
$$ [...]
38925b388136p57586o95469n03321k54740j17345j33241j71280j10904K4934J48203
38915d958885K27845K82448L15603L21120L18974L31098L39111L15887K93170
38906b213629L46327M91624O33236O50608N33326L94224L36202L37121K93500
38897A802539J48474p3889l43812o55372r54182j110259j033248p84801n14513
38888c519063l00710j12105Q8506K77010M16668N08418N60375N53875M78483L71872
38878f76671K89189K49132K35498K32512K30718K16351J91664J98220K78289M00839
38868A845741M57719L61919J44422o1478j29226k6570J85820M07048N37771N05296
38858D228462K94171l4292l70232o18322p38478p40943o64975n60765m64775l81938
$$ y = [-2388136, -3145722, -3841191, -4344512, -4599252, -4716597, -4849838, -5021118, -5132022, -5107088, -4958885, -4731040, -4448592, -4132989, -3811869, -3492895, -3161797, -2822686, -2506799, -2213629, -1867302, -1375678, -742442, -91834, 441492, 835716, 1171918, 1509039, 1802539, 1951013, 1877124, 1533312, 877940, -76242, -1186501, -2219749, -3004550, -3519063, -3819773, -3931878, -3843372, -3566362, -3149694, -2641276, -2080901, -1527026, -1048543, -676671, -387482, -138350, 97148, 329660, 560378, 776729, 968393, 1166613, 1444902, 1845741, 2303460, 2665379, 2809801, 2748323, 2619097, 2592527, 2778347, 3185395, 3723166, 4228462, 4522633, 4488341, 4118109, 3499787, 2761309, 2020366, 1355391, 794626, 329851, -52087]
38848e2087l08602k71549l08376l95100m35823l64232k30726j44768j46755j86793
38838b844811k20830k59593k99075k64394q2318K07224M58679N43324M45163K52463
38828b064168R0470N1893J40125K58212K85501J90049M6647o6666j49569k25185
38818a442691k50997j58002K7726J81481K25988K18718K51744L19318L44188K94044
38808A1517J97623O8514r9441k55563k97634j89980j3146J43573K78814M12023
38798B56300M71582L39124P410l73772o34955p31709p30785o89822n96412m20853
38788c103892j81488P3420L23150N62739P34074P37532N58811L32031J99746J33758
38778C69881j5456k90829n50502o50604o09281n22619l99438j80427J19279L93576
$$ y = [-52087, -360689, -632238, -940614, -1335714, -1771537, -2135769, -2366495, -2511263, -2658018, -2844811, -3065641, -3325234, -3624309, -3888703, -3971021, -3763797, -3305118, -2761794, -2316631, -2064168, -1973698, -1921805, -1781680, -1523468, -1237967, -1047918, -1001271, -1067937, -1217506, -1442691, -1693688, -1851690, -1823964, -1642483, -1416495, -1197777, -946033, -626715, -282527, 11517, 209140, 277654, 178213, -77350, -374984, -564964, -578110, -434537, -155723, 256300, 727882, 1067006, 1074416, 700644, 65689, -666020, -1396805, -2086627, -2683039, -3103892, -3285380, -3211960, -2888810, -2326071, -1591997, -854465, -295654, 36377, 236123, 369881, 354425, 63596, -486906, -1137510, -1746791, -2269410, -2668848, -2849275, -2729996, -2336420]
38768b336420N73704O92331Q04358R04729R43359Q76640O91004M14701J19080
38759C683486j20255k66403l04235k07723J5461K52433L33242J84212j06425l91392
38749C072401n83408o55226n96599m41021k98496k75008l42808l47791j82071
38740f50027P5357K21931J27414j54875m59046o45930o60146n03568k20548R2413
38730b777025L29233M62066N49518O25335O16311M18302L5150l99111p20045q19480
38720a679746o69642l39855L976J90431J81016R6427Q3063J70515K68221K72272
38710a423322J54907k9381j95999k82874k61702j17572J48717M80691P57739Q66997
38700I8201P85633N81923L60695K27734K57127M23570N80099N72014L84260J33962
$$ y = [-2336420, -1762716, -1070385, -266027, 638702, 1582061, 2458701, 3149705, 3564406, 3683486, 3563231, 3296828, 2992593, 2784870, 2800331, 3052764, 3386006, 3570218, 3463793, 3072401, 2488993, 1833767, 1237168, 796147, 497651, 222643, -120165, -467956, -650027, -574670, -352739, -225325, -380200, -839246, -1485176, -2145322, -2648890, -2869438, -2777025, -2447792, -1985726, -1436208, -810873, -194562, 223740, 258890, -140221, -860266, -1679746, -2349388, -2689243, -2685267, -2494836, -2313820, -2217393, -2134330, -1963815, -1695594, -1423322, -1268415, -1297796, -1493795, -1776669, -2038371, -2155943, -2007226, -1526535, -768796, 98201, 883834, 1465757, 1826452, 2054186, 2311313, 2734883, 3314982, 3886996, 4271256, 4405218]
38690D405218p0962k05814k76584k83769k59840k60044k76752k36024j28490p1688
38680B335251j66698l38239m00891k71906n3816Q6931O3737j05708l49795n78637
38670B20229o95453o18025l27082P9223L94515M34740K08521o8871j77314r7105
38660f46622J7932M5821J8965M5710J68430L23622M09338L68426K25973O4544
38650A042139n1785j45196l01830n57404q09553q77053o70367k91111O5510L02738
38640b293912M79154O67291Q16516Q15751O63462M97746M44494M89812N16125
38631C096439M12058J32961k79302o91776r43246r66165q27648o24834l83813
38622a075326j05083J39795K35946J47477m1077k07490k78439k44550j43403m1494
$$ y = [4405218, 4334256, 4128442, 3851858, 3568089, 3308249, 3048205, 2771453, 2535429, 2406939, 2335251, 2168553, 1830314, 1429423, 1157517, 1103701, 1190632, 1254369, 1148661, 798866, 220229, -475224, -1093249, -1420331, -1341108, -946593, -511853, -303332, -372203, -549517, -646622, -628690, -582869, -563904, -518194, -349764, -26142, 383196, 751622, 977595, 1042139, 990354, 845158, 543328, -14076, -823629, -1700682, -2371049, -2662160, -2596650, -2293912, -1814758, -1147467, -330951, 484800, 1148262, 1646008, 2090502, 2580314, 3096439, 3508497, 3641458, 3362156, 2670380, 1727134, 760969, -66679, -691513, -1075326, -1180409, -1040614, -804668, -657191, -698268, -905758, -1184197, -1428747, -1572150, -1613644]
38612a613644K632k2515q6199j51711j92831j93332j62806j45687j83631k68413
38602c018137l47994l66093k80822p9497J80955L73721M05244L21303K57312K71256
38592b282752K73997J48878r3855l09242l49220j91192M6735K09826K43144K33707
38582b069974L09297M98866P03696P91159O94232M39292J21695j44706k95123
38573A048434l45789l39850k72864j13652J06579K86655L59353L55875L39786
38564A424527L22105K77433J99910Q9946q3957l42223o15735p72126p39122n60616
38554g99858l19651o1509J75439L15457L12239K39590K22798K58456J93223n4802
38544D81382l27376l85190k08868k1735M803n1711k4980Q8893J53292J06891K4207
$$ y = [-1613644, -1611012, -1633527, -1719726, -1871437, -2064268, -2257600, -2420406, -2566093, -2749724, -3018137, -3366131, -3732224, -4013046, -4092543, -3911588, -3537867, -3132623, -2811320, -2554008, -2282752, -2008755, -1859877, -1953732, -2262974, -2612194, -2803386, -2756651, -2546825, -2303681, -2069974, -1760677, -1261811, -558115, 233044, 927276, 1366568, 1488263, 1343557, 1048434, 702645, 362795, 89931, -23721, 82858, 369513, 728866, 1084741, 1424527, 1746632, 2024065, 2223975, 2313921, 2229964, 1887741, 1272006, 499880, -239242, -799858, -1119509, -1181018, -1005579, -690122, -377883, -138293, 84505, 342961, 536184, 481382, 154006, -231184, -440052, -461787, -456984, -508695, -533675, -444782, -291490, -184599, -160392]
38533a60392l9537j41718l40448n71151p03342o83820n68620m30908k84714j03419
38523d028069J12205K96159L53188K50073P5709j3682O9797K70760M58720N55770
38513a599370N77550N56069M58645K20247j39152m66199n85155m57441k03878
38504a638684K3668J52059J79800J37813R0563J09703J89522K33207J75921P3524
38494b72904Q792l3625j10524j83063j47910Q821J97756L64507N27823O68577
38484A028250P06771O34216N57543N47964N47791M93935M31359M08018L44799
38475E700646J36681j58506l53978l50871k28072j18691q4095j19005j96819k69659
38465C957631k67468j38903R7686L30614L88414J60713k65064o31325p36889o12946
$$ y = [-160392, -199929, -341647, -682095, -1253246, -1956588, -2640408, -3209028, -3639936, -3924650, -4028069, -3915864, -3619705, -3266517, -3016444, -2940735, -2954417, -2884620, -2613860, -2155140, -1599370, -1021820, -465751, -7106, 213141, 73989, -392210, -977365, -1434806, -1638684, -1615016, -1462957, -1283157, -1145344, -1054781, -945078, -755556, -522349, -346428, -272904, -264112, -297737, -408261, -591324, -739234, -730413, -532657, -168150, 359673, 1028250, 1735021, 2369237, 2926780, 3474744, 4022535, 4516470, 4947829, 5355847, 5700646, 5837327, 5678821, 5324843, 4973972, 4745900, 4627209, 4543114, 4424109, 4227290, 3957631, 3690163, 3551260, 3648946, 3979560, 4367974, 4528687, 4263623, 3632298, 2895409, 2282463]
38455B282463m30097k82624j42822J5085J57158K54650L07686K90126J64445j8161
38445B597909j18907o5250N3118R1052J2756q6346q9464L7630K18880L18099K47341
38434C216818M9032j51836k82333l69358m45461m63840l46376q9526K05233L93929
38424A716282L86907K24938O4684L7872J06138R9805q4073l70117o01006o81386
38414I00044o04408m12772j86499j2893Q4922J45452J61445N2883j85826l89754
38404d47406l80368j77475M6206J85420K61635K86694K12377M3071j31457k72627
38394c73930m50465o86712q36390p36903m30363j36965k2513o9052j57030j88054
38384d088377j21228K8002J86906K70653K63036K28524K29082K56373K60068K15640
$$ y = [2282463, 1852366, 1569742, 1426920, 1442005, 1599163, 1853813, 2161499, 2451625, 2616070, 2597909, 2479002, 2413752, 2466870, 2557922, 2570678, 2484332, 2394868, 2432498, 2651378, 2969477, 3216818, 3265850, 3114014, 2831681, 2462323, 2016862, 1553022, 1206646, 1117120, 1322353, 1716282, 2103189, 2328127, 2392811, 2430683, 2536821, 2636626, 2552553, 2182436, 1581430, 900044, 295636, -117136, -303635, -316528, -231606, -86154, 75291, 128174, -57652, -447406, -827774, -1005249, -959043, -773623, -511988, -225294, -12917, 30154, -101303, -373930, -824395, -1511107, -2347497, -3084400, -3514763, -3651728, -3674241, -3743293, -3900323, -4088377, -4209605, -4181603, -3994697, -3724044, -3461008, -3232484, -3003402, -2747029, -2486961, -2271321]
38374b271321J47137J01686J08135J36327R6751p3931l04465m11807k80687J96
38364b751979K25155K77763K01944Q8497k4081j11493j14055o493J21785J50219
38354a942738R5352J09378K72295M54190M53952K46296K2229j6265J50840L79453
38344B24982N18520N23348M49500L71865L03764J83550m4400l27987n13663m77047
38334A212432k32852R5761L81803N38142N03917K73640m3588k63760k81842j65175
38324B018478o0098k9332k1686J9054P5835R6097N2742n9962k45408m70526o34602
38313G40592o32367m65869k62195j59997j91154k79301l30392l07577k36714j67102
38303b292076j27663j05631o6730m592L6922Q838p5273j37681j14902k3941O8901
$$ y = [-2271321, -2124184, -2022498, -1914363, -1778036, -1681285, -1755216, -2059681, -2471488, -2752175, -2751979, -2526824, -2249061, -2047117, -1958620, -1982701, -2094194, -2208249, -2214742, -2092957, -1942738, -1847386, -1738008, -1465713, -1011523, -557571, -311275, -289046, -305311, -154471, 224982, 743502, 1266850, 1716350, 2088215, 2391979, 2575529, 2531129, 2203142, 1689479, 1212432, 979580, 1075341, 1457144, 1995286, 2499203, 2772843, 2729255, 2465495, 2183653, 2018478, 1958380, 1929048, 1907362, 1926416, 2002251, 2098348, 2151090, 2091128, 1845720, 1375194, 740592, 108225, -357644, -619839, -779836, -970990, -1250291, -1580683, -1888260, -2124974, -2292076, -2419739, -2525370, -2592100, -2596692, -2559770, -2550932, -2626205, -2763886, -2878788, -2902729, -2833828]
38292b833828J39380K37174M09695O12892P31695O94608N39863L54114J78349
38283A063942Q510j37875k20273k52985l26997n08645p38815q73521q22135o24979
38273c433773m05398k67162k25429k09801j36992M057J49273K51030L40241M65538
38263c468416O04684O92007P13444P03737O49395M76543J72164j42061l07088
38254I4409k66892q0499J63380L95483N58879O11215N41776L70564J45972m8596
38244B485691j32480j10549q0424j11770j57288j43080j06914j53419k75726l19790
38234H94251j66555J11355L15774L07383J01298j71592l60132l88705l07889k43449
38224I1739k73446l66036m39144m43266l70314k30522o4338N0999N6228k6128
$$ y = [-2833828, -2694448, -2457274, -2047579, -1434687, -702992, -8384, 531479, 885593, 1063942, 1072452, 934577, 714304, 461319, 134322, -374323, -1113138, -1986659, -2808794, -3433773, -3839171, -4106333, -4331762, -4541563, -4678555, -4674498, -4525225, -4274195, -3933954, -3468416, -2863732, -2171725, -1458281, -754544, -105149, 371394, 543558, 401497, 94409, -172483, -252982, -89602, 305881, 864760, 1475975, 2017751, 2388315, 2534287, 2485691, 2353211, 2242662, 2162238, 2050468, 1893180, 1750100, 1643186, 1489767, 1214041, 894251, 727696, 839051, 1154825, 1462208, 1563506, 1391914, 1031782, 643077, 335188, 91739, -181707, -547743, -986887, -1430153, -1800467, -2030989, -2095327, -2044328, -1988100, -2014228]
38214b014228r9688n8489J50975M83126P83613Q80325P44198N38477M55590N15233
38204B379132N65091M59978J83800j88291n63423q36436q90443o69169k61457
38195A78782J15465K51826J03757j58088k76733j25014J95671M74291N78153N02111
38185A840221K93849K4389j79218j90229l2654R5375K4661j90858l44546l14879
38175A026111j66972l3496K5938L0483J3266j366J1392O2007J24626J50734J00629
38164A343352m4906k77162n31648o82484o16224l39078R023K72774M07289M71208
38154A2144N14425N14978M34336K91869J47728K7809r9029k69332m75634o68589
38144D30705p86169p83156o62250m87489l42636k57000j81842n2629J31232K96557
$$ y = [-2014228, -2113916, -2172405, -2021430, -1538304, -754691, 125634, 869832, 1408309, 1863899, 2379132, 2944223, 3404201, 3588001, 3399710, 2836287, 1999851, 1109408, 440239, 178782, 294247, 546073, 649830, 491742, 215009, 89995, 285666, 759957, 1338110, 1840221, 2134070, 2158459, 1979241, 1789012, 1756358, 1851733, 1876394, 1685536, 1340990, 1026111, 859139, 825643, 851581, 882064, 895330, 893964, 905356, 967363, 1091989, 1242723, 1343352, 1298446, 1021284, 489636, -192848, -809072, -1148150, -1139127, -866353, -459064, 12144, 526569, 1041547, 1475883, 1767752, 1915480, 1943289, 1844260, 1574928, 1099294, 430705, -355464, -1138620, -1800870, -2288359, -2630995, -2887995, -3069837, -3122466, -2991234, -2694677]
38134b694677L65031L34173K92158L34883M50072N03736L79906J25752q9353j60493
38124a58812j32698p9272L0256K66937N80286P86555P41251M81756J87050K8161
38114B731470N6689J87962K66297J79928n2207l08565m81926n51140n43857m77990
38104A006661l70301k67104k17744k22834k39985k33747j90529r7843M1280J62647
38094f29499J58972j5236k71010m48870m57304l35544j87480p0923N0855K60108
38084a945931N81748R18878J106064J050637Q13904N30942K66976l198k78516
38075C041504m61840m49734k58643j7025J51301J98640J29765l5691k66849n24675
38065A506753p72684r60927j006899q41049m89634p7121K72541N07307O11652
$$ y = [-2694677, -2329646, -1995473, -1703315, -1368432, -918360, -414624, -34718, 91034, 1681, -158812, -291510, -370782, -340526, -73589, 506697, 1293252, 2034503, 2516259, 2703309, 2731470, 2788159, 2976121, 3242418, 3422346, 3370139, 3061574, 2579648, 2028508, 1484651, 1006661, 636360, 369256, 151512, -71322, -311307, -545054, -735583, -833426, -792146, -629499, -470527, -485763, -756773, -1205643, -1662947, -1998491, -2185971, -2256894, -2206039, -1945931, -1364183, -445305, 660759, 1711396, 2525300, 3056242, 3323218, 3320020, 3041504, 2579664, 2129930, 1871287, 1854262, 2005563, 2204203, 2333968, 2298277, 2031428, 1506753, 734069, -226858, -1233757, -2074806, -2564440, -2641561, -2369020, -1861713, -1250061]
38056a250061N58015L45319N5671j90654l41322m31583m94045m94904l85183j86183
38046b814930J2812J41179K09516K81646M02044N62747P23469Q28163P96065N48160
38036A690871J02310l65204o16756n46277k53933P5429L20944M37507L96289J97853
38026A439033p2385k79320l50556l19458k56421j96840j34042l4531J44099L96401
38016C35980O14580O46893M47517J37136j07903j92654j22113M2780J91237J85697
38006B179150k2775l04579m52657l88651k15758o4039M6110J61347K88379L88005
37996A614532M35711M25743L31304J18418j94747n27987p92969r38572r61479
37987d90046r08084q47797p93477o60647l76165l4380J44362O5860r3521p4284
$$ y = [-1250061, -692046, -346727, -291056, -481710, -823032, -1254615, -1748660, -2243564, -2628747, -2814930, -2802118, -2660939, -2451423, -2169777, -1767733, -1204986, -481517, 346646, 1142711, 1690871, 1793181, 1427977, 811221, 264944, 11011, 86440, 407384, 844891, 1241180, 1439033, 1366648, 1087328, 736772, 417314, 160893, -35947, -169989, -204520, -60421, 335980, 950560, 1597453, 2044970, 2182106, 2074203, 1881549, 1759436, 1802216, 1993453, 2179150, 2156375, 1851796, 1399139, 1010488, 794730, 730691, 776801, 938148, 1226527, 1614532, 2050243, 2475986, 2807290, 2925708, 2730961, 2202974, 1410005, 471433, -490046, -1398130, -2245927, -3039404, -3700051, -4076216, -4110596, -3966234, -3900374, -3993895, -4068179]
37977d068179J66828M23061M83892L28191P4340j55871k74782k15833K3774L42937
37967b871642N99763P17208P02960N96260M44754L11644K36343J75830L8853j92419
37957G59554m04523m42468k46695J02374M47757O49624O48632M79380K32806m794
37947B221647j85454k89075l07143k52779j73711j29545j43389j80168j82609
37938C77774j31766o2088o181O1513J94430L83434N36296N75962N29646M77085
37928B936105M27316L03988O4609k14020m00957m37048l66886k61051j42795l263
37918A905998J31174J80019Q2312j15073k76307l04000k25355j32093p1876m4685
37908A130114p1179j78414l07107l16806j33403J57664M12057N76234O81194P27089
$$ y = [-4068179, -3901351, -3478290, -2994398, -2666207, -2591867, -2747738, -3022520, -3238353, -3214579, -2871642, -2271879, -1554671, -851711, -255451, 189303, 500947, 737290, 913120, 951973, 759554, 355031, -87437, -334132, -231758, 215999, 865623, 1514255, 1993635, 2226441, 2221647, 2036193, 1747118, 1439975, 1187196, 1013485, 883940, 740551, 560383, 377774, 246008, 183920, 177739, 239252, 433682, 817116, 1353412, 1929374, 2459020, 2936105, 3363421, 3667409, 3732018, 3517998, 3117041, 2679993, 2313107, 2052056, 1909261, 1905998, 2037172, 2217191, 2299503, 2184430, 1908123, 1604123, 1378768, 1246675, 1174799, 1130114, 1058935, 880521, 573414, 256608, 123205, 280869, 692926, 1269160, 1950354, 2677443]
37898B677443O59111M63590K17279O656j63856l50712n79176p99778r27214r04841
37888B98502p43202n21995l55261l23826m10896n02839m75911k97569l6331K29241
37878c140087M85678P49215R82050J089892J005775P43538L69732l3994l72012
37869A879787n54767n64057m79041m02194l64810l19935k09669k0227K08764M05483
37859d20666N10948N22681M81686M10746K96939J49302K9237j2997L22J3891Q922
37848A991011o642l9872q8543j04531m9338K8422L9651k6079r5597j24374j37899
37837A386209j51215j31747p8605o3493j33006k19512k14893j11573j8025m2415
37827B21725j94823l89379n05149m52329k19876J20220M56197O90284P74733P32755
$$ y = [2677443, 3336554, 3800144, 4017423, 4024079, 3860223, 3509511, 2930335, 2130557, 1203343, 298502, -444700, -966695, -1321956, -1645782, -2056678, -2559517, -3035428, -3332997, -3369328, -3140087, -2654409, -1905194, -923144, 166748, 1172523, 1916061, 2285793, 2251799, 1879787, 1325020, 760963, 281922, -120272, -485082, -805017, -1014686, -1034913, -826149, -420666, 90282, 612963, 1094649, 1505395, 1802334, 1951636, 1980873, 1967876, 1968198, 1982089, 1991011, 1984369, 1944497, 1855954, 1751423, 1702085, 1730507, 1770158, 1744079, 1648482, 1524108, 1386209, 1234994, 1103247, 1024642, 961149, 828143, 608631, 393738, 282165, 264140, 221725, 26902, -362477, -867626, -1319955, -1539831, -1419611, -963414, -273130, 501603, 1234358]
37817A234358O45875N81781N21060L87749J60043r3378l00674m52119n42619n10520
37807A631556l08535j6455J86832J77505j9960k88253n21728o65559o91254n76231
37797a092082l27308k1176K12550K91997K60672K14284J51002k7421l31015n82391
37787a250888n84144l40168k7519K17208L86461M94356N01785L90383K24206P2160
37777H3840q6105l14349n90335p63841o60574k38433L41626Q07623R70985Q44058
37767C94495N72221K90238P4025k8586j6888J9032l1948j63038k51878k24112
37757F33561j38517p8051m1437k395l679j07104k85280m37753m97913m68561l76665
37746a803794k56916j67131j55642k06553k57025k64781k23780j29653K0709J98771
$$ y = [1234358, 1880233, 2462014, 2983074, 3370823, 3530866, 3437488, 3136814, 2684695, 2142076, 1631556, 1323021, 1306566, 1493398, 1670903, 1650943, 1362690, 840962, 175403, -515851, -1092082, -1419390, -1440566, -1228016, -936019, -675347, -461063, -310061, -337482, -668497, -1250888, -1835032, -2175200, -2202719, -1985511, -1599050, -1104694, -602909, -212526, 11680, 83840, -2265, -316614, -906949, -1670790, -2331364, -2569797, -2228171, -1420548, -449563, 394495, 966716, 1256954, 1330979, 1302393, 1285505, 1304537, 1272589, 1109551, 857673, 633561, 495044, 416993, 375556, 373161, 369482, 262378, -22902, -460655, -958568, -1427129, -1803794, -2060710, -2227841, -2383483, -2590036, -2847061, -3111842, -3335622, -3465275, -3444566, -3245795]
37736c245795L57622M76205N55531N79606N25515M14880L14637K74742K86900
37727E39843L02350K69146J67533M1408k1364J7378Q2297O0905n9488j75730j88152
37716A036126r2556M0901J26695J01055l6958k01613k89151k90782k88220l18113
37706b12616l03794j66228M5314J90877J86257O8524o4497j37565j36973j11600
37696f42301j32547k18671l05494l13201k30829r8129P7838L26061O16661Q20785
37686i9827Q18121O29375L97472K32600J09885o6307l29481o14133q31727r37109
37676f91131r16987p65239n06275k14144L3860K13039L30441L67864K97014J53195
37666a698363M0853L6586J12351J80193K00789K27813L42258N43477P10233O95405
$$ y = [-3245795, -2888173, -2411968, -1856437, -1276831, -751316, -336436, -21799, 252943, 539843, 842193, 1111339, 1278872, 1320280, 1298916, 1316294, 1398591, 1459496, 1400008, 1224278, 1036126, 943570, 984471, 1111166, 1212221, 1175263, 973650, 684499, 393717, 105497, -212616, -516410, -682638, -637324, -446447, -260190, -191666, -256163, -393728, -530701, -642301, -774848, -993519, -1299013, -1612214, -1843043, -1941172, -1863334, -1537273, -920612, -99827, 718294, 1347669, 1745141, 1977741, 2087626, 2021319, 1691838, 1077705, 245978, -691131, -1608118, -2373357, -2879632, -3093776, -3059916, -2846877, -2516436, -2148572, -1851558, -1698363, -1657510, -1620924, -1508573, -1328380, -1127591, -899778, -557520, -14043, 696190, 1391595]
37656A391595M78698J99601P025r6256k12658l83773n41953o23301o41806o25635
37646a048463n59050m32199k81769j27680P2968L43487O02512P32084P07165N98783
37636F07838M74042L54303K47707J52254L7956j06989k23081k47632k31644k98025
37626G66729m57757n53279m40211j67678Q2924J99879K18438K19123K19435J79141
37616B66744O8424q9154k18740k31885r2953J28943K89834K79778J08525j19784
37606C89732l04982m12136m56338m68851m85692n26845n56096m91259k96935n5252
37596c664654R3953P7940o9541k64191m13183m27638k80306o5227P4572J02770
37586d835505J04741J28354J03435k5906j74765k04778q0377J36369L84841O07613
$$ y = [1391595, 1870293, 2069894, 2076919, 1980663, 1768005, 1384232, 842279, 218978, -422828, -1048463, -1607513, -2039712, -2321481, -2449161, -2376193, -2032706, -1430194, -698110, 9055, 607838, 1081880, 1436183, 1683890, 1836144, 1874100, 1767111, 1544030, 1296398, 1064754, 766729, 308972, -244307, -684518, -852196, -769272, -569393, -350955, -131832, 87603, 266744, 335168, 246014, 27274, -204611, -297564, -168621, 121213, 400991, 509516, 389732, 84750, -327386, -783724, -1252575, -1738267, -2265112, -2821208, -3312467, -3609402, -3664654, -3570701, -3492761, -3562302, -3826493, -4239676, -4667314, -4947620, -5012847, -4938275, -4835505, -4730764, -4602410, -4498975, -4524881, -4699646, -4904424, -4984801, -4848432, -4463591, -3855978]
37576c855978P07139O18132M11099K28500J26023O0686J3908K2047R0532J83573
37566a394339L02577M66443O04503N91095M23021K48477J66316J00759n7639k78375
37556A172838m35868m56175l48536j62093J0672N3492n7350j95164k20028j37299
37546g75511m6018K6047J39635L12653M63321M99704M13477K82001K13871K75559
37536A804739M28845N57314N88768N58915N17206M25632K19949p4063l68649o22226
37526D036430q24155q98401p42931l83576R848K90661M34686M47805K80664q2720
37516B568311n07491p69821p41923m82686j58447R0999K14793K21778J28016m3159
37506E20370k18762k89640k12837p4748q15j7323n2902n4468k7577L3386J66896
$$ y = [-3855978, -3148839, -2530707, -2119608, -1891108, -1765085, -1704399, -1690491, -1668444, -1577912, -1394339, -1091762, -625319, -20816, 570279, 993300, 1241777, 1408093, 1508852, 1451213, 1172838, 736970, 280795, -67741, -229834, -219162, -165670, -223020, -418184, -638212, -775511, -821529, -795482, -655847, -343194, 120127, 619831, 1033308, 1315309, 1529180, 1804739, 2233584, 2790898, 3379666, 3938581, 4455787, 4881419, 5101368, 5027305, 4658656, 4036430, 3212275, 2313874, 1570943, 1187367, 1197215, 1487876, 1922562, 2370367, 2651031, 2568311, 2060820, 1290999, 549076, 66390, -92057, -1058, 213735, 435513, 563529, 520370, 301608, 11968, -200869, -275617, -276432, -293755, -346657, -401125, -428702, -395316, -228420]
37495b28420L65436N40189O01546N32194L66245J59085J937j2371J02026K02825
37485B630692J70751M6109m2771n0811m7391r9978k02985l20235m22594m61202
37475A199585l68226j37503J17119K30871J30858r6568k82670l19513k32835j26162
37465A14956p1560o7071q2538j05225j25692j14309m8979M5164J17746J55269
37455a82239J90961K41768K60385J75624k1236k45125l75143l39912j58572P2785
37445c80704K27772K25211J06714K6511J06185K87193L80796K87988J13958K5007
37435A406631N2595J10069J59622K60542M44119O23078O60106M85543J38246k61527
37425D079024n70243p05637o96017o16335m85519k84940p0026K8276m9493k11354
$$ y = [-228420, 137016, 677205, 1278751, 1810945, 2177190, 2336275, 2338212, 2325841, 2427867, 2630692, 2801443, 2847552, 2804781, 2753970, 2706579, 2606601, 2403616, 2083381, 1660787, 1199585, 831359, 693856, 810975, 1041846, 1172704, 1076136, 793466, 473953, 241118, 114956, 43396, -23675, -106213, -211438, -337130, -451439, -500418, -455254, -337508, -182239, 8722, 250490, 510875, 686499, 665263, 420138, 44995, -294917, -453489, -380704, -152932, 72279, 178993, 205504, 311689, 598882, 979678, 1267666, 1381624, 1406631, 1459226, 1569295, 1728917, 1989459, 2433578, 3056656, 3716762, 4202305, 4340551, 4079024, 3508781, 2803144, 2107127, 1490792, 1005273, 720333, 650307, 678583, 629090, 417736]
37415D17736l24159l48740l25589k84272k21458j29140K290J75854L48053M39586
37405b49839M22323L49519K64559J40563l8633k02104k68089k46448j93217j18628
37395a39994l1748k5336j88402m36181n43535l79798l3367L14145N57945O93916
37385b12355P58169P87745P83419O75321L78638q0728n43405q54739r88680j012301
37375c08916r76836q77154o77698l49718P1584M38740N64903M09763J57765M4144
37365a503423J14332K06337J55852l9709k56401l76633l64485k59036j35764n8297
37355b517227l4745j8703L3091J05677J38238Q7744l1965j70294k77305l14772
37345c000261k59096j24876K5974J35790K14211L17284M62305O03120O94504P30234
$$ y = [417736, 93577, -255163, -580752, -865024, -1086482, -1215622, -1213332, -1037478, -689425, -249839, 172484, 522003, 786562, 927125, 888492, 686388, 418299, 171851, -21366, -139994, -171742, -197078, -385480, -821661, -1365196, -1744994, -1778361, -1464216, -906271, -212355, 545814, 1333559, 2116978, 2792299, 3170937, 3090209, 2546804, 1692065, 703385, -308916, -1285752, -2162906, -2840604, -3190322, -3118738, -2679998, -2115095, -1705332, -1547567, -1503423, -1389091, -1182754, -1026902, -1066611, -1323012, -1699645, -2064130, -2323166, -2458930, -2517227, -2551972, -2570675, -2537584, -2431907, -2293669, -2205925, -2237890, -2408184, -2685489, -3000261, -3259357, -3384233, -3358259, -3222469, -3008258, -2690974, -2228669, -1625549, -931045, -200811]
37335b00811P07129O22812N43821N90037P69571Q91548P51901L81312O340k19445
37325D844215l32627m13740m62647m64665m59428m68952m50264l98610m10363
37316I82919n41138o66507o06450l67614j51502j13578k01361k51046j74943k4741
37306b115961Q2705P3967j9575r2159o6924L7902J58547K66634L54971L72133
37296i47760K52765L4892j12801l2214K61210N75685P05221N99593L85902K25729
37286A948222J57108R1681m8213k41538m23694n55931n95404m69489j68114J76121
37276a29251L96368M70396N04078N43060N04687L23942P3114j16843j90499j75178
37266B203874j09295j7711P4772J44959J60227N4379k22045n88037q34815q15456
$$ y = [-200811, 506318, 1129130, 1672951, 2262988, 3032559, 3924107, 4676008, 5057320, 5063660, 4844215, 4511588, 4097848, 3635201, 3170536, 2711108, 2242156, 1791892, 1393282, 982919, 441781, -224726, -831176, -1198790, -1350292, -1463870, -1665231, -1916277, -2091220, -2115961, -2033256, -1959289, -1978864, -2071023, -2137947, -2100045, -1941498, -1674864, -1319893, -947760, -694995, -660103, -772904, -805118, -543908, 31777, 736998, 1336591, 1722493, 1948222, 2105330, 2197011, 2148798, 1907260, 1483566, 927635, 332231, -137258, -305372, -129251, 267117, 737513, 1241591, 1784651, 2289338, 2613280, 2686394, 2569551, 2379052, 2203874, 2094579, 2076868, 2151640, 2296599, 2456826, 2511205, 2289160, 1701123, 866308, 50852]
37256E0852o05763m23099m10900n45004p03743p56959o19678l14935N961J78625
37246d144643J83285J40967J50783J93660K11482K12444K56163L76866N57049
37237a861944P40896Q41501P77394N56021L05145J75228K09128L28708M30062
37228B502139M57995M08655L17446K55689K90792M14358N24113N00379L01048
37219E972614j6847l47147n92632o94951o41478m58370j95220Q7627L26156M67294
37209C907046M93347M30059L16602J61393o0798l48131o04386o64897m40322m9296
37199C140617K35235K17762m7819l39633m92065m94366m02832k54747r2818J8180
37189A487514O6146J25413K45337L48681L16684J41370q8391l20664n55626p36492
$$ y = [50852, -554911, -978010, -1388910, -1933914, -2637657, -3394616, -4014294, -4329229, -4323268, -4144643, -3961358, -3820391, -3669608, -3475948, -3264466, -3052022, -2795859, -2418993, -1861944, -1121048, -279547, 497847, 1053868, 1359013, 1534241, 1743369, 2072077, 2502139, 2960134, 3368789, 3686235, 3941924, 4232716, 4647074, 5171187, 5671566, 5972614, 5955767, 5608620, 5015988, 4321037, 3679559, 3221189, 3025969, 3113596, 3439752, 3907046, 4400393, 4830452, 5147054, 5308447, 5247649, 4899518, 4295132, 3630235, 3189913, 3140617, 3375852, 3593614, 3545795, 3206162, 2714097, 2219731, 1816899, 1562152, 1469334, 1487514, 1553660, 1679073, 1924410, 2273091, 2589775, 2731145, 2642754, 2322090, 1766464, 1029972]
37179A029972p47484n57636k70982J0221K83648N57964P59204Q07866P27083N95557
37169C195413M43512K69625J10293Q305m8867q2772o3204J5736M7275q2401l20232
37158C492683m95918n39976n33087n33060m84988l41163j49873L2618K15446L93312
37148A055994M85906M34352K87620J23609m7077k26684l48413l37521k11580m5508
37138A170698J20383K66485L37995K92268J76445Q1695L9869K3756R882k7537
37128B491939j35069l01909m05215l38900j68642m6089J0251J15367K94183M03024
37118A918940L28627J51113L6835M9360J25992J63206O1248k36900o59813j001692
37108I36916j081549q94374n65663k04285J39465M17102N71555N80253M52711
$$ y = [1029972, 282488, -275148, -546130, -535909, -252261, 305703, 1064907, 1872773, 2599856, 3195413, 3638925, 3908550, 4018843, 4027148, 3978281, 3895509, 3832305, 3848041, 3895316, 3812915, 3492683, 2996765, 2456789, 1923702, 1390642, 905654, 564491, 414618, 447236, 662682, 1055994, 1541900, 1976252, 2263872, 2387481, 2340404, 2113720, 1765307, 1427786, 1216206, 1170698, 1291081, 1557566, 1895561, 2187829, 2364274, 2445969, 2485838, 2509594, 2519476, 2491939, 2356870, 2054961, 1649746, 1310846, 1142204, 1096115, 1106366, 1221733, 1515916, 1918940, 2247567, 2398680, 2435515, 2484875, 2610867, 2774073, 2835321, 2598421, 1938608, 936916, -144633, -1039007, -1604670, -1808955, -1669490, -1252388, -680833, -100580, 352131]
37099C52131J97709j48695m70317o12706n03996k11394J22958L80151N14239N49576
37089A69656N42491N28407N02168M50198L78414K95183J98651J05728N7696N9681
37079C288273N1036j0874o6647k3979R8313J67526Q9392r8845l02142m66156n67335
37068B158562n71308m71826l44924k91440l13803k99327j52701Q2141K63401L06321
37058C65096K67810K70932L73499N35985O96245Q23191Q87321Q38702O68237M62615
37048F189633L33232K88621K34051J10315k8392j12301j80036l38575o13888r04746
37038D977914j096005j167048j164967j116140j008679q37549o15325l42934k0988
37029b391721K99694N32051O49223P23639Q23291R02807Q61422O94259N12260
$$ y = [352131, 549840, 401145, -69172, -681878, -1185874, -1397268, -1274310, -894159, -379920, 169656, 712147, 1240554, 1742722, 2192920, 2571334, 2866517, 3065168, 3170896, 3228592, 3288273, 3339309, 3328435, 3261788, 3237809, 3336122, 3503648, 3593040, 3494195, 3192053, 2725897, 2158562, 1587254, 1115428, 770504, 479064, 165261, -134066, -286767, -204626, 58775, 365096, 632906, 903838, 1277337, 1813322, 2509567, 3332758, 4220079, 5058781, 5727018, 6189633, 6522865, 6811486, 7045537, 7155852, 7127460, 7015159, 6835123, 6496548, 5882660, 4977914, 3881909, 2714861, 1549894, 433754, -574925, -1412474, -2027799, -2370733, -2391721, -2092027, -1559976, -910753, -187114, 636177, 1538984, 2400406, 3094665, 3606925]
37020C606925M02983L43648K77151J99485J22372J7947j20910k10564j64789m5143
37010D429105l0856k16463n07514p37331q17044p42955n44910l08040j93153l25052
37000E787o39383r05180r35071p46880n02494l20733j80049J2139K91669N90702
36990c329493Q02179Q73904Q37436P59243O81983O14355N55065N04377M55627
36981B754676L93323L03019J72265j6145k68905n43682p40863p67398o25257m21135
36971B39898k66766j72806o1014J18941L11224M05937L50633J93466L1913o0924
36961A090502p5314o0789p8409j31096j46235n3703J27204L11442M43998N15540
36951A943140M85298K79427p4046l73503m07331j88050N2239J13326Q242j25112
$$ y = [3606925, 4009908, 4353556, 4630707, 4830192, 4952564, 4970511, 4849601, 4639037, 4474248, 4429105, 4398249, 4181786, 3674272, 2936941, 2119897, 1376942, 832032, 523992, 330839, 5787, -633596, -1538776, -2473847, -3220727, -3723221, -4043954, -4224003, -4211864, -3920195, -3329493, -2527314, -1653410, -815974, -56731, 625252, 1239607, 1794672, 2299049, 2754676, 3147999, 3451018, 3623283, 3607138, 3338233, 2794551, 2053688, 1286290, 661033, 239898, -26868, -199674, -260688, -141747, 169477, 575414, 926047, 1119513, 1151426, 1090502, 1015188, 954399, 875990, 744894, 598659, 544956, 672160, 983602, 1427600, 1943140, 2428438, 2707865, 2633819, 2260316, 1852985, 1664935, 1717174, 1830500, 1838742, 1713630]
36941A713630k12620k77132l30123l24874k35025j17071n3837o1467q4778o9084
36931e2381k673J06640K56068M26709N59725N84413M71076K41504o1031l77959
36921B152091o11450o49980m70891k05527n1472j02819k86912m61691n30050m50994
36911a669695k09588J50790M83625O07361M62999J83231k2809m9834M5267J45442
36901A26789K05090K69567L76616M69394M42424K80043J10473Q2371J99539L17884
36891B880190L04573J60570j6013j36149j67975j28853p3100n8112p8578n5147
36881B631406O5056K10594K42254J11646q2698k09397k32792k09590j99477k18531
36871B108471k62390l29119m02178m30151l52314j63106N2531J73239J48949M3875
$$ y = [1713630, 1501010, 1223878, 893755, 568881, 333856, 216785, 162948, 101481, 16703, -52381, -55054, 51586, 307654, 734363, 1294088, 1878501, 2349577, 2591081, 2530050, 2152091, 1540641, 890661, 419770, 214243, 162771, 59952, -226960, -688651, -1218701, -1669695, -1879283, -1728493, -1244868, -637507, -174508, 8723, -14086, -63920, -18653, 126789, 331879, 601446, 978062, 1447456, 1889880, 2169923, 2280396, 2362767, 2562306, 2880190, 3184763, 3345333, 3329320, 3193171, 3025196, 2896343, 2823243, 2765131, 2686553, 2631406, 2696462, 2907056, 3149310, 3260956, 3178258, 2968861, 2736069, 2526479, 2327002, 2108471, 1846081, 1516962, 1114784, 684633, 332319, 169213, 221744, 394983, 543932, 587807]
36861E87807m1199p1643q2975j04760j21112j02620m1091M7099J17344J01512
36851B88362l2273k08990k83251j80951J7708J57480J49957K5549j19414j97231
36841c83054j73783p4081N4860J89919L24928M22471M13774K67126K8960k16322
36831H54798l94991m45539l29311p9584J98668M17617N64038O39523N98391M05645
36821B429255J19377j52207l52043m70251m75071l45169j69267j08765k15243
36812B60616l51440l44843j81017m727M2594m4893j43276j12641P1803K81999
36802e25825L53752K58569J33911J25452K29454L17123K89248J73140P8001Q3354
36792A516179J70587K46196K29761J25996J4120k3461M7734K11856M10100N47837
$$ y = [587807, 546608, 474965, 391990, 287230, 166118, 63498, 22407, 69506, 186850, 288362, 256089, 47099, -236152, -417103, -399395, -241915, -91958, -66409, -185823, -383054, -556837, -630918, -576058, -386139, -61211, 361260, 775034, 1042160, 1071120, 854798, 459807, 14268, -315043, -394627, -195959, 221658, 785696, 1425219, 2023610, 2429255, 2548632, 2396425, 2044382, 1574131, 1099060, 753891, 584624, 475859, 260616, -90824, -435667, -616684, -621411, -578817, -623710, -766986, -879627, -807824, -525825, -172073, 86496, 220407, 345859, 575313, 892436, 1181684, 1354824, 1432825, 1516179, 1686766, 1932962, 2162723, 2288719, 2302839, 2279378, 2327112, 2538968, 2949068, 3496905]
36782C496905N39644L79311J51845m1572j62876k39267l07625l68485l80911k95916
36772B771053j10140J06830K50928K53617J12093j25513l73930n31803n48611
36763A804524m83109m49634m86737n12388m19999j81097J49736M69692O45390
36754E36378N74665L02011K9947o5350j9923j7402j43424k81099k77651j49767
36744D88385o3135j30534k89364l91548l72895k96559k41846j97034r0676R2100
36734a493106K65871L28689K68176J69821J28618J63080K15578K30633K18945
36725D96305K26066K47671K22817J34507O7592J09655K19631K63307J78893M5897
36715B212341j9952J5471J05611J87982K27246K37254K73892L60408M14807L17898
$$ y = [3496905, 4036549, 4415860, 4567705, 4526133, 4363257, 4123990, 3816365, 3447880, 3066969, 2771053, 2660913, 2767743, 3018671, 3272288, 3384381, 3258868, 2884938, 2353135, 1804524, 1321415, 871781, 385044, -127344, -547343, -728440, -578704, -109012, 536378, 1111043, 1413054, 1443001, 1377651, 1357728, 1340326, 1196902, 915803, 638152, 488385, 425250, 294716, 5352, -386196, -759091, -1055650, -1297496, -1494530, -1585206, -1493106, -1227235, -898546, -630370, -460549, -331931, -168851, 46727, 277360, 496305, 722371, 970042, 1192859, 1327366, 1394958, 1504613, 1724244, 1987551, 2166444, 2212341, 2192389, 2207860, 2313471, 2501453, 2728699, 2965953, 3239845, 3600253, 4015060, 4332958]
36705D332958P7738j39690j83151o6092R1025K07087K77477L16337L25508K98642
36695E537839K17766P2783r4409k16240k95865m04975n38649n57227l56638l0641
36685C333744K34571L74950M47704M59217L35307P1780k12200m14924n54819o86909
36675C388421p90983p97051o78126m79924k90635j99104k38240l38864l64055
36666g88561k11155J19694N31547Q72333J005189R00129O46238L30083n3100m89628
36656B862769q06082p87325m53658q6453P3880M6115k2267p0565j09293r5432
36646E51689L4644K45533M32830N56671O46904O87981O05244L87222J39591j9109
36636D269200o7072o3107o8282j12859k09400l62390n57702p40093q06391o60740
$$ y = [4332958, 4410696, 4271006, 4087855, 4021763, 4112788, 4319875, 4597352, 4913689, 5239197, 5537839, 5755605, 5828388, 5733979, 5517739, 5221874, 4816899, 4278250, 3721023, 3364385, 3333744, 3568315, 3943265, 4390969, 4850186, 5185493, 5257273, 5045073, 4630149, 4075330, 3388421, 2597438, 1800387, 1122261, 642337, 351702, 152598, -85642, -424506, -788561, -999716, -880022, -348475, 523858, 1529047, 2429176, 3075414, 3405497, 3352397, 2862769, 2056687, 1269362, 815704, 729251, 803131, 849246, 826979, 756414, 647121, 551689, 586333, 831866, 1264696, 1821367, 2468271, 3156252, 3761496, 4148718, 4288309, 4269200, 4202128, 4139021, 4070739, 3957880, 3748480, 3386090, 2828388, 2088295, 1281904, 621164]
36626F21164l16628P2788L30097L98557L44361K37144Q8612q5932k13426k16988
36616A259749r5985Q6863K81973M76034O43539P26745O97244O11456N54757N24285
36606E766660M14688J51129j98274m86840o40186o83078o30067m38003j06679
36597C149350K37216M22311L81334J80513p2623l03847m73111n59558n62522m94481
36587A904582l69768k15105p7689Q559O2082J27897K06953K38554J70091L1964
36577B088120p5758p9862j6313m953j27748l36115m96967n27682m62518l90916
36567d30712l70677m10553m84798n22251m16868j16311K85420N79045N93509L32679
36557i61517k5320k64308k95621k15206j91233k87598m11753m32244l05513p0856
$$ y = [621164, 304536, 377324, 707421, 1105978, 1450339, 1687483, 1776095, 1690163, 1476737, 1259749, 1163764, 1250627, 1532600, 2008634, 2652173, 3378918, 4076162, 4687618, 5242375, 5766660, 6181348, 6332477, 6134203, 5647363, 5007177, 4324099, 3694032, 3256029, 3149350, 3386566, 3808877, 4190211, 4370724, 4298101, 3994254, 3521143, 2961585, 2399063, 1904582, 1534814, 1319709, 1242020, 1250579, 1312661, 1440558, 1647511, 1886065, 2056156, 2088120, 2012362, 1932500, 1916187, 1911234, 1783486, 1447371, 950404, 422722, -39796, -430712, -801389, -1211942, -1696740, -2218991, -2635859, -2752170, -2466750, -1887705, -1294196, -961517, -986837, -1251145, -1546766, -1761972, -1953205, -2240803, -2652556, -3084800, -3390313, -3461169]
36547c461169K24610N41022Q12964R65081R69710Q59208O86945N06431L74040
36538B478842L22519L23209L10922K58253J99629J75820J82351J83020J52680
36529D587245R7667N1767N7045J28161K25875K80164K48768J48089L2353m1143
36519E815991l1065P4791K48453M32411N72112O39832O31463N49409L93811J74687
36509I501895o1779k30527k62448j75983p0421k8499m5964p8263j27982k41092
36499H178937m20371n82858o18839m81567k23697L7088J96581K32330J92686J08693
36489F618983n3100l08428n48521n91583l73242l8620K03204K98970L83025N89914
36479F180602Q74045J041353R50382O59002L64013K10530J78396J46840L6694
$$ y = [-3461169, -3236559, -2695537, -1882573, -917492, 52218, 911426, 1598371, 2104802, 2478842, 2801361, 3124570, 3435492, 3693745, 3893374, 4069194, 4251545, 4434565, 4587245, 4684912, 4736679, 4793724, 4921885, 5147760, 5427924, 5676692, 5824781, 5857134, 5815991, 5784926, 5859717, 6108170, 6540581, 7112693, 7752525, 8383988, 8933397, 9327208, 9501895, 9440116, 9209589, 8947141, 8771158, 8700737, 8672238, 8626274, 8548011, 8420029, 8178937, 7758566, 7175708, 6556869, 6075302, 5851605, 5888693, 6085274, 6317604, 6510290, 6618983, 6565883, 6257455, 5708934, 5117351, 4744109, 4705489, 4908693, 5207663, 5590688, 6180602, 7054647, 8096000, 9046382, 9705384, 10069397, 10279927, 10458323, 10605163, 10641857]
36470A0641857j26316k60269l04814k58284j68846r6869p0868p4518p9456p9285
36460I122332p8668o5108k0830L7719O0212J5546o8978j34462j53239j56570j94333
36449H363621k66875l08864k56858j26511L190Q3158J36785J95772K33763K01196
36439H258377J04153P507l4852k2864R810L0175K6743K5158P8213K09711L67479
36428I059610M57959M29221L01046J23991n6256j93113k37264j64864J721K07087
36418I929138L88158M93569N01737M26610K95413J26559n2631j76811j70247k5996
36408A1735499J54230K19019P8449k27911n57592p59712p62049n91655l36697
36399H951581r5465O9955J72535K84357M34530N24839M12609J03963j95073k64924
$$ y = [10641857, 10515541, 10255272, 9950458, 9692174, 9523328, 9426459, 9355591, 9281073, 9201617, 9122332, 9043664, 8978556, 8957726, 8995445, 9055657, 9071203, 9002225, 8867763, 8714524, 8557954, 8363621, 8096746, 7787882, 7531024, 7404513, 7407703, 7490861, 7627646, 7823418, 8057181, 8258377, 8362530, 8370037, 8335185, 8312321, 8322131, 8352306, 8379049, 8404207, 8482420, 8692131, 9059610, 9517569, 9946790, 10247836, 10371827, 10315571, 10122458, 9885194, 9720330, 9722051, 9929138, 10317296, 10810865, 11312602, 11739212, 12034625, 12161184, 12108553, 11931742, 11761495, 11735499, 11889729, 12108748, 12187197, 11959286, 11401694, 10641982, 9879933, 9288278, 8951581, 8856116, 8926071, 9098606, 9382963, 9817493, 10342332, 10754941, 10858904, 10663831, 10398907]
36389A0398907o9160K64882N92919Q13815Q45614O57721L35381L3782j52946k34531
36379A3486384k48269k06556j25003l7468L7141R7480J20591O9574m6840j66637
36369A2980397k40537k73114k99591l59732m80951o27394o67932m65369k2560
36360I543217N00750R20296J134473J123463R31317O62437M10072J57342j74411
36351A5208956n46454p58366o46053k68119J59659M65862O12771O47659O41021
36342A5516936O45409O56122O27369N56526N09288N20243N21533M33782K88465
36333B0275673J89489J79302K14820K59601L20298L81068L70272K34631K6877
36324B2452031j10314o8772R8180J88923M8128k39148m08823l03249k9343K12592
$$ y = [10398907, 10329747, 10594629, 11187548, 12001363, 12846977, 13504698, 13840079, 13873861, 13720915, 13486384, 13238115, 13031559, 12906556, 12869088, 12906229, 13003709, 13124300, 13193874, 13147034, 12980397, 12739860, 12466746, 12167155, 11807423, 11326472, 10699078, 10031146, 9565777, 9543217, 10043967, 10964263, 12098736, 13222199, 14153516, 14815953, 15226025, 15383367, 15208956, 14662502, 13904136, 13258083, 12989964, 13149623, 13615485, 14228256, 14875915, 15516936, 16162345, 16818467, 17445836, 18002362, 18511650, 19031893, 19553426, 19987208, 20275673, 20465162, 20644464, 20859284, 21118885, 21439183, 21820251, 22190523, 22425154, 22452031, 22341717, 22272945, 22371125, 22560048, 22608176, 22369028, 21960205, 21656956, 21627613, 21840205]
36314B1840205L74453N41549P26404Q12105P09169M65872J91523n1985k45346
36305B5363949l65887m02400l84531l50730k93372j61237P9976L92724O75081
36296B4553573Q41174R08457R82286J128305J284723J337742J260578J127819
36288C3424657J007019R00905Q08546P83641Q86800J092182J268148J267044J056115
36279D2495057P71025O12973O64660Q26209R52529J012566J068470J145026J207990
36270E0756505J264690J393064J635754J926296K161112K305399K394810K469090
36262F6306720K546991K649636K805414L018591L245951L420287L512286L572929
36254I1078805L698478L948577M326047M846790N584155O612436P951748R608878
$$ y = [21840205, 22214658, 22756207, 23482611, 24294716, 25003885, 25469757, 25661280, 25609295, 25363949, 24998062, 24595662, 24211131, 23860401, 23567029, 23405792, 23485768, 23878492, 24553573, 25394747, 26303204, 27285490, 28413795, 29698518, 31036260, 32296838, 33424657, 34431676, 35332581, 36141127, 36924768, 37811568, 38903750, 40171898, 41438942, 42495057, 43266082, 43879055, 44543715, 45369924, 46322453, 47335019, 48403489, 49548515, 50756505, 52021195, 53414259, 55050013, 56976309, 59137421, 61442820, 63837630, 66306720, 68853711, 71503347, 74308761, 77327352, 80573303, 83993590, 87505876, 91078805, 94777283, 98725860, 103051907, 107898697, 113482852, 120095288, 128047036, 137655914]
36246A37655914J1606274J3881534J6200979J8298616K0121741K1844792K3605740
36239B63215590K5290719K6574316K7057127K6327368K4036861K0090600J4797265
36232D27389846Q800475K867489k287336o134854q472331r476809r557885r118231
36224C94010364q424616p608286o683622n583498m273893k860556j533486m04313
36216C56638094N43990J343000J939974K227074K098027J435408R8211k010311
36208C64313467m859143q277597j1977354j5549362j8500045k0409851k1127125
36201B63612990k0810431j9780944j8345157j6730910j5106082j3577510j2160081
36194A47101875j0786132r377265p917349o468321n134535m015193l170867k610919
$$ y = [137655914, 149262188, 163143722, 179344701, 197643317, 217765058, 239609850, 263215590, 288506309, 315080625, 342137752, 368465120, 392501981, 412592581, 427389846, 436190321, 439057810, 436770474, 430635620, 422163289, 412686480, 403128595, 394010364, 385585748, 377977462, 371293840, 365710342, 361436449, 358575893, 357042407, 356638094, 357182084, 358525084, 360465058, 362692132, 364790159, 366225567, 366323778, 364313467, 359454324, 351176727, 339199373, 323650011, 305149966, 284740115, 263612990, 242802559, 223021615, 204676458, 187945548, 172839466, 159261956, 147101875, 136315743, 126938478, 119021129, 112552808, 107418273, 103403080, 100232213, 97621294]
36186I7621294k296417k143520k024220j791666j347801p08541M026O44147J127379
36177H9084681J466402J763279K162119K758795L528522M363423N192008O028910
36169A16348139O899515P780835Q672417R684845J0982558J2640095J4603638
36162A87612042J6780184J9094068K1438868K3627045K5412121K6526311K6687665
36155C47178304K5627605K3171458J9319239J4287263Q527186K697536k484525
36148D38324066o479909r084997j0395682j0650416j0101548q982420p538317
36141C75090777o042877m728829l661330k709446j710476o69850K45684Q95502
36133C56709155J261916J344164J042973J99707j311083l568673o597250j0259938
$$ y = [97621294, 95324877, 93181357, 91157137, 89365471, 88017670, 87309129, 87313155, 87957302, 89084681, 90551083, 92314362, 94476481, 97235276, 100763798, 105127221, 110319229, 116348139, 123247654, 131028489, 139700906, 149385751, 160368309, 173008404, 187612042, 204392226, 223486294, 244925162, 268552207, 293964328, 320490639, 347178304, 372805909, 395977367, 415296606, 429583869, 438111055, 440808591, 438324066, 431844157, 422759160, 412363478, 401713062, 391611514, 382629094, 375090777, 369047900, 364319071, 360657741, 357948295, 356237819, 355567969, 355813653, 356709155, 357971071, 359315235, 360358208, 360557915, 359246832, 355678159, 349080909, 338820971]
36125C38820971j4168291j7773970k0587507k2331729k2965008k2638867k1616549
36118A96739050k0156108j8439940j6611363j4823170j3185646j1690634j0260381
36111I1571808q879484p630085o596675n787776n157986m653933m215964l776538
36103D4873367l299166k820620k439725k245256k226530k249211k155796j912893
36095B5524170j626961j397221j211225j028116q88660q43884q17218o64335l78944
36086A6667606j25776l5885p1945j46960k73672n04328p86105r82458j023505
36077A2716972r55395q43419o95518m95677k63416n7841N8176N8220k1725j04254
36067I396123j41069j56124k03660l06723m59740o48311q07782p96360n09085
$$ y = [338820971, 324652680, 306878710, 286291203, 263959474, 240994466, 218355599, 196739050, 176582942, 158143002, 141531639, 126708469, 113522823, 101832189, 91571808, 82692324, 75062239, 68465564, 62677788, 57519802, 52865869, 48649905, 44873367, 41574201, 38753581, 36313856, 34068600, 31842070, 29592859, 27437063, 25524170, 23897209, 22499988, 21288763, 20260647, 19371987, 18528103, 17710885, 17046550, 16667606, 16541830, 16505945, 16434000, 16287040, 16013368, 15509040, 14722935, 13740477, 12716972, 11761577, 10918158, 10222640, 9726963, 9463547, 9405706, 9463882, 9522102, 9500377, 9396123, 9255054, 9098930, 8895270, 8588547, 8128807, 7480496, 6672714, 5876354, 5367269]
36058E367269m1663L42726M65054L97751L29020L15017K53140P9352j16676k15577
36048G175413k35333l06117n04063p65730r57941r83056q17404n02947j31342
36039A971480J91584L96760M67884M12349K46302J7201j98764l56286m78663o04368
36029B065479p12561p40249o66401n35539l87690k01077P1713M27198P88150J048749
36019A157772J136290J048075Q50302O39135M83574L89935L15632K21701J23465
36010F365881R3071J97321M17532O35377P12039N87655L14269J6951j72026j84024
36000H984046o7240L9494K8286p4518j49005j19983k7428K8616k8150k10756m48704
35989G954658n90326m92439j63097K10860M21954M19691L16990K56620L02639
$$ y = [5367269, 5325606, 5668332, 6133386, 6531137, 6860157, 7175174, 7428314, 7507666, 7390990, 7175413, 6940080, 6633963, 6129900, 5364170, 4406229, 3423173, 2605769, 2102822, 1971480, 2163064, 2559824, 3027708, 3440057, 3686359, 3703560, 3504796, 3148510, 2669847, 2065479, 1352918, 612669, -53732, -589271, -976961, -1178038, -1106325, -679127, 109023, 1157772, 2294062, 3342137, 4192439, 4831574, 5315148, 5705083, 6020715, 6242416, 6365881, 6458952, 6656273, 7073805, 7709182, 8421221, 9008876, 9323145, 9340096, 9168070, 8984046, 8916806, 8956300, 8984586, 8910068, 8761063, 8641080, 8613652, 8642268, 8614118, 8403362, 7954658, 7364332, 6871893, 6708796, 6919656, 7341610, 7761301, 8078291, 8334911, 8637550]
35980H637550M20580N03030M31918J83883j12661k72520k25668o7527O5222J29561
35970I693368J73959K41282L03760K78822R7936k14347n14802o29346n05289k69257
35960H656086j11889j23875k57330m13909n22684n44486m66534l25738k00523
35951E689118j38096j02823l1200O8219J08695L1720j07975j85007j16978P9506
35941E295179L23711N24354O02209N10370K74451L868j75728k23819k15244k60404
35931F658947l91482n23036n21915l23846N871L22200N13340N66166N28886M34823
35921G269954K83812Q1730j39920l49289n24196o20105n63473l18244M6656L86848
35911E553773N85133O14215N12487L28121Q7160k08576n54352q94875j118166
$$ y = [8637550, 9058130, 9561160, 9993078, 10176961, 10064300, 9791780, 9566112, 9498585, 9563807, 9693368, 9867327, 10108609, 10412369, 10691191, 10789127, 10574780, 10059978, 9430632, 8925343, 8656086, 8544197, 8420322, 8162992, 7749083, 7226399, 6681913, 6215379, 5889641, 5689118, 5551022, 5448199, 5416999, 5485218, 5593913, 5625633, 5517658, 5332651, 5215673, 5295179, 5618890, 6143244, 6745453, 7255823, 7530274, 7534142, 7358414, 7134595, 6919351, 6658947, 6267465, 5744429, 5222514, 4898668, 4904539, 5226739, 5740079, 6306245, 6835131, 7269954, 7553766, 7635496, 7495576, 7146287, 6622091, 6001986, 5438513, 5120269, 5166925, 5553773, 6138906, 6753121, 7265608, 7593729, 7680889, 7472313, 6917961, 6023086, 4904920]
35902D904920j143867j025688r16127r00159r02240p91736n39795k19174J17644
35893a416222M77876Q38473J094106J142905R90867P38239M93582L35122L17146
35884E012094M42403O16950O85484N52172K60760n6488k95135m30695m75053m21502
35874E890990k55945j1789K12133L03240K06672m7428l69767o59887q52868r46532
35864C468819r79940r65214q45621n52302j16746K93378M77251L54355K8919k87326
35854H75573m30126l90547k78253j69566p751L11053P59593J141969J261458J092466
35844D165869P64183M18619J29978p1273j68220j66638r7918k316P2919P6799
35834E122002L538o1346M21K05783M27067N11985M26456K54528Q1248q1984k54195
$$ y = [4904920, 3761053, 2735365, 1819238, 919079, 16839, -774897, -1314692, -1533866, -1416222, -938346, -99873, 994233, 2137138, 3128005, 3866244, 4359826, 4694948, 5012094, 5454497, 6071447, 6756931, 7309103, 7569863, 7513375, 7218240, 6787545, 6312492, 5890990, 5635045, 5623256, 5835389, 6138629, 6345301, 6297873, 5928106, 5268219, 4415351, 3468819, 2488879, 1523665, 678044, 125742, 8996, 302374, 779625, 1133980, 1162899, 875573, 445447, 54900, -223353, -392919, -400670, -89617, 669976, 1811945, 3073403, 4165869, 4930052, 5348671, 5478649, 5407376, 5239156, 5072518, 4974600, 4972284, 5045203, 5122002, 5125540, 5064194, 5064615, 5270398, 5697465, 6209450, 6635906, 6890434, 6971682, 6889698, 6635503]
35823F635503m04877m51003l43033j42456J2119L7269p010O271R9610J32645m9375
35812E525663m17791p43020p84584m90023j7414M00911N98131N16839J89049k80124
35802D497637p25596r76132r41866o64802k83925N2986K60277L27201K78907J28551
35792A953238j21254m16652o18469n94394l74109j61291j28849k18439k07960
35783h88179J4185L03505M19426K86088M8821j00422r5452M004J19637K17833
35773C29446K92450L40594L72482M13935M72457N16491N14967M84947M63725M35572
35763D637066L31510J22934j18581k84642l33684l09511k80626k88190l29570
35754C146706l56207l02704j55929J0056R4969N7809p7317k66544m54553n73076
$$ y = [6635503, 6230626, 5779623, 5436590, 5294134, 5306253, 5343522, 5336512, 5342783, 5442393, 5575038, 5525663, 5107872, 4364852, 3580268, 3090245, 3072831, 3473742, 4071873, 4588712, 4777761, 4497637, 3772041, 2795909, 1854043, 1189241, 905316, 958302, 1218579, 1545780, 1824687, 1953238, 1831984, 1415332, 796863, 202469, -171640, -332931, -461780, -680219, -888179, -873994, -570489, -151063, 135025, 183846, 83424, -12028, -8024, 111613, 329446, 621896, 962490, 1334972, 1748907, 2221364, 2737855, 3252822, 3737769, 4201494, 4637066, 4968576, 5091510, 4972929, 4688287, 4354603, 4045092, 3764466, 3476276, 3146706, 2790499, 2487795, 2331866, 2341922, 2436891, 2494700, 2417383, 2150839, 1696286, 1123210]
35744A123210o00762o10091o77303p43699o51303l43207M6252L38981M82706N29230
35734a105986N18905M65359M07773L85102L65235K73235R6705r1404k17719k63956
35724H33249k37430j52407o6829p8828k30442m31753n25887m34773k19182K727
35714a541555J65823K73893L34960L25092K25247N7564j42591l63598n87933p49308
35704b002406p81867p13862o44714o03212m91679k19061J56241M70696O11028
35695d218836N75959M21038K14135L0446q4415j57565k40579l13501k97241j76433
35685d246992m7341o694l5556l4287N2296J80719K66619K69586K26222K15122
35675c160306K86667M24552N80036P24417Q35583Q50162O95335L92467P4701j44170
$$ y = [1123210, 522448, -87643, -764946, -1508645, -2159948, -2503155, -2456903, -2117922, -1635216, -1105986, -587081, -121722, 286051, 671153, 1036388, 1309623, 1406328, 1314924, 1097205, 833249, 595819, 443412, 376583, 297755, 67313, -364440, -890327, -1325100, -1544282, -1541555, -1375732, -1101839, -766879, -441787, -216540, -158976, -301567, -665165, -1253098, -2002406, -2784273, -3498135, -4142849, -4746061, -5237740, -5456801, -5300560, -4829864, -4218836, -3642877, -3221839, -3007704, -2977258, -3061673, -3219238, -3459817, -3773318, -4070559, -4246992, -4294333, -4301027, -4336583, -4370870, -4318574, -4137855, -3871236, -3601650, -3375428, -3160306, -2873639, -2449087, -1869051, -1144634, -309051, 541111, 1236446, 1628913, 1703614, 1559444]
35665A559444k85214m42095o28525p44960o94049m78782j80287J10373L16336
35656a467759L81857L10973J89073J17937J17976J26774J04270R5470J50931K18037
35646C45539J80109J3554j53037j71243k6469J73277L20122L66991L01060J34795
35636A484698p1765k43880l67956m89759o24943p24563p53055p46457p52415p54487
35626d044582p05348o05857m96921l86908k41117m5564J63703L46852N02398O46310
35616d867034P69393Q31518P92306O46108M37005K38755J07583N1040M4800O7443
35606h81083J05030J34695J32691J06487J03112J72965L21334M87477N69165M88173
35596A740046K57072j8764k23748l24380l78602m63312o01480p44793q04006p02833
$$ y = [1559444, 1274230, 832135, 203610, -541350, -1235399, -1714181, -1894468, -1784095, -1467759, -1085902, -774929, -585856, -467919, -349943, -223169, -118899, -23429, 127502, 345539, 525648, 539202, 386165, 214922, 188453, 361730, 681852, 1048843, 1349903, 1484698, 1412933, 1169053, 801097, 311338, -313605, -1038168, -1791223, -2537680, -3290095, -4044582, -4749930, -5355787, -5852708, -6239616, -6480733, -6526297, -6362594, -6015742, -5513344, -4867034, -4097641, -3266123, -2473817, -1827709, -1390704, -1151949, -1044366, -993326, -948526, -881083, -776053, -641358, -508667, -402180, -299068, -126103, 195231, 682708, 1251873, 1740046, 1997118, 1978354, 1754606, 1430226, 1051624, 588312, -13168, -757961, -1561967, -2264800]
35586b264800m33952p8838K36822M19087M46503L57247K19319J07627P8541J44788
35576g67656K74625M15953N18460N43068M70711L08713Q2904j72980m13575n83269
35566F76954o47397o22072n53434m68638l67141k51783j32215O575J96022M20169
35556a742960N93224O34167N44627L85018J98139j630j80469k83863k94282k47403
35546c95432j77911r3026j9583k2466j22879k31344k30935j22439j8569J8971
35536a415613O0555J76841K86175K22011n3965l82688n71115n64274m26024k14032
35526b882129N4780L36346N33469N66030M39620K32532L5950r3151j57141k14362
35516a148056l21586m54079n03418l84844j37138J10559K61510L08366K73997
$$ y = [-2264800, -2698752, -2777590, -2540768, -2121681, -1675178, -1317931, -1098612, -990985, -912444, -767656, -493031, -77078, 441382, 984450, 1455161, 1763874, 1846778, 1673798, 1260223, 676954, 29557, -592515, -1145949, -1614587, -1981728, -2233511, -2365726, -2359151, -2163129, -1742960, -1149736, -515569, 29058, 414076, 612215, 610585, 430116, 146253, -148029, -395432, -573343, -666369, -685952, -708418, -831297, -1062641, -1293576, -1416015, -1434584, -1415613, -1355058, -1178217, -892042, -670031, -723996, -1106684, -1677799, -2242073, -2668097, -2882129, -2827349, -2491003, -1957534, -1391504, -951884, -719352, -683402, -776553, -933694, -1148056, -1469642, -1923721, -2427139, -2811983, -2949121, -2838562, -2577052, -2268686, -1994689]
35507a994689J47700q5795l78381o20954p19364o53695m73917k64602j05662k2513
35497e171872M2927J75377L71676N15301N07657M00204L34357L53375L47690K17758
35487a905550K3824r2333r9409j11204k27076m04698n16566m86065l38559j57663
35477d315299l2584k5028j37618l05524m41120m91902m48727l16757j09406J33118
35467f490847L51779N04724N75834N48208M05301J78447l8086j58069j81029j66301
35457d470039j34663l9230J49950L71539N19514N44399M69485L20897J00914j47832
35447b315066l02985k46011J5504L43201N89743P01339P02588O22580M66441K43272
35437H20606j0504k43646m16549n16432n55230n48697m88257l41621j02612J58266
$$ y = [-1994689, -1846989, -1932784, -2311165, -2932119, -3651483, -4305178, -4779095, -5043697, -5149359, -5171872, -5128945, -4953568, -4581892, -4066591, -3558934, -3158730, -2824373, -2470998, -2123308, -1905550, -1881726, -1974059, -2073468, -2184672, -2411748, -2816446, -3333012, -3819077, -4157636, -4315299, -4347883, -4372911, -4510529, -4816053, -5257173, -5749075, -6197802, -6514559, -6623965, -6490847, -6139068, -5634344, -5058510, -4510302, -4105001, -3926554, -3964640, -4122709, -4303738, -4470039, -4604702, -4643932, -4493982, -4122443, -3602929, -3058530, -2589045, -2268148, -2167234, -2315066, -2618051, -2864062, -2848558, -2505357, -1915614, -1214275, -511687, 110893, 577334, 820606, 810102, 566456, 149907, -366525, -921755, -1470452, -1958709, -2300330, -2402942, -2244676]
35427b244676L22992L34540K69600K70673L87815N02581M32157J12993l26952
35418F1723o74905q01194p30800n82525m61210l96629l52954k76213j37187N4096
35408d297798K60776M41940N69805O32468O20379N12380K91632p373k77443l94386
35398a647620l06640n9875K58954N66511P66919P49298M65367R705m18814o52932
35388b69127o50684m78329k42703l8962Q3553J34872J52064J44094Q6623k0343
35378a098942j14478j14512K33J59248K46733J88290J7425j38443j60160m0121
35368a054727J19031K02870J72958P8150J3240N3140J79064K67941K04949J4763
35358B51379j70830k80717l64698m62297n09525m52546l75687m02666n07468n44330
$$ y = [-2244676, -1921684, -1587144, -1317544, -1046871, -659056, -156475, 275682, 388675, 61723, -613182, -1414376, -2145176, -2727701, -3188911, -3585540, -3938494, -4214707, -4351894, -4297798, -4037022, -3595082, -3025277, -2392809, -1772430, -1260050, -968418, -975791, -1253234, -1647620, -1954260, -2014135, -1755181, -1188670, -421751, 327547, 792914, 802619, 383805, -269127, -919811, -1398140, -1640843, -1679805, -1596252, -1461380, -1309316, -1165222, -1078599, -1098942, -1213420, -1327932, -1327699, -1168451, -921718, -733428, -716003, -854446, -1014606, -1054727, -935696, -732826, -559868, -481718, -468478, -415338, -236274, 31667, 236616, 251379, 80549, -200168, -564866, -1027163, -1536688, -1989234, -2364921, -2767587, -3275055, -3819385]
35348c819385m59873l50505k80186j63495R1695M02941N66650M67507J79577j11424
35338c476498k38798j49942N6340J98645J77832P0529J7517M2821M9644j4956
35328c266866p8474n6261K4029O6821L8111p355j0863L1967R5374J55496J83075
35317b824946J43282K9360j25629k91979m73033o58190p67589p01397m59499j68600
35307f298220L7978J37471J90596K40338K90374L55421M55615N51272N53511M37041
35297c048603K95473K42225K88575L60893M08935M41136M58631M09828K38703
35288I5796l6011l05576m43357m08705k86010j99587j78090j32379P628J67130
35278a719161J86919N340k59865m18257l72705j85222j0637K8296p5530k37106
$$ y = [-3819385, -4279258, -4629763, -4909949, -5073444, -4981749, -4578808, -4012158, -3544651, -3365074, -3476498, -3715296, -3865238, -3808898, -3610253, -3432421, -3361892, -3344375, -3301554, -3251910, -3266866, -3345340, -3401601, -3377572, -3310751, -3272640, -3279995, -3290858, -3258891, -3163517, -3008021, -2824946, -2681664, -2652304, -2777933, -3069912, -3542945, -4201135, -4968724, -5670121, -6129620, -6298220, -6260242, -6122771, -5932175, -5691837, -5401463, -5046042, -4590427, -4039155, -3485644, -3048603, -2753130, -2510905, -2222330, -1861437, -1452502, -1011366, -552735, -142907, 95796, 59785, -245791, -689148, -1097853, -1383863, -1583450, -1761540, -1893919, -1886291, -1719161, -1532242, -1526902, -1786767, -2205024, -2577729, -2762951, -2773588, -2745292, -2820822, -3057928]
35268c057928l76724m73245n20731m85609l53265j81851m5103O5439K15991M09203
35258d803823N51576N52132L97919J30808j74309l91219l95935j99943L1998J59663
35248d141133K09831K75250L31620K62525N1569j60235k40607k13210j93330k24495
35238d042215k28073r8533J81598N16003P71291Q86698R07563Q99484Q47375O78508
35228A319699L82207N4166k03480l89633n77060p96644r82415j029051q83990
35219c106201n87678k45646L3376J90270K31733K09008J77007J56137J24031N3450
35209b764513m0269j11506j51717k09594l18104m38649n20784n77853o30809o02495
35199f366293l73074L7816M44075P01752Q59787J028862J177644J171368R74310
$$ y = [-3057928, -3434652, -3907897, -4428628, -4914237, -5267502, -5449353, -5494456, -5429017, -5213026, -4803823, -4252247, -3700115, -3302196, -3171388, -3345697, -3736916, -4132851, -4332794, -4300796, -4141133, -3931302, -3656052, -3324432, -3061907, -3010338, -3170573, -3411180, -3624390, -3817720, -4042215, -4270288, -4368821, -4187223, -3671220, -2899929, -2013231, -1105668, -206184, 641191, 1319699, 1701906, 1756072, 1552592, 1162959, 585899, -210745, -1193160, -2222211, -3106201, -3693879, -3939525, -3906149, -3715879, -3484146, -3275138, -3098131, -2941994, -2817963, -2764513, -2804782, -2916288, -3068005, -3277599, -3595703, -4034352, -4555136, -5132989, -5763798, -6366293, -6739367, -6701551, -6257476, -5555724, -4695937, -3667075, -2489431, -1318063, -343753]
35190c43753O88409L88098M3497l41236o16628o12758l43106r793J90743K24012
35180g32515J91487J99257K66228L36709L64669L78406M49094N92646P24506P28079
35170C498566N58330K73892j1844k05189k90819l38992m32040n66537o56976o55535
35160A172856o26840o63884p62171q25708p74860o01728l50033j07425M853p4071
35150c609011k46299l27128k41713q8060J0897L4980J3066n8238j58844j79509
35140d849859k3956K42529M40161M73337M13777L88673M52865N67757O32706N32527
35130g29483K33754j40255l93666m42738l60933k30855m0736K20885M46357M75296
35120i62374K60407q9163m11134n92617o00688m75232k91165q9620J46346M21918
$$ y = [-343753, 344656, 732754, 776251, 435015, -181613, -794371, -1137477, -1147270, -956527, -732515, -541028, -341771, -75543, 261166, 625835, 1004241, 1453335, 2045981, 2770487, 3498566, 4056896, 4330788, 4318944, 4113755, 3822936, 3483944, 3051904, 2485367, 1828391, 1172856, 546016, -117868, -880039, -1705747, -2480607, -3082335, -3432368, -3539793, -3534940, -3609011, -3855310, -4182438, -4424151, -4512211, -4501314, -4466334, -4453268, -4511506, -4670350, -4849859, -4873815, -4631286, -4191125, -3717788, -3304011, -2915338, -2462473, -1894716, -1262010, -729483, -495729, -635984, -1029650, -1472388, -1833321, -2064176, -2104912, -1884027, -1437670, -962374, -701967, -791130, -1202264, -1794881, -2395569, -2870801, -3161966, -3251586, -3105240, -2683322]
35110b683322O66271P85453P59745O38956M59095K24836k9214k24622l06974k89807
35100D17k24151j64094j63991k54204l93329m80116m36557k57051K5579L71412
35090a976085P03201Q93255Q42798N80501K54259J3525j00865j59733k46383l53114
35080D51359l86430k87806j29788n7561j43038l31707n17233o07787n23453k23018
35070b756462K10084N70436O95754O11238M61878L36380K26292J31807J04080
35061E91487J46284J43414m2447m15371q13269j029300r62374o76160l35868p7537
35051c471141Q4536K32743M36286O73794Q54569Q91462P50614M62035J08136k07318
35041H15716m03283m45634l36051r8833K04396M61679N48822M08128R8287k34479
$$ y = [-2683322, -2017051, -1231598, -471853, 167103, 626198, 851034, 821820, 597198, 290224, 417, -223734, -387828, -551819, -806023, -1199352, -1679468, -2116025, -2373076, -2347497, -1976085, -1272884, -379629, 463169, 1043670, 1297929, 1311454, 1210589, 1050856, 804473, 451359, 64929, -222877, -352665, -410226, -553264, -884971, -1402204, -2009991, -2533444, -2756462, -2546378, -1975942, -1280188, -668950, -207072, 129308, 355600, 487407, 591487, 737771, 881185, 838738, 423367, -389902, -1419202, -2381576, -3057736, -3393604, -3471141, -3386605, -3153862, -2717576, -2043782, -1189213, -297751, 452863, 914898, 1023034, 815716, 412433, -33201, -369252, -468085, -263689, 197990, 746812, 1154940, 1253227, 1018748]
35031A018748m43089m61150l31044j70556j02413j86654l93134o25862p75161
35022b470315p62285n67690k52795M2924J70015Q1207j20952k71532k79784j68624
35012d599831p253J41705K10891J37696o5538k83880l89662l48487k11557l4874
35002e450790J48416K98947L75485L72795L14411K09736O1929q3406j50977j13037
34992d016491j4872Q6576J68922K24132K48310K73595L55229M90740N96703O03798
34982i83358N32642M35394L11167J37073n7988k22860l62296n09270o33289o60401
34972b013186n89287n04134m50391l77465k42866r9961k3471J311N2933J70748
34962d075769L32459N05043O59209P51511P48077O55888M85166K06376j85622
$$ y = [1018748, 575659, 114509, -216535, -387091, -489504, -676158, -1069292, -1695154, -2470315, -3232600, -3800290, -4053085, -4010161, -3840146, -3758939, -3879891, -4151423, -4431207, -4599831, -4607084, -4465379, -4254488, -4116792, -4182330, -4466210, -4855872, -5204359, -5415916, -5450790, -5302374, -5003427, -4627942, -4255147, -3940736, -3731000, -3669071, -3752477, -3903454, -4016491, -4031363, -3944787, -3775865, -3551733, -3303423, -3029828, -2674599, -2183859, -1587156, -983358, -450716, -15322, 295845, 432918, 374930, 152070, -210226, -719496, -1352785, -2013186, -2602473, -3106607, -3556998, -3934463, -4177329, -4277290, -4300761, -4299450, -4246517, -4075769, -3743310, -3238267, -2579058, -1827547, -1079470, -423582, 61584, 267960, 82338]
34953H2338n73154p65840o80239m16575j30919J17359L59407O11847Q32695R57343
34943C94262R30000P13258L17170j68658n98497q47834q84249p87847p07661p60753
34933b400809r36305j101983j117143r27491n53919m9899M79974Q64991R65183
34924d777401Q06438N67071M02884L16200K11905M1376j43869k61206k85706k67968
34914c390276k72673k96776k56549p9336J92515M22006N11836M85470M19121L35364
34904a929298K04833K8588j33007k17336k14648j65737j32389j68369k83288m19271
34894c429922m86025m37066l03556j52595l5248J7022j8561j29115k36724k43743
34884e455533j34999j4480p202j23568k47207k66458j91160j12345o1113M8942
$$ y = [82338, -490816, -1256656, -1936895, -2353470, -2484389, -2367030, -2007623, -1395776, -563081, 394262, 1324262, 2037520, 2354690, 2186032, 1587535, 739701, -144548, -932395, -1640056, -2400809, -3337114, -4439097, -5556240, -6483731, -7037650, -7087549, -6607575, -5742584, -4777401, -3970963, -3403892, -3001008, -2684808, -2472903, -2431527, -2575396, -2836602, -3122308, -3390276, -3662949, -3959725, -4216274, -4295610, -4103095, -3681089, -3169253, -2683783, -2264662, -1929298, -1724465, -1695877, -1828884, -2046220, -2260868, -2426605, -2558994, -2727363, -3010651, -3429922, -3915947, -4353013, -4656569, -4809164, -4844412, -4827390, -4845951, -4975066, -5211790, -5455533, -5590532, -5605012, -5612214, -5735782, -5982989, -6249447, -6440607, -6552952, -6614065, -6565123]
34874f565123L18265P19586J082712J220530J064916O94162K55272j28316l89819
34865a727815m99834m54007k92611j03297L8284J35761K45465L67444M02336K61677
34855a626597O350j80172j75248l5691R5298J66618K50612L97633N21327M74771
34845a05099K16946j45707m77794p19588q58692q61632o97114m09142j09019J08971
34835d057870K04843J58624k9736k79937m33901l79603j56304R7845K77707L51653
34825d246679L06407J33435j10581k92558l04886j64706J8868J64730K73955L68138
34815c853877M21525L93332L10568K64039K97449L37701K79271J20589l2550r3643
34805a555596o8024R563J41275L28415N17531O38193O63303N83538L61002j5381
$$ y = [-6565123, -6246858, -5527272, -4444560, -3224030, -2159114, -1464952, -1209680, -1337996, -1727815, -2227649, -2681656, -2974267, -3077564, -3039280, -2903519, -2658054, -2290610, -1888274, -1626597, -1620247, -1800419, -1975667, -2011358, -1916060, -1749442, -1498830, -1101197, -579870, -105099, 111847, -33860, -511654, -1231242, -2089934, -2951566, -3648680, -4057822, -4166841, -4057870, -3853027, -3694403, -3724139, -4004076, -4437977, -4817580, -4973884, -4876039, -4598332, -4246679, -3940272, -3806837, -3917418, -4209976, -4514862, -4679568, -4660700, -4495970, -4222015, -3853877, -3432352, -3039020, -2728452, -2464413, -2166964, -1829263, -1549992, -1429403, -1461953, -1555596, -1623620, -1614057, -1472782, -1144367, -626836, 11357, 674660, 1258198, 1619200, 1603819]
34795A603819m38214p25357p83328o87136n86393n70576o27599o77934o25832
34786d118550m24341j27286J43746L03093L54012L42561L07368K88398L24704
34777b606295L98634M23126L36981J90838R3817R4333J58281K42933L31479L98609
34767F2736M08716L71862L50998L76577L86382K94092J07516o0453j07886m9861
34757B140679J128n1430k00405l44308l66374k14983N8735L18834M14874K72673
34747B029423n8436m41631p34433q45235p46090m71889j11328K30013M72933N68179
34737a08494M80691K19382j11238l47390l99227l24588k37268j70615p8544M8873
34727a028418J35975J01741n4282k61454m32241m84505l54496m3701L46193O61017
$$ y = [1603819, 1165605, 440248, -343080, -1030216, -1616609, -2187185, -2814784, -3492718, -4118550, -4542891, -4670177, -4526431, -4223338, -3869326, -3526765, -3219397, -2930999, -2606295, -2207661, -1784535, -1447554, -1256716, -1162899, -1068566, -910285, -667352, -335873, 62736, 471452, 843314, 1194312, 1570889, 1957271, 2251363, 2358879, 2298426, 2190540, 2140679, 2141807, 2090377, 1889972, 1545664, 1179290, 964307, 1023042, 1341876, 1756750, 2029423, 1970987, 1529356, 794923, -50312, -796402, -1268291, -1379619, -1149606, -676673, -108494, 372197, 591579, 480341, 132951, -266276, -590864, -828132, -998747, -1077291, -1028418, -892443, -790702, -844984, -1106438, -1538679, -2023184, -2377680, -2421381, -2075188, -1414171]
34717a414171P96321P52625O00073M07687K08246J2871j57337k59852k54823j45281
34707E46359J0439J35593J85914J61214P9755l2350j22181j18855l046J40266
34697I83108J84842R7870k0401n8850l3034o3788k28824m73318o67376p14000
34687i93771n92650l41985l8022K25434L70391L60548J95071j02889m68023p74179
34677b160075q76418p09866l56374J642K14295K62964K33072K08600K19608K80460
34667b682092M14122N94637P11610O70222N24857M41088M99903N91429N29271
34658B295047K26593k57178p73257j134429j175899q69568l84726K9209K38857
34649a805351K78349K29672J26527q572j09042j09053j8539R6885K02519L16044
$$ y = [-1414171, -617850, 134775, 734848, 1142535, 1350781, 1363652, 1206315, 946463, 691640, 546359, 556798, 692391, 878305, 1039519, 1119274, 1086924, 964743, 845888, 842842, 983108, 1167950, 1265820, 1245419, 1186569, 1153535, 1089747, 860923, 387605, -279771, -993771, -1586421, -1928406, -1966428, -1740994, -1370603, -1010055, -814984, -917873, -1385896, -2160075, -3036493, -3746359, -4102733, -4101091, -3886796, -3623832, -3390760, -3182160, -2962552, -2682092, -2267970, -1673333, -961723, -291501, 233356, 674444, 1174347, 1765776, 2295047, 2521640, 2264462, 1491205, 356776, -819123, -1688691, -2073417, -2044208, -1805351, -1527002, -1297330, -1170803, -1179375, -1288417, -1397470, -1416009, -1319124, -1116605, -800561]
34639h00561M39298N20567N25439N18805O10486P96360R05825P64635L92859j3826
34629D659887k91066m30340m99338n31688n44092n84034o72778p33704o60964
34620b88117m57231k43205j29323j21478j41789r5264O7278K95006M56791M72227
34610a85105M07903L77285L65329K47072j4407k90893m44650m73921m61292m63104
34600i35783n06952o13261p32909p23951m93024j41905J06387J21269m8753k70067
34590d238949m23272m23878k43475N0863L28918N00921N69211N82656N81246N81735
34580b134024N63964M62449K27378q2090l11813l52182k33140n8069J15768K90748
34570a511011M56208N66002N98046N93172O07096O39878O35562N46275L76122
$$ y = [-800561, -361263, 159304, 684743, 1203548, 1814034, 2610394, 3516219, 4280854, 4673713, 4659887, 4368821, 3938481, 3439143, 2907455, 2363363, 1779329, 1106551, 372847, -288117, -745348, -988553, -1117876, -1239354, -1381143, -1476407, -1409129, -1114123, -657332, -185105, 222798, 600083, 965412, 1212484, 1198077, 907184, 462534, -11387, -472679, -935783, -1442735, -2055996, -2788905, -3512856, -4005880, -4147785, -4041398, -3920129, -3968882, -4238949, -4662221, -5086099, -5329574, -5278711, -4949793, -4448872, -3879661, -3297005, -2715759, -2134024, -1570060, -1107611, -880233, -962323, -1274136, -1626318, -1859458, -1917527, -1801759, -1511011, -1054803, -488801, 109245, 702417, 1309513, 1949391, 2584953, 3131228, 3507350]
34561C507350J63485n1111k24672l10770k98773k43213k12825k16323k25719k61889
34551A625540l73098n04280m87079k40494Q6416K73830K91943K89369L42690L54660
34541A659497K29329J9863j65381l02892m13681m61437l96568k61944j55447j01546
34531c50207m1167O4341K00454L60727N46602O90992O72835M52109J29592j65517
34521B560761l89820n48977o16753n68159m59756l96619m20505m87738n49994
34512a877560n87211n51687l61651o607L83492O34865O84274N97694M58407K99824
34502c26160J51707P8336J16150K02173K20343J25184j1509q4352o1623L87L2646
34491D43282K6985L3637Q6037J31755O1902j62138m17898m99293l12296K0090
$$ y = [3507350, 3670835, 3619724, 3395052, 3084282, 2785509, 2542296, 2329471, 2113148, 1887429, 1625540, 1252442, 748162, 261083, 20589, 107005, 380835, 672778, 962147, 1304837, 1659497, 1888826, 1908689, 1743308, 1440416, 1026735, 565298, 168730, -93214, -248661, -350207, -391374, -327033, -126579, 234148, 780750, 1471742, 2144577, 2596686, 2726278, 2560761, 2170941, 1621964, 1005211, 437052, -22704, -419323, -839828, -1327566, -1877560, -2464771, -3016458, -3378109, -3384716, -3001224, -2366359, -1682085, -1084391, -625984, -326160, -174453, -96117, 20033, 222206, 442549, 567733, 556224, 471872, 410249, 410636, 443282, 470267, 503904, 589941, 721696, 783598, 621460, 203562, -295731, -608027, -587937]
34481e87937K68533L05766J89640N2923n2136j80477l84746o13641p36351o58216
34471b396642l97435n8163K40163M02320L78343K04063J4582m3046N7277K00505
34461a398033K63564K40190K05629J88015J28123l1829k65874m92915o57791p50501
34451b571422p53742o12599k89093J56085N69636Q22274R13326R35815R45938
34442A16218R06760P66553N39802K75148j0612l04504n27580n73874m37737k43377
34432E06797j19269q9961j20405k07848l62484n22191n62708m11861j15391K18892
34422a786429N03518O88208P44028O73369N21622L50289K03356J12238J08332
34413B118531J92036K93399L04505J73874m0846k20348k74493j92573l3657J16703
$$ y = [-587937, -319404, -13638, 176002, 228925, 176789, -3688, -388434, -1002075, -1738426, -2396642, -2794077, -2852240, -2612077, -2209757, -1831414, -1627351, -1612769, -1655815, -1598538, -1398033, -1134469, -894279, -688650, -500635, -372512, -404341, -670215, -1163130, -1820921, -2571422, -3325164, -3937763, -4226856, -4070771, -3501135, -2678861, -1765535, -829720, 116218, 1022978, 1789531, 2329333, 2604481, 2593869, 2289365, 1761785, 1187911, 750174, 506797, 387528, 297567, 177162, -30686, -393170, -915361, -1478069, -1889930, -2005321, -1786429, -1282911, -594703, 149325, 822694, 1344316, 1694605, 1897961, 2010199, 2118531, 2310567, 2603966, 2908471, 3082345, 3041499, 2821151, 2546658, 2354085, 2320428, 2437131]
34403B437131J95575J83868P7978j42210m73899q14631r91349r24485p29309n85897
34393a767228n26062m30887k42368p6427p1420k00214l13121l24748k73171k13827
34383d439473j46517o2064J4015O1115J02034J69421K59846L39370L72083L38663
34373b991507K59761K04981K35816L27419L90414L84669L62441L76795M01868
34364d7343L81517L08617K11561J08506L0812M9268K00150L99475M99955M35694
34354B578212K62674P1961p2859j24291o5020M1239Q0939O411j31639k90485n04002
34343A853140p91928j056483j146493j010801p34057m35967j92769m9235l0509
34334c595102j00047j43470m7938J88287M37230N41884M44312K25890L0307m8589
$$ y = [2437131, 2632706, 2816574, 2894552, 2752342, 2278443, 1463812, 472463, -452022, -1181331, -1767228, -2293290, -2724177, -2966545, -3042972, -3114392, -3314606, -3627727, -3952475, -4225646, -4439473, -4585990, -4648054, -4634039, -4572924, -4470890, -4301469, -4041623, -3702253, -3330170, -2991507, -2731746, -2526765, -2290949, -1963530, -1573116, -1188447, -826006, -449211, -47343, 334174, 642791, 854352, 962858, 993670, 1042938, 1243088, 1642563, 2142518, 2578212, 2840886, 2912847, 2839988, 2715697, 2650677, 2691916, 2772855, 2779266, 2647627, 2357142, 1853140, 1061212, 4729, -1141764, -2152565, -2886622, -3322589, -3515358, -3564593, -3595102, -3695149, -3838619, -3886557, -3698270, -3261040, -2719156, -2274844, -2048954, -2018647, -2067236]
34324b067236q809J02176K38759L65907M51652M73610M20037K76502L8177k45608
34314D5167m68500n48700n08258m43808m24446m44577m64021m47812l57432j53395
34304d215782J48391M37385N71033M96710L00346J26299N8714Q3058J34673J50524
34294a708649Q4860o7365k27559k53068o1861K60543N25030O20577N95658N53850
34284C22016N20670M43684K83510O3228j50365k80113k75743j59681k7585L2888
34274G72509K6494L5932J28115K83943M01913L62523J27093j98387m33627m96240
34264A010268m69191m53626m03625j89623J92123N63560P31209O39043L49554
34255A969692l6882l99818o08728n90180l73969m8791K97726N78787P04840O33255
$$ y = [-2067236, -2076045, -1973869, -1735110, -1369203, -917551, -443941, -23904, 252598, 290775, 45167, -423333, -972033, -1480291, -1924099, -2348545, -2793122, -3257143, -3704955, -4062387, -4215782, -4067391, -3630006, -3058973, -2562263, -2261917, -2135618, -2076904, -1993846, -1859173, -1708649, -1623789, -1691154, -1918713, -2171781, -2233642, -1973099, -1448069, -827492, -231834, 322016, 842686, 1286370, 1569880, 1633108, 1482743, 1202630, 926887, 767206, 739621, 772509, 799003, 834935, 963050, 1246993, 1648906, 2011429, 2138522, 1940135, 1506508, 1010268, 541077, 87451, -316174, -505797, -313674, 249886, 981095, 1620138, 1969692, 1932810, 1532992, 924264, 334084, -39885, -88676, 209050, 787837, 1492677, 2125932]
34245B125932M02223Q6903k51286n52806p49780q19562q20004q22451q27844p86588
34235c015263o72133m86528k23285J05284M08633N56098N00164L26280J68005
34226b332745J04289J40637K37526L23332L10451J48844j18413l61903m47332
34217a995314l37378j29285K2101L8817k6142p4492p6397p3309r2813j07388p6651
34206b928251R636J39100K95010M53960N86864O72804O98699O47737N10582L10099
34196A396240R4038r8691k46572l27071l20381k38902j32815o2306p3418j77977
34186a87855l16802l58563k06096O5795K29324J13872k11665m95993n39239l58388
34176b265610j45935r7227k65397n41546p55097q06763p25910o13832n39183m84340
$$ y = [2125932, 2528155, 2615058, 2363772, 1810966, 1061186, 241624, -578380, -1400831, -2228675, -3015263, -3687396, -4173924, -4397209, -4291925, -3883292, -3327194, -2827030, -2500750, -2332745, -2228456, -2087819, -1850293, -1526961, -1216510, -1067666, -1186079, -1547982, -1995314, -2332692, -2461977, -2439876, -2401059, -2427201, -2501693, -2578090, -2651399, -2744212, -2851600, -2928251, -2918615, -2779515, -2484505, -2030545, -1443681, -770877, -72178, 575559, 1086141, 1396240, 1490278, 1391587, 1145015, 817944, 497563, 258661, 125846, 63540, -9878, -187855, -504657, -863220, -1069316, -1003521, -774197, -660325, -871990, -1367983, -1907222, -2265610, -2411545, -2508772, -2774169, -3315715, -4070812, -4877575, -5603485, -6217317, -6756500, -7240840]
34166g240840l79135j80085P7821L04307M33057M78375N09193N70798O37263O35016
34156d154230N13278L14306J85423K80965N99995R31163J015506P84464M09778
34147H80648J16391j5232n8187j07818j77757k00605j05350R2706K76671L35316
34137A036783K89386K62392L11021L47153K68092J02576m1484j34347k41596l83978
34127A815998m56417l22588L4261M63591P34108O89203L67739j9027k59451k96153
34117B751264k03944o0196J01071K33699K75818K29433J69969J34048N5763j34880
34107C552045l96767o18330p38763p66960p06864n43451l10155j02783K887Q047
34097f21094n0719j49202k45962k52623j06499J23892K66712K19820P3788K2733
$$ y = [-7240840, -7619975, -7800060, -7722239, -7417932, -6984875, -6506500, -5997307, -5426509, -4789246, -4154230, -3640952, -3326646, -3141223, -2860258, -2260263, -1329100, -313594, 470870, 880648, 997039, 981807, 923620, 815802, 638045, 437440, 332090, 424796, 701467, 1036783, 1326169, 1588561, 1899582, 2246735, 2514827, 2617403, 2575919, 2441572, 2199976, 1815998, 1359581, 1036993, 1071254, 1534845, 2268953, 2958156, 3325895, 3306868, 3047417, 2751264, 2547320, 2487124, 2588195, 2821894, 3097712, 3327145, 3497114, 3631162, 3686925, 3552045, 3155278, 2536948, 1798185, 1031225, 324361, -219090, -529245, -632028, -629141, -621094, -671813, -821015, -1066977, -1319600, -1426099, -1302207, -1035495, -815675, -741887, -719154]
34087g19154J49732L29630L59760J67231j36065l87410n15993n38219m62771k69006
34077b022265J3966K70048L90760L88889L67601L73547L31468J56667r9390k67983
34067i6692k37120p5522L9570Q416r8983j40936p2365J6648L4862J7031O4993
34056e40098J78871K29009J34968O183K5662K18097M14287M47799L11054R9855
34046A525687j14598l06164m46782n15492n40489n75138o26114o35283n36369
34037b770742l20880o4482J05000J05439k339m6973Q3577L22956N03804N21123
34027a563517L86572J73555k2571j07733o9545l6435j67595m54964o98793p08433
34017c269459m74385j23389K24308N03502O67247O78499N40749L06431N4873j39755
$$ y = [-719154, -569422, -239792, 119968, 287199, 151134, -236276, -752269, -1290488, -1753259, -2022265, -2008299, -1738251, -1347491, -958602, -591001, -217454, 114014, 270681, 171291, -96692, -333812, -409334, -369764, -361348, -460331, -601267, -673632, -656984, -622122, -605091, -540098, -361227, -132218, 2750, 8933, 34595, 252692, 666979, 1114778, 1425832, 1525687, 1411089, 1104925, 658143, 142651, -397838, -972976, -1599090, -2234373, -2770742, -3091622, -3156104, -3051104, -2945665, -2948004, -2994977, -2911400, -2588444, -2084640, -1563517, -1176945, -1003390, -1025961, -1133694, -1203239, -1239674, -1407269, -1862233, -2561026, -3269459, -3743844, -3867233, -3642925, -3139423, -2472176, -1793677, -1252928, -946497, -891624, -1031379]
34007a031379k52868l33708m46093n68843o03086n07776l79343l51176m46810
33998d921082n73908o28993n59544l54996m3943K97330N75655P25507P13646N41764
33988d228564K92473J34992K02145M49762O91062P81044P25598O13032N04541
33979A66085M19746L75963L87510M33876M57957M02940K53696N2085j34549k76146
33969B539163m01783n38821o50992o79606o37075o03119o11440n84999m12509
33960b581181o7286L61412P26410R02309Q48888O28267L45999O3580k12547m61025
33950E54826o18477o50316o03305n38582m34102k04171J81046O26901R71958J101736
33940C87514J013274P89231N15354K21850r2126l91030n92613o31929n09378k73592
$$ y = [-1031379, -1284247, -1617955, -2064048, -2632891, -3235977, -3743753, -4123096, -4474272, -4921082, -5494990, -6123983, -6683527, -7038523, -7082466, -6785136, -6209481, -5483974, -4770328, -4228564, -3936091, -3801099, -3598954, -3149192, -2458130, -1677086, -951488, -338456, 166085, 585831, 961794, 1349304, 1783180, 2241137, 2644077, 2897773, 2949858, 2815309, 2539163, 2137380, 1598559, 947567, 267961, -369114, -972233, -1583673, -2168672, -2581181, -2648467, -2287055, -1560645, -658336, 190552, 818819, 1164818, 1228398, 1015851, 554826, -63651, -713967, -1317272, -1855854, -2289956, -2494127, -2313081, -1686180, -714222, 387514, 1400788, 2190019, 2705373, 2927223, 2835097, 2444067, 1851454, 1219525, 710147, 436555]
33930D36555K039K16643K77903J90352P2459L3767N5500L8283n5690j63971k13581
33919H90259j89962j17848l2701J4308k9398j73062l71541n60241o79535o84296
33909a934017n77218m23086k75074r6999J65561M30908M96248K64832j04754l39359
33899b392958l02315n9157K46363N00343O35118O33134N32822L82321J84643p1216
33889B89098l37837n24776n88767n62329m94107m07073l09475j90974j0231K48248
33879b888223M96124N90893M90762L02418J50322O2677J9094L4041J23449K35379
33869c83064K88206K59493J86036J02035K9874K325K9496O0781M0437j4562n3556
33858E47501q8909j75102k96475l62937l35097k73826k35957j96594j18885l3022
$$ y = [436555, 438594, 655237, 933140, 1123492, 1195951, 1229718, 1285218, 1323501, 1267811, 1103840, 890259, 700297, 582449, 549748, 564056, 534658, 361596, -9945, -570186, -1249721, -1934017, -2511235, -2934321, -3209395, -3306394, -3140833, -2709925, -2213677, -1948845, -2053599, -2392958, -2695273, -2754430, -2508067, -2007724, -1372606, -739472, -206650, 175671, 360314, 289098, -48739, -573515, -1162282, -1724611, -2218718, -2625791, -2935266, -3126240, -3136471, -2888223, -2392099, -1801206, -1310444, -1008026, -857704, -795027, -775933, -741892, -618443, -383064, -94858, 164635, 350671, 452706, 482580, 484905, 514401, 575182, 615619, 601057, 547501, 458592, 283490, -12985, -375922, -711019, -984845, -1220802, -1417396, -1536281, -1569303]
33848a569303J5159M7402J20250K32751L18638L17367K20333P1203m7312o1195
33838c34707J6247Q3940Q0280Q0162K01245M30539O16541O40554N34170M09841
33828B758812L28399K63653J60184q238k23438m43696o37219p89705q75717q53007
33818c19972p16552n28824l44086j24418J93259N43047P28939O21528L01056l5630
33808C18347k57556l43829l10113j82385k8996O8746J02913J42353K22361K70279
33798B120J75123q5846m13583o66941p55923o73339m77900k67875j45291j56419
33788c465874k45763k94683k37256j28235o9354q3748j06520r1961o6541n4352
33778d844287j3727R6986K26468K66522J75953K4740q1897q7885m033J14412K04441
$$ y = [-1569303, -1554144, -1506742, -1386492, -1153741, -835103, -517736, -297403, -226200, -273512, -334707, -318460, -234520, -154240, -74078, 127167, 557706, 1174247, 1814801, 2348971, 2758812, 3087211, 3350864, 3511048, 3502810, 3279372, 2835676, 2198457, 1408752, 533035, -319972, -1036524, -1565348, -1909434, -2033852, -1840593, -1297546, -568607, 52921, 353977, 318347, 60791, -283038, -593151, -775536, -804532, -735786, -632873, -490520, -268159, 2120, 177243, 91397, -322186, -989127, -1745050, -2418389, -2896289, -3164164, -3309455, -3465874, -3711637, -4006320, -4243576, -4371811, -4441165, -4524913, -4631433, -4723394, -4789935, -4844287, -4858014, -4761028, -4534560, -4268038, -4092085, -4067345, -4149242, -4237127, -4241160, -4126748, -3922307]
33767c922307K45037K76518L45865M39651N03794N18884N08043M71609L73873
33758b39033K16330P0914Q05j8873o2735j60144k73858l56247l91596l92178l82993
33747a989608l82631l69983k77641n3825K63943N64443P61090Q54985Q93917Q92995
33737A157685Q16388O31004L61564Q6009j24141k59791l68525m89041n93260o00414
33727F17478m55938k06558m339j7748k92965o74322q87362p52859l43505P6920
33717b941198K71409J87906o2988l28717m97835n15704l80281j37673J36710L68051
33707c900320N07837N54271N55863N67519N78646N05673K91305J567k14516k63049
33697h15204j69415r214J69904L35420M32882M18294L16586K11465J80588K54935
$$ y = [-3922307, -3677270, -3400752, -3054887, -2615236, -2111442, -1592558, -1084515, -612906, -239033, -22703, 48211, 49016, 30143, -32592, -192736, -466594, -822841, -1214437, -1606615, -1989608, -2372239, -2742222, -3019863, -3073688, -2809745, -2245302, -1484212, -629227, 264690, 1157685, 1974073, 2605077, 2966641, 3052650, 2928509, 2668718, 2300193, 1811152, 1217892, 617478, 161540, -45018, -49357, -67105, -360070, -1034392, -1921754, -2674613, -3018118, -2941198, -2669789, -2481883, -2544871, -2873588, -3371423, -3887127, -4267408, -4405081, -4268371, -3900320, -3392483, -2838212, -2282349, -1714830, -1136184, -630511, -339206, -337639, -552155, -815204, -984619, -993833, -823929, -488509, -55627, 362667, 679253, 890718, 1071306, 1326241]
33687A326241M10803N63995O00469M72171K59323Q8041j0725j07988k49738l96908
33677B955684n06200n86827o31376n68277l63133j22327p243n7288j68898k38432
33667b94317k48699k15686j43082o8574q2078k30462m31555n37856m84854l49588
33657c086751k67880l12911m47454n72435o11680n50246m06376k06164r243Q6834
33647f384306L9250n0090j4477J83798M03855N03078M97602M91334N02296M46238
33637c381422K81586R6721L4888J68133M45179P25114Q62258Q00772O04438L80361
33627A018028J79878p572j87973l37244m35335m77435m47567l27083j40924M5687
33617a117540J90011K93587L52967L39835K55118J52849P0349k1347j42360k14014
$$ y = [1326241, 1737044, 2301039, 2901508, 3373679, 3633002, 3721043, 3710318, 3602330, 3352592, 2955684, 2449484, 1862657, 1231281, 663004, 299871, 177544, 170301, 113013, -55885, -294317, -543016, -758702, -901784, -970358, -1052436, -1282898, -1714453, -2252309, -2737163, -3086751, -3354631, -3667542, -4114996, -4687431, -5299111, -5849357, -6255733, -6461897, -6471140, -6384306, -6345056, -6395146, -6409623, -6225825, -5821970, -5318892, -4821290, -4329956, -3827660, -3381422, -3099836, -3003115, -2968227, -2800094, -2354915, -1629801, -767543, 33229, 637667, 1018028, 1197906, 1190334, 1002361, 665117, 229782, -247653, -695220, -1022303, -1163227, -1117540, -927529, -633942, -280975, 58860, 313978, 466827, 537176, 515829, 373469, 159455]
33607A59455j24465J08993L13806L35634J97472M8895j0047m136o71k0509n5359
33596I49068j20832k36088l62477m10739l18884r5116K13479N51242Q43524J010458
33586B023635J031777R65681Q64042O99338M22912O5301k86881n94921q64866
33577D326018j037332r85533o84398l10171q5295n1286o8675k3599N0997P1072
33567A201798L3238m780l2103j07711k74630m92360o68876p37331o86136n32996
33557b301887l04645n4616J28730J78010J23926Q4843J48756K76395L47382K94098
33547a079008J59413K6992n9868q9822l8417J10670K99387M03106L40849J58155
33537B31457l5792k04586m07732o65495q51151p90510m76737j23667M1942J7291
$$ y = [159455, 34990, 143983, 457789, 793423, 990895, 1039790, 1029743, 1025607, 1024936, 1004427, 949068, 828236, 592148, 229671, -181068, -499952, -595068, -381589, 169653, 1013177, 2023635, 3055412, 4021093, 4885135, 5584473, 6007385, 6072686, 5785805, 5190884, 4326018, 3288686, 2303153, 1618755, 1308584, 1223289, 1172003, 1103328, 1079729, 1130726, 1201798, 1235036, 1230256, 1198153, 1090442, 815812, 323452, -345424, -1082755, -1768891, -2301887, -2606532, -2661148, -2532418, -2354408, -2230482, -2145639, -1996883, -1720488, -1373106, -1079008, -919595, -892603, -952471, -1042293, -1080710, -970040, -670653, -267547, 73302, 231457, 195665, -8921, -416653, -1082148, -1933299, -2723809, -3200546, -3324213, -3282271, -3264980]
33527c264980P731J80731M79598O94837O85423M99694K90361J43869J2461j88998
33517d59273m39472n94712n32202k97473p2384O779l3154p9568q5734r6019j38823
33506b822035j66898j35853q9559j05641j72707j90504j09583j0802Q97n4211
33496c856896m8426R3385L08454M80949N58180N51980M68874K94247M0288k30448
33486a339413m38656n29255m87511l46847j90631j20835j94934l76437n38621
33477d563140n26549k54237K21089P22401J077556J231544J233736J138464R55862
33468A236726O95975M12072J71083l83j22429k28237l33288m19314m41629l79865
33458E90711k93538k87582l86958m74099m00381j51718J40267L45013M36849M45609
$$ y = [-3264980, -3257249, -3076518, -2596920, -1902083, -1216660, -716966, -426605, -282736, -270275, -459273, -898745, -1493457, -2025659, -2323132, -2395516, -2388737, -2421891, -2501459, -2587193, -2683212, -2822035, -2988933, -3124786, -3214345, -3319986, -3492693, -3683197, -3792780, -3803582, -3802685, -3856896, -3905322, -3811937, -3503483, -3022534, -2464354, -1912374, -1443500, -1149253, -1108965, -1339413, -1778069, -2307324, -2794835, -3141682, -3332313, -3453148, -3648082, -4024519, -4563140, -5089689, -5343926, -5122837, -4400436, -3322880, -2091336, -857600, 280864, 1236726, 1932701, 2344773, 2515856, 2515473, 2393044, 2164807, 1831519, 1412205, 970576, 590711, 297173, 9591, -377367, -851466, -1251847, -1403565, -1263298, -918285, -481436, -35827]
33448c5827L72041K05877k399j51062j81836j34897r5576j01875j15117p2331
33438c13002M3865J87938K96717L40940L25338K53455J24801k5743j22314j17279
33428I94716n3793k5796p6383j63303k25133k50211k70296l11928l68195m00066
33418a150388l56683k17905l1051J16735J80730J94843K12407K40388K59852K82001
33408b69071L37167M18951M87186N28059N65341O00455N85676M82083L13669J40512
33398D190028M483p9077j13406j42880k53181m89463p72286r41607q99858o84995
33388a82242m03684j39734N4805J37102J06577M6144O5229J77733K74915K49859
33378C86704J23407R262l2062n3518j21924k05822k11717j17577j2403K0549J8647
$$ y = [-35827, 336214, 542091, 539692, 388630, 206794, 71897, -23679, -125554, -240671, -313002, -269137, -81199, 215518, 556458, 881796, 1135251, 1260052, 1234309, 1111995, 994716, 940923, 915127, 838744, 675441, 450308, 200097, -70199, -382127, -750322, -1150388, -1507071, -1724976, -1756027, -1639292, -1458562, -1263719, -1051312, -810924, -551072, -269071, 68096, 487047, 974233, 1502292, 2067633, 2668088, 3253764, 3735847, 4049516, 4190028, 4194511, 4115434, 4002028, 3859148, 3605967, 3116504, 2344218, 1402611, 502753, -182242, -585926, -725660, -670855, -533753, -427176, -381032, -315803, -138070, 136845, 386704, 510111, 519373, 487311, 433793, 311869, 106047, -105670, -223247, -235650, -215101, -196454]
33367a96454Q8482K46124L59751K82208K0529k58211l85346l27044j66187L201
33357c32947J27588J71078J08281l6169j79055k44744k27260j66472q4878J7067
33347h47511J14419J51427R6955j5134j10591j28242n5980N8843J34129J20349
$$ y = [-196454, -107972, 138152, 497903, 780111, 800640, 542429, 157083, -169961, -336148, -332947, -205359, -34281, 74000, 37831, -141224, -385968, -613228, -779700, -864578, -847511, -733092, -581665, -484710, -499844, -610435, -738677, -794657, -735814, -601685, -481336]
$$ [...]
##END NTUPLES=NMR SPECTRUM
##END=
