##TITLE=31Pdec_IPACAT-33-5
  DMF-d7
  24 sc
 5.10.2023
##JCAMPDX= 6.0         $$ Bruker NMR JCAMP-DX V2.0
##DATA TYPE= NMR SPECTRUM
##DATA CLASS= NTUPLES
##ORIGIN= UXNMR, Bruker Analytische Messtechnik GmbH
##OWNER= root
$$ XWIN-NMR		Version 3.5
$$ Thu Oct  5 14:19:49 2023 Russian Standard Time (UT+4h)  she@DPX200
##.OBSERVE FREQUENCY= 81.013821
##.OBSERVE NUCLEUS= ^31P
##.ACQUISITION MODE= SIMULTANEOUS
##.ACQUISITION SCHEME= undefined
##.AVERAGES= 24
##.DIGITISER RES= 16
##SPECTROMETER/DATA SYSTEM= spect
##.PULSE SEQUENCE= zgpg30
##.SOLVENT NAME= CDCl3
##.SHIFT REFERENCE= (INTERNAL, CDCl3, 0, 248.564)
##AUDIT TRAIL= $$ (NUMBER, WHEN, WHO, WHERE, WHAT)
$$ ##TITLE= Audit trail, XWIN-NMR		Version 3.5
$$ ##JCAMPDX= 5.01
$$ ##ORIGIN= Bruker BioSpin GmbH
$$ ##OWNER= she
$$ F:/spectra/data/she/nmr/P31/1/pdata/1/auditp.txt
$$ ##AUDIT TRAIL=  $$ (NUMBER, WHEN, WHO, WHERE, WHAT)
(   1,<2023-10-05 14:17:30.78 +0400>,<she>,<DPX200>,
      <created by zg, POWCHK disabled, PULCHK disabled
       configuration hash MD5:
       00 E9 B6 7A A2 85 ED C7 34 08 36 98 17 FE 4E 26
       data hash MD5: 32K
       26 0F E8 EE AF 6B 9E A2 45 AB 3D 44 D8 E2 C6 00>)
(   2,<2023-10-05 14:17:33.14 +0400>,<she>,<DPX200>,
      <Start of raw data processing
       efp BC_mod = 2 LB = 5 FT_mod = 6 PKNL = 1 PHC0 = -10676.15 PHC1 = 66.68633 SI = 64K 
       data hash MD5: 64K
       11 9E 0B 54 A2 EA 65 65 F7 9E 44 45 9C A1 68 10>)
(   3,<2023-10-05 14:17:55.54 +0400>,<she>,<DPX200>,
      <pk PHC0 = 7.824598 PHC1 = 0 
       data hash MD5: 64K
       20 04 BE 39 8B 3D 55 4E A7 27 73 F3 3F B8 A8 04>)
$$ ##END=
$$ 
$$ hash MD5
$$ 3F FB 17 34 52 64 00 96 B5 54 DC 25 03 B6 45 B5
##$RELAX= 
##$RELAX= 
##$RELAX= 
##$RELAX= 
##$RELAX= 
##$RELAX= 
##$RELAX= 
##$RELAX= 
##$RELAX= 
$$ Bruker specific parameters
$$ --------------------------
##$DU= <F:/spectra>
##$EXPNO= 1
##$NAME= <P31>
##$PROCNO= 1
##$TYPE= <nmr>
##$USER= <she>
##$AMP= (0..31)
100 100 100 100 100 100 100 100 100 100 100 100 100 100 100 100 100 100 
100 100 100 100 100 100 100 100 100 100 100 100 100 100 
##$AQSEQ= 0
##$AQ_mod= 1
##$AUNM= <au_zg>
##$AUTOPOS= <>
##$BF1= 81.014009
##$BF2= 200.13
##$BF3= 200.13
##$BF4= 200.13
##$BF5= 200.13
##$BF6= 200.13
##$BF7= 200.13
##$BF8= 200.13
##$BYTORDA= 1
##$CFDGTYP= 0
##$CFRGTYP= 5
##$CHEMSTR= <none>
##$CNST= (0..31)
1 1 145 1 1 1 1 1 1 1 1 1 1 1 1 1 1 1 1 1 1 1 1 1 1 1 1 1 1 1 1 1 
##$CPDPRG= <waltz16>
##$CPDPRG1= <>
##$CPDPRG2= <waltz16>
##$CPDPRG3= <>
##$CPDPRG4= <mlev>
##$CPDPRG5= <mlev>
##$CPDPRG6= <mlev>
##$CPDPRG7= <mlev>
##$CPDPRG8= <mlev>
##$CPDPRGB= <>
##$CPDPRGT= <>
##$D= (0..31)
0 1 0 0 0 0 0 0 0 0 0 0.03 2e-05 3e-06 0 0 0 0 0 0 0 0 0 0 0 0 0 0 0 0 
0 0 
##$DATE= 1696501050
##$DBL= (0..7)
120 120 120 11 120 120 24 19 
##$DBP= (0..7)
150 150 150 150 150 150 150 150 
##$DBP07= 0
##$DBPNAM0= <>
##$DBPNAM1= <>
##$DBPNAM2= <>
##$DBPNAM3= <>
##$DBPNAM4= <>
##$DBPNAM5= <>
##$DBPNAM6= <>
##$DBPNAM7= <>
##$DBPOAL= (0..7)
0.5 0.5 0.5 0.5 0.5 0.5 0.5 0.5 
##$DBPOFFS= (0..7)
$$ [...]
##$SUBNAM2= <"">
##$SUBNAM3= <"">
##$SUBNAM4= <"">
##$SUBNAM5= <"">
##$SUBNAM6= <"">
##$SUBNAM7= <"">
##$SUBNAM8= <"">
##$SUBNAM9= <"">
##$SW= 501.771253377433
##$SWIBOX= (0..15)
0 1 3 0 0 0 0 0 0 0 0 0 0 0 0 0 
##$SW_h= 40650.406504065
##$TD= 32768
##$TD0= 1
##$TE= 0
##$TE2= 300
##$TE3= 300
##$TEG= 300
##$TL= (0..7)
0 120 53 12 22 120 120 120 
##$TP= (0..7)
150 150 150 150 150 150 150 150 
##$TP07= 0
##$TPNAME0= <>
##$TPNAME1= <>
##$TPNAME2= <>
##$TPNAME3= <>
##$TPNAME4= <>
##$TPNAME5= <>
##$TPNAME6= <>
##$TPNAME7= <>
##$TPOAL= (0..7)
0.5 0.5 0.5 0.5 0.5 0.5 0.5 0.5 
##$TPOFFS= (0..7)
0 0 0 0 0 0 0 0 
##$TUNHIN= 0
##$TUNHOUT= 0
##$TUNXOUT= 0
##$USERA1= <user>
##$USERA2= <user>
##$USERA3= <user>
##$USERA4= <user>
##$USERA5= <user>
##$V9= 5
##$VALIST= <valist>
##$VCLIST= <CCCCCCCCCCCCCCC>
##$VD= 0
##$VDLIST= <DDDDDDDDDDDDDDD>
##$VPLIST= <PPPPPPPPPPPPPPP>
##$VTLIST= <TTTTTTTTTTTTTTT>
##$WBST= 1024
##$WBSW= 4
##$XGAIN= (0..3)
0 0 0 0 
##$XL= 0
##$YL= 0
##$YMAX_a= 13324
##$YMIN_a= -4535
##$ZGOPTNS= <>
##$ZL1= 120
##$ZL2= 120
##$ZL3= 120
##$ZL4= 120
##$ABSF1= 0
##$ABSF2= 0
##$ABSG= 0
##$ABSL= 0
##$ALPHA= 0
##$AQORDER= 0
##$ASSFAC= 0
##$ASSFACI= 0
##$ASSFACX= 0
##$ASSWID= 0
##$AUNMP= <proc_1d>
##$AZFE= 0.1
##$AZFW= 0.5
##$BCFW= 0
##$BC_mod= 2
##$BYTORDP= 0
##$COROFFS= 0
##$CY= -3
##$DATMOD= 1
##$DC= 0
##$DFILT= <>
##$DTYPP= 0
##$F1P= 0
##$F2P= 0
##$FCOR= 1
##$FTSIZE= 65536
##$FT_mod= 6
##$GAMMA= 0
##$GB= 0
##$INTBC= 1
##$INTSCL= 6.047779e-11
##$ISEN= 30
##$LB= 5
##$LEV0= 0
##$LPBIN= 0
##$MAXI= 10000
##$MC2= 0
##$MEAN= 0
##$ME_mod= 0
##$MI= 50
##$NCOEF= 0
##$NC_proc= -10
##$NLEV= 6
##$NOISF1= 182.463
##$NOISF2= 159.3651
##$NSP= 0
##$NTH_PI= 0
##$NZP= 0
##$OFFSET= 248.5645
##$PC= 4
##$PHC0= -10668.33
##$PHC1= 66.68633
##$PH_mod= 1
##$PKNL= yes
##$PPARMOD= 0
##$PSCAL= 0
##$PSIGN= 0
##$REVERSE= no
##$SF= 81.0140089999694
##$SI= 65536
##$SIGF1= 159.3651
##$SIGF2= -187.1042
##$SINO= 113.3802
##$SIOLD= 16384
##$SREGLST= <1H.CDCl3>
##$SSB= 0
##$STSI= 65536
##$STSR= 0
##$SW_p= 40650.406504065
##$SYMM= 0
##$S_DEV= 0
##$TDeff= 32768
##$TDoff= 0
##$TI= <>
##$TILT= no
##$TM1= 0
##$TM2= 0
##$TOPLEV= 0
##$USERP1= <user>
##$USERP2= <user>
##$USERP3= <user>
##$USERP4= <user>
##$USERP5= <user>
##$WDW= 1
##$XDIM= 65536
##$YMAX_p= 329062412
##$YMIN_p= -118422160
$$ End of Bruker specific parameters
$$ ---------------------------------
##NTUPLES= NMR SPECTRUM
##VAR_NAME=  FREQUENCY,     SPECTRUM/REAL,   SPECTRUM/IMAG
##SYMBOL=    X,             R,               I
##VAR_TYPE=  INDEPENDENT,   DEPENDENT,       DEPENDENT
##VAR_FORM=  AFFN,          ASDF,            ASDF
##VAR_DIM=   65536,         65536,           65536
##UNITS=     HZ,            ARBITRARY UNITS, ARBITRARY UNITS
##FACTOR=    0.620285442955139, 1,           1
##FIRST=     20137.2065510682, 0,            0
##LAST=      -20513.1999529968, 0,           0
##MIN=       -20513.1999529968, -118422160,  0
##MAX=       20137.2065510682, 329062412,    0
$$ Real data points
##PAGE= N=1
##DATA TABLE= (X++(R..R)), XYDATA
$$ [...]
33590A1033327R12595Q92349R79015Q77492N85304L26765K75674L49399K19808
33581A6451728l78274j214883j562830q99103L92894J294558J195658M29138k91889
33572A5416997o41027o93391n05974p8679L62790M00127j91575j239775k322100
33563A0507393k979642k896359k109852j024248k8448Q46658J702367K326274
33555F344143K313199J647712Q31618L16258Q0079r2093j83115l1538L30515O92686
33545A2249464R60946J221646J514878J721830J736076J644718J653787J832523
33537B4535868J965173J708811R45775l9414p85920j047322r31260p33380p30076
33528B4888255j037936j482164j637490j247908o65079o14562j352299k227166
$$ plain form
33590 11033327 11945922 12838271 13817286 14694778 15280082 15606847 15882521 16231920 16451728
33581 16451728 16073454 14858571 13295741 12396638 12789532 14084090 15279748 15708886 15416997
33572 15416997 14775970 14082579 13576605 13497926 13860716 14260843 14069268 12829493 10507393
33563 10507393 7527751 4631392 2521540 1497292 1468844 2315502 4017869 6344143
33555 6344143 8657342 10305054 11136672 11452930 11533009 11440916 11257801 11226263 11556778 12249464
33545 12249464 13210410 14432056 15946934 17668764 19404840 21049558 22703345 24535868
33537 24535868 26501041 28209852 29155627 29116213 28330293 27282971 26351711 25618331 24888255
33528 24888255 23850319 22368155 20730665 19482757 18817678 18203116 16850817 14623651
33520A4623651k304605j355029l3925Q78320J214505J384526J816229K578573
33512A8802245L450456M129091M275741L529875J780771m63403k197930k698508
33504C0608338k189052j561887j427234j602816j518774q63475K55354J515717
33496B3216171K529243K957569K751959K251068J859163J635841J330301P74500
33488C9305815Q5896m96727q12382p99352m83279k5349L10081L26914L9376l43687
33478C7107306n35236l19200K74755Q70956R04465L2101j509467k960884l563715
33469C0301081l153647k256707j535278j145519p33708m6656O49861Q73938N03828
33460B3457193j23410o18563q56250q90385p49701m29967k1390K62886K38321
$$ plain form
33520 14623651 12319046 10964017 10930092 11808412 13022917 14407443 16223672 18802245
33512 18802245 22252701 26381792 30657533 34187408 35968179 35504776 33306846 30608338
33504 30608338 28419286 26857399 25430165 23827349 22308575 21445100 21700454 23216171
33496 23216171 25745414 28702983 31454942 33706010 35565173 37201014 38531315 39305815
33488 39305815 39391711 38894984 38082602 37283250 36799971 36774622 37084703 37411617 37450993 37107306
33478 37107306 36572070 36252870 36527625 37398581 38303046 38335147 36825680 33864796 30301081
33469 30301081 27147434 24890727 23355449 22209930 21476222 21429566 22079427 22953365 23457193
33460 23457193 23333783 22715220 21858970 20968585 20218884 19788917 19767527 20030413 20268734
33451B0268734n3024l38826m15288m62917r06457j852647k814064l177964k849545
33442G398002k195318j413338l05441J198710K583451L116401K632444J739845
33434A4754756J200703J207171J303359R53041J26287o80175r71137p34021l60853
33425A6799131j85135k20875k95374k30175J32554Q42002J650922K126692K138759
33416B2758501K048968K159298K135837J376964n0191j257510j479122q32387
33408B6860358P8368R70775J896594K654912K744245K017572J006256L88967L77390
33399C8995437P92240J475804K330545L094361L429044L283329K959925K762714
33391E9123399K711666K623476K318636J699371P65340l46503j388588k120548
$$ plain form
33451 20268734 20215710 19876884 19461596 18998679 18092222 16239575 13425511 10247547 7398002
33442 7398002 5202684 3789346 3483905 4682615 7266066 10382467 13014911 14754756
33434 14754756 15955459 17162630 18465989 19419030 19545317 18865142 17894005 17159984 16799131
33425 16799131 16613996 16393121 16097747 15867572 16000126 16842128 18493050 20619742 22758501
33416 22758501 24807469 26966767 29102604 30479568 30429377 29171867 27692745 26860358
33408 26860358 26938726 27909501 29806095 32461007 35205252 37222824 38229080 38618047 38995437
33399 38995437 39787677 41263481 43594026 46688387 50117431 53400760 56360685 59123399
33391 59123399 61835065 64458541 66777177 68476548 69241888 68895385 67506797 65386249
33383F5386249k402151k258084j983209k102728k940975m113823m672496l977424
33375D0935359k359355p61104J88130N61586P03149P35316O16651M44952M27105
33366D1491789N56704N17412M142r23016j861338k396623k375370j932751j373607
33357C1707342j008560r57073j041237r72573p13250n36713o24524p46164n51816
33348B4555432j02821J79619J39175J71245P11646J619884K274144K199888J471993
33339C3220205O04953K04000O07188J623629K607750K965628K643981K055518
33331D6532852J579150J273367J033240Q15704O47156N69057O87989J199518K250979
33322E6589012L763962N413430O813755P804868Q605610R618313J1020834J2611614
$$ plain form
33383 65386249 62984098 60726014 58742805 56640077 53699102 49585279 44912783 40935359
33375 40935359 38576004 37814900 38003030 38564616 39267765 40003081 40619732 41064684 41491789
33366 41491789 42048493 42565905 42570047 41647031 39785693 37389070 35013700 33080949 31707342
33357 31707342 30698782 29741709 28700472 27727899 27014649 26477936 25853412 25107248 24555432
33348 24555432 24452611 24632230 24771405 24942650 25654296 27274180 29548324 31748212 33220205
33339 33220205 33825158 34029158 34636346 36259975 38867725 41833353 44477334 46532852
33331 46532852 48112002 49385369 50418609 51234313 51881469 52450526 53138515 54338033 56589012
33322 56589012 60352974 65766404 72580159 80385027 88990637 98608950 109629784 122241398
33314A22241398J4038050J4902995J4467102J1620409N791294j967645r236780
33307A71856823j3905487j5522203j5017640j3530403j1765911j0089526q643427
33300H3382226p325330n994002m750422l790990l031050k192881j287432o63815
33292E4346304m67076l72204o8010K43368R6728o26169j572236k297699k544657
33283D6738349k233646j471437n88007P0074M54248P61150J038606J050771O19535
33274D6439643j07913q97637j787205k988104m468203n806225o471119o140308
33266A7772929m803165k769853o41993R30771J680608J909017K132426K516996
33258A8727736K736716K423686J695984J151347J311948K126513L068209L660098
$$ plain form
33314 122241398 136279448 151182443 165649545 177269954 183061248 181093603 171856823
33307 171856823 157951336 142429133 127411493 113881090 102115179 92025653 83382226
33300 83382226 76056896 70062894 65312472 61521482 58490432 56297551 55010119 54346304
33292 54346304 53879228 53507024 53439014 53682382 53779110 53152941 51580705 49283006 46738349
33283 46738349 44504703 43033266 42445259 42515333 42969581 43730731 44769337 45820108 46439643
33274 46439643 46331730 45434093 43646888 40658784 36190581 30384356 23913237 17772929
33266 17772929 12969764 10199911 9557918 10488689 12169297 14078314 16210740 18727736
33258 18727736 21464452 23888138 25584122 26735469 28047417 30173930 33242139 36902237
33250C6902237L772473L425323K567680J282879P2432m20870p1749N76476R37453
33241D9044334R49219Q74797P89342N63795K22106m2285k02413m13903o16382
33232E1168610m43768K73758J155268J660939J704618J660949J878225K420517
33224F1479116L205582M105295M895087N384454N704481O246931P169925Q142705
33216A06333576Q793563R325032J0444788J2630590J5592729J8505447K0626043
33209B02251768K1554365K0963815J8341189J3236609N834861k805136j1148638
33202B68228833j7828838k2005164k3416121k2420466j9991458j7337571j5227880
33195A30001335j3646335j2144123j0450720q671442p017037n548862m228662
$$ plain form
33250 36902237 40674710 44100033 46667713 47950592 48023024 47602154 47530405 48106881 49044334
33241 49044334 49993553 50868350 51657692 52221487 52443593 52401308 52198895 51784992 51168610
33232 51168610 50724842 50998600 52153868 53814807 55519425 57180374 59058599 61479116
33224 61479116 64684698 68789993 73685080 79069534 84774015 91020946 98190871 106333576
33216 106333576 115127139 124452171 134896959 147527549 163120278 181625725 202251768
33209 202251768 223806133 244769948 263111137 276347746 282182607 279377471 268228833
33202 268228833 250399995 228394831 204978710 182558244 162566786 145229215 130001335
33195 130001335 116355000 104210877 93760157 85088715 78071678 72522816 68294154
33188F8294154l096760k312916k017101k145398k388868k402072k098287j684855
33180E0147897j385421j250551j305109j664379k251270k533268j937777o26385
33172C7193737M60753N37837k34849j043972j275288q38586J10213J316838K279877
33163C8506560K372397J375037k42228j722318k625216k962388k894698k505735
33155B9301411j875410j231485r16345j147283j774520k312889k315357j760727
33147A5967395j033034n16397k64643m3949M01984J116579J823437K059278J619970
33138B1130620R55923R04005J824193L115990L781776L383980K266105R73579
33130C8336171j94291j052470j375134j159217q41320r19856j361555j607007
$$ plain form
33188 68294154 65197394 62884478 60867377 58721979 56333111 53931039 51832752 50147897
33180 50147897 48762476 47511925 46206816 44542437 42291167 39757899 37820122 37193737
33172 37193737 37654490 38192327 37957478 36913506 35638218 34799632 34909845 36226683 38506560
33163 38506560 40878957 42253994 42011766 40289448 37664232 34701844 31807146 29301411
33155 29301411 27426001 26194516 25278171 24130888 22356368 20043479 17728122 15967395
33147 15967395 14934361 14417964 14153321 14109372 14511356 15627935 17451372 19510650 21130620
33138 21130620 22086543 22990548 24814741 27930731 31712507 35096487 37362592 38336171
33130 38336171 38141880 37089410 35714276 34555059 33713739 32793883 31432328 29825321
33122B9825321j208042k90368O74153J393992J942588K531456L258706M048663
33114D2176469M680116M841777M321030L296040K423302K490275L851991O153215
33106G4234215Q596994J0506599J1648603J2008878J1297763Q871540M406223
33099A41570815j306622o511137r721176j0806269j0740712j0406099r901589
33092H2177211q971933p702848o554675n902056n764865n887453n897136n479249
33084C0016996m607512l583973k709939j967956j176623l77441J65549L57012
33076A6116113M34167O54108R74919J148218J026767O96423L78426K71573M32768
33067B2133482P42815R96236J032967P79581K43663m20403q83856q46925l20712
$$ plain form
33122 29825321 28617279 28326911 29001064 30395056 32337644 34869100 38127806 42176469
33114 42176469 46856585 51698362 56019392 59315432 61738734 64229009 68081000 74234215
33106 74234215 82831209 93337808 104986411 116995289 128293052 137164592 141570815
33099 141570815 140264193 133753056 124031880 113225611 102484899 92078800 82177211
33092 82177211 73205278 65502430 58947755 53045699 47280834 41393381 35496245 30016996
33084 30016996 25409484 21825511 19115572 17147616 15970993 15593552 15759101 16116113
33076 16116113 16550280 17204388 18179307 19327525 20354292 21050715 21429141 21700714 22133482
33067 22133482 22876297 23872533 24905500 25685081 25928744 25508341 24624485 23777560 23456848
33058B3456848L82254R51620J285598J421150J404532J239437Q22171n0465j379693
33049B9533452k623009k938194j983929l36647J069040J797506K058135K179089
33041B8755443K230089K121817J788331J197464L68579n46337j333532j913369
33033C2668485k337826k572413k456558j965571j356899r17503o51602l46619
33025B0063494J10995O22072J051089J361709J520934J386890Q32318j5879p73906
33016B6159716j117171j045366p41273k24765O55451J814726K717636K807930
33008C1026884K140899J404831J241020J607079J826580J222206k44644j847284
33000C8377571k642924k308918j458633j016787j297447j830663k024840j725162
$$ plain form
33058 23456848 23839102 24790722 26076320 27497470 28902002 30141439 30963610 30913145 29533452
33049 29533452 26910443 23972249 21988320 21651673 22720713 24518219 26576354 28755443
33041 28755443 30985532 33107349 34895680 36093144 36461723 35915386 34581854 32668485
33033 32668485 30330659 27758246 25301688 23336117 21979218 21061715 20410113 20063494
33025 20063494 20174489 20796561 21847650 23209359 24730293 26117183 26949501 26933622 26159716
33016 26159716 25042545 23997179 23255906 23031141 23686592 25501318 28218954 31026884
33008 31026884 33167783 34572614 35813634 37420713 39247293 40469499 40224855 38377571
33000 38377571 35734647 33425729 31967096 30950309 29652862 27822199 25797359 24072197
32992B4072197j092194k78794N57788J173914J460203J617439J858938K040112
32984C1409603J841415J231284M57787l62442j304295k257552k850870k905653
32976B5259277k696647k580712k576718k492275k268527j973450j581405r79064
32968H110479j28256R21678K079671L122243L697310L631073L140611K549200
32960B7124009J913049J171488N27899L17195N19053P84846J004003J424680K010690
32951C6796912K071746R47014j070690k837436l386493k657091j279751O3382
32943B8647593J012471J545343J844775K103589K325861K294139J787503Q72843
32935D2434117k6929m14502j44721M19851P37938O00699K94379K81966P74738
$$ plain form
32992 24072197 22980003 22701209 23258997 24432911 25893114 27510553 29369491 31409603
32984 31409603 33251018 34482302 34940089 34577647 33273352 31015800 28164930 25259277
32976 25259277 22562630 19981918 17405200 14912925 12644398 10670948 9089543 8110479
32968 8110479 7982223 8903901 10983572 14105815 17803125 21434198 24574809 27124009
32960 27124009 29037058 30208546 30736445 31053640 31572693 32357539 33361542 34786222 36796912
32951 36796912 38868658 39815672 38744982 35907546 32521053 29863962 28584211 28647593
32943 28647593 29660064 31205407 33050182 35153771 37479632 39773771 41561274 42434117
32935 42434117 42407188 41992686 41847965 42267816 43005754 43606453 43900832 44182798 44957536
32926D4957536J553487K089122J895547R65083j30303p77614r99711j353322k083878
32917D6115947k702943k608744j826368q26587J20889R74967J471043J214777
32909D1932981L35832m09141m24828J16791O48275Q97280R46216Q31532M42416
32900D5317354k04493q42240j156682r92925l75818N20721J367444J737670J302384
32891D6673415P7687j468801k633844k947405k471369j592912n92859M41556J354471
32882C6839939J860435J853589J581975J375357J325700J331830J302456J175762
32874D8647043Q59221K91735n08840j523640k701488l755719m219560l932653
32866C3156099l322819k929836k709391k075522o54480J202745K695412L227658
$$ plain form
32926 44957536 46511023 48600145 50495692 51460775 51330472 50552858 49553147 48199825 46115947
32917 46115947 43413004 40804260 38977892 38151305 38272194 39247161 40718204 41932981
32909 41932981 42268813 41859672 41434844 41551635 42199910 43097190 44043406 44874938 45317354
32900 45317354 45112861 44270621 43113939 42121014 41745196 42265917 43633361 45371031 46673415
32891 46673415 46751102 45282301 42648457 39701052 37229683 35636771 35043912 35485468 36839939
32882 36839939 38700374 40553963 42135938 43511295 44836995 46168825 47471281 48647043
32874 48647043 49506264 49797999 49289159 47765519 45064031 41308312 37088752 33156099
32866 33156099 29833280 26903444 24194053 22118531 21464051 22666796 25362208 28589866
32858B8589866K806625J951336J229632P83822L28901l23666q93651r80425o56638
32849C2835802m12528n32182q38002j085951j253791j283427q96472p442Q66658
32840B7392665J012081L66623l30594l66566J40499M12434r8124j138110j958072
32831B5432836k028190j370914l13604Q61823J966648K800766L203224L173266
32823C3725855K794189K055220R02691n17966j830015k706641l085696l058140
32815B8279497k660494j868533p25070O15059J935328K996587L558220L425568
32807C5556162K520384R73395p93623k158215k645868k250968j348610l19686
32799B9532971O05973J199556J238385Q19169M40903N13976Q66285R64720O00222
$$ plain form
32858 28589866 31396491 33347827 34577459 35361281 35690182 35366516 34472865 33492440 32835802
32849 32835802 32423274 31891092 31053090 29967139 28713348 27429921 26533449 26526007 27392665
32840 27392665 28404746 28771369 28440775 28074209 28214708 28627142 28529018 27390908 25432836
32831 25432836 23404646 22033732 21720128 22581951 24548599 27349365 30552589 33725855
32823 33725855 36520044 38575264 39477955 38959989 37129974 34423333 31337637 28279497
32815 28279497 25619003 23750470 23025400 23640459 25575787 28572374 32130594 35556162
32807 35556162 38076546 39049941 38256318 36098103 33452235 31201267 29852657 29532971
32799 29532971 30138944 31338500 32576885 33396054 33836957 34350933 35217218 36181938 36782160
32790C6782160J37671N3014L93664P60210P08969J41789n72161q11613j86519
32781C7407184J064657K214880K679837K485765K074666J759032J530536J378342
32773E2594899J553112K290653L266257L508660K080800j008455m546308o865507
32765E2874111p037904n505639l603322k404470j942526j492735n44151O04335
32757C0947699J238946J089251O08373L76805M14239K51229l86145j180124j587570
32748C1772703j459552j149940j059828j228802j389582j269813p59170P5016
32740B3531032R58677J457265J283409O54726K15452M72084J322092K167732K427691
32731C4490160J922758R11089j18186p59805r57866r68723r91594q87847l74996
$$ plain form
32790 36782160 36919831 36972845 37366509 38126719 38835688 38977477 38405316 37593703 37407184
32781 37407184 38471841 40686721 43366558 45852323 47926989 49686021 51216557 52594899
32773 52594899 54148011 56438664 59704921 63213581 65294381 64285926 59739618 52874111
32765 52874111 45836207 40330568 36727246 34322776 32380250 30887515 30343364 30947699
32757 30947699 32186645 33275896 33884269 34261074 34675313 34926542 34540397 33360273 31772703
32748 31772703 30313151 29163211 28103383 26874581 25484999 24215186 23456016 23531032
32740 23531032 24489709 25946974 27230383 27885109 28100561 28572645 29894737 32062469 34490160
32731 34490160 36412918 37324007 37205821 36446016 35488150 34519427 33527833 32639986 32264990
32722C2264990N42138J468938J954087J831619J262289N74556P5314j23567j61821
32713C9688543k56585m56766o28050o50517n24625l01934m2118J63023K59972
32704C7250943L30891M73287N87743M79695J96274J8676J9069j22318o56632j310476
32694C7267152j548807j210659o54563l11945l00918m54457n07437k26056M34074
32685C2486384J183777J534763J204243L73105m85807r93979j068734q18127l37458
32676C3078167L27928J028409J439570J301628P29345J22613k77359n67824q47394
32667C6335083r45404p11992l97667m12977p29500q03280j54959J154767K622827
32658C5956898L652331L805484L020544J735676O06627n1731m31647p97107j112126
$$ plain form
32722 32264990 32807128 34276066 36230153 38061772 39324061 39898617 39973931 39850364 39688543
32713 39688543 39431958 38975192 38347142 37696625 37172000 36870066 36827948 36990971 37250943
32704 37250943 37581834 38055121 38642864 39122559 39318833 39337509 39356578 39234260 38577628 37267152
32694 37267152 35718345 34507686 33853123 33541178 33240260 32785803 32278366 32052310 32486384
32685 32486384 33670161 35204924 36409167 36782272 36296465 35302486 34233752 33415625 33078167
32676 33078167 33406095 34434504 35874074 37175702 37905047 38027660 37750301 37182477 36335083
32667 36335083 35389679 34677687 34280020 33867043 33137543 32334263 32179304 33334071 35956898
32658 35956898 39609229 43414713 46435257 48170933 48777560 48725829 48294182 47497075 46384949
32649D6384949j240759j272256j365141j365977q64622L28475J894641L182921
32641D5682231L574483K792058J121716o17262j563566j498520j043224j069576
32633D7378340j853107k791472k964542k005510m48225P84639J213446J087242
32625D0400811R16080R08065R37456Q82300P91724P71077Q69304J073697J295408
32616D8845922J380716J249253R82989O64893K23334l60904p78753o62374k01299
32607E1343777j40151r18115k038422k590174k267273j560348j012331o61336
32599D0155627l05195K4909R9781j66059o31491j100881j389112j289722p19442
32590C4678415O3656N71489N26176J19595k12948j99401J23434N54390R11204
$$ plain form
32649 46384949 45144190 43871934 42506793 41140816 40276194 40604669 42499310 45682231
32641 45682231 49256714 52048772 53170488 52553226 50989660 49491140 48447916 47378340
32633 47378340 45525233 42733761 39769219 37763709 37315484 38100123 39313569 40400811
32625 40400811 41316891 42224956 43162412 44044712 44836436 45607513 46476817 47550514 48845922
32616 48845922 50226638 51475891 52458880 53123773 53347107 52986203 52207450 51545076 51343777
32607 51343777 51203626 50285511 48247089 45656915 43389642 41829294 40816963 40155627
32599 40155627 39850432 39875341 39975122 39809063 39177572 38076691 36687579 35397857 34678415
32590 34678415 34742071 35313560 35839736 35959331 35746383 35546982 35670416 36224806 37136010
32581C7136010J126761J278116J520111J906100K247321K196339J514694K96935
32573D9222387j016414j851633j847028j112699j45401N81373R38854J042620
32565D5812059R49655O07538N9878m93188q89137j117525j207573j174981j146134
32556D1400592j316114j613221j595913r58766o5238L13951j74025j120429j857543
32547C3013294k053756j740987j057435k09897M78660P83735Q44319J018502J433152
32538C2509587J788817J639077Q14001l88457j362688j642915j342431j093399
32530C0921592j379293j954863k114225j521068n43641K71703P81626J138025
32522B5599856J334702J151991M96456m37933j354670k023451k257775j923939
$$ plain form
32581 37136010 38262771 39540887 41060998 42967098 45214419 47410758 48925452 49222387
32573 49222387 48205973 46354340 44507312 43394613 43249212 43830585 44769439 45812059
32565 45812059 46761714 47369252 47429130 46935942 46046805 44929280 43721707 42546726 41400592
32556 41400592 40084478 38471257 36875344 35916578 35851340 36165291 35991266 34870837 33013294
32547 33013294 30959538 29218551 28161116 27951219 28429879 29213614 30057933 31076435 32509587
32538 32509587 34298404 35937481 36751482 36363025 35000337 33357422 32014991 30921592
32530 30921592 29542299 27587436 25473211 23952143 23408502 23680205 24461831 25599856
32522 25599856 26934558 28086549 28583005 28145072 26790402 24766951 22509176 20585237
32514B0585237j077939k818R64924J604967J815813J581277J028389M51611J56484
32505B7107945K26233M42370M51664P1809n00043q14187o09003j33715Q8013j32622
32495B6198464l99190k04466M15344Q47653N37174m48389j513629k104790k113845
32486B1214326j768855j257328n65363L26794J248868J999922K660460L518981
32478B7377805M572181N272820N003903L768512K208097R28914J8323p18030j295297
32469D7137228j551935j504845j450454j659295k094174k478372k580400k419742
32461C1398011k230306k186222k126476j674939p84986m7961j71008j123209k092130
32452A8960774k400642k171301j873938j529431p86193L35099J266431J586688
$$ plain form
32514 20585237 19507298 19504480 20469404 22074371 23890184 25471461 26499850 26951461 27107945
32505 27107945 27334178 27776548 28228212 28300021 27799978 26985791 26376788 26243073 26331086 26198464
32495 26198464 25799274 25594808 26010152 26857805 27394979 26946590 25432961 23328171 21214326
32486 21214326 19445471 18188143 17622780 17949574 19198442 21198364 23858824 27377805
32478 27377805 31949986 37222806 42226709 45995221 48203318 49132232 49150555 48432525 47137228
32469 47137228 45585293 44080448 42629994 40970699 38876525 36398153 33817753 31398011
32461 31398011 29167705 26981483 24855007 23180068 22395082 22347121 22176113 21052904 18960774
32452 18960774 16560132 14388831 12514893 10985462 10199269 10534368 11800799 13387487
32444A3387487J540743J672485K178869K810001L200064L096393K458102J597641
32436C1941785J110952J371846K077010K467452J994848O64749j127594k821390
32428C7679658l810188l707320k661853j256613j7519Q42261J230176J058223
32420B9356825M75641n5364j86370n8512l0206j45599j35467R5478K53187k134
32410B9567479o55840j334458j584982j147923j17040J072040J880186J980400
32402B9659862J392964M24585m31280o71034j32429P78872J427908J616395J732922
32393C5798765K124601K529136K368278J490703L45947n55270j054240j140112
32385D1907808o53012N02355J922242K760130K333703O48190j608904l455649
$$ plain form
32444 13387487 14928230 16600715 18779584 21589585 24789649 27886042 30344144 31941785
32436 31941785 33052737 34424583 36501593 38969045 40963893 41628642 40501048 37679658
32428 37679658 33869470 30162150 27500297 26243684 26226165 27068426 28298602 29356825
32420 29356825 29832466 29777102 29590732 29532220 29502014 29356415 29220948 29316426 29569613 29567479
32410 29567479 28911639 27577181 25992199 24844276 24727236 25799276 27679462 29659862
32402 29659862 31052826 31477411 31046131 30375097 30242668 31021540 32449448 34065843 35798765
32393 35798765 37923366 40452502 42820780 44311483 44657430 44102160 43047920 41907808
32385 41907808 41254796 41757151 43679393 46439523 48773226 49421416 47812512 44356863
32377D4356863m096893l365378j885367o34581j11926K8550L87779R89209J291963
32368C6960219R97498M98268L53413N53908N69337L9417q11556j451850j578910
32359C6129744j373463j329185j803415k611719l095684k737414j696424n90884
32351B0891556K27784R66099J908136K880873L375091L091074K223991J285292
32343C6849896P52675P90937J140503J294758R10185N3187r76788j934317k620015
32334C6261021k762341k204896j202437k52984M30941J031089J609945J800260
32326C4710598J282405L82788j64069n0085K91824K70763j90331o60875o89515
32317C5183503j53946P26623J558710K019329K076709J962189J871603J765276
$$ plain form
32377 44356863 40259970 36894592 35009225 34374644 34262718 34291268 34679047 35668256 36960219
32368 36960219 37957717 38455985 38809398 39363306 39932643 39972060 39160504 37708654 36129744
32359 36129744 34756281 33427096 31623681 29011962 25916278 23178864 21482440 20891556
32351 20891556 21119340 22085439 23993575 26874448 30249539 33340613 35564604 36849896
32343 36849896 37602571 38393508 39534011 40828769 41738954 41792141 40815353 38881036 36261021
32334 36261021 33498680 31293784 30091347 29838363 30269304 31300393 32910338 34710598
32326 34710598 35993003 36375791 36211722 36161637 36453461 36724224 36533893 35873018 35183503
32317 35183503 35029557 35756180 37314890 39334219 41410928 43373117 45244720 47009996
32309D7009996J526645J193233Q72201M93708j59658j155702k277849l209829
32301D4292745l747078l825414l482212k832512j975169r06604L28832J386356
32293B9238944J760531J357046P66355P09950J240757J718707J608459J074062
32285C9474811O54043N17661K79736m32406j398213j916261j496441l96898N47266
32276C5833298O40075r2910r72409j266525p54704J82889R04110R23429J46730
32267C5543983j118619k324294k950947k761563j867471n86099P14045J645198
32259B6294233J864134J330130M97677J5513Q7951K63265j410o83045j278439
32250B8390009j441047j275398j015019o98848k80550J59821M80038O23137N70780
$$ plain form
32309 47009996 48536641 49729874 50602075 51095783 50936125 49780423 47502574 44292745
32301 44292745 40545667 36720253 33238041 30405529 28430360 27523756 27852588 29238944
32293 29238944 30999475 32356521 33122876 33832826 35073583 36792290 38400749 39474811
32285 39474811 40128854 40646515 40926251 40493845 39095632 37179371 35682930 35286032 35833298
32276 35833298 36473373 36380463 35408054 34141529 33386825 33569714 34473824 35397253 35543983
32267 35543983 34425364 32101070 29150123 26388560 24521089 23934990 24649035 26294233
32259 26294233 28158367 29488497 29986174 30001687 30089638 30352903 30351493 29668448 28390009
32250 28390009 26948962 25673564 24658545 23959697 23679147 23838968 24319006 24942143 25512923
32241B5512923K80909j74247n21620n34554l27787k35778l96265n89721n17855
32232B2496005j62138J37903p3279r63102k128232k766289k289483q20493R44194
32223A4375086K294242K877194K711923K129652J686935J804437K300509K457441
32215C2637419J767587N59909k76832j70011O76877J671449K462088L048688L411701
32206D5788875L328283K702077J917806J592819J902776K329840K210917J420182
32198F3193575L59931o10099j472722k256671k704011k450974j492895l20876
32190E2245258M30937M21875k66479j281001k174855k530095k139157j215117
32182D3491366l32520L3608n6487j47533L9949L54753N69840P55387J113919J585224
$$ plain form
32241 25512923 25793832 25619585 25097965 24563411 24235624 23999846 23603581 23013860 22496005
32232 22496005 22333867 22471770 22398491 21435389 19307157 16540868 14251385 13430892 14375086
32223 14375086 16669328 19546522 22258445 24388097 26075032 27879469 30179978 32637419
32215 32637419 34405006 34964915 34688083 34518072 35194949 36866398 39328486 42377174 45788875
32206 45788875 49117158 51819235 53737041 55329860 57232636 59562476 61773393 63193575
32198 63193575 63553506 62943407 61470685 59214014 56510003 54059029 52566134 52245258
32190 52245258 52676195 53098070 52831591 51550590 49375735 46845640 44706483 43491366
32182 43491366 43158846 43192454 43135967 42988434 43028383 43383136 43952976 44708363 45822282 47407506
32172D7407506J830486J562434P47299m29526j607150k326125k298429j639455
32164D3247040p07384K48052J131926J803844K108567K116365K065495J986537
32156E4000442J610087P62093l18449j158390j417341j040490k51686N06198Q24815
32147E3517279O95278N22381O73972J122774J590792J857550J789666J254702
32139F3024394K50094r27409j834160k245784k315641k375593k578536k670847
32131D8326518k151767q20569Q20744J914160K066076J631394J129641O73446
32123E3589643J58389k63260k22058M68953J687823L136692M351829M756093M087332
32114G1751436K766483J523486O27845k40311j347051k459385l150121l267247
$$ plain form
32172 47407506 49237992 50800426 51547725 51118199 49511049 47184924 44886495 43247040
32164 43247040 42539656 42787708 43919634 45723478 47832045 49948410 52013905 54000442
32156 54000442 55610529 56372622 56054173 54895783 53478442 52437952 52186266 52692464 53517279
32147 53517279 54212557 54734938 55408910 56531684 58122476 59980026 61769692 63024394
32139 63024394 63274488 62347079 60512919 58267135 55951494 53575901 50997365 48326518
32131 48326518 46174751 45354182 46174926 48089086 50155162 51786556 52916197 53589643
32123 53589643 53748032 53484772 53262714 53731667 55419490 58556182 62908011 67664104 71751436
32114 71751436 74517919 76041405 76669250 76428939 75081888 72622503 69472382 66205135
32106F6205135k924416k225339j214303k8872J052857J726633J812082J368755
32098F5772532O85520N3110m99549j168575k053831k955737l513589l490237k956178
32089D9873466k289695j927809j925465j750174p06072J357928L860639N988145
32081E2480963P200104P270173O189053M290500K294274Q80504J38759m19282
32073H0325048j231676k135368k499823j917442p42188J21242K6703q43551j754062
32064F9348883k134757j861719r56392O11887K685082M769684O399516P533632
32056H6395816Q396792R029670R202300Q686534P384628N251869K395994o66556
32048A36077047l102808m314403m357543l763017l038110k402835j865060j367204
$$ plain form
32106 66205135 63280719 61055380 59841077 59812205 60865062 62591695 64403777 65772532
32098 65772532 66458052 66511162 66011613 64843038 62789207 59833470 56319881 52829644 49873466
32089 49873466 47583771 45655962 43730497 41980323 41274251 42632179 46492818 52480963
32081 52480963 59681067 66951240 73140293 77430793 79725067 80605571 80744330 80325048
32073 80325048 79093372 76958004 74458181 72540739 71798551 71919793 71946496 71102945 69348883
32064 69348883 67214126 65352407 64396015 65007902 67692984 72462668 78862184 86395816
32056 86395816 94792608 103822278 113024578 121711112 129095740 134347609 136743603 136077047
32048 136077047 132974239 128659836 124302293 120539276 117501166 115098331 113233271 111866067
32040A11866067q67425m17935k15126m87166j248093k174789k798022k872897
32032A00784614k573800k301343k271177k292556j971052j135893m9513Q20998
32024H9010278J225380J292157J273905J204106Q95357K65966m64769j008713
32016I3693667j369685j828477k547631l306744l692472l477474k757676j807223
32008G2906285r10310k84514l514P7693K38807O41118J162091J524585J575679
31999G6927920J393023J135895Q72539N82714K54143j00548m90677r30813j381143
31990G8263053j768764k054137k192540k047641j490269o47777O8439K98718M0014
31981F8469096m49332r25749j197864j005755j33267J294601K799601L920853
$$ plain form
32040 111866067 110998642 110580707 110365581 109878415 108630322 106455533 103657511 100784614
32032 100784614 98210814 95909471 93638294 91345738 89374686 88238793 88189280 89010278
32024 89010278 90235658 91527815 92801720 94005826 94901183 95167149 94702380 93693667
32016 93693667 92323982 90495505 87947874 84641130 80948658 77471184 74713508 72906285
32008 72906285 71995975 71711461 71707947 71785640 72024447 72665565 73827656 75352241 76927920
31999 76927920 78320943 79456838 80329377 80912091 81166234 81065686 80575009 79644196 78263053
31990 78263053 76494289 74440152 72247612 70199971 68709702 68061925 68130364 68429082 68469096
31981 68469096 68019764 67094015 65896151 64890396 64757129 66051730 68851331 72772184
31973G2772184M482796M457580L773546K474000J001672Q7058K27056J312160
31965I0588052K811568M287273N679008P116730Q564658R748000J0400912J0436796
31957A49632997R791651Q236664N564588J991260j787898n027474p352291q764064
31949A52285433r433343r615693r605886r518364r115018q058984o406120m692711
31941H5839314l451163k761668k362621k032397j668975j114762k21583Q31211
31933G3057356J524538J466256P33998l54917j597232k787830l439577l053454
31925F5549138j767028m33321J29854j70957q29155j319729j411833j124183o25216
31916E7997570j16353L44764Q58565J455552J997668K400057K749483L052179
$$ plain form
31973 72772184 77254980 81712560 85486106 87960106 88961778 89048836 89275892 90588052
31965 90588052 93399620 97686893 103365901 110482631 119047289 128795289 139196201 149632997
31957 149632997 159424648 167661312 173225900 175217160 173429262 168401788 161049497 152285433
31949 152285433 142852090 133236397 123630511 114112147 104997129 96938145 90532025 85839314
31941 85839314 82388151 79626483 77263862 75231465 73562490 72447728 72226145 73057356
31933 73057356 74581894 76048150 76782148 76427231 74829999 72042169 68602592 65549138
31925 65549138 63782110 63348789 63478643 63307686 62478531 61158802 59746969 58622786 57997570
31916 57997570 57881217 58225981 59084546 60540098 62537766 64937823 67687306 70739485
31908G0739485L101762K829064K531734K410996K089516J060084m54438j585074
31900H2723129j827689j527899j235188j019291o67787j85499K43447N68237Q36187
31891G7907647R79672Q88936O04525K53986r8082l92706n14210m35564k60721
31882G8933483L5239O97517J792444K902885L507773L547506L342557L069736
31874I7829140K638698K031194J428226R68550O52327N28651P38122J316327K163517
31865A10294752L233730M507672N709641O306972N953633M799580L262028J630351
31857A45698359j2102j627833l119181m294757m876251m689873l978978l393324
31849A19706060l467415m115666m752883m881762m452050l687246k745180j641051
$$ plain form
31908 70739485 73841247 76670311 79202045 81613041 83702557 84762641 84308203 82723129
31900 82723129 80895440 79367541 78132353 77113062 76445275 76259776 76503223 77071460 77907647
31891 77907647 78887319 79776255 80380780 80634766 80536684 80143978 79629768 79194204 78933483
31882 78933483 78968722 79666239 81458683 84361568 87869341 91416847 94759404 97829140
31874 97829140 100467838 102499032 103927258 104895808 105548135 106076786 106814908 108131235 110294752
31865 110294752 113528482 118036154 123745795 130052767 136006400 140805980 144068008 145698359
31857 145698359 145686257 144058424 140939243 136644486 131768235 127078362 123099384 119706060
31849 119706060 116238645 112122979 107370096 102488334 98036284 94349038 91603858 89962807
31841H9962807m11902P67684J649531K045347J908850J364573O85331J48818j91414
31832I7929625n57622j144342j758080j902989j287978j36865J063059J982537
31824I4187345K532043K705063K564198K325923K242257K358801K499349K469467
31816A13884446K156054J491825N45918l10574n53575l250Q63266J200415M56064
31807A19730589j161376k771381l427014k825500j524993m16574M2333N0403K1470
31798A07717957J10823J96238J24098j63793o41078j173502j491050j303318n30706
31789A02845669N46850J390417J553585J051682L70138q399j15139m42177j330065
31780A05862561k475556l116501k703177j385991J24675J163250J585231J662794
$$ plain form
31841 89962807 89550905 90318589 91968120 94013467 95922317 97286890 97972221 98121039 97929625
31832 97929625 97372003 96227661 94469581 92566592 91278614 91141749 92204808 94187345
31824 94187345 96719388 99424451 101988649 104314572 106556829 108915630 111414979 113884446
31816 113884446 116040500 117532325 118078243 117767669 117214094 117210844 118074110 119274525 119730589
31807 119730589 118569213 115797832 112370818 109545318 108020325 107603751 107646084 107696487 107717957
31798 107717957 107828780 108025018 108149116 107985323 107344245 106170743 104679693 103376375 102845669
31789 102845669 103392519 104782936 106336521 107388203 107758341 107749942 107634803 107192626 105862561
31780 105862561 103387005 100270504 97567327 96181336 96306011 97469261 99054492 100717286
31772A00717286J598269J309301P37743J55731m4560K37285Q26000J613696K591600
31763A09742351L517252L859430L254878J889604L39622q30539j283342r91493
31755A19497763l05222K21092K91700J10057K9686O9848m2157m18810q27485r99237
31745A17627235r75574j068689j523424k241755k809087k791954k041899p34531
31737A03440322Q19174K301815L369379L705883L230604K181850R26015k33668
31729A19741374j030290j219029p82929n7505N56693R94067J488261K157908K785276
31720A24633826L019783K670555J784419N73899o70881j687309k337606k622274
31712A25364412k645704k590749k598537k527665j923950m69309J496474L093503
$$ plain form
31772 100717286 102315555 103624856 104362599 104518330 104473770 104711055 105537055 107150751 109742351
31763 109742351 113259603 117119033 120373911 122263515 122603137 121772598 120489256 119497763
31755 119497763 119192541 119413633 119705333 119815390 119845076 119914924 119872767 119453957 118626472 117627235
31745 117627235 116651661 115582972 114059548 111817793 109008706 106216752 104174853 103440322
31737 103440322 104259496 106561311 109930690 113636573 116867177 119049027 119975042 119741374
31729 119741374 118711084 117492055 116709126 116651621 117208314 118202381 119690642 121848550 124633826
31720 124633826 127653609 130324164 132108583 132682482 132011601 130324292 127986686 125364412
31712 125364412 122718708 120127959 117529422 115001757 113077807 112608498 114104972 117198475
31704A17198475L651867L269596K615013K322705K610853L259666L774479L685446
31696A42388100K901908J775887P06268k73704j384934k636061l667519m099622
31688A35710323l875883l197811k282150j313811n20030q8948L481l5716m9155
31679A24350300m9547q8878j00637O5699M89160J084467J630529J895761J819736
31670A31096590J603221J519468J549914J278988K79348j396481l194364m520362
31662A28216322n126467n043383m317901l008949j433976k10483J66864j59049
31654A09082978m46516n2571R17838J763715J971332J692752J416810J380777
31646A17727115J477277J583817J703192J779032J623113J136947M77055q0751
$$ plain form
31704 117198475 120850342 124119938 126734951 129057656 131668509 134928175 138702654 142388100
31696 142388100 145290008 147065895 147772163 147498459 146113525 143477464 139809945 135710323
31688 135710323 131834440 128636629 126354479 125040668 124520638 124431690 124435171 124399455 124350300
31679 124350300 124300753 124211875 124111238 124176937 124666097 125750564 127381093 129276854 131096590
31670 131096590 132699811 134219279 135769193 137048181 137327529 135931048 132736684 128216322
31662 128216322 123089855 118046472 113728571 110719622 109285646 109075163 109242027 109082978
31654 109082978 108636462 108583891 109501729 111265444 113236776 114929528 116346338 117727115
31646 117727115 119204392 120788209 122491401 124270433 125893546 127030493 127507548 127426797
31638A27426797l55177l15460o5754J59769J27213j51811l85215l11358J9842
31629A26148846L61489N80370P25547Q34834Q28533O37351L51273J89209L37573
31620A30995025Q00933J337534J514427R19589n13726k288149l522201l562989
31612A25680443k552510j307510n30430k15898N3958L79772L91553j87712j117334
31603A20594332j873573k075805j582804m58370R17250J916038K180532K034836
31595A21652436K123602K647953L173795L185412K589972J635381N73158m66214
31587A37115495j425466k303926l118652l778298m049395l737303k881434j736047
31579A14084974o03977K92706Q81081J272344J673541K154884K515632K481320
$$ plain form
31638 127426797 127071620 126756160 126690406 126850175 126977388 126825577 126440362 126129004 126148846
31629 126148846 126510335 127090705 127816252 128651086 129479619 130116970 130468243 130657452 130995025
31620 130995025 131795958 133133492 134647919 135567508 135053782 132765633 129243432 125680443
31612 125680443 123127933 121820423 121289993 121074095 121128053 121507825 121899378 121711666 120594332
31603 120594332 118720759 116644954 115062150 114603780 115521030 117437068 119617600 121652436
31595 121652436 123776038 126423991 129597786 132783198 135373170 137008551 137581709 137115495
31587 137115495 135690029 133386103 130267451 126489153 122439758 118702455 115821021 114084974
31579 114084974 113480997 113773703 114654784 115927128 117600669 119755553 122271185 124752505
31571A24752505K043510J483860R90962L74811o53123j930381k804838k782498
31563A21474808k055432j189008m15415M56846J460177K193712K321881K045896
31555A26293465J778507J530409R66829J7376r09413j378166j337622j004495
31547A25956890n74808j88857j1718j66981o25845j230557j772934k030607j848578
31538A17506005j269419n21030J58684O06370O57741J85390o72975j474432j835420
31529A13340914j777515j572278j311563q27121n6528O94120R84252O96138J75851
31520A10346270r6789M5626L56022N06618M69079M86320O85311Q70563Q11713
31511A14480733O29870P01670J166766J704143J872460J530171Q13839j38938
$$ plain form
31571 124752505 126796015 128279875 129270837 129645648 128992525 127062144 124257306 121474808
31563 121474808 119419376 118230368 117814953 118271799 119731976 121925688 124247569 126293465
31555 126293465 128071972 129602381 130569210 130586586 129677173 128299007 126961385 125956890
31547 125956890 125382082 125193225 125181507 125014526 124388681 123158124 121385190 119354583 117506005
31538 117506005 116236586 115715556 115874240 116480610 117138351 117323741 116650766 115176334 113340914
31529 113340914 111563399 109991121 108679558 107852437 107795909 108490029 109474281 110170419 110346270
31520 110346270 110249481 110295107 110651129 111157747 111626826 112113146 112798457 113669020 114480733
31511 114480733 115110603 115812273 116979039 118683182 120555642 122085813 122899652 122760714
31503A22760714j214718k128679k498595k240896j702866j234868p76147p4851
31495A10889094P95899J450363J740649J979838K441238K853631K650781J650911
31487A26452404K80942q48646j415633j457534j196053q83061o74042n10085j62582
31478A19585710M92106J218664J526357J136382L77771L302M48276J275085J535060
31469A27598713P68295m92649j304494j235808n70448K15131Q85842J408594J776556
31460A29049732J965203J909036J487929O86298k27056q63486j098024j120573
31452A31789059j089808r61360p22815n42463n32109n75986n83278p17548j128668
31443A24935024j593039j713422j440307j122412j003988r00925m58932M32096
$$ plain form
31503 122760714 121545996 119417317 116918722 114677826 112974960 111740092 110963945 110889094
31495 110889094 111684993 113135356 114876005 116855843 119297081 122150712 124801493 126452404
31487 126452404 126733346 125884700 124469067 123011533 121815480 120932419 120258377 119748292 119585710
31478 119585710 120077816 121296480 122822837 123959219 124336990 124340292 124788568 126063653 127598713
31469 127598713 128367008 127874359 126569865 125334057 124763609 124978740 125864582 127273176 129049732
31460 129049732 131014935 132923971 134411900 135098198 134871142 134007656 132909632 131789059
31452 131789059 130699251 129737891 129015076 128472613 127940504 127364518 126781240 126063692 124935024
31443 124935024 123341985 121628563 120188256 119065844 118061856 117160931 116701999 117134095
31435A17134095J554035K529785K975100K632545J547975J27800j056846j545272
31427A25899217j110953K17041K082598L784851M551900M030745K559112R18277
31419A42932788k27927p25727q93529j170904j727570k271634k231297j278332
31411A32405868K30800J431233J689568J128716L42413k92868q37301j407338
31403A34691091j887681k129763k197560k212446k083041j609679q28222p5699
31395A21667000L10444K69472K5681p0685K46591R46139J660747J970274J746746
31386A28772409J137332K62890q34635j868946k200122j356227L50736J964799
31378A26228236K718524K590195K007770J240691K93676p37150j528593j838303
$$ plain form
31435 117134095 118688130 121217915 124193015 126825560 128373535 128501335 127444489 125899217
31427 125899217 124788264 125005305 127087903 130872754 135424654 139455399 142014511 142932788
31419 142932788 142704861 141979134 141085605 139914701 138187131 135915497 133684200 132405868
31411 132405868 132636668 134067901 135757469 136886185 137228598 136935730 136098429 134691091
31403 134691091 132803410 130673647 128476087 126263641 124180600 122570921 121742699 121667000
31395 121667000 121977444 122246916 122272597 122201912 122448503 123394642 125055389 127025663 128772409
31386 128772409 129909741 130172631 129337996 127469050 125268928 123912701 124263437 126228236
31378 126228236 128946760 131536955 133544725 134785416 135079092 134341942 132813349 130975046
31370A30975046j743023j437638r43757j92857O76259J298281J393062J003156
31362A31028529M27061O948m9946K11354N06845N36594K42299j93727n72326q07626
31352A31336005q84959q64499r43853j319598j881800k184279j841707q85627
31344A20529683L14754J328521J777150J416250L95708o20562q83371k10042R01590
31335A24949681J819724K308837K528363K709786K930665L063787K828869K001000
31327A45140712P17611m67595r89999p66269k02476K92532O91743J195512J803184
31318A47414955K189676K022801J294905K89781o90725j487740k049382k360954
31310A46623317k397698k047234j114971M28297K175781L447932L858109L618709
$$ plain form
31370 130975046 129232023 127794385 126850628 126657771 127334030 128632311 130025373 131028529
31362 131028529 131455590 131462538 131412592 131623946 132130791 132667385 132909684 132715957 132143631 131336005
31352 131336005 130451046 129586547 128642694 127323096 125441296 123257017 121415310 120529683
31344 120529683 120844437 122172958 123950108 125366358 125762066 125141504 124258133 124048091 124949681
31335 124949681 126769405 129078242 131606605 134316391 137247056 140310843 143139712 145140712
31327 145140712 145858323 145390728 144400729 143634460 143431984 143724516 144416259 145611771 147414955
31318 147414955 149604631 151627432 152922337 153212118 152521393 151033653 148984271 146623317
31310 146623317 144225619 142178385 141063414 141491711 143667492 147115424 150973533 154592242
31302A54592242L178708K680725J963966J047907L64616L83822J084725J887481
31294A67184192K106702J481042L25132p80998j439670j599459j376880q86968
31286A65013093l06403Q4925J46035J05904L22943P78837J022893P23899J08745
31277A68000871k97273k53635L5347K70592L83035N10960Q10482J323679J909043
31268A72693101K250348K041982J253716J85303p50572j241107j119196m06297
31260A74907278N86557J379918J747198J920842K174956K301911J829320Q03883
31252A87651863J7664K25084J323446K544635L335134L793127M280184M848551
31244B08019688N120301M631110L304251J672358N54364L66620P95762J247013
$$ plain form
31302 154592242 157770950 160451675 162415641 163463548 163828164 164211986 165296711 167184192
31294 167184192 169290894 170771936 171097068 170316070 168876400 167276941 165900061 165013093
31286 165013093 164706690 164791615 164937650 165043554 165366497 166145334 167168227 167892126 168000871
31277 168000871 167703598 167449963 167485310 167755902 168138937 168649897 169460379 170784058 172693101
31268 172693101 174943449 176985431 178239147 178424450 177673878 176432771 175313575 174907278
31260 174907278 175493835 176873753 178620951 180541793 182716749 185018660 186847980 187651863
31252 187651863 187669527 187894611 189218057 191762692 195097826 198890953 203171137 208019688
31244 208019688 213139989 217771099 221075350 222747708 223302072 223668692 224464454 225711467
31236B25711467J465615J530471J445197J133895Q03826Q84484J479470K192046
31228B36646471K623950K776838K864922L044648L453107M152927M828175M872596
31220B65263634M045133K756917J497666L77441m47349m08555P64862K251605
31212B76101354K800982K182315J340647J070306J191803J205355J078531R96916
31204B87968209Q64338N72888M61379R81572K005390K851068K971696K366550
31196C01043090J396117M68624j12055k31773K5445N09778J097923J633363J949631
31187C07780143K059139K140818K203888J955192J181034R2081q90160j505384
31179C15016751j634448j185488l42571K68054J02675o20211j098489p89856K19167
$$ plain form
31236 225711467 227177082 228707553 230152750 231286645 232090471 232974955 234454425 236646471
31228 236646471 239270421 242047259 244912181 247956829 251409936 255562863 260391038 265263634
31220 265263634 269308767 272065684 273563350 273940791 273493442 273084887 273849749 276101354
31212 276101354 278902336 281084651 282425298 283495604 284687407 285892762 286971293 287968209
31204 287968209 288832547 289405435 289866814 290848386 292853776 295704844 298676540 301043090
31196 301043090 302439207 302907831 302795776 302564003 302589448 303099226 304197149 305830512 307780143
31187 307780143 309839282 311980100 314183988 316139180 317320214 317412295 316522135 315016751
31179 315016751 313382303 312196815 311854244 312122298 312224973 311604762 310506273 309716417 309935584
31170C09935584J589378L009490M038381M160316L295699J997801Q98236J37527
31162C29062412m93510j097379j608780k005802k290972k344194k049327j540150
31154C15632298j115668r19814q67817q61496q96355r51461r50409q85396q52594
31145C07331288r00358r25912p81634m45393o3861J43269L0623l75601r26402
31136C03086019j502570k052677k435198k342638j559679l01539Q43293J357050
31128B95092061J120594L46882o29510j442173j774953j579408j212482j206957
31120B88714054j803746k698008l256475l027870k135446j225167r68337j519390
31112B72079615k440006l165443l505820l669479l896452m198733m429365m445042
$$ plain form
31170 309935584 311524962 314534452 318572833 322733149 326028848 328026649 328924885 329062412
31162 329062412 328568902 327471523 325862743 323856941 321565969 319221775 317172448 315632298
31154 315632298 314516630 313596816 312728999 311867503 310971148 310019687 309069278 308183882 307331288
31145 307331288 306430930 305505018 304723384 304277991 304214130 304357399 304388022 304012421 303086019
31136 303086019 301583449 299530772 297095574 294752936 293193257 292891718 293735011 295092061
31128 295092061 296212655 296559537 295930027 294487854 292712901 291133493 289921011 288714054
31120 288714054 286910308 284212300 280955825 277927955 275792509 274567342 273599005 272079615
31112 272079615 269639609 266474166 262968346 259298867 255402415 251203682 246774317 242329275
31104B42329275m145144l487692k601235j836086j569943j915641k655117l450038
31096B20668379m059842m378060m385992m156554l840311l544499l239628k873729
31088A90189764k564284k539342k823364l099961l019065k590728k144700j936671
31080A69471649j960019k140718k479475k869504k970195k508935j659614r12968
31072A51970221n66874n09697m96788m41060m03139n16739j004244k018803l278346
31063A42734531m045896l763044k676736j626404j218271j398369j812021k293421
31055A23900369k856785l411912l742573l755001l587585l436976l361706l275005
31047I6472826l036355k497155j551472k87632Q92643J444639J100878J15972
$$ plain form
31104 242329275 238184131 234696439 232095204 230259118 228689175 226773534 224118417 220668379
31096 220668379 216608537 212230477 207844485 203687931 199847620 196303121 193063493 190189764
31088 190189764 187625480 185086138 182262774 179162813 176143748 173553020 171408320 169471649
31080 169471649 167511630 165370912 162891437 160021933 157051738 154542803 152883189 151970221
31072 151970221 151403347 150893650 150396862 149955802 149552663 149035924 148031680 146012877 142734531
31063 142734531 138688635 134925591 132248855 130622451 129404180 128005811 126193790 123900369
31055 123900369 121043584 117631672 113889099 110134098 106546513 103109537 99747831 96472826
31047 96472826 93436471 90939316 89387844 89100212 89992855 91437494 92538372 92654344
31039I2654344r51634j640829j719034j095515R7776J325467J870124J440989
31031I1981688M18935o23057j432062j941067j923244j199613j15918O04688N75814
31022H6346164L9814n89928j151315j596165j781911j644503j350828j026376
31014G7244952m94202M53497J618131K478789K696791K366218J798109J227559
31006H9389844P27208K55342k55580p98966j286398j655286j901209j964449j717286
30997H0793220j155180m63405K22708R61686J731812K170955J866863Q71995l01291
30988H6699363j190962j694792j905721j894354j712228j412424r86614m10221
30980G5492047K25337P63254J155722J410765J380689Q57344m9656q70105j241503
$$ plain form
31039 92654344 91702710 90061881 88342847 87247332 87345108 88670575 90540699 91981688
31031 91981688 92400623 91777566 90345504 88404437 86481193 85281580 85165662 85770350 86346164
31022 86346164 86385978 85796050 84644735 83048570 81266659 79622156 78271328 77244952
31014 77244952 76750750 77204247 78822378 81301167 83997958 86364176 88162285 89389844
31006 89389844 90117052 90372394 90116814 89317848 88031450 86376164 84474955 82510506 80793220
30997 80793220 79638040 79174635 79397343 80359029 82090841 84261796 86128659 87000654 86699363
30988 86699363 85508401 83813609 81907888 80013534 78301306 76888882 75902268 75492047
30980 75492047 75717384 76480638 77636360 79047125 80427814 81285158 81235502 80365397 79123894
30971G9123894j234935j090177q32250l46991L13446R34245J382189J642294J637073
30962H1528788J211753L65282o05373j265419j363894j038897p14162p17914r81927
30953G6418237j207869j318190j529484j887655j995742j476996n59228J41640
30945F6584713L93514N55356R27283J227158R53746P6662r18514j619791k073924
30936F6106203k531722k990314l132374k696097j807621q76157j65209M24841
30928E2331550J037188J409619J018539j96450j462873j796442r45998M82079
30920E1877212J752623K523464K630573J843058K29668j452546k239512j934128
30912E5230412j298336j148367j501741j779974j625747j235366r46579p69453
$$ plain form
30971 79123894 77888959 76798782 75966532 75619541 75932987 76867232 78249421 79891715 81528788
30962 81528788 82740541 83105823 82500450 81235031 79871137 78832240 78118078 77400164 76418237
30953 76418237 75210368 73892178 72362694 70475039 68479297 67002301 66443073 66584713
30945 66584713 66978227 67533583 68460866 69688024 70641770 70718432 69799918 68180127 66106203
30936 66106203 63574481 60584167 57451793 54755696 52948075 52071918 51906709 52331550
30928 52331550 53368738 54778357 55796896 55600446 54137573 52341131 51395133 51877212
30920 51877212 53629835 56153299 58783872 60626930 60856598 59404052 57164540 55230412
30912 55230412 53932076 52783709 51281968 49501994 47876247 46640881 45694302 44924849
30904D4924849m27648K42069J030600J514721J472673J103260P71518O04252N13349
30895E1749643N93497J171863K264694L236285L329735K453811J172725J3532
30887F5985785q80278j468064j644986j508741j428546j596526j740497j503211
30879E4214936r04571k09554M53206J066301J486710J565176J438180J409400
30871F0519784J570493J801618K098051K563147L032894L038415K308613J123766
30863G8056781P3140l49602J35548J550361L483651N172091O077589O358969O579760
30854A07138288P010131P419680P501047P240224O830888O438457O119942N779860
30846A61478517N088497L615193J238416j611547m226612o094967p046103p094034
$$ plain form
30904 44924849 44497201 44739270 45769870 47284591 48757264 49860524 50632042 51236294 51749643
30895 51749643 52343140 53515003 55779697 59015982 62345717 64799528 65972253 65985785
30887 65985785 65105507 63637443 61992457 60483716 59055170 57458644 55718147 54214936
30879 54214936 53310365 53100811 53554017 54620318 56107028 57672204 59110384 60519784
30871 60519784 62090277 63891895 65989946 68553093 71585987 74624402 76933015 78056781
30863 78056781 78129921 77780319 77915867 79466228 82949879 88121970 94199559 100558528 107138288
30854 107138288 114148419 121568099 129069146 136309370 143140258 149578715 155698657 161478517
30846 161478517 166567014 170182207 171420623 169809076 165582464 159487497 152441394 145347360
30838A45347360o404287n429601m805000m893315n480633o030910o196178n989881
30830A00117555n545524m895322m037668l108924k393772k148466k375076k734151
30822G2878652k779703k435337k197120k650842l728844m625502m540550l359849
30814D6560905j561465K70467J648932K206279J939526J379027J140093J258222
30806E4841986J256754Q91086M80693M18967P21297J216274J779133K073605J450212
30797F5130007l67926k625081m060543m137534l380713k504496j688550q76625
30789D5488539l18135m00469j116033k003032k525798k316119j223522N23773
30781C6109204K221549L061886K742080J632809L83341m99176p66907m29165K47496
$$ plain form
30838 145347360 138943073 133513472 128708472 123815157 118334524 112303614 106107436 100117555
30830 100117555 94572031 89676709 85639041 82530117 80136345 77987879 75612803 72878652
30822 72878652 70098949 67663612 65466492 62815650 59086806 54461304 49920754 46560905
30814 46560905 44999440 45269907 46918839 49125118 51064644 52443671 53583764 54841986
30806 54841986 56098740 56989826 57470519 57889486 58610783 59827057 61606190 63679795 65130007
30797 65130007 64762081 62137000 58076457 53938923 50558210 48053714 46365164 45488539
30789 45488539 45170404 44769935 43653902 41650870 39125072 36808953 35585431 36109204
30781 36109204 38330753 41392639 44134719 45767528 46150869 45651693 44884786 44455621 44703117
30772D4703117Q94691J310614J505475J473284J077951K49753q14329j723137
30764D8677419k095501j705187o19780P06273J658460J965462J896542J831039
30756E2314727J756902J392419P09793O0833k54785l18911l98633n95829q17354
30747E3849162r64864j000430q86878o14457k90087r1009r2582j93118k29924
30738D9485813j38075O820N4069j38469o35007j354032k049290k438037k442594
30729D0351198k285230k237668k269941k084506j548690r18476m91222j98479
30721B8316986K19025P34291J045658J065566J060627J200025J293493J181819
30713C6117490J086800J259572J500735J424481J094913R63199J135989J127675
$$ plain form
30772 44703117 45597808 46908422 48413897 49887181 50965132 51214885 50400556 48677419
30764 48677419 46581918 44876731 44256951 44963224 46621684 48587146 50483688 52314727
30756 52314727 54071629 55464048 56173841 56234674 55979889 55660978 55262345 54666516 53849162
30747 53849162 52884298 51883868 50996990 50382533 50092446 50001437 49908855 49715737 49485813
30738 49485813 49347738 49354558 49408627 49270158 48635151 47281119 45231829 42793792 40351198
30729 40351198 38065968 35828300 33558359 31473853 29925163 29006687 28515465 28316986
30721 28316986 28536011 29270302 30315960 31381526 32442153 33642178 34935671 36117490
30713 36117490 37204290 38463862 39964597 41389078 42483991 43447190 44583179 45710854
30705D5710854N28188l86306r47241q08326j64014N70101J052568J105646P79208
30696D7440678L29024m0353l94401q74715j328591j355119p82921N6942O18561
30687D3669105O05673J19572n00332q74493p46726j44465N99876J103289J274851
30678D5106350J365978J631565J962328J925633J219426N1240j014067j589488
30670E0658965j753373j769080j671665j306865p07221j74402R7146K88895O98256
30661D4360656J313078J788012J774956J154265M5972j192673k016490k008539
30653D5219237j263259l04224M66782J091945J752983K364785K685519K685680
30645E4699448K520682K166033J369935N5488j435774k604411l144645k977916
$$ plain form
30705 45710854 46239042 45852736 44905495 44097169 43933155 44503256 45555824 46661470 47440678
30696 47440678 47769702 47729349 47334948 46460233 45131642 43776523 42993602 43050544 43669105
30687 43669105 44274778 44394350 43894018 43019525 42272799 42128334 42728210 43831499 45106350
30678 45106350 46472328 48103893 50066221 51991854 53211280 53262520 52248453 50658965
30670 50658965 48905592 47136512 45464847 44157982 43450761 43276359 43373505 43662400 44360656
30661 44360656 45673734 47461746 49236702 50390967 50436939 49244266 47227776 45219237
30653 45219237 43955978 43651754 44118536 45210481 46963464 49328249 52013768 54699448
30645 54699448 57220130 59386163 60756098 60811586 59375812 56771401 53626756 50648840
30637E0648840k164239r57947K00535R63858J303396J342314J094202N53191q5780
30628E2898370n81503r93983j581417k286218k601465k120673j057531n5428M24631
30619D2044783M12517K41315K08001L84584O58918R55944J402849K156144L035605
30610E1500660L509337L185863K234063J213598N82885M47704O21677P55957N24136
30601F4575880j18897r01262j563638k088068k452224k394795j775476j037189
30593E2244331q45269j198491j319796o34331M53792J001368N24719o52517j824946
30584D7748860k397432k111198j145442o7819M89870K03246q37147k199384l190856
30575C6492698l111196j752234L36297K230824L268326L271515K415940J178113
$$ plain form
30637 50648840 48484601 47526654 47727189 48691047 49994443 51336757 52430959 52984150 52898370
30628 52898370 52316867 51322884 49741467 47455249 44853784 42733111 41675580 41620152 42044783
30619 42044783 42457300 42698615 42906616 43291200 43950118 44906062 46308911 48465055 51500660
30610 51500660 55009997 58195860 60429923 61643521 62226406 62674110 63295787 64051744 64575880
30601 64575880 64456983 63555721 61992083 59904015 57451791 55056996 53281520 52244331
30593 52244331 51399062 50200571 48880775 48246444 48700236 49701604 50226323 49573806 47748860
30584 47748860 45351428 43240230 42094788 42026969 42516839 42720085 41882938 39683554 36492698
30575 36492698 33381502 31629268 31965565 34196389 37464715 40736230 43152170 44330283
30567D4330283K56170J06475M77546O84837M04928o2837l38092l95946l34902
30558D5128462r5069K99001M85922J30270n70339j055666j026609o26175o5009
30549D2604788N86296J184934J443293J264185R34320P66980O81164L59027k34828
30540D9590159p22295p52333m17075j33156j89265n03124p81361q09934n69004
30531D4712612j59925K85006O31588P77258P27369O30247O87122R97789J496842
30522E0785908K044237K557082L017157L345814L339775K826199J892619Q64012
30514G0672803j8510q21674j716812k602993l092900k915671k214733j381716
30506E5907794o94713k01144J39093L37036L99431L87719M43162P67794J490240
$$ plain form
30567 44330283 44586453 44692928 45170474 45855311 46260239 46197402 45859310 45463364 45128462
30558 45128462 45033393 45332394 45818316 45948586 45378247 44322581 43295972 42669797 42604788
30549 42604788 43191084 44376018 45819311 47083496 48017816 48784796 49465960 49824987 49590159
30540 49590159 48867864 48115531 47698456 47565300 47376035 46872911 46091550 45281616 44712612
30531 44712612 44552687 44837693 45469281 46246539 46973908 47604155 48291277 49289066 50785908
30522 50785908 52830145 55387227 58404384 61750198 65089973 67916172 69808791 70672803
30514 70672803 70654293 69832619 68115807 65512814 62419914 59504243 57289510 55907794
30506 55907794 55213081 55011937 55151030 55488066 55887497 56275216 56718378 57486172 58976412
30497E8976412K439743L108670L013871K158676J044726J77365l52858p45957
30489F9820648j082574j214424j053611p78793o21590n47086l50917j03085k75926
30480F3792642j224950k619489l634686l763821l242019k576339j902785j064672
30472D3763881j69842L43846L09177J72504M60742J041838J204523M82942q18959
30463D6790652j979757k533833k470858j943672j041676J09753J199706J827407
30455C9957722J781539J247171P51120Q03402J429116K043578J958330J096951
30447E1068929Q4708m60801n77422p47746j191677j628388j699263j345939p10990
30438D2791411P9193Q88603J511684J817597J879601J869021J915346K115117
$$ plain form
30497 58976412 61416155 64524825 67538696 69697372 70742098 70919463 70566605 69820648
30489 69820648 68738074 67523650 66470039 65691246 65069656 64522570 64171653 64068568 63792642
30480 63792642 62567692 59948203 56313517 52549696 49307677 46731338 44828553 43763881
30472 43763881 43594039 43937885 44247062 44419566 44880308 45922146 47126669 47609611 46790652
30463 46790652 44810895 42277062 39806204 37862532 36820856 36930609 38130315 39957722
30455 39957722 41739261 42986432 43737552 44540954 45970070 48013648 49971978 51068929
30447 51068929 51153637 50692836 50115414 49367668 48175991 46547603 44848340 43502401 42791411
30438 42791411 42870604 43759207 45270891 47088488 48968089 50837110 52752456 54867573
30430E4867573K486365K786391K578725J707601N82752k36399o47171r61630j353455
30421F1810752j649848j667018j446442j086577o15572j58934L557k60908p13788
30412E4215222r79039r12379o30092k81271P4086M29042P88442J132367J372673
30403E5209051J415804J290367J077902O72707j78804j427730k470531k611840
30395E2976926j783389o35255R6642J87553p7707k97267k45145J06380O81263
30386E1010001J335162J829077J901250J509313R74632O93300O34588L20746n44027
30377E9664042j596966k202710k215456k073606k143041k271121k118231j692002
30369D3350909j323281j204980j172689r61207n27177m7289L12086N20264O06974
$$ plain form
30430 54867573 57353938 60140329 62719054 64426655 65009407 64773008 64125837 63164207 61810752
30421 61810752 60160904 58493886 57047444 55960867 55345295 55186361 55189918 54929010 54215222
30412 54215222 53236183 52323804 51693712 51412441 51486527 51915569 52704011 53836378 55209051
30403 55209051 56624855 57915222 58993124 59665831 59487027 58059297 55588766 52976926
30395 52976926 51193537 50558282 50654924 50842477 50764770 50467503 50222358 50328738 51010001
30386 51010001 52345163 54174240 56075490 57584803 58559435 59252735 59887323 60208069 59664042
30377 59664042 58067076 55864366 53648910 51575304 49432263 47161142 45042911 43350909
30369 43350909 42027628 40822648 39649959 38688752 38161575 38114286 38426372 38946636 39553610
30360C9553610N86017N04901M63028M66417L47148N157l16323k61389P4297J22349
30350D1545212l85878q58063l98853J125591K860724L786097L535570K471394
30342E3681794J293388O33910O95465J083593J173274P67973K28824j22312m61770
30333E8974139j139081k113880k972633l381105l280012k720797j771574n99837
30325D0995220N37340J429454J961336K075914J797366J233775M53722n38603
30317D9945524j561478k127994j835532q78498P0201N49962P13107J005048J640124
30308D7520464K462391L128342L292654K762275J670964N03664j80185j52735
30300F1007834K75222M34002j88074j435490k517305k715017k071487j240405
$$ plain form
30360 39553610 40139627 40644528 41107556 41573973 41921121 41926278 41609955 41348566 41422863 41545212
30350 41545212 41159334 40301271 39902418 41028009 43888733 47674830 51210400 53681794
30342 53681794 54975182 55609092 56304557 57388150 58561424 59329397 59558221 59435909 58974139
30333 58974139 57835058 55721178 52748545 49367440 46087428 43366631 41595057 40995220
30325 40995220 41532560 42962014 44923350 46999264 48796630 50030405 50484127 49945524
30317 49945524 48384046 46256052 44420520 43542022 43612223 44162185 44875292 45880340 47520464
30308 47520464 49982855 53111197 56403851 59166126 60837090 61340754 61160569 61007834
30300 61007834 61283056 61717058 61528984 60093494 57576189 54861172 52789685 51549280
30292E1549280p09592m35109k49104k34425m42679n29239o5629Q58763J683210
30283E1425476K018303J928938J543727P66950l69746j314176j342326l59124
30275E4298022Q65055J386120R52858J27627l80265l84353k21646k31058m04366
30266E6007994n69673p32423j049659j513994j867868j905824j733001j625624
30258D5009928j713277j884884j935799j709629j162056m15323K75481P28385
30250C7192826R82113J112114R59707K97372o69697j250568r64148j42497M31878
30241C7949100M18074J57822O5218J58176L04629N27834P56185N63225l91586
30232D0508677j739816k626297k578809j821938p27598N93667J982615K954199
$$ plain form
30292 51549280 50839688 50404579 50155475 49921050 49478371 48949132 48883503 49742266 51425476
30283 51425476 53443779 55372717 56916444 57683394 57313648 55999472 54657146 54298022
30275 54298022 55163077 56549197 57502055 57629682 57249417 56865064 56643418 56412360 56007994
30266 56007994 55438321 54705898 53656239 52142245 50274377 48368553 46635552 45009928
30258 45009928 43296651 41411767 39475968 37766339 36604283 36188960 36464441 37192826
30250 37192826 38174939 39287053 40246760 40544132 39874435 38623867 37659719 37517222 37949100
30241 37949100 38367174 38524996 38590214 38748390 39053019 39580853 40337038 40900263 40508677
30232 40508677 38768861 36142564 33563755 31741817 31014219 31607886 33590501 36544700
30224C6544700L115426K650418K059375J570098J122094P72786P08655Q84475
30216D9428027J042138J136282J384183J793368J978749J620489Q32628r9397
30208E9116467j083416k091305k882313l144877k831975k169130j438568r08932
30200D2565951p82077r35839q47518q7213J141045K187898K607933K341836J375503
30191D9567519k96795k246386l586351l710645k888233j898479j222226p86613
30183C2931791l45520J52576N22714M73347j64812j154954j862624j776507j039349
30174B7736662k86325O5004K02662N77195J351731K278121K976938L208900K945815
30165D1056703K339993J679437J285504J313352J572637J616871J177297N50332
$$ plain form
30224 36544700 39660126 42310544 44369919 45940017 47062111 47834897 48543552 49428027
30216 49428027 50470165 51606447 52990630 54783998 56762747 58383236 59215864 59116467
30208 59116467 58033051 55941746 53059433 49914556 47082581 44913451 43474883 42565951
30200 42565951 41783874 40848035 40000517 39913304 41054349 43242247 45850180 48192016 49567519
30191 49567519 49270724 47024338 43437987 39727342 36839109 34940630 33718404 32931791
30183 32931791 32586271 32738847 33261561 33734908 33570096 32415142 30552518 28776011 27736662
30174 27736662 27450337 27515341 27718003 28295198 29646929 31925050 34901988 38110888 41056703
30165 41056703 43396696 45076133 46361637 47674989 49247626 50864497 52041794 52592126
30157E2592126L88401R75829J833845K222629J967984J595536J668605K187462
30149F5432417K643950K461611J361592m32302k193645l105429k921260k171954
30141F1074980j566188j252167q32027l9586Q28384J212250Q55242k3576r97266
30132E9260046j721210j992368j717637r96542k25214P4988k85774r12668j201157
30123E0282464r90606o75934o23174p15104o60738n29716o05038p26965j97305
30114D4557884J413512L551546N041928N161304M210394L051395K249227J728539
30106G0965729J144965M17430j83095m13524l86978m35215p22196j148802j635055
30097F7603259k289529l159342l938478m139546l582548k586928j635760r32816
$$ plain form
30157 52592126 52980527 53956356 55790201 58012830 59980814 61576350 63244955 65432417
30149 65432417 68076367 70537978 71899570 71467268 69273623 66168194 63246934 61074980
30141 61074980 59508792 58256625 57424598 57385012 58213396 59425646 60280888 60257312 59260046
30132 59260046 57538836 55546468 53828831 52832289 52607075 52682063 52396289 51483621 50282464
30123 50282464 49291858 48615924 47992750 47277646 46616908 46087192 45482154 44755189 44557884
30114 44557884 45971396 49522942 54564870 59726174 63936568 66987963 69237190 70965729
30106 70965729 72110694 72528124 72345029 71931505 71544527 71109312 70387116 69238314 67603259
30097 67603259 65313730 62154388 58215910 54076364 50493816 47906888 46271128 45338312
30089D5338312l30500L78578J170903J788578K005911J890571J757564J820017
30081E5819934J931224J767977J263844P46535N90289Q00352R95010P51811n6263
30072F4610713j179511k156578k606262k458398j923670j233023m68924L05448
30064E2889795Q61804R13545M12678l75279j111603j608648j832849j854596j862925
30055D6431922k062390k391966k428418j756898m58382Q84109J684000J788915
30047D1690892J477115J190282J302568J965726L011715M036377M679537M834624
30039F4188836M585146M039319L309573K553304J867239J149704K14286r28473
30031H0978934k028574k879577l501708l934461l971431l315707k030525o74565
$$ plain form
30089 45338312 45007812 45386390 46557293 48345871 50351782 52242353 53999917 55819934
30081 55819934 57751158 59519135 60782979 61529514 62119803 62920155 63915165 64666976 64610713
30072 64610713 63431202 61274624 58668362 56209964 54286294 53053271 52584347 52889795
30064 52889795 53751599 54665144 55077822 54702543 53590940 51982292 50149443 48294847 46431922
30055 46431922 44369532 41977566 39549148 37792250 37333868 38217977 39901977 41690892
30047 41690892 43168007 44358289 45660857 47626583 50638298 54674675 59354212 64188836
30039 64188836 68773982 72813301 76122874 78676178 80543417 81693121 81907407 80978934
30031 80978934 78950360 76070783 72569075 68634614 64663183 61347476 59316951 58642386
30023E8642386J37340K83574J87467L45660Q60557J415959J618347J313678O41355
30014F5446323j04499o47488q77905r40944j148648j689280k380776k768544k503823
30005E2384416j605552l82318P99595J667070K126678K314765K446608K479914
29997F2231176K051967R78933k42118p37874j63955R31303J777904K170713K358720
29988G1356769K381677J939048R48269j23079o80005n92756k21624K3445m832
29979G5026912k32184n23450p45495p42944l50698M50467J316702J605615R14816
29970G6719741l85136j378536j513398j132951r53587j179397j374525j133243
29962F7668968o00546k73539m58416r82451j340032j117653l81324L75071P76532
$$ plain form
30023 58642386 58779726 59063300 59250767 59596427 60456984 61872943 63491290 64804968 65446323
30014 65446323 65341824 64694336 63816431 62875487 61726839 60037559 57656783 54888239 52384416
30005 52384416 50778864 50396546 51196141 52863211 54989889 57304654 59751262 62231176
29997 62231176 64283143 65262076 65019958 64282084 64118129 65049432 66827336 68998049 71356769
29988 71356769 73738446 75677494 76625763 76502684 75822679 75229923 75008299 75031744 75026912
29979 75026912 74794728 74271278 73525783 72782839 72432141 72882608 74199310 75804925 76719741
29970 76719741 76334605 74956069 73442671 72309720 71356133 70176736 68802211 67668968
29962 67668968 67068422 66794883 66336467 65354016 64013984 62896331 62515007 62890078 63666610
29953F3666610R93230J438992K108991K494725K191235J310604K14433q39894
29945G3578926j593075j653851q78369K08013P28409K64794q28572j891072k485677
29936F5449526k439607j669617k34045J476738K796108L195982K753207K185179
29928G3513471K248096K975670L621078L475168K603729J604612Q27648J68739
29920I1038211m64538r31853j193219j458917j803477j953834j708383j286372
29912H0237618r68959o40984n7002O01717Q55381N85044K07669J65091N27497
29903H1513072J101684J602062J674557J121888K64498k16192J1772N89439R72998
29894H8635778J018111Q70680N69091R2010l58674m88746l12623j55090k39528
$$ plain form
29953 63666610 64659840 66098832 68207823 70702548 72893783 74204387 74418820 73578926
29945 73578926 71985851 70332000 69453631 69661644 70390053 70654847 69826275 67935203 65449526
29936 65449526 63009919 61340302 61106257 62582995 65379103 68575085 71328292 73513471
29928 73513471 75761567 78737237 82358315 85833483 88437212 90041824 90869472 91038211
29920 91038211 90573673 89641820 88448601 86989684 85186207 83232373 81523990 80237618
29912 80237618 79268659 78627675 78570673 79172390 80027771 80612815 80820484 80985575 81513072
29903 81513072 82614756 84216818 85891375 87013263 87277761 87061569 87073341 87662780 88635778
29894 88635778 89653889 90524569 91093660 91185670 90826996 90338250 90025627 89870537 89631009
29885H9631009m74921o35963n53716j52758M66843R63928J000530O22346K23232
29876I1090530Q2640J21440J76354L00336O32789J096281J386060J233446O12776
29867I6732652k45381r71343j250692j010112m51926O9687J96046k95780j315895
29858I1457256k397142k941913k613093j501746o1163R67487P72744r21012l340971
29849G9420447n096700n341703m339967k844657j303249J21381J203061J822415
29841F3641028K266658K857655L363428L242938K445114J491459P37990P0298
29833H0116568n24840o23445L8994R89247J444936J142444M12130l97393j182929
29824H1415712j821889k013834j520441m29990Q46490J765699J937064J419857
$$ plain form
29885 89631009 89156088 88520125 87966409 87813651 88280494 89244422 90244952 90867298 91090530
29876 91090530 91173170 91294610 91470964 91771300 92404089 93500370 94886430 96119876 96732652
29867 96732652 96487271 95515928 94265236 93255124 92803198 92872885 93068931 92773151 91457256
29858 91457256 89060114 86118201 83505108 82003362 81942199 82909686 83682430 82761418 79420447
29849 79420447 74323747 68982044 64642077 61797420 60494171 60615552 61818613 63641028
29841 63641028 65907686 68765341 72128769 75371707 77816821 79308280 80046270 80116568
29833 80116568 79591728 78968283 79007277 79996524 81441460 82583904 82996034 82598641 81415712
29824 81415712 79593823 77579989 76059548 75629558 76476048 78241747 80178811 81598668
29816H1598668P35761M30586N92730Q62379Q41110L94062l21641r27235j003630
29807H3202790m58143K72388N88637L35303j17458l83423m23484l64241k23799
29798H2428570J7967K55174L59372L59309L49523K67670q1017p64767j577000
29789H1614801k149445k172352j557465m83534P06198J696516K306763K448550
29781H2410032K106900J444487Q15716N08859M75406M38837K66464P6963n2330
29772H8491334k63490o09195o99726K2996J568403L178583L997554L827227L053110
29763A02566796J987743O20469r80811k384827l125107l121691k588783j698873
29755I1274916n86640M24403R07188P03942O7906n57179p72285l49950N85726
$$ plain form
29816 81598668 82334429 82765015 83357745 84220124 85061234 85455296 85133655 84206420 83202790
29807 83202790 82744647 83017035 83605672 83940975 83823517 83440094 83016610 82652369 82428570
29798 82428570 82446537 82701711 83061083 83420392 83769915 84037585 83956568 83191801 81614801
29789 81614801 79465356 77293004 75735539 75252005 75958203 77654719 79961482 82410032
29781 82410032 84516932 85961419 86777135 87285994 87761400 88200237 88466701 88543664 88491334
29772 88491334 88227844 87618649 86918923 86941919 88510322 91688905 95686459 99513686 102566796
29763 102566796 104554539 105175008 104194197 101809370 98684263 95562572 92973789 91274916
29755 91274916 90688276 91112679 92019867 92723809 92791715 92234536 91462251 91112301 91698027
29746I1698027J489284J788616J460039J004482P69540N41159m5765r34686j717762
29737I6052934k112290k113967j786113j176288m25835K75559Q79992J454976
29729I1048968J940288K076056J609298N04247r68775k203355k456814j444567
29721I0105346J73945J194251R49106j47848j234470j943104k516351l202395
29713H3378480l873497m203749l932696k929773j282606N58126J942956K530529
29705G2187770K559113K511008K608364K754814K847239K922304K991489K920945
29697I4303046K565635J933148J148903L31465m22017r77116j199318j095414
29689I6588332q81575q46076j099283j469823j699847j742876j774529j854305
$$ plain form
29746 91698027 93187311 94975927 96435966 97440448 98209988 98751147 98705382 97770696 96052934
29737 96052934 93940644 91826677 90040564 88864276 88438441 88714000 89593992 91048968
29729 91048968 92989256 95065312 96674610 97178857 96210082 94006727 91549913 90105346
29721 90105346 90279291 91473542 92422648 92274800 91040330 89097226 86580875 83378480
29713 83378480 79504983 75301234 71368538 68438765 67156159 67714285 69657241 72187770
29705 72187770 74746883 77257891 79866255 82621069 85468308 88390612 91382101 94303046
29697 94303046 96868681 98801829 99950732 100282197 99860180 98883064 97683746 96588332
29689 96588332 95706757 94860681 93761398 92291575 90591728 88848852 87074323 85220018
29681H5220018j697412r50607L31629J662241K604006L113363L350587L354475
29673I6988300L077714K616451K186167J890690J672621J468439J254209R56758
29665A12111349N01835l5802n24336j063404j950858l199364m244722m370960
29657I7223738l418192j922491n61688L94311J072492J628642K054242K301494
29649I8772548K410996K400367K115286J385593L83705l47114l90510R5936O05563
29640A07432370Q92384J121982J417335J562291J321648Q33104M47935L03275
29632A15332324K64513J83515l9114n84608j591050k813447l647757l645804k889613
29623A00568959j781282o32056M06591J175736J536609J567342J526638J534386
$$ plain form
29681 85220018 83522606 82571999 82903628 84565869 87169875 90283238 93633825 96988300
29673 96988300 100066014 102682465 104868632 106759322 108431943 109900382 111154591 112111349
29665 112111349 112613184 112577382 112053046 110989642 109038784 105839420 101594698 97223738
29657 97223738 93805546 91883055 91321367 91715678 92788170 94416812 96471054 98772548
29649 98772548 101183544 103583911 105699197 107084790 107468495 107121381 106730871 106826807 107432370
29640 107432370 108324754 109446736 110864071 112426362 113748010 114581114 115029049 115332324
29632 115332324 115596837 115780352 115741238 115156630 113565580 110752133 107104376 103458572 100568959
29623 100568959 98787677 98155621 98562212 99737948 101274557 102841899 104368537 105902923
29615A05902923J405924Q96722L1914r08447j660906k077788j983679j200012
29607A00406651R3067J179294J321445N28226m15655p88770n90723k10552L05718
29598A01828701J279861K705996L885064L971163K799301J070975k39296o57336
29590A16644429n23742o20901j412387k572453l285304l019245j973898q17014
29582A02419485j04350N6355m9788l9819K22966N00991M77633K15917J78896O89972
29572A04568258J497788K021796J944018J404344O93735j6568o21963r90317j061104
29563A09439987r23620o65252k32582L83157Q68003P53375R35p63384q51366l02513
29553A07706740J83469J19906k71526n71902q17129j280922j828605j988259j664793
$$ plain form
29615 105902923 107308847 108205569 108237483 107329036 105668130 103590342 101606663 100406651
29607 100406651 100499718 101679012 103000457 103528683 103113028 102324258 101733535 101522983 101828701
29598 101828701 103108562 105814558 109699622 113670785 116470086 117541061 117301765 116644429
29590 116644429 116120687 115499786 114087399 111514946 108229642 105210397 103236499 102419485
29582 102419485 102315135 102371490 102321702 102281883 102504849 103005840 103483473 103699390 103878286 104568258
29572 104568258 106066046 108087842 110031860 111436204 112129939 112113371 111491408 110501091 109439987
29563 109439987 108516367 107851115 107618533 108001690 108869693 109623068 109624003 108860619 108009253 107706740
29553 107706740 107890209 108010115 107738589 107166687 106349558 105068636 103240031 101251772 99586979
29544I9586979j288127j086716o71781L15320J464720J946144J460672M50122
29536A02177333n67759j429331k019009j976826j038371M90863J880563K609364
29528A00126827K737464K671901K679641K659680K324162J544195N15813l78149
29520A14881534q43422q56989o66133o11012q43721j176545j288007j092664p63398
29511A06739643l49670L86487J562126K789719L494042L544736L295992L025412
29503A24488487K634677J950192J024833J8883r84941j910751k629973l105789
29495A21485618l417861l531000l268850k689655k236370k224827k364480k155153
29487I9597422j683405j592982k145615k672065k245533p60123R12640J815379
$$ plain form
29544 99586979 98298852 97212136 96540355 96855675 98320395 100266539 101727211 102177333
29536 102177333 101609574 100180243 98161234 96184408 95146037 95636900 97517463 100126827
29528 100126827 102864291 105536192 108215833 110875513 113199675 114743870 115259683 114881534
29520 114881534 114038112 113181123 112514990 111903978 111060257 109883712 108595705 107503041 106739643
29511 106739643 106389973 106776460 108338586 111128305 114622347 118167083 121463075 124488487
29503 124488487 127123164 129073356 130098189 130117072 129132131 127221380 124591407 121485618
29495 121485618 118067757 114536757 111267907 108578252 106341882 104117055 101752575 99597422
29487 99597422 97914017 96321035 94175420 91503355 89257822 88497699 89410339 91225718
29479I1225718J764648J304080R86321Q60286O49625K79197O9146L81507J170599
29470I8691127J958747K230571J835234J096194N99768P55786J378010J724050
29462A10269487J168569p8536j084954j147461n09882P328l8342l75267n96597
29453A07614345p32117j043239j470648j624583j321897q36638m88266j99149
29445I9897808L22052J062502J615461J632581J193089O55187K52461q6650n79982
29436A05964509j307382k051654k415263k163319j475298p94305m01514j95745
29428I5160029R5812N71918J058559J279027J067330M65462l29010j117985j815966
29419I6435176k397926k781319k847308k576230k084256j536215j102643r48053
$$ plain form
29479 91225718 92990366 94294446 95280767 96141053 96790678 97069875 97139021 97520528 98691127
29470 98691127 100649874 102880445 104715679 105811873 106411641 107167427 108545437 110269487
29462 110269487 111438056 111359520 110274566 109127105 108617223 108624551 108586209 108210942 107614345
29453 107614345 106882228 105838989 104368341 102743758 101421861 100585223 100096957 99897808
29445 99897808 100219860 101282362 102897823 104530404 105723493 106378680 106631141 106544491 105964509
29436 105964509 104657127 102605473 100190210 98026891 96551593 95757288 95355774 95160029
29428 95160029 95255841 95827759 96886318 98165345 99232675 99698137 99369127 98251142 96435176
29419 96435176 94037250 91255931 88408623 85832393 83748137 82211922 81109279 80161226
29411H0161226j089273j255272j080795n20491P2864L41497K23613k03414r32739
29402G5717216j876810k679958k956471k689810k221615j883401j772906j789068
29394E7847177j677471j113327n253J256071K073896K244318K131977K206398
29386F4963786K547798K849686K756175K135455J166049K51875k39501k54504
29378G6176819o2214O650k24806p68319j506447k177477k424353j949147o57903
29369F6412803J236526L139885M213125L863318K232169J16258j651392k714232
29361G6848460l191476l376461l464948l414027l012511k202089j316774q25077
29353E6045097q10632q94756p13788k78779J82582N04511N95079L89723m4971
$$ plain form
29411 80161226 79071953 77816681 76735886 76215395 76288259 76629756 76853369 76649955 75717216
29402 75717216 73840406 71160448 68203977 65514167 63292552 61409151 59636245 57847177
29394 57847177 56169706 55056379 55051126 56307197 58381093 60625411 62757388 64963786
29386 64963786 67511584 70361270 73117445 75252900 76418949 76670824 76431323 76176819
29378 76176819 76114605 76121255 75896449 75128130 73621683 71444206 69019853 67070706 66412803
29369 66412803 67649329 70789214 75002339 78865657 81097826 81214084 79562692 76848460
29361 76848460 73656984 70280523 66815575 63401548 60389037 58186948 56870174 56045097
29353 56045097 55234465 54339709 53625921 53347142 53529724 54034235 54629314 55019037 54974066
29344E4974066n00328q21085r56614p69837q5107Q93005J490774J204093K84949
29335E5713916n63137r22157q18451l35211M90385J369341J766280J392653N12380
29326E8605999l30882p26475n15846K33919J201973J892448J918861J240840J46285
29317F3667122r29929j641641j969296k220198k612594k872700k495641j459267
29309D7465856l85440J76253L64456O47694J064035J214164R82227Q35987J194957
29300E3560189J759230J772600Q82597n19979j806616k660055k997729k650041
29292D7340196j493845J04602J310200J470226O60880m43215j079766p68886M83379
29283D7583771K059696K981457K654606J421314J73022n78103j026888j500187
$$ plain form
29344 54974066 54473738 53652653 52696039 51926202 51841095 52734100 54224874 55428967 55713916
29335 55713916 55150779 54228622 53410171 53074960 53565345 54934686 56700966 58093619 58605999
29326 58605999 58275117 57548642 57032796 57266715 58468688 60361136 62279997 63520837 63667122
29317 63667122 62737193 61095552 59126256 56906058 54293464 51420764 48925123 47465856
29309 47465856 47080416 47256669 47621125 48268819 49332854 50547018 51529245 52365232 53560189
29300 53560189 55319419 57092019 57974616 57454637 55648021 52987966 49990237 47340196
29292 47340196 45846351 45950953 47261153 48731379 49392259 48949044 47869278 47100392 47583771
29283 47583771 49643467 52624924 55279530 56700844 56873866 56295763 55268875 53768688
29275E3768688j894723j882134j468161j067444j019383j202191j197804p67316
29267D3269532q6374M80686P44956P46616N19066R431o98916j300778j597536
29258D2086683j771007k096612k466055k447959j797775o85206N25270J429207
29250C2776546J568337P06130p00587j649631j506315o07693K23336N48184M77695
29241C1836002K29282q5258l04253k28164J40269O13075J121152J759683K443278
29232C7525066K738423K204650Q09580j067814k901546m177153m467799l636128
29224B7027279k020696k76575J061775J835571K121536K005137J588051J082848
29216C4424926O90668L77864n8597o50709j118834j135473o15435K84206J257844
$$ plain form
29275 53768688 51873965 49991831 48523670 47456226 46436843 45234652 44036848 43269532
29267 43269532 43183158 43663844 44408800 45155416 45674482 45683913 44984997 43684219 42086683
29258 42086683 40315676 38219064 35753009 33305050 31507275 30822069 31347339 32776546
29250 32776546 34344883 35051013 34350426 32700795 31194480 30586787 30810123 31358307 31836002
29241 31836002 32065284 31980026 31675773 31447609 31587878 32200953 33322105 35081788 37525066
29232 37525066 40263489 42468139 43277719 42209905 39308359 35131206 30663407 27027279
29224 27027279 25006583 24730008 25791783 27627354 29748890 31754027 33342078 34424926
29216 34424926 35115594 35493458 35434861 34784152 33665318 32529845 31914410 32198616 33456460
29207C3456460J862819J715651R37398K16969J01850L18895J30887o99977j685807
29198C6355145k327287k592908k574277k142650j249212k38664M67069P86988
29190B6484204Q20535N11054j95692j014757j484250j421174j017175o04727n08559
29181B1569459q99535j500323j639544r57545R3648Q14618J139379J487461J870080
29172B1977698J740760Q10936n13902j667659k426455k707803k371377j541847
29164A3300351p44348l54391j77975J23349M78162O14200N48585M65913L15634
29155A4569480k3183l08478j53613L27601N43387J71433n02375j097492j597090
29146A1929670k085831k369737k179247j571235q29787p2155P48098J476750J716102
$$ plain form
29207 33456460 35319279 37034930 37972328 38189297 38291147 38610042 38740929 38040952 36355145
29198 36355145 34027858 31434950 28860673 26718023 25468811 25230147 25697216 26484204
29190 26484204 27304739 27815793 27620101 26605344 25121094 23699920 22682745 22078018 21569459
29181 21569459 20669924 19169601 17530057 16572512 16666160 17480778 18620157 20107618 21977698
29172 21977698 23718458 24529394 24015492 22347833 19921378 17213575 14842198 13300351
29164 13300351 12556003 12201612 12023637 12146986 12625148 13239348 13787933 14253846 14569480
29155 14569480 14546297 14237819 14084206 14411807 14955194 15126627 14624252 13526760 11929670
29146 11929670 9843839 7474102 5294855 3723620 2893833 2821678 3569776 5046526 6762628
29137F762628J276024M89462o2601n2552M45178J156387J771546J990558J676051
29128A5452681J058227O06919N60167O90534O53481M18461J65657j09104n88936
29119A8908087j252971j803234k057958k163235k291191k358028k204610j861017
29111B915843j441628r36079l09683L02157O81456P01722K74505o65546j847190
29102c24443k515507k027590o42233O03423R03616L62334l30211n72817j19214
29093d662642R47322K190704K942729K762802J809549O52913k24519o64794p25795
29084E028269n28100j67022L56042J064961J766204J992192J409218K81404o57819
29075A0545349q54469l63955L30353P40414N88756j48632j188072j995590k130789
$$ plain form
29137 6762628 8038652 8528114 8465513 8412961 8858139 10014526 11786072 13776630 15452681
29128 15452681 16510908 17117827 17677994 18368528 19022009 19440470 19606127 19497023 18908087
29119 18908087 17655116 15851882 13793924 11630689 9339498 6981470 4776860 2915843
29111 2915843 1474215 538136 228453 530610 1212066 1913788 2188293 1522747 -324443
29102 -324443 -2839950 -4867540 -5509773 -4906350 -4002734 -3640400 -3970611 -4543428 -4662642
29093 -4662642 -3715320 -1524616 1418113 4180915 5990464 6643377 6418858 5754064 5028269
29084 5028269 4500169 4333147 4689189 5754150 7520354 9512546 10921764 11203168 10545349
29075 10545349 9690880 9326925 9657278 10397692 10986448 10837816 9649744 7654154 5523365
29066E523365j637989j018357p28402p29617o04125j04987N23534Q66803R15346
29057C005571J142355J924829L005384L684054L526504K746326J864198J131623
29049B2030844L96301n42770j600381k465570k917831l010351k940223k786785
29041F163234k432785j767350r25901k43373P2808J68757L66947P73798J144023
29032C320158J159796P73564K26738k02527l85863l33988j43381J0470n4312l55036
29022D015619o69939o95858k87160M41387J171563J542799J411491J047629R26563
29013H904094J146860J169476M04744r56546k001479k088172j517359j047627
29005D013991r99328j115870j116540r80153o89543r5516P86800J592972J925978
$$ plain form
29066 5523365 3885376 2867019 2138617 1409000 804875 699888 1223422 2090225 3005571
29057 3005571 4147926 6072755 9078139 12762193 16288697 19035023 20899221 22030844
29049 22030844 22427145 21884375 20283994 17818424 14900593 11890242 8950019 6163234
29041 6163234 3730449 1963099 1037198 793825 866633 1035390 1402337 2176135 3320158
29032 3320158 4479954 5253518 5480256 5277729 4891866 4557878 4414497 4424967 4370655 4015619
29022 4015619 3345680 2649822 2362662 2804049 3975612 5518411 6929902 7977531 8904094
29013 8904094 10050954 11220430 11625174 10668628 8667149 6578977 5061618 4013991
29005 4013991 3014663 1898793 782253 -197900 -887443 -982959 -196159 1396813 3322791
28996C322791J731624J223757N84550q4067o26891q84512q81280q14606q34223
28987B737143r13170r06383o39238O049R34502J773882K135360J999076J717637
28978H844858J571028J439777J037514L96260m7863P4706N74065P94015K71105
28969A4955465p35857j479810j495854j000981m82280j17143J71362K57666j81488
28960I891080j138567k094133k551743k520206k283104j942706j474503j033828
28952e147710q14873o44646r8619Q89697J834172K246328K139045J820703J401632
28943C625729P39547k23386j278428k082063k342141j928794r57404K32059J277075
28934b937806J982505K286329K149841J623253R59316M74368K50492P2442l23386
$$ plain form
28996 3322791 5054415 6278172 6862722 6778655 6151764 5267252 4385972 3571366 2737143
28987 2737143 1823973 917590 278352 284401 1218903 2992785 5128145 7127221 8844858
28978 8844858 10415886 11855663 12893177 13289437 13241574 13316280 13890345 14684360 14955465
28969 14955465 14219608 12739798 11243944 10242963 9760683 9643540 9814902 10072568 9891080
28960 9891080 8752513 6658380 4106637 1586431 -696673 -2639379 -4113882 -5147710
28952 -5147710 -5962583 -6607229 -6705848 -5816151 -3981979 -1735651 403394 2224097 3625729
28943 3625729 4365276 4141890 2863462 781399 -1560742 -3489536 -4446940 -4214881 -2937806
28934 -2937806 -955301 1331028 3480869 5104122 6063438 6537806 6788298 6860740 6537354
28925F537354j007852j816071k396200k324222j396966O9890J374471K007613
28917A048017K054172J943342J889881J698024J056118r9562j475412k551595
28909E562985k855282k257750j056661K69359J343026J891207J672748P06029
28901E275661m62981j082128r47965n98968n88581q16984q23195m86228o1133
28892e92502L28085P72281J165406J181401P91202L76202J07836l90770j436531
28883B302610k660513l410256l580631l592570l626543l336882k389889r32097
28875b1226771N52545J555515J697616R79487L9411k13412M78472J362995J479125
28866a3295017O60340m35477j078660r98833l64414M08577Q65898Q41103O40053
$$ plain form
28925 6537354 5529502 3713431 1317231 -1006991 -2403957 -2334067 -959596 1048017
28917 1048017 3102189 5045531 6935412 8633436 9689554 9589992 8114580 5562985
28909 5562985 2707703 449953 -606708 -337349 1005677 2896884 4569632 5275661
28901 5275661 4812680 3730552 2782587 2183619 1595038 778054 -45141 -531369 -592502
28892 -592502 -264417 507864 1673270 2854671 3645873 4022075 4129911 3739141 2302610
28883 2302610 -357903 -3768159 -7348790 -10941360 -14567903 -17904785 -20294674 -21226771
28875 -21226771 -20674226 -19118711 -17421095 -16441608 -16402197 -16615609 -16137137 -14774142 -13295017
28866 -13295017 -12634677 -13070154 -14148814 -15147647 -15512061 -15103484 -14237586 -13396483 -12756430
28857a2756430P43780J326638K178723K993794L523653L551591L026960K247272
28849F835981J632703J257565Q44139K74659j71966k20096L2243L34508O42474
28840A1462210R86663J127209O57693n29865k074858l434089m168528l998092
28832B8343k866721j113044N55203J443973J309146M73029m25843q58901p50916
28823b205731m61186l52194l79733k17725K34397O61107P01648L18021l05883
28814b007279j013956j631783j860591j525251q81766m07335k89634l71271n62900
28805a0551766r42648j350656j289421n29610M26719Q16877M29643l13290r27932
28796a4232084j182912r66828l01375M28895O49137K11509l77981n13416j06538
$$ plain form
28857 -12756430 -12012650 -10686012 -8507289 -5513495 -1989842 1561749 4588709 6835981
28849 6835981 8468684 9726249 10570388 10845047 10673081 10452985 10485228 10819736 11462210
28840 11462210 12448873 13576082 14233775 13703910 11629052 8194963 4026435 28343
28832 28343 -2838378 -3951422 -3396219 -1952246 -643100 -170071 -595914 -1454815 -2205731
28823 -2205731 -2666917 -3019111 -3398844 -3616569 -3382172 -2721065 -2019417 -1701396 -2007279
28814 -2007279 -3021235 -4653018 -6513609 -8038860 -8920626 -9327961 -9617595 -9988866 -10551766
28805 -10551766 -11494414 -12845070 -14134491 -14664101 -14237382 -13420505 -12990862 -13304152 -14232084
28796 -14232084 -15414996 -16381824 -16683199 -16254304 -15605167 -15393658 -15771639 -16285055 -16391593
28787a6391593M41115O63228L00938n95242j601393k116085j866140j167526n57696
28778b2890394k88187k98958m79514p04737p72390o27718n86788j009029j727981
28769b9385696k103708j715085p51917L52082J386188K280291K797763K639720
28761b4500362J862462R72340M84266M30355L80202l4434o66579j003273p58806
28752b2833829j84850K81124N24654P48664J077518J413127J667274J888418K096035
28743a3321865K195887K155850K096230K090256K004659J653716J016717K06916
28735I8366o88205j638456k593141l421211l876156l643546k592817j046414L60493
28726a9041087J197665J510002J521978J286390Q06864L42233L01414Q12520J553210
$$ plain form
28787 -16391593 -15950478 -15287250 -14986312 -15581554 -17182947 -19299032 -21165172 -22332698 -22890394
28778 -22890394 -23178581 -23477539 -23957053 -24661790 -25434180 -26061898 -26648686 -27657715 -29385696
28769 -29385696 -31489404 -33204489 -33956406 -33604324 -32218136 -29937845 -27140082 -24500362
28761 -24500362 -22637900 -21665560 -21181294 -20750939 -20370737 -20405171 -21071750 -22075023 -22833829
28752 -22833829 -23018679 -22737555 -22212901 -21464237 -20386719 -18973592 -17306318 -15417900 -13321865
28743 -13321865 -11125978 -8970128 -6873898 -4783642 -2778983 -1125267 -108550 98366
28735 98366 -589839 -2228295 -4821436 -8242647 -12118803 -15762349 -18355166 -19401580 -19041087
28726 -19041087 -17843422 -16333420 -14811442 -13525052 -12718188 -12375955 -12074541 -11262021 -9708811
28717i708811K025838J918269J269430M51290k8686J08233O71256J200621J422127
28708f70433J422224J392837J344708J124434O09894j84205j124075j991446k524784
28699f00846k527259k020415j314215q61991r32948j375791j755485j764358j462488
$$ plain form
28717 -9708811 -7682973 -5764704 -4495274 -4043984 -4072670 -3964437 -3293181 -2092560 -670433
28708 -670433 751791 2144628 3489336 4613770 5223664 5039459 3915384 1923938 -600846
28699 -600846 -3128105 -5148520 -6462735 -7324726 -8257674 -9633465 -11388950 -13153308 -14615796
$$ [...]
##END NTUPLES=NMR SPECTRUM
##END=
