##TITLE=31Pdec_IPACAT-33-4
  CDCl3
  24 sc
 4.10.2023
##JCAMPDX= 6.0         $$ Bruker NMR JCAMP-DX V2.0
##DATA TYPE= NMR SPECTRUM
##DATA CLASS= NTUPLES
##ORIGIN= UXNMR, Bruker Analytische Messtechnik GmbH
##OWNER= root
$$ XWIN-NMR		Version 3.5
$$ Wed Oct  4 15:56:15 2023 Russian Standard Time (UT+4h)  she@DPX200
##.OBSERVE FREQUENCY= 81.013821
##.OBSERVE NUCLEUS= ^31P
##.ACQUISITION MODE= SIMULTANEOUS
##.ACQUISITION SCHEME= undefined
##.AVERAGES= 24
##.DIGITISER RES= 16
##SPECTROMETER/DATA SYSTEM= spect
##.PULSE SEQUENCE= zgpg30
##.SOLVENT NAME= CDCl3
##.SHIFT REFERENCE= (INTERNAL, CDCl3, 0, 248.564)
##AUDIT TRAIL= $$ (NUMBER, WHEN, WHO, WHERE, WHAT)
$$ ##TITLE= Audit trail, XWIN-NMR		Version 3.5
$$ ##JCAMPDX= 5.01
$$ ##ORIGIN= Bruker BioSpin GmbH
$$ ##OWNER= she
$$ F:/spectra/data/she/nmr/P31/1/pdata/1/auditp.txt
$$ ##AUDIT TRAIL=  $$ (NUMBER, WHEN, WHO, WHERE, WHAT)
(   1,<2023-10-04 15:55:18.26 +0400>,<she>,<DPX200>,
      <created by zg, POWCHK disabled, PULCHK disabled
       configuration hash MD5:
       00 E9 B6 7A A2 85 ED C7 34 08 36 98 17 FE 4E 26
       data hash MD5: 32K
       98 36 2E BD AD D2 F6 71 96 71 F1 F4 A8 01 1A F7>)
(   2,<2023-10-04 15:55:20.71 +0400>,<she>,<DPX200>,
      <Start of raw data processing
       efp BC_mod = 2 LB = 5 FT_mod = 6 PKNL = 1 PHC0 = -10617.42 PHC1 = 13.28622 SI = 64K 
       data hash MD5: 64K
       7F DA 43 5C 23 A1 C1 59 22 F1 21 14 2D 7E 1C 47>)
(   3,<2023-10-04 15:55:39.70 +0400>,<she>,<DPX200>,
      <pk PHC0 = -92.21716 PHC1 = 182 
       data hash MD5: 64K
       64 F1 E3 2B 0C F2 A5 C0 CF C4 4D 9F CA 7E 05 38>)
$$ ##END=
$$ 
$$ hash MD5
$$ E9 62 8C 0B 40 87 EE 61 EE 93 F2 CA 99 B8 AA 56
##$RELAX= 
##$RELAX= 
##$RELAX= 
##$RELAX= 
##$RELAX= 
##$RELAX= 
##$RELAX= 
##$RELAX= 
##$RELAX= 
$$ Bruker specific parameters
$$ --------------------------
##$DU= <F:/spectra>
##$EXPNO= 1
##$NAME= <P31>
##$PROCNO= 1
##$TYPE= <nmr>
##$USER= <she>
##$AMP= (0..31)
100 100 100 100 100 100 100 100 100 100 100 100 100 100 100 100 100 100 
100 100 100 100 100 100 100 100 100 100 100 100 100 100 
##$AQSEQ= 0
##$AQ_mod= 1
##$AUNM= <au_zg>
##$AUTOPOS= <>
##$BF1= 81.014009
##$BF2= 200.13
##$BF3= 200.13
##$BF4= 200.13
##$BF5= 200.13
##$BF6= 200.13
##$BF7= 200.13
##$BF8= 200.13
##$BYTORDA= 1
##$CFDGTYP= 0
##$CFRGTYP= 5
##$CHEMSTR= <none>
##$CNST= (0..31)
1 1 145 1 1 1 1 1 1 1 1 1 1 1 1 1 1 1 1 1 1 1 1 1 1 1 1 1 1 1 1 1 
##$CPDPRG= <waltz16>
##$CPDPRG1= <>
##$CPDPRG2= <waltz16>
##$CPDPRG3= <>
##$CPDPRG4= <mlev>
##$CPDPRG5= <mlev>
##$CPDPRG6= <mlev>
##$CPDPRG7= <mlev>
##$CPDPRG8= <mlev>
##$CPDPRGB= <>
##$CPDPRGT= <>
##$D= (0..31)
0 1 0 0 0 0 0 0 0 0 0 0.03 2e-05 3e-06 0 0 0 0 0 0 0 0 0 0 0 0 0 0 0 0 
0 0 
##$DATE= 1696420517
##$DBL= (0..7)
120 120 120 11 120 120 24 19 
##$DBP= (0..7)
150 150 150 150 150 150 150 150 
##$DBP07= 0
##$DBPNAM0= <>
##$DBPNAM1= <>
##$DBPNAM2= <>
##$DBPNAM3= <>
##$DBPNAM4= <>
##$DBPNAM5= <>
##$DBPNAM6= <>
##$DBPNAM7= <>
##$DBPOAL= (0..7)
0.5 0.5 0.5 0.5 0.5 0.5 0.5 0.5 
##$DBPOFFS= (0..7)
$$ [...]
##$SUBNAM2= <"">
##$SUBNAM3= <"">
##$SUBNAM4= <"">
##$SUBNAM5= <"">
##$SUBNAM6= <"">
##$SUBNAM7= <"">
##$SUBNAM8= <"">
##$SUBNAM9= <"">
##$SW= 501.771253377433
##$SWIBOX= (0..15)
0 1 3 0 0 0 0 0 0 0 0 0 0 0 0 0 
##$SW_h= 40650.406504065
##$TD= 32768
##$TD0= 1
##$TE= 0
##$TE2= 300
##$TE3= 300
##$TEG= 300
##$TL= (0..7)
0 120 53 12 22 120 120 120 
##$TP= (0..7)
150 150 150 150 150 150 150 150 
##$TP07= 0
##$TPNAME0= <>
##$TPNAME1= <>
##$TPNAME2= <>
##$TPNAME3= <>
##$TPNAME4= <>
##$TPNAME5= <>
##$TPNAME6= <>
##$TPNAME7= <>
##$TPOAL= (0..7)
0.5 0.5 0.5 0.5 0.5 0.5 0.5 0.5 
##$TPOFFS= (0..7)
0 0 0 0 0 0 0 0 
##$TUNHIN= 0
##$TUNHOUT= 0
##$TUNXOUT= 0
##$USERA1= <user>
##$USERA2= <user>
##$USERA3= <user>
##$USERA4= <user>
##$USERA5= <user>
##$V9= 5
##$VALIST= <valist>
##$VCLIST= <CCCCCCCCCCCCCCC>
##$VD= 0
##$VDLIST= <DDDDDDDDDDDDDDD>
##$VPLIST= <PPPPPPPPPPPPPPP>
##$VTLIST= <TTTTTTTTTTTTTTT>
##$WBST= 1024
##$WBSW= 4
##$XGAIN= (0..3)
0 0 0 0 
##$XL= 0
##$YL= 0
##$YMAX_a= 4046
##$YMIN_a= -3447
##$ZGOPTNS= <>
##$ZL1= 120
##$ZL2= 120
##$ZL3= 120
##$ZL4= 120
##$ABSF1= 0
##$ABSF2= 0
##$ABSG= 0
##$ABSL= 0
##$ALPHA= 0
##$AQORDER= 0
##$ASSFAC= 0
##$ASSFACI= 0
##$ASSFACX= 0
##$ASSWID= 0
##$AUNMP= <proc_1d>
##$AZFE= 0.1
##$AZFW= 0.5
##$BCFW= 0
##$BC_mod= 2
##$BYTORDP= 0
##$COROFFS= 0
##$CY= -3
##$DATMOD= 1
##$DC= 0
##$DFILT= <>
##$DTYPP= 0
##$F1P= 0
##$F2P= 0
##$FCOR= 1
##$FTSIZE= 65536
##$FT_mod= 6
##$GAMMA= 0
##$GB= 0
##$INTBC= 1
##$INTSCL= 6.047779e-11
##$ISEN= 30
##$LB= 5
##$LEV0= 0
##$LPBIN= 0
##$MAXI= 10000
##$MC2= 0
##$MEAN= 0
##$ME_mod= 0
##$MI= 50
##$NCOEF= 0
##$NC_proc= -8
##$NLEV= 6
##$NOISF1= 182.463
##$NOISF2= 159.3651
##$NSP= 0
##$NTH_PI= 0
##$NZP= 0
##$OFFSET= 248.5645
##$PC= 4
##$PHC0= -10709.64
##$PHC1= 195.2862
##$PH_mod= 1
##$PKNL= yes
##$PPARMOD= 0
##$PSCAL= 0
##$PSIGN= 0
##$REVERSE= no
##$SF= 81.0140089999694
##$SI= 65536
##$SIGF1= 159.3651
##$SIGF2= -187.1042
##$SINO= 113.3802
##$SIOLD= 16384
##$SREGLST= <1H.CDCl3>
##$SSB= 0
##$STSI= 65536
##$STSR= 0
##$SW_p= 40650.406504065
##$SYMM= 0
##$S_DEV= 0
##$TDeff= 32768
##$TDoff= 0
##$TI= <>
##$TILT= no
##$TM1= 0
##$TM2= 0
##$TOPLEV= 0
##$USERP1= <user>
##$USERP2= <user>
##$USERP3= <user>
##$USERP4= <user>
##$USERP5= <user>
##$WDW= 1
##$XDIM= 65536
##$YMAX_p= 442066064
##$YMIN_p= -13515715
$$ End of Bruker specific parameters
$$ ---------------------------------
##NTUPLES= NMR SPECTRUM
##VAR_NAME=  FREQUENCY,     SPECTRUM/REAL,   SPECTRUM/IMAG
##SYMBOL=    X,             R,               I
##VAR_TYPE=  INDEPENDENT,   DEPENDENT,       DEPENDENT
##VAR_FORM=  AFFN,          ASDF,            ASDF
##VAR_DIM=   65536,         65536,           65536
##UNITS=     HZ,            ARBITRARY UNITS, ARBITRARY UNITS
##FACTOR=    0.620285442955139, 1,           1
##FIRST=     20137.2065510682, 0,            0
##LAST=      -20513.1999529968, 0,           0
##MIN=       -20513.1999529968, -13515715,   0
##MAX=       20137.2065510682, 442066064,    0
$$ Real data points
##PAGE= N=1
##DATA TABLE= (X++(R..R)), XYDATA
$$ [...]
$$ plain form
38768 -3279716 -3199940 -2975472 -2660452 -2258545 -1741841 -1114865 -455278 122121 551508 863688
38758 863688 1146512 1469295 1848030 2252961 2615559 2842839 2874823 2749419 2594837 2554551
38748 2554551 2730653 3170865 3843471 4603356 5236040 5585486 5635539 5465787 5171288 4845060
38738 4845060 4576195 4390525 4201564 3878968 3382060 2799779 2256078 1798204 1374135
38729 1374135 893423 310728 -324739 -896240 -1311012 -1569131 -1740305 -1890022 -2040419
38720 -2040419 -2175559 -2252914 -2228169 -2106573 -1958196 -1843136 -1731695 -1543317 -1255018 -909124
38710 -909124 -504552 44447 786918 1610251 2293759 2679122 2753224 2583752 2235627 1770874
38700 1770874 1285805 897469 680956 628468 669073 718245 706137 575061 281836 -170082
$$ packed form
38768c279716P9776K24468L15020M01907N16704O26976O59587N77399M29387L12180
38758H63688K82824L22783L78735M04931L62598K27280L1984j25404j54582m0286
38748B554551J76102M40212O72606P59885O32684L49446N0053j69752k94499l26228
38738D845060k68865j85670j88961l22596m96908n82281n43701m57874m24069
38729A374135m80712n82695o35467n71501m14772k58119j71174j49717j50397
38720b040419j35140p7355K4745J21596J48377J15060J11441J88378K88299L45894
38710i09124M04572N48999P42471Q23333O83508L85363P4102j69472l48125m64753
38700A770874m85069l88336k16513n2488M0605M9172j2108j31076k93225m51918
$$ plain form
38690 -170082 -700299 -1177735 -1503738 -1681760 -1807375 -1987490 -2258668 -2567002 -2817320 -2947366
38680 -2947366 -2968093 -2943542 -2934331 -2949612 -2932674 -2781465 -2396600 -1736215 -840558 192820
38670 192820 1254481 2247411 3090435 3727061 4133992 4299743 4189027 3756559 3027143
38661 3027143 2158755 1391847 901874 686697 599083 491955 330519 164996 13159 -197542
38651 -197542 -553335 -1036696 -1519831 -1888669 -2153411 -2413881 -2726910 -3041928 -3271529 -3375226
38641 -3375226 -3321442 -2989213 -2198668 -903189 671696 2135434 3187923 3759744 3945176
38632 3945176 3875211 3665669 3411528 3167294 2944530 2753974 2626664 2566126 2505996 2357637
38622 2357637 2099303 1797279 1544967 1393617 1325390 1275823 1198771 1123343 1121532 1202142 1273214
$$ packed form
38690a70082n30217m77436l26003j78022j25615j80115k71178l08334k50318j30046
38680b947366k0727K4551R211j5281J6938J51209L84865O60385Q95657J033378
38670A92820J061661R92930Q43024O36626M06931J65751j10716m32468p29416
38661C027143q68388p66908m89973k15177q7614j07128j61436j65523j51837k10701
38651a97542l55793m83361m83135l68838k64742k60470l13029l15018k29601j03697
38641c375226N3784L32229P90545J295479J574885J463738J052489N71821J85432
38632C945176o9965k09542k54141k44234k22764j90556j27310o0538o0130j48359
38622B357637k58334l02024k52312j51350o8227m9567p7052p5428j811Q0610P1072
$$ plain form
38611 1273214 1243169 1124992 993189 861765 657966 306482 -202964 -810871 -1395069 -1801656
38601 -1801656 -1946500 -1904145 -1848096 -1895415 -2047772 -2257997 -2463560 -2545070 -2357437 -1868493
38591 -1868493 -1215148 -578640 -56886 305447 443377 314246 -25909 -466599 -939665
38582 -939665 -1407782 -1794109 -2018849 -2105754 -2168334 -2270152 -2359773 -2358987 -2256954 -2101587 -1958567
38571 -1958567 -1901368 -1977618 -2142705 -2273265 -2290157 -2229536 -2147928 -1998517 -1670873 -1145169
38561 -1145169 -546660 -37823 296755 446106 409032 188188 -156914 -490549 -662771 -601585
38551 -601585 -352561 -36265 234167 409402 505129 568659 643456 745591 855346 928824
38541 928824 925165 831208 672204 512677 444475 546295 824041 1185206 1489191 1639285
$$ packed form
38611A273214l0045j18177j31803j31424k03799l51484n09446o07907n84198m06587
38601a801656j44844M2355N6049m7319j52357k10225k05563q1510J87633M88944
38591a868493O53345O36508N21754L62333J37930j29131l40155m40690m73066
38582i39665m68117l86327k24740q6905o2580j01818q9621P86J02033J55367J43020
38571a958567N7199p6250j65087j30560j6892O0621Q1608J49411L27644N25704
38561a145169N98509N08837L34578J49351l7074k20844l45102l33635j72222O1186
38551f01585K49024L16296K70432J75235R5727O3530P4797J02135J09755P3478
38541I28824l659r3957j59004j59527o8202J01820K77746L61165L03985J50094
$$ plain form
38531 1639285 1632669 1532440 1411158 1327628 1330016 1436474 1595006 1689443 1624779 1419273 1199369
38520 1199369 1095479 1145937 1294902 1459361 1589203 1690088 1823217 2081964 2531907 3137985
38510 3137985 3740535 4117948 4105942 3695385 3037225 2345393 1773579 1371006 1141640 1115874
38500 1115874 1338735 1797024 2389481 2980988 3473968 3828629 4045998 4156725 4208165 4221928
38490 4221928 4152571 3915153 3479326 2929736 2410660 2004932 1679724 1354528 1005126 688275
38480 688275 478664 404381 443634 565744 768523 1083995 1544887 2128130 2728790 3211747
38470 3211747 3507194 3652506 3736321 3806458 3824668 3689021 3304142 2672359 1943361 1344128
38460 1344128 1015018 913194 896161 883535 903599 997838 1139307 1266572 1355815 1421163
$$ packed form
38531A639285o616j00229j21282q3530K388J06458J58532R4437o4664k05506k19904
38520A199369j03890N0458J48965J64459J29842J00885J33129K58747M49943O06078
38510C137985O02550L77413j2006m10557o58160o91832n71814m02573k29366k5766
38500A115874K22861M58289N92457N91507M92980L54661K17369J10727N1440J3763
38490D221928o9357k37418m35827n49590n19076m05728l25208l25196l49402l16851
38480F88275k09611p4283L9253J22110K02779L15472M60892N83243O00660M82957
38470C211747K95447J45312Q3815P0137J8210j35647l84879o31783p28998n99233
38460A344128l29110j01824j7033j2626K0064R4239J41469J27265Q9243O5348
$$ plain form
38450 1421163 1461321 1444384 1352559 1221788 1119305 1071406 1007745 790245 329097 -311219
38440 -311219 -935676 -1371110 -1596971 -1714587 -1792942 -1768819 -1514324 -989825 -302362 394253
38430 394253 1026851 1598751 2079426 2364742 2379876 2178340 1888139 1584356 1274598 997275
38420 997275 849815 880979 1010163 1107095 1125597 1112357 1102850 1063414 941807 735237 497070
38409 497070 308972 263289 440346 856362 1416135 1932890 2225912 2228262 2015587 1735412
38399 1735412 1512340 1415829 1485376 1741353 2161450 2675011 3194612 3636254 3913107 3959267
38389 3959267 3793147 3530553 3303193 3181085 3187361 3331385 3559270 3699004 3548997 3059239
38379 3059239 2382425 1718570 1139835 589692 23123 -484439 -758353 -645896 -144134
$$ packed form
38450A421163M0158j6937r1825j30771j02483m7899o3661k17500m61148o40316
38440c11219o24457m35434k25861j17616p8355K4123K54495N24499O87463O96615
38430C94253O32598N71900M80675K85316J5134k01536k90201l03783l09758k77323
38420I97275j47460L1164J29184R6932J8502j3240r507l9436j21607k06570k38167
38409D97070j88098m5683J77057M16016N59773N16755K93022K350k12675k80175
38399A735412k23072r6511O9547K55977M20097N13561N19601M41642K76853M6160
38389C959267j66120k62594k27360j22108O276J44024K27885J39734j50007m89758
38379C059239o76814o63855n78735n50143n66569n07562k73914J12457N01762
$$ plain form
38370 -144134 564689 1213014 1607222 1708697 1591013 1357358 1100615 898197 806801 856229
38360 856229 1041884 1308163 1557023 1718264 1814584 1910499 1988867 1940978 1717453 1438318
38350 1438318 1295921 1372706 1603872 1898630 2239793 2663030 3184728 3763259 4306383 4713583
38340 4713583 4930427 4961228 4824760 4527281 4100557 3623568 3153260 2657212 2073111 1420989
38330 1420989 793432 240724 -261217 -715466 -1048073 -1181962 -1116098 -899060 -571326 -172354
38320 -172354 233388 580931 836271 982142 1007933 943458 863926 817285 770135 661269
38310 661269 480179 253517 -7688 -279863 -460293 -407629 -82651 382143 772177 938964
38300 938964 878134 713947 622686 725687 1009951 1343518 1571532 1601199 1425658 1120596
$$ packed form
38370a44134P08823O48325L94208J01475j17684k33655k56743k02418r1396M9428
38360H56229J85655K66279K48860J61241R6320R5915P8368m7889k23525k79135
38350A438318j42397P6785K31166K94758L41163M23237N21698N78531N43124M07200
38340D713583K16844L0801j36468k97479m26724m76989m70308m96048n84101o52122
38330A420989o27557n52708n01941m54249l32607j33889O5864K17038L27734L98972
38320a72354M05742L47543K55340J45871K5791o4475p9532m6641m7150j08866
38310F61269j81090k26662k61205k72175j80430N2664L24978M64794L90034J66787
38300I38964o0830j64187r1261J03001K84264L33567K28014K9667j75541l05062
$$ plain form
38290 1120596 837118 754097 975999 1447786 1970935 2314841 2334078 2009206 1407395 629473
38280 629473 -199122 -916495 -1358131 -1435486 -1177888 -700099 -159058 256540 367841 122369
38270 122369 -324937 -703164 -831767 -736450 -580373 -515365 -587280 -727805 -811515 -753117
38260 -753117 -581082 -411362 -341543 -380190 -472266 -560444 -609152 -596784 -511392 -353615 -141061
38249 -141061 84430 264900 365513 403066 411170 382221 277171 93076 -119108 -316318
38239 -316318 -508021 -722430 -954558 -1154665 -1232572 -1070149 -594137 117035 837731 1361259
38229 1361259 1652806 1812554 1926671 2015445 2111654 2308678 2684596 3194863 3663419 3891309
38219 3891309 3802747 3516159 3258195 3163182 3145826 2999140 2627596 2163439 1852262 1852044
$$ packed form
38290A120596k83478q3021K21902M71787N23149L43906J9237l24872o01811p77922
38280F29473q28595p17373m41636p7355K57598M77789N41041M15598J11301k45472
38270A22369m47306l78227j28603R5317J56077O5008p1915j40525q3710N8398
38260g53117J72035J69720O9819l8647r2076q8178m8708J2368Q5392J57777K12554
38249a41061K25491J80470J00613L7553Q104k8949j05050j84095k12184j97210
38239c16318j91703k14409k32128k00107p7907J62423M76012P11172P20696N23528
38229A361259K91547J59748J14117Q8774R6209J97024L75918N10267M68556K27890
38219C891309q8562k86588k57964r5013j7356j46686l71544m64157l11177k18
$$ plain form
38209 1852044 2145044 2597411 3064602 3459479 3771184 4043689 4321824 4595921 4793205
38200 4793205 4829395 4671141 4344278 3889261 3339541 2766309 2315351 2138454 2269048 2604943
38190 2604943 3033935 3529508 4082829 4589408 4885954 4903366 4719930 4446113 4111170 3691377
38180 3691377 3201283 2709677 2287629 1980942 1819426 1811091 1925673 2115667 2359246 2656313
38170 2656313 2973954 3221325 3298551 3162302 2835416 2372129 1840130 1329699 942806 748209
38160 748209 756019 948008 1315809 1847282 2491112 3170794 3828819 4412702 4811843 4874028
38150 4874028 4542797 3956460 3357058 2900285 2585062 2346584 2150587 1981287 1798982
38141 1798982 1561868 1279278 1022499 893305 977915 1282125 1678005 1954427 1981466 1825127
$$ packed form
38209A852044K93000M52367M67191L94877L11705K72505K78135K74097J97284
38200D793205L6190j58254l26863m55017n49720n73232m50958j76897J30594L35895
38190B604943M28992M95573N53321N06579K96546J7412j83436k73817l34943m19793
38180C691377m90094m91606m22048l06687j61516q335J14582J89994K43579K97067
38170B656313L17641K47371P7226j36249l26886m63287n31999n10431l86893j94597
38160G48209P810J91989L67801N31473O43830O79682O58025N83883L99141O2185
38150D874028l31231n86337n99402m56773l15223k38478j95997j69300j82305
38141A798982k37114k82590k56779j29194Q4610L04210L95880K76422K7039j56339
$$ plain form
38131 1825127 1656122 1536498 1331131 846813 39599 -921845 -1771352 -2311730 -2507824
38122 -2507824 -2469431 -2351971 -2237384 -2077233 -1748546 -1179262 -428583 348092 996439 1414462
38112 1414462 1533843 1313668 800533 180458 -286365 -424045 -241685 117147 501272
38103 501272 819171 1014215 1027265 814833 402460 -95429 -525358 -780786 -849222 -776573
38093 -776573 -590545 -273617 182752 715110 1203245 1551213 1736704 1770760 1621052 1197956
38083 1197956 433481 -619217 -1765322 -2755348 -3413232 -3711394 -3754260 -3702771 -3693526 -3785146
38073 -3785146 -3945450 -4083693 -4110737 -3986171 -3721588 -3352900 -2921070 -2478101 -2095018 -1843945
38063 -1843945 -1763133 -1843302 -2051799 -2360172 -2731469 -3081704 -3282211 -3232100 -2936612 -2502340
$$ packed form
38131A825127j69005j19624k05367m84318q07214r61444q49507n40378j96094
38122b507824L8393J17460J14587J60151L28687N69284P50679P76675O48347M18023
38112A414462J19381k20175n13135o20075m66823j37680J82360L58832L84125
38103E01272L17899J95044J3050k12432m12373m97889m29929k55428o8436P2649
38093g76573J86028L16928M56369N32358M88135L47968J85491L4056j49708m23096
38083A197956p64475j052698j146105r90026o57884k98162m2866N1489R245r1620
38073c785146j60304j38243k7044J24566K64583L68688M31830M42969L83083K51073
38063a843945Q0812q0169k08497l08373l71297l50235k00507N0111K95488M34272
$$ plain form
38053 -2502340 -2047193 -1615460 -1175505 -687262 -168399 295437 601683 708383 682047 671758
38043 671758 820549 1183122 1715033 2327673 2940680 3480323 3850360 3946438 3732572 3303275
38033 3303275 2842448 2495982 2277550 2095111 1858874 1564761 1296844 1167272 1237606 1466445
38023 1466445 1725908 1887008 1902927 1812786 1674696 1507465 1290671 1004187 668119 356718
38013 356718 165400 138543 222585 304966 302286 199730 18379 -215646 -457226 -634492
38003 -634492 -689968 -624617 -490411 -358644 -314088 -455658 -855328 -1492883 -2232946 -2871593
37993 -2871593 -3224963 -3219968 -2940526 -2578998 -2305474 -2164569 -2098379 -2056037 -2060854 -2177804
37983 -2177804 -2439492 -2802377 -3151164 -3345384 -3293557 -3007172 -2585575 -2151795 -1802686 -1584366
$$ packed form
38053b502340M55147M31733M39955M88243N18863M63836L06246J06700k6336j0289
38043F71758J48791L62573N31911O12640O13007N39643L70037R6078k13866m29297
38033C303275m60827l46466k18432j82439k36237k94113k67917j29572P0334K28839
38023A466445K59463J61100J5919r0141j38090j67231k16794k86484l36068l11401
38013C56718j91318k6857Q4042Q2381k680j02556j81351k34025k41580j77266
38003f34492n5476O5351J34206J31767M4556j41570l99670o37555p40063o38647
37993b871593l53370M995K79442L61528K73524J40905O6190M2342m817j16950
37983b177804k61688l62885l48787j94220N1827K86385M21597M33780L49109K18320
$$ plain form
37973 -1584366 -1461164 -1307718 -997698 -549288 -156699 -29590 -200707 -511811 -767006
37964 -767006 -861232 -782126 -568314 -313054 -172540 -305573 -770107 -1464940 -2160762 -2604515
37954 -2604515 -2652672 -2355247 -1904845 -1467147 -1049096 -541797 118919 857213 1508213 1925498
37944 1925498 2040837 1875339 1533187 1157025 835154 538878 174709 -290869 -770849
37935 -770849 -1125489 -1280033 -1277090 -1233434 -1256428 -1385213 -1584357 -1780083 -1907119 -1932486
37925 -1932486 -1844757 -1628961 -1261219 -737897 -114149 494482 963133 1220521 1272333 1184758
37915 1184758 1060831 1008131 1073545 1182900 1177724 956471 582998 236450 57389 55135
37905 55135 142792 220021 220053 122228 -46912 -232145 -382621 -462232 -433117 -260472 45278
$$ packed form
37973a584366J23202J53446L10020M48410L92589J27109j71117l11104k55195
37964g67006r4226P9106K13812K55260J40514j33033m64534o94833o95822m43753
37954b604515m8157K97425M50402M37698M18051N07299O60716P38294O51000M17285
37944A925498J15339j65498l42152l76162l21871k96276l64169m65578m79980
37935g70849l54640j54544K943M3656k2994j28785j99144j95726j27036k5367
37925a932486Q7729K15796L67742N23322O23748O08631M68651K57388N1812q7575
37915A184758j23927n2700O5414J09355n176k21253l73473l46548j79061k254
37905E5135Q7657P7229L2r7825j69140j85233j50476p9611K9115J72645L05750
$$ plain form
37894 45278 406092 717446 911698 979807 949019 850856 692399 441509 58304 -434124
37884 -434124 -924393 -1291121 -1506552 -1637744 -1750723 -1850000 -1915621 -1948854 -1946296 -1864475 -1665159
37873 -1665159 -1389826 -1137878 -958129 -804247 -619268 -422336 -269426 -153968 -1986
37864 -1986 232560 514148 779610 1004648 1193479 1333825 1389505 1312469 1033343 469634
37854 469634 -400491 -1461700 -2489950 -3276531 -3728416 -3875612 -3823577 -3698445 -3587716
37845 -3587716 -3491996 -3334325 -3028255 -2536714 -1873358 -1075414 -195338 689442 1478423 2076274
37835 2076274 2439607 2611662 2698460 2781852 2852652 2854116 2796178 2792217 2949950 3229109 3429754
37824 3429754 3338403 2899770 2258498 1634139 1147086 762765 397010 46825 -203753 -282657
$$ packed form
37894D5278L60814L11354J94252O8109l0788r8163j58457k50890l83205m92428
37884d34124m90269l66728k15431j31192j12979r9277o5621l3233K558Q1821J99316
37873a665159K75333K51948J79749J53882J84979J96932J52910J15458J51982
37864a986K34546K81588K65462K25038J88831J40346N5680p7036k79126n63709
37854D69634q70125j061209j028250p86581m51885j47196N2035J25132J10729
37845c587716R5720J57671L06070M91541O63356P97944Q80076Q84780P88981N97851
37835B076274L63333J72055Q6798Q3392P0800J464n7938l961J57733K79159K00645
37824C429754r1351m38633o41272o24359m87053l84321l65755l50185k50578p8904
$$ plain form
37814 -282657 -196737 -13713 173916 264197 178555 -87340 -459892 -837956 -1123171 -1218465
37804 -1218465 -1070731 -748674 -422744 -215427 -96949 40639 251833 527683 863114
37795 863114 1239632 1542116 1580561 1242779 601386 -143361 -798802 -1256062 -1478836 -1452964
37785 -1452964 -1148744 -543048 297554 1169634 1820892 2113627 2094667 1918366 1735850 1639646
37775 1639646 1632050 1599189 1359410 795684 -58644 -1076110 -2142440 -3179134 -4103180
37766 -4103180 -4835676 -5359629 -5726905 -5995263 -6185252 -6299096 -6337888 -6275178 -6044316 -5593411
37756 -5593411 -4957649 -4262758 -3657727 -3249104 -3079112 -3125580 -3301142 -3470208 -3502686 -3337821
37746 -3337821 -3009745 -2619444 -2279209 -2061996 -1975804 -1975548 -2006659 -2042981 -2084593 -2134782 -2202228
$$ packed form
37814b82657Q5920J83024J87629R0281q5642k65895l72552l78064k85215r5294
37804a218465J47734L22057L25930K07317J18478J37588K11194K75850L35431
37795H63114L76518L02484L8445l37782o41393p44747o55441m57260k22774K5872
37785a452964L04220O05696Q40602Q72080O51258K92735j8960j76301j82516r6204
37775A639646p596l2861k39779n63726q54328j017466j066330j036694r24046
37766d103180p32496n23953l67276k68358j89989j13844l8792O2710K30862M50905
37756e593411O35762O94891O05031M08623J69992m6468j75562j69066l2478J64865
37746c337821L28076L90301L40235K17213Q6192K56l1111l6322m1612n0189o7446
$$ plain form
37735 -2202228 -2320485 -2528239 -2810755 -3085086 -3264442 -3312020 -3203518 -2873364 -2269495 -1471751
37725 -1471751 -691887 -108022 281966 617500 1013737 1474941 1934422 2311071 2516125
37716 2516125 2470477 2174987 1752654 1373678 1121122 947372 769299 586575 494008 593246
37706 593246 905086 1345172 1751488 1943596 1805638 1350025 698914 -4266 -656162 -1176494
37696 -1176494 -1481646 -1520773 -1324845 -981101 -566994 -153496 131476 120582 -246773 -811215
37686 -811215 -1281261 -1453520 -1333372 -1054247 -732089 -426225 -196235 -116026 -193807 -305578
37676 -305578 -255308 75108 630409 1225901 1677843 1904365 1928613 1803371 1535491 1084353
37666 1084353 435202 -335210 -1077888 -1655661 -2008480 -2161098 -2196814 -2212037 -2252904 -2284323
$$ packed form
37735b202228j18257k07754k82516k74331j79356m7578J08502L30154O03869P97744
37725a471751P79864N83865L89988L35534L96237M61204M59481L76649K05054
37716B516125m5648k95490m22333l78976k52556j73750j78073j82724r2567R9238
37706E93246L11840M40086M06316J92108j37958m55613o51111p03180o51896n20332
37696a176494l05152l9127J95928L43744M14107M13498K84972j0894l67355n64442
37686h11215m70046j72259J20148K79125L22158L05864K29990Q0209p7781j11771
37676c05578N0270L30416N55301N95492M51942K26522K4248j25242k67880m51138
37666A084353o49151p70412p42678n77773l52819j52618l5716j5223m0867l1419
$$ plain form
37656 -2284323 -2251936 -2182459 -2182205 -2313757 -2510987 -2649161 -2671688 -2615766 -2545691 -2508409 -2529107
37645 -2529107 -2583496 -2569082 -2362875 -1938648 -1403097 -900319 -495673 -149510 229135 710847
37635 710847 1291128 1881385 2365148 2673682 2806401 2806033 2762192 2832033 3177693 3818084
37625 3818084 4555104 5093313 5253738 5077702 4745360 4412487 4109982 3765501 3302395
37616 3302395 2723971 2127687 1666459 1490410 1667865 2108948 2587918 2907126 3056210
37607 3056210 3173652 3351924 3534066 3613984 3573476 3476665 3371653 3245803 3051434 2731561
37597 2731561 2241676 1594375 878933 205074 -366631 -819355 -1135648 -1308926 -1394374 -1499932
37587 -1499932 -1706210 -2007382 -2323987 -2551474 -2610275 -2491772 -2264876 -2004861 -1700447 -1258066
$$ packed form
37656b284323L2387O9477K54j31552j97230j38174k2527N5922P0075L7282k0698
37645b529107n4389J4414K06207M24227N35551N02778M04646L46163L78645M81712
37635G10847N80281N90257M83763L08534J32719l68m3841O9841L45660O40391
37625C818084P37020N38209J60425j76036l32342l32873l02505l44481m63106
37616C302395n78424n96284m61228j76049J77455M41083M78970L19208J49084
37607C056210J17442J78272J82142P9918m0508r6811j05012j25850j94369l19873
37597B731561m89885o47301p15442o73859n71705m52724l16293j73278q5448j05558
37587a499932k06278l01172l16605k27487n8801J18503K26896K60015L04414M42381
$$ plain form
37577 -1258066 -623609 108380 727812 1061155 1097227 975901 868145 871775 1003204 1240574
37567 1240574 1533125 1786637 1903206 1866075 1756048 1660664 1591659 1509803 1395016 1257745
37557 1257745 1110298 970831 879078 863496 898464 931701 949776 980208 1031629 1070564 1064454
37546 1064454 1019027 967277 942773 962246 1013327 1068039 1133707 1272475 1524167 1813620 1989665
37535 1989665 1978976 1868796 1818091 1909463 2094878 2250171 2259922 2076381 1730395 1292364
37525 1292364 826292 390775 62414 -91900 -78709 26124 168765 375362 695536 1117546
37515 1117546 1574501 2019064 2453260 2877301 3230156 3397068 3284955 2900798 2356688
37506 2356688 1789499 1279004 850996 533475 364163 344583 439269 638992 972637 1413279
$$ packed form
37577a258066O34457P31989O19432L33343L6072j21326j07756L630J31429K37370
37567A240574K92551K53512J16569l7131j10027r5384o9005q1856j14787j37271
37557A257745j47447j39467r1753j5582L4968L3237J8075L0432N1421L8935o110
37546A064454m5427n1750k4504J9473N1081N4712O5668J38768K51692K89453J76045
37535A989665j0689j10180n0705R1372J85415J55293R751j83541l45986m38031
37525A292364m66072m35517l28361j54314J3191J04833J42641K06597L20174M22010
37515A117546M56955M44563M34196M24041L52855J66912j12113l84157n44110
37506B356688n67189n10495m28008l17521j69312j9580R4686J99723L33645M40642
$$ plain form
37496 1413279 1806205 1948206 1743962 1261709 649002 27252 -542803 -1042443 -1465348
37487 -1465348 -1787513 -1954728 -1915775 -1677414 -1309568 -879518 -389758 197592 868439 1505753
37477 1505753 1954639 2145279 2137918 2039127 1892529 1668684 1338709 916699 430853 -105578
37467 -105578 -678029 -1253784 -1798652 -2287389 -2679735 -2906495 -2904192 -2665532 -2260877 -1825297
37457 -1825297 -1505800 -1366401 -1328618 -1255102 -1124075 -1079257 -1266971 -1661030 -2097780 -2449231
37447 -2449231 -2692605 -2825844 -2804421 -2599494 -2268525 -1921624 -1629045 -1380524 -1120917 -808659
37437 -808659 -446875 -66818 321297 755193 1283714 1902306 2530589 3041197 3302623 3232917
37427 3232917 2868922 2383433 1979007 1733343 1566510 1363809 1093130 784709 439110
$$ packed form
37496A413279L92926J42001k04244m82253o12707o21750n70055m99640m22905
37487a465348l22165j67215L8953K38361L67846M30050M89760N87350O70847O37314
37477A505753M48886J90640p361r8791j46598k23845l29975m22010m85846n36431
37467a05578n72451n75755n44868m88737l92346k26760K303K38660M04655M35580
37457a825297L19497J39399L7783P3516J31027M4818j87714l94059m36750l51451
37447b449231k43374j33239K1423K04927L30969L46901K92579K48521K59607L12258
37437h08659L61784L80057L88115M33896N28521O18592O28283N10608K61426o9706
37427C232917l63995m85489m04426k45664j66833k02701k70679l08421l45599
$$ plain form
37418 439110 3707 -563136 -1229406 -1888023 -2405144 -2685765 -2721203 -2579540 -2340656 -2040336
37408 -2040336 -1680770 -1283578 -915074 -656567 -556889 -613392 -786084 -1011313 -1193508 -1210174
37398 -1210174 -981745 -568117 -161872 66090 109205 75585 12665 -150285 -469265 -863134
37388 -863134 -1170131 -1286324 -1209950 -1000415 -763170 -645851 -756432 -1056530 -1383272 -1596468
37378 -1596468 -1669219 -1632968 -1500391 -1281842 -1025077 -774133 -509061 -189194 146412 388863
37368 388863 496535 567767 723001 938509 1057322 968974 722723 435777 137375 -238127
37358 -238127 -714883 -1193063 -1529286 -1670187 -1679311 -1649734 -1624892 -1611299 -1642715 -1799040 -2141417
37347 -2141417 -2628374 -3116106 -3463750 -3641815 -3732425 -3835170 -3986831 -4150635 -4239379 -4147544
$$ packed form
37418D39110m35403n66843o66270o58617n17121k80621l5438J41663K38884L00320
37408b040336L59566L97192L68504K58507R9678n6503j72692k25229j82195j6666
37398a210174K28429M13628M06245K27962M3115l3620o2920j62950l18980l93869
37388h63134l06997j16193P6374K09535K37245J17319j10581l00098l26742k13196
37378a596468p2751L6251J32577K18549K56765K50944K65072L19867L35606K42451
37368C88863J07672P1232J55234K15508J18813q8348k46251k86946k98402l75502
37358b38127m76756m78180l36223j40901r124K9577K4842J3593l1416j56325l42377
37347b141417m86957m87732l47644j78065r0610j02745j51661j63804q8744R1835
$$ plain form
37337 -4147544 -3814107 -3290053 -2719074 -2218673 -1795542 -1405866 -1078218 -929128 -1046878
37328 -1046878 -1386420 -1789191 -2090475 -2205551 -2138839 -1939324 -1657093 -1331908 -994701 -649608
37318 -649608 -256894 230050 790947 1324607 1728028 1970739 2080477 2097682 2083189 2134847
37308 2134847 2330365 2651578 3009247 3339936 3633797 3874554 4016687 4040582 3979318 3872759
37298 3872759 3750907 3689278 3811617 4166557 4626192 4969176 5063109 4929525 4651172 4277368
37288 4277368 3826863 3327301 2821583 2365482 2044965 1970717 2215055 2744121 3424099 4100389
37278 4100389 4670952 5091984 5335596 5368762 5183943 4830994 4386738 3885249 3303431 2637773
37268 2637773 1986182 1528964 1412285 1638119 2055815 2464209 2744568 2910571 3030399
$$ packed form
37337d147544L33437N24054N70979N00401M23131L89676L27648J49090j17750
37328a046878l39542m02771l01284j15076O6712J99515K82231L25185L37207L45093
37318f49608L92714M86944N60897N33660M03421K42711J09738J7205j4493N1658
37308B134847J95518L21213L57669L30689K93861K40757J42133K3895o1264j06559
37298C872759j21852o1629J22339L54940M59635L42984R3933j33584k78353l73804
37288D277368m50505m99562n05718m56101l20517p4248K44338N29066O79978O76290
37278D100389N70563M21032K43612L3166j84819l52949m44256n01489n81818o65658
37268B637773o51591m57218j16679K25834M17696M08394K80359J66003J19828
$$ plain form
37259 3030399 3113786 3104686 2983152 2823212 2707964 2607977 2391854 1967916 1392640 831525
37249 831525 427189 208831 114178 82856 119252 265879 539017 921235 1405954 1991647
37239 1991647 2603676 3074465 3271991 3249309 3216939 3348024 3632057 3921467 4085699 4098291
37229 4098291 4000302 3827676 3604022 3391817 3296596 3366432 3492437 3466340 3164366 2642731
37219 2642731 2043991 1474484 1013641 763604 779355 957916 1090172 1051728 897864 773501
37209 773501 793516 1012136 1422086 1937376 2428841 2820748 3125241 3368503 3534266 3603872
37199 3603872 3595064 3524329 3383642 3195558 3031305 2907492 2705586 2273051 1598262 832974
37189 832974 156774 -328240 -594890 -672032 -652106 -656372 -748688 -896467 -1022581 -1072470 -1034917
$$ packed form
37259C030399Q3387r100j21534j59940j15248r9987k16123m23938n75276n61115
37249H31525m04336k18358r4653l1322L6396J46627K73138L82218M84719N85693
37239A991647O12029M70789J97526k2682l2370J31085K84033K89410J64232J2592
37229D098291r7989j72626k23654k12205r5221O9836J26005k6097l01974n21635
37219B642731n98740n69507m60843k50037J5751J78561J32256l8444j53864j24363
37209G73501K0015K18620M09950N15290M91465L91907L04493K43262J65763O9606
37199C603872q808p0735j40687j88084j64253j23813k01906m32535o74789p65288
37189H32974o76200m85014k66650p7142J9926m266r2316j47779j26114m9889L7553
$$ plain form
37178 -1034917 -940261 -851608 -817040 -799800 -676279 -334519 221772 871169 1464523 1907968
37168 1907968 2169989 2235916 2087680 1747238 1321745 956489 715498 532828 310287 46699
37158 46699 -155112 -188301 -14953 338378 804315 1291493 1725278 2090890 2410538 2670622
37148 2670622 2802245 2747790 2525150 2218038 1925485 1724527 1646198 1659679 1689656 1663965
37138 1663965 1541251 1299616 930667 466595 2347 -328298 -413186 -226915 130025 461939
37128 461939 597285 519376 381066 376589 585773 916553 1170281 1175541 908523 508540
37118 508540 156728 -72617 -225208 -340140 -359733 -189463 194983 743287 1405021 2151225
37108 2151225 2918058 3575121 3979432 4058832 3847442 3457690 3013773 2580235 2132896 1606445
$$ packed form
37178a034917R4656Q8653L4568J7240J23521L41760N56291O49397N93354M43445
37168A907968K62021O5927j48236l40442m25493l65256k40991j82670k22541k63588
37158D6699k01811l3189J73348L53331M65937M87178M33785L65612L19648K60084
37148B670622J31623n4455k22640l07112k92553k00958p8329J3481K9977k5691
37138A663965j22714k41635l68949m64072m64248l30645q4888J86271L56940L31914
37128D61939J35346p7909j38310m477K09184L30780K53728N260k67018l99983
37118E08540l51812k29345j52591j14932j9593J70270L84446N48304O61734P46204
37108B151225P66833O57063M04311P9400k11390l89752m43917m33538m47339n26451
$$ plain form
37098 1606445 984818 346733 -181106 -516231 -672454 -737690 -813991 -969122 -1210506 -1471853
37088 -1471853 -1630622 -1585507 -1356333 -1100032 -999471 -1133325 -1462225 -1908879 -2395217 -2803503
37078 -2803503 -2978321 -2829433 -2420081 -1923673 -1512788 -1317139 -1444763 -1951063 -2745691
37069 -2745691 -3570000 -4123154 -4240263 -3972386 -3525335 -3121466 -2870072 -2716762 -2509566
37060 -2509566 -2134745 -1594337 -948289 -208298 658260 1598948 2393617 2765349 2604881
37051 2604881 2082279 1535553 1251667 1326410 1670448 2103790 2465784 2697661 2857513 3045904
37041 3045904 3293466 3514540 3577385 3426318 3139691 2870819 2729416 2712958 2741472 2741502 2685778
37030 2685778 2570901 2398690 2196657 2025078 1926008 1870071 1783062 1631273 1465480 1381024
$$ packed form
37098A606445o21627o38085n27839l35125j56223o5236p6301j55131k41384k61347
37088a471853j58769M5115K29174K56301J00561j33854l28900m46654m86338m08286
37078b803503j74818J48888M09352M96408M10885J95649j27624n06300p94628
37069b745691q24309n53154j17109K67877M47051M03869K51394J53310K07196
37060b509566L74821N40408O46048P39991Q66558R40688P94669L71732j60468
37051B604881n22602n46726k83886P4743L44038M33342L61994K31877J59852J88391
37041C045904K47562K21074O2845j51067k86627k68872j41403j6458K8514L0n5724
37030B685778j14877j72211k02033j71579r9070n5937q7009j51789j65793q4456
$$ plain form
37020 1381024 1447851 1671294 1993216 2320689 2566361 2670497 2588949 2283785 1756514 1088125
37010 1088125 413775 -160858 -612908 -976231 -1281460 -1526373 -1690569 -1774045 -1829907 -1957161
37000 -1957161 -2249956 -2752871 -3457359 -4298620 -5120450 -5686117 -5817277 -5558880 -5161581
36991 -5161581 -4862484 -4698827 -4543523 -4275362 -3876210 -3396225 -2883197 -2353988 -1806770
36982 -1806770 -1253492 -750660 -392205 -258922 -377570 -726369 -1249705 -1846467 -2374661
36973 -2374661 -2718407 -2863788 -2890814 -2888165 -2892346 -2909529 -2968043 -3118708 -3372853 -3651708 -3822856
36962 -3822856 -3805564 -3632802 -3393711 -3127324 -2801039 -2385834 -1910362 -1431322 -995527 -662950
36952 -662950 -534797 -703981 -1156374 -1724597 -2147600 -2206925 -1857992 -1253267 -616900 -83603
$$ packed form
37020A381024O6827K23443L21922L27473K45672J04136q1548l05164n27271o68389
37010A088125o74350n74633m52050l63323l05229k44913j64196q3476n5862j27254
37000a957161k92795n02915p04488q41261q21830n65667j31160K58397L97299
36991e161581K99097J63657J55304K68161L99152M79985N13028N29209N47218
36982a806770N53278N02832L58455J33283j18648l48799n23336n96762n28194
36973b374661l43746j45381k7026K649m181j7183n8514j50665k54145k78855j71148
36962c822856J7292J72762K39091K66387L26285M15205M75472M79040M35795L32577
36952f62950J28153j69184m52393n68223m23003n9325L48933O04725O36367N33297
$$ plain form
36942 -83603 326529 596746 652572 448299 59768 -366384 -729641 -997338 -1146889 -1159112
36932 -1159112 -1065334 -935704 -799180 -608800 -295059 172238 765433 1394142 1912343 2182160
36922 2182160 2167283 1952496 1663520 1384745 1149181 962675 808692 649524 449428 194352
36912 194352 -115277 -473954 -862186 -1244958 -1596708 -1919073 -2214419 -2439286 -2500351 -2317394
36902 -2317394 -1902234 -1368087 -841058 -355675 149532 731475 1359446 1939510 2392755
36893 2392755 2689871 2839484 2884704 2904725 2980877 3145897 3375294 3624048 3859352 4065784
36883 4065784 4234879 4348316 4371448 4283487 4117537 3935211 3744153 3481410 3110041 2692926
36873 2692926 2331434 2074103 1938160 1966911 2167186 2403517 2463211 2264838 1937386 1665060
$$ packed form
36942h3603M10132K70217N5826k04273l88531m26152l63257k67697j49551j2223
36932a159112R3778J29630J36524J90380L13741M67297N93195O28709N18201K69817
36922B182160j4877k14787k88976k78775k35564j86506j53983j59168k00096k55076
36912A94352l09629l58677l88232l82772l51750l22365k95346k24867o1065J82957
36902b317394M15160N34147N27029M85383N05207N81943O27971N80064M53245
36893B392755K97116J49613M5220K0021P6152J65020K29397K48754K35304K06432
36883D065784J69095J13437K3132q7961j65950j82326j91058k62743l71369m17115
36873B692926l61492k57331j35943K8751K00275K36331N9694j98373l27452k72326
$$ plain form
36863 1665060 1513999 1437214 1377135 1307245 1221610 1149238 1161214 1311142 1565290 1814495
36853 1814495 1951241 1930006 1778704 1570181 1361448 1142163 857046 483071 58336 -364930
36843 -364930 -749440 -1039163 -1149432 -1034203 -741042 -374114 -28335 225437 341590 333395
36833 333395 275683 229017 182335 108717 48187 79423 218749 394554 517435 534290 419964
36822 419964 165454 -214138 -694095 -1270448 -1943952 -2662223 -3305665 -3751383 -3943960 -3897591
36812 -3897591 -3637550 -3149228 -2398740 -1426931 -422555 343942 705541 717223 577607
36803 577607 457137 425357 500773 693394 982275 1299703 1567206 1736979 1806914 1831389
36793 1831389 1913251 2123158 2383956 2463461 2137097 1383197 421950 -427432 -926331 -992954
$$ packed form
36863A665060j51061p6785o0079o9890q5635p2372J1976J49928K54148K49205
36853A814495J36746k1235j51302k08523k08733k19285k85117l73975m24735m23266
36843c64930l84510k89723j10269J15229K93161L66928L45779K53772J16153q195
36833C33395n7712m6666m6682p3618o0530L1236J39326J75805J22881J6855j14326
36822D19964k54510l79592m79957n76353o73504p18271o43442m45718j92577M6369
36812c897591K60041M88322P50488R71809J004376P66497L61599J1682j39616
36803E77607j20470l1780P5416J92621K88881L17428K67503J69773O9935K4475
36793A831389Q1862K09907K60798P9505l26364p53900r61247q49382m98899o6623
$$ plain form
36783 -992954 -666720 -45210 747541 1580563 2356474 3043421 3645997 4144604 4496056 4703424
36773 4703424 4842833 4984066 5103457 5106054 4917814 4528555 3971630 3316071 2680256 2202710
36763 2202710 1965982 1948507 2042659 2107130 2025044 1753751 1326723 795854 196423 -395827
36753 -395827 -803253 -820222 -378531 391985 1275570 2108638 2813733 3371567 3809273 4182235
36743 4182235 4516333 4767134 4852336 4717743 4375987 3916986 3489638 3222157 3118895 3059110
36733 3059110 2926955 2717859 2494500 2287224 2097225 1966953 1962491 2068098 2157993 2108266
36723 2108266 1908971 1646137 1405431 1222402 1102277 1044939 1044318 1087954 1170768 1300236
36713 1300236 1476642 1668769 1817136 1865606 1785957 1571118 1224140 781777 347500 64319
$$ packed form
36783i92954L26234O21510P92751Q33022P75911O86947O02576M98607L51452K07368
36773D703424J39409J41233J19391K597j88240l89259n56925o55559o35815m77546
36763B202710k36728j7475R4152O4471q2086k71293m27028n30869n99431n92250
36753c95827m07426j6969M41691P70516Q83585Q33068P05095N57834M37706L72962
36743D182235L34098K50801Q5202j34593l41756m59001m27348k67481j03262n9785
36733C059110j32155k09096k23359k07276j89999j30272m462J05607Q9895m9727
36723B108266j99295k62834k40706j83029j20125n7338o21M3636Q2814J29468
36713A300236J76406J92127J48367M8470p9649k14839l46978m42363m34277k83181
$$ plain form
36703 64319 27538 233758 623768 1145308 1744974 2329104 2794649 3113459 3348932 3570810
36693 3570810 3777204 3911215 3923131 3794535 3529673 3161569 2761853 2411856 2148884 1945879
36683 1945879 1744215 1504587 1237933 1001483 859676 829524 851404 811461 600084 173353
36673 173353 -408450 -995195 -1432656 -1669160 -1778635 -1867976 -1971340 -2043335 -2031210 -1926886
36663 -1926886 -1764409 -1597037 -1463380 -1340066 -1138957 -795667 -356283 74597 470044
36654 470044 891969 1338943 1662098 1708054 1507949 1246306 1054367 906672 722496 491691
36644 491691 269951 107858 27786 36057 117206 234862 366631 519482 686243 810351
36634 810351 827156 726195 540216 281956 -74063 -546335 -1108687 -1695741 -2218173 -2573354
$$ packed form
36703F4319l6781K06220L90010N21540N99666N84130M65545L18810K35473K21878
36693C570810K06394J34011J1916j28596k64862l68104l99716l49997k62972k03005
36683A945879k01664k39628k66654k36450j41807l0152K1880l9943k11377m26731
36673A73353n81803n86745m37461k36504j09475q9341j03364p1995J2125J04324
36663a926886J62477J67372J33657J23314K01109L43290M39384M30880L95447
36654D70044M21925M46974L23155M5956k00105k61643j91939j47695j84176k30805
36644D91691k21740j62093q0072Q271Q1149J17656J31769J52851J66761J24108
36634H10351J6805j00961j85979k58260l56019m72272n62352n87054n22432l55181
$$ plain form
36624 -2573354 -2681660 -2542553 -2243827 -1891935 -1531314 -1145301 -738374 -401210 -273157
36615 -273157 -426961 -786940 -1161156 -1359318 -1302503 -1059296 -800640 -695359 -797289 -1008058
36605 -1008058 -1161102 -1155134 -1012681 -836707 -744790 -825885 -1087281 -1403698 -1559471 -1395355
36595 -1395355 -915597 -239519 520198 1300998 2053750 2733298 3333975 3887152 4401648
36586 4401648 4825920 5075568 5084420 4840224 4400630 3867945 3312471 2720519 2050350 1332932
36576 1332932 673789 162082 -158318 -222141 55838 641434 1303348 1775086 1991622 2092884
36566 2092884 2196139 2252980 2159664 1921060 1630093 1330864 989900 599042 230089 -37094
36556 -37094 -186307 -233449 -170056 11211 256305 469041 598079 672759 745630 828340 898650
$$ packed form
36624b573354j08306J39107K98726L51892L60621L86013M06927L37164J28053
36615b73157j53804l59979l74216j98162N6815K43207K58656J05281j01930k10769
36605a008058j53044N968J42453J75974R1917q1095k61396l16417j55773J64116
36595a395355M79758O76078P59717P80800P52752O79548O00677N53177N14496
36586D401648M24272K49648Q852k44196m39594n32685n55474n91952o70169p17418
36576A332932o59143n11707l20400o3823K77979N85596O61914M71738K16536J01262
36566B092884J03255N6841r3316k38604k90967k99229l40964l90858l68953k67183
36556c7094j49213m7142O3393J81267K45094K12736J29038P4680P2871Q2710P0310
$$ plain form
36545 898650 948589 997640 1047891 1029489 813428 326746 -311282 -798492 -864563 -506842
36535 -506842 9811 399744 585489 693685 883958 1214533 1632903 2039899 2359782 2575961
36525 2575961 2706630 2748942 2672047 2475354 2221219 1988172 1824549 1775694 1913862 2282333
36515 2282333 2820712 3391228 3873064 4198459 4324969 4240848 4004370 3723220 3477141 3290748
36505 3290748 3171006 3109764 3039000 2851936 2513368 2118081 1811061 1672790 1688691 1775494
36495 1775494 1800037 1619844 1173450 539699 -110195 -610930 -860170 -844893 -673170 -554852
36485 -554852 -678903 -1082188 -1648250 -2214347 -2647216 -2846262 -2758143 -2429173 -2007079 -1650170
36475 -1650170 -1438359 -1377628 -1449754 -1604947 -1710940 -1577960 -1101169 -386590 304364 765991
$$ packed form
36545H98650M9939M9051N0251j8402k16061m86682o38028m87210o6071L57721
36535e06842N16653L89933J85745J08196J90273L30575M18370M06996L19883K16179
36525B575961J30669M2312p6895j96693k54135k33047j63623m8855J38168L68471
36515B282333N38379N70516M81836L25395J26510q4121k36478k81150k46079j86393
36505C290748j19742o1242p0764j87064l38568l95287l07020j38271J5901Q6803
36495A775494K4543j80193m46394o33751o49894n00735k49240J5277J71723J18318
36485e54852j24051m03285n66062n66097m32869j99046Q8119L28970M22094L56909
36475a650170K11811O0731p2126j55193j05993J32980M76791P14579O90954M61627
$$ plain form
36465 765991 997345 1136070 1280048 1413628 1482300 1464362 1347470 1101005 731599 339814
36455 339814 62830 -43489 -35689 -8036 -29636 -151012 -409380 -780392 -1140645 -1318728
36445 -1318728 -1201095 -788092 -155766 617484 1475967 2349965 3122010 3658967 3892803
36436 3892803 3870942 3726067 3591352 3522396 3471148 3329777 3024837 2592091 2162791 1876789
36426 1876789 1809789 1963462 2286552 2694459 3099294 3445235 3704821 3837090 3777888 3488863
36416 3488863 2995017 2364094 1683637 1076592 687981 596964 755400 1055823 1441045 1895184
36406 1895184 2346982 2666714 2789067 2779937 2734415 2641334 2396184 1933879 1302872 601186
36396 601186 -125351 -892158 -1688222 -2409744 -2914988 -3152440 -3204280 -3175895 -3063669 -2769966
$$ packed form
36465G65991K31354J38725J43978J33580O8672j7938j16892k46465l69406l91785
36455C39814k76984j06319P800K7653k1600j21376k58368l71012l60253j78083
36445a318728J17633M13003O32326P73250Q58483Q73998P72045N36957K33836
36436C892803k1861j44875j34715o8956n1248j41371l04940m32746m29300k86002
36426A876789o7000J53673L23090M07907M04835L45941K59586J32269n9202k89025
36416C488863m93846o30923o80457o07045l88611r1017J58436L00423L85222M54139
36406A895184M51798L19732J22353r130m5522r3081k45150m62305o31007p01686
36396F01186p26537p66807p96064p21522n05244k37452n1840K8385J12226K93703
$$ plain form
36386 -2769966 -2232700 -1484230 -579909 461102 1601182 2717774 3650869 4303494 4657386
36377 4657386 4719032 4519758 4172195 3854018 3687833 3658219 3665751 3626148 3485084 3180805
36367 3180805 2671986 2020907 1398561 967183 764637 710683 695171 632972 462842 154794
36357 154794 -258305 -689776 -1078297 -1461474 -1951115 -2621304 -3418297 -4181837 -4754954 -5071119
36347 -5071119 -5138321 -4962021 -4519457 -3817197 -2936592 -1987938 -1038227 -122151 691275 1304312
36337 1304312 1685835 1923928 2156079 2465855 2856442 3286010 3701045 4069132 4418831
36328 4418831 4827072 5331385 5874236 6370650 6803215 7189967 7465904 7468007 7071649 6313272
36318 6313272 5369414 4454720 3748436 3352754 3255564 3340371 3473912 3595196 3718614 3881161
$$ packed form
36386b769966N37266P48470R04321J041011J140080J116592R33095O52625L53892
36377D657386O1646j99274l47563l18177j66185k9614P532l9603j41064l04279
36367C180805n08819o51079o22346m31378k02546n3954j5512o2199j70130l08048
36357A54794m13099m31471l88521l83177m89641o70189p96993p63540n73117l16165
36347e071119o7202J76300M42564P02260Q80605R48654R49711R16076Q13426O13037
36337A304312L81523K38093K32151L09776L90587M29568M15035L68087L49699
36328D418831M08241N04313N42851M96414M32565L86752K75937K103l96358p58377
36318F313272r43858r14694p06284l95682r7190Q4807J33541J21284J23418J62547
$$ plain form
36308 3881161 4116817 4456239 4893278 5331235 5585876 5463442 4850689 3769585 2395994
36299 2395994 1023665 -57476 -712755 -1005435 -1079344 -1012510 -800401 -450195 -33590
36290 -33590 363019 692259 921666 996759 881727 629963 368082 198817 148177 212787
36280 212787 421743 827358 1448327 2226209 3011294 3588543 3770563 3514152 2936307 2194816
36270 2194816 1380484 558808 -123332 -457558 -333042 153088 760948 1269285 1585128
36261 1585128 1748160 1861305 1998184 2149302 2254187 2285774 2292277 2357731 2537693 2829919
36251 2829919 3181203 3516909 3789948 4014505 4235140 4456321 4622344 4670611 4576634 4337402
36241 4337402 3946538 3414427 2792123 2147577 1529609 973230 520111 206161 43508
$$ packed form
36308C881161K35656L39422M37039M37957K54641j22434o12753j081104j373591
36299B395994j372329j081141o55279k92680p3909O6834K12109L50206M16605
36290c3590L96609L29240K29407P5093j15032k51764k61881j69265n0640O4610
36280B12787K08956M05615O20969P77882P85085N77249J82020k56411n77845p41491
36270B194816q14332q21676o82140l34226J24516M86130O07860N08337L15843
36261A585128J63032J13145J36879J51118J04885L1587O503O5454J79962K92226
36251B829919L51284L35706K73039K24557K20635K21181J66023M8267r3977k39232
36241D337402l90864n32111o22304o44546o17968n56379m53119l13950j62653
$$ plain form
36232 43508 43735 243144 659624 1214311 1728899 2026654 2038054 1815656 1470745 1108877
36222 1108877 814704 675796 790740 1211656 1849907 2460336 2778356 2715786 2429186 2198680
36212 2198680 2246819 2647518 3336264 4149259 4869114 5298542 5334207 4978832 4299826 3409360
36202 3409360 2480561 1718911 1251738 1039131 926930 803614 700092 745077 1041530 1573523
36192 1573523 2197859 2730225 3092501 3404776 3895681 4676580 5607835 6404731 6854834
36183 6854834 6914888 6648518 6154571 5569915 5069284 4789933 4737134 4766806 4663756 4263062
36173 4263062 3544600 2640071 1745038 1011675 504128 206150 29786 -152361 -408560
36164 -408560 -661688 -746064 -568515 -182048 293186 754145 1103979 1248875 1188393 1074091
$$ packed form
36232D3508K27J99409M16480N54687N14588K97755J1400k22398l44911l61868
36222A108877k94173j38908J14944M20916O38251O10429L18020o2570k86600k30506
36212B198680M8139M00699O88746Q12995P19855M29428L5665l55375o79006q90466
36202C409360r28799p61650m67173k12607j12201j23316j03522M4985K96453N31993
36192A573523O24336N32366L62276L12275M90905P80899R31255P96896M50103
36183F854834O0054k66370m93947n84656n00631k79351n2799K9672j03050m00694
36173D263062p18462r04529q95033p33363n07547k97978j76364j82147k56199
36164d08560k53128q4376J77549L86467M75234M60959L49834J44896o0482j14302
$$ plain form
36154 1074091 1098904 1321245 1628181 1842601 1819614 1485157 890912 262266 -84736 55899
36144 55899 653162 1497848 2343737 2995422 3343884 3396812 3272899 3123839 3043810 3049727
36134 3049727 3122765 3242788 3388608 3523489 3585932 3508298 3281013 3015217 2903280 3062640
36124 3062640 3406823 3694707 3722703 3473102 3094676 2765567 2567786 2446910 2250048 1807947
36114 1807947 1033033 -877 -1050308 -1802764 -2042885 -1758391 -1094762 -217548 768783
36105 768783 1790655 2757353 3582167 4227858 4693070 4964294 5022504 4904155 4722529 4609313
36095 4609313 4645240 4844606 5172254 5552938 5888334 6102920 6179603 6137652 5984739 5719422
36085 5719422 5389142 5118020 5039469 5179364 5403235 5493469 5309113 4900356 4472735 4220587
$$ packed form
36154A074091K4813K22341L06936K14420k2987l34457n94245o28646l47002J40635
36144E5899N97263Q44686Q45889O51685L48462N2928j23913j49060q0029N917
36134C049727P3038J20023J45820J34881O2443p7634k27285k65796j11937J59360
36124C062640L44183K87884K7996k49601l78426l29109j97781j20876j96862m42101
36114A807947p74914j033910j049431p52456k40121K84494O63629Q77214R86331
36105G68783J021872R66698Q24814O45691M65212K71224N8210j18349j81626j13216
36095D609313L5927J99366L27648L80684L35396K14586P6683m1951j52913k65317
36085E719422l30280k71122p8551J39895K23871R0234j84356m08757m27621k52148
$$ plain form
36075 4220587 4177261 4225730 4255053 4293446 4476091 4891767 5482980 6101265 6638635 7083650
36065 7083650 7459218 7742900 7875374 7838818 7701659 7581783 7585408 7787203 8235892 8935914
36055 8935914 9817546 10752494 11615445 12323036 12816370 13039773 12969215 12658348 12232808 11825904
36045 11825904 11512791 11285957 11069344 10758700 10282326 9656389 8986229 8392083 7908303
36036 7908303 7450535 6901064 6243694 5604397 5137224 4874196 4710707 4533217 4324523
36027 4324523 4137894 4018512 3987869 4068471 4261063 4492326 4629196 4570533 4322033 3989754
36017 3989754 3715474 3600521 3655662 3820599 4054127 4402553 4956722 5747562 6710393 7744635
36007 7744635 8775489 9760859 10676871 11505039 12208037 12723498 13017308 13133214 13136093 13005687
$$ packed form
36075D220587m3326M8469K9323L8393J82645M15676N91213O18285N37370M45015
36065G083650L75568K83682J32474l6556j37159j19876L625K01795M48689P00022
36055H935914Q81632R34948Q62951P07591M93334K23403p0558l10867m25540m06904
36045A1825904l13113k26834k16613l10644m76374o25937o70160n94146m83780
36036G908303m57768n49471o57370o39297m67173k63028j63489j77490k08694
36027D324523j86629j19382l0643Q0602J92592K31263J36870n8663k48500l32279
36017C989754k74280j14953N5141J64937K33528L48426N54169P90840R62831J034242
36007G744635J030854R85370R16012Q28168P02998N15461K93810J15906K879j30406
$$ plain form
35997 13005687 12656338 12091335 11478077 11025410 10828146 10870261 11123684 11566660 12126664
35988 12126664 12692662 13217268 13770164 14461557 15319780 16253578 17138996 17956204 18842843
35979 18842843 19987936 21456848 23134001 24836581 26446532 27919330 29218314 30292385
35971 30292385 31105857 31673390 32106379 32655160 33645035 35284293 37525165 40144766 42951064
35962 42951064 45897182 49061149 52595135 56675357 61431526 66932412 73293168 80771364
35954 80771364 89690656 100296806 112767259 127328776 144252067 163737804 185941589
35947 185941589 211149346 239795711 272158405 307873175 345379070 381344891 410563787
35940 410563787 427125350 426840030 409411284 378608245 340317498 300091392 261785313
$$ packed form
35997A3005687l49349n65003o13258m52667j97264M2115K53423M42976N60004
35988A2126664N65998N24606N52896O91393Q58223R33798Q85418Q17208Q86639
35979A8842843J145093J468912J677153J702580J609951J472798J298984J074071
35971C0292385Q13472N67533M32989N48781R89875J639258K240872K619601K806298
35962D2951064K946118L163967L533986M080222M756169N500886O360756P478196
35954H0771364Q919292J0606150J2470453J4561517J6923291J9485737K2203785
35947A85941589K5207757K8646365L2362694L5714770L7505895L5965821K9218896
35940D10563787J6561563k85320j7428746l0803039l8290747m0226106l8306079
$$ plain form
35933 261785313 227478665 197918923 172950606 151925784 134126843 119019329 106228979
35926 106228979 95408724 86204162 78310828 71487212 65501308 60125838 55231306 50856594
35918 50856594 47132586 44125059 41775547 39979787 38658550 37724091 37037025 36466844
35910 36466844 35987937 35664708 35533677 35533290 35555944 35540343 35504758 35514387 35626370 35845694 36118255
35899 36118255 36374370 36590140 36809586 37112797 37569380 38218847 39085656 40203792 41610206
35890 41610206 43298145 45193233 47219350 49401595 51871143 54756776 58116992 62005619
35882 62005619 66549718 71900676 78133662 85262252 93359520 102635171 113418416 126122017
35874 126122017 141212128 159141886 180279530 204907868 233257331 265441179 301213099
$$ packed form
35933B61785313l4306648k9559742k4968317k1024822j7798941j5107514j2790350
35926A06228979j0820255r204562p893334o823616n985904n375470m894532m374712
35918E0856594l724008l007527k349512j795760j321237r34459o87066n70181
35910C6466844m78907l23229j31031l87K2654j5601l5585R629J11983K19324K72561
35899C6118255K56115K15770K19446L03211M56583O49467Q66809J118136J406414
35890D1610206J687939J895088K026117K182245K469548K885633L360216L888627
35882F2005619M544099N350958O232986P128590Q097268R275651J0783245J2703601
35874A26122017J5090111J7929758K1137644K4628338K8349463L2183848L5771920
$$ plain form
35867 301213099 339508889 377783920 411520328 434746535 442066064 431286248 404689823
35860 404689823 367840575 326914014 286591590 249541843 216917483 188912578 165114430
35853 165114430 144842593 127468822 112525956 99618831 88350385 78363724 69419982
35846 69419982 61430411 54427286 48470987 43533241 39465204 36092354 33312289 31068804
35838 31068804 29264177 27750456 26390674 25077430 23712680 22250646 20780284 19495831
35830 19495831 18533126 17852600 17297058 16726334 16076672 15344821 14576461 13857707 13267842
35821 13267842 12827360 12499948 12222414 11909710 11466535 10854589 10153543 9516375 9055910
35812 9055910 8795925 8712385 8759573 8838237 8796590 8521384 8030124 7454168 6929802 6502763
$$ packed form
35867C01213099L8295790L8275031L3736408K3226207P319529j0779816k6596425
35860D04689823l6849248m0926561m0322424l7049747l2624360k8004905k3798148
35853A65114430k0271837j7373771j4942866j2907125j1268446r986661q943742
35846F9419982p989571p003125n956299m937746m068037l372850k780065k243485
35838C1068804j804627j513721j359782j313244j364750j462034j470362j284453
35830A9495831r62705o80526n55542n70724o49662p31851p68360p18754n89865
35821A3267842m40482l27412k77534l12704m43175o11946p01046o37168m60465
35812I055910k59985q3540M7188P8664m1647k75206m91260n75956n24366m27039
$$ plain form
35802 6502763 6118119 5692812 5208729 4733916 4338520 4007431 3677787 3354989 3125384
35793 3125384 3029575 2990039 2924746 2893387 3055551 3481697 4053421 4553238 4816621 4806337
35783 4806337 4597649 4316690 4060323 3844282 3626972 3378151 3112077 2869131 2694302
35774 2694302 2624507 2663292 2774272 2936213 3194601 3601223 4088160 4454653 4511791 4208650
35764 4208650 3598185 2738827 1699878 651018 -129712 -391877 -68377 699430 1680565
35755 1680565 2697535 3669419 4548962 5264477 5749317 5998576 6046195 5890267 5495345
35746 5495345 4882898 4165084 3451757 2760254 2059155 1378763 835039 545989 539154 714977
35736 714977 872668 806617 442855 -97160 -580197 -806855 -683098 -212971 506820 1294087
$$ packed form
35802F502763l84644m25307m84083m74813l95396l31089l29644l22798k29605
35793C125384r5809l9536o5293l1359J62164M26146N71724M99817K63383j0284
35783D806337k08688k80959k56367k16041k17310k48821k66074k42946j74829
35774B694302o9795L8785J10980J61941K58388M06622M86937L66493N7138l03141
35764D208650o10465q59358j038949j048860p80730k62165L23500P67807R81135
35755A680565J016970R71884Q79543P15515M84840K49259M7619j55928l94922
35746E495345o12447p17814p13327o91503p01099o80392n43724k89050o835J75823
35736G14977J57691o6051l63762n40015m83037k26658J23757M70127P19791P87267
$$ plain form
35726 1294087 1953998 2382519 2589162 2629780 2552207 2397576 2198977 1958772 1660979 1318322
35716 1318322 974264 652751 355060 134414 132322 488806 1208799 2121953 2960575 3486552
35706 3486552 3600887 3380168 3000197 2601043 2230209 1910030 1706179 1685328 1831715 2056253
35696 2056253 2287202 2523638 2814213 3220856 3786136 4471693 5106149 5442167 5318086
35687 5318086 4773490 3997915 3166269 2316960 1369900 255172 -965205 -2098369 -2951800
35678 -2951800 -3464539 -3705483 -3766488 -3697294 -3542595 -3385392 -3307735 -3317890 -3338004 -3251844
35668 -3251844 -2951419 -2369341 -1516015 -492618 561741 1545208 2400410 3057044 3414420
35659 3414420 3411170 3092645 2580462 1983535 1363849 782803 343850 164465 305405 721393
$$ packed form
35726A294087O59911M28521K06643M0618p7573j54631j98599k40205k97793l42657
35716A318322l44058l21513k97691k20646k092L56484P19993R13154Q38622N25977
35706C486552J14335k20719l79971l99154l70834l20179k03851k0851J46387K24538
35696B056253K30949K36436K90575M06643N65280O85557O34456L36018j24081
35687E318086n44596p75575q31646q49309r47060j114728j220377j133164q53431
35678b951800n12739k40944o1005O9194J54699J57203P7657j0155k0114Q6160
35668c251844L00425N82078Q53326J023397J054359R83467Q55202O56634L57376
35659C414420l250l18525n12183n96927o19686n81046m38953j79385J40940M15988
$$ plain form
35649 721393 1260373 1710756 1891992 1750597 1383850 957219 594255 349824 264505 389486
35639 389486 727837 1180503 1599320 1904970 2129457 2331104 2485671 2480562 2217779 1720596
35629 1720596 1145780 692096 477340 475262 551735 556508 390065 12622 -568015 -1290593
35619 -1290593 -2033702 -2647711 -3017518 -3103777 -2933564 -2565231 -2062748 -1484125 -874658 -270703
35609 -270703 281989 719652 987233 1078700 1040217 931021 794068 661785 551423 420692
35599 420692 152511 -355126 -1063517 -1794121 -2378456 -2774424 -3006093 -3035274 -2769545 -2202636
35589 -2202636 -1481059 -797339 -255559 127818 336366 334489 140001 -125880 -278644 -155000
35579 -155000 313791 1052968 1848112 2441397 2673397 2543249 2140794 1559958 902728 322788
$$ packed form
35649G21393N38980M50383J81236j41395l66747m26631l62964k44431q5319J24981
35639C89486L38351M52666M18817L05650K24487K01647J54567n109k62783m97183
35629A720596n74816m53684k14756k078P6473M773j66443l77443n80637p22578
35619a290593p43109o14009l69807q6259J70213L68333N02483N78623O09467O03955
35609b70703N52692M37663K67581R1467l8483j09196j36953j32283j10362j30731
35599D20692k68181n07637p08391p30604n84335l95968k31669k9181K65729N66909
35589b202636P21577O83720N41780L83377K08548j877j94488k65881j52764J23644
35579a55000M68791P39177P95144N93285K32000j30148m02455n80836o57230n79940
$$ plain form
35569 322788 -14632 -48816 127119 357510 555916 738698 950878 1186648 1384761 1492211
35559 1492211 1535772 1633624 1913443 2385834 2891192 3188266 3109096 2642501 1907704 1091671
35549 1091671 398129 -21034 -148706 -111121 -69171 -97763 -180781 -293923 -444887 -633953
35539 -633953 -820727 -947881 -973175 -873590 -656742 -389032 -177220 -83835 -68765 -30810
35529 -30810 114722 418855 917621 1604553 2382492 3095434 3635124 3997627 4232070 4368456
35519 4368456 4408668 4347978 4170389 3844402 3361390 2775486 2183586 1674778 1319848 1187221
35509 1187221 1314956 1651049 2056045 2387141 2562288 2539621 2288134 1833543 1315852 937471
35499 937471 827401 977446 1309381 1752135 2222788 2582506 2688844 2508474 2142256 1725527
$$ packed form
35569C22788l37420l4184J75935K30391J98406J82782K12180K35770J98113J07450
35559A492211M3561R7852K79819M72391N05358K97074p9170m66595p34797q16033
35549A091671o93542m19163j27672L7585M1950k8592q3018j13142j50964j89066
35539f33953j86774j27154k5294R9585K16848K67710K11812R3385J5070L7955
35529c0810J45532L04133M98766O86932P77939P12942N39690L62503K34443J36386
35519D368456M0212o0690j77589l25987m83012n85904n91900n08808l54930j32627
35509A187221J27735L36093M04996L31096J75147k2667k51487m54591n17691l78381
35499I37471j10070J50045L31935M42754M70653L59718J06338j80370l66218m16729
$$ plain form
35489 1725527 1328435 959769 632052 393947 309685 419898 704121 1061443 1342757 1432555
35479 1432555 1311896 1045905 725803 431901 231421 179238 303210 579031 910814 1154764
35469 1154764 1208507 1095002 921729 732943 444734 -28650 -615773 -1110627 -1336218 -1235287
35459 -1235287 -835233 -226006 409752 847890 983316 910180 803145 755619 764604 808434
35449 808434 859474 845813 681067 341952 -126123 -665976 -1214129 -1664367 -1909702 -1947817
35439 -1947817 -1883903 -1793578 -1629348 -1297379 -781736 -148404 532795 1205735 1784318 2165963
35429 2165963 2318561 2318927 2275516 2225785 2127152 1937880 1684495 1443372 1267617 1149080
35419 1149080 1058739 1003832 1006014 1010960 863854 435488 -214442 -834873 -1167233 -1122233 -780445
$$ packed form
35489A725527l97092l68666l27717k38105q4262J10213K84223L57322K81314Q9798
35479A432555j20659k65991l20102k93902k00480n2183J23972K75821L31783K43950
35469A154764N3743j13505j73273j88786k88209m73384n87123m94854k25591J00931
35459a235287M00054O09227O35758M38138J35426p3136j07035m7526Q985M3830
35449H08434N1040j3661j64746l39115m68075n39853n48153m50238k45335l8115
35439a947817O3914R0325J64230L31969N15643O33332O81199O72940N78583L81645
35429B165963J52598L66m3411m9731r8633j89272k53385k41123j75755j18537
35419A149080r0341n4907K182M946j47106m28366o49930o20431l32360M5000L41788
$$ plain form
35408 -780445 -271384 302213 852382 1301381 1627075 1879044 2116049 2343117 2526263 2634675
35398 2634675 2633823 2475282 2162270 1818654 1615288 1594388 1614917 1503523 1218740 842565
35388 842565 476210 208062 131459 287385 576015 799940 828259 684419 476207 304796
35378 304796 255851 392849 687121 989679 1137888 1084845 888674 599935 217171 -249478
35368 -249478 -728699 -1129130 -1409178 -1597546 -1766683 -1992182 -2309630 -2684165 -3020796 -3215034
35358 -3215034 -3209045 -3025269 -2765501 -2563724 -2508035 -2597184 -2779445 -3024980 -3341306 -3726697
35348 -3726697 -4141667 -4538051 -4894621 -5209774 -5474703 -5671547 -5792598 -5846597 -5841423 -5762813
35338 -5762813 -5573128 -5239126 -4770657 -4232793 -3715981 -3295792 -3016536 -2886647 -2863914 -2857407
$$ packed form
35408g80445N09061N73597N50169M48999L25694K51969K37005K27068J83146J08412
35398B634675q52j58541l13012l43616k03366k0900K0529j11394k84783l76175
35388H42565l66355k68148p6603J55926K88630K23925K8319j43840k08212j71411
35378C04796m8945J36998K94272L02558J48209n3043j96171k88739l82764m66649
35368b49478m79221m00431k80048j88368j69137k25499l17448l74535l36631j94238
35358c215034N989J83776K59768K01777N5689q9149j82261k45535l16326l85391
35348c726697m14970l96384l56570l15153k64929j96844j21051n3999N174P8610
35338e762813J89685L34002M68469N37864N16812M20189K79256J29889K2733O507
$$ plain form
35328 -2857407 -2779948 -2607564 -2365807 -2056783 -1635863 -1082635 -471083 59378 393798 484502
35318 484502 323276 -88628 -730457 -1540253 -2412251 -3207924 -3779685 -4024050 -3944705 -3657478
35308 -3657478 -3307820 -2974838 -2662865 -2375938 -2164381 -2073559 -2063634 -2015569 -1825986 -1478412
35298 -1478412 -1019842 -500666 36814 534447 928473 1193304 1349528 1420101 1404598 1313167
35288 1313167 1202417 1146882 1177171 1266802 1378967 1503192 1635996 1744251 1774851 1713232
35278 1713232 1628117 1645044 1859313 2260225 2729911 3110823 3281268 3192353 2867635 2383970
35268 2383970 1840504 1326952 915596 677623 682193 951087 1412205 1919266 2332332 2579384
35258 2579384 2648255 2547198 2294888 1936266 1535575 1138280 751622 376595 52018 -154702
$$ packed form
35328b857407P7459J72384K41757L09024M20920N53228O11552N30461L34420R0704
35318D84502j61226m11904o41829q09796q71998p95673n71761k44365P9345K87227
35308c657478L49658L32982L11973K86927K11557R0822R925M8065J89583L47574
35298a478412M58570N19176N37480M97633L94026K64831J56224P0573j5503r1431
35288A313167j10750n5535L0289Q9631J12165J24225J32804J08255L0600o1619
35278A713232q5115J6927K14269M00912M69686L80912J70445q8915l24718m83665
35268B383970n43466n13552m11356k37973M570K68894M61118N07061M13066K47052
35258B579384O8871j01057k52310l58622m00691l97295l86658l75027l24577k06720
$$ plain form
35248 -154702 -215448 -199634 -256150 -525927 -1056387 -1782695 -2579105 -3327145 -3943019 -4355191
35238 -4355191 -4479601 -4243292 -3645920 -2792525 -1856756 -1013729 -405892 -139759 -258961
35229 -258961 -689021 -1230453 -1654703 -1841051 -1832723 -1767127 -1752853 -1794455 -1802133 -1656806 -1283727
35218 -1283727 -701506 -29539 550734 872532 870876 630485 348272 220038 330583 627179
35208 627179 975640 1231409 1280087 1060391 587193 -44083 -690646 -1214117 -1522089 -1594768
35198 -1594768 -1492914 -1324956 -1178676 -1079548 -1020390 -1012459 -1079089 -1209738 -1364798 -1540571
35188 -1540571 -1791808 -2158145 -2589363 -2978005 -3255553 -3421426 -3482468 -3412847 -3203029 -2925000
35178 -2925000 -2709505 -2642339 -2681668 -2672112 -2441527 -1910504 -1147385 -339266 302689 648836
$$ packed form
35248a54702o0746J5814n6516k69777n30460p26308p96410p48040o15874m12172
35238d355191j24410K36309N97372Q53395R35769Q43027O07837K66133j19202
35229b58961m30060n41432m24250j86348Q328O5596J4274m1602p678J45327L73079
35218a283727N82221O71967N80273L21798j656k40391k82213j28234J10545K96596
35208F27179L48461K55769M8678k19696m73198o31276o46563n23471l07972p2679
35198a594768J01854J67958J46280R9128N9158P931o6630j30649j55060j75773
35188a540571k51237l66337m31218l88642k77548j65873o1042O9621K09818K78029
35178b925000K15495O7166l9329R556K30585N31023P63119Q08119O41955L46147
$$ plain form
35168 648836 706802 595741 460920 397059 438171 595620 870630 1218533 1535799 1726885
35158 1726885 1789141 1811346 1890391 2066657 2322232 2592541 2770474 2752326 2522631 2173686
35148 2173686 1807404 1431438 985248 461780 -30708 -336458 -371217 -188377 42005 120662
35138 120662 -77850 -557673 -1241619 -2039707 -2865898 -3613243 -4163493 -4447196 -4487387 -4378248
35128 -4378248 -4217671 -4031069 -3722955 -3113833 -2081738 -699814 783041 2108593 3138297
35119 3138297 3832636 4181770 4217012 4052713 3833783 3621165 3368053 3015490 2565145 2041001
35109 2041001 1433508 735892 18973 -581861 -964646 -1119697 -1095310 -953701 -786920 -730871
35099 -730871 -890141 -1225305 -1550012 -1674558 -1550903 -1268862 -932490 -571052 -163827 289472
$$ packed form
35168F48836N7966j11061j34821o3861M1112J57449K75010L47903L17266J91086
35158A726885O2256K2205P9045J76266K55575K70309J77933j8148k29695l48945
35148B173686l66282l75966m46190n23468m92488l05750l4759J82840K30382P8657
35138A20662j98512m79823o83946p98088q26191p47345n50250k83703m0191J09139
35128d378248J60577J86602L08114O09122J032095J381924J482855J325552J029704
35119C138297O94339L49134L5242j64299k18930k12618k53112l52563m50345n24144
35109B041001o07493o97616p16919o00834l82785j55051K4387J41609J66781N6049
35099g30871j59270l35164l24707j24546J23655K82041L36372L61438M07225M53299
$$ plain form
35089 289472 747066 1153799 1459701 1604400 1503402 1074150 292960 -762517 -1921122
35080 -1921122 -2969774 -3713275 -4021380 -3869510 -3365761 -2722143 -2152510 -1765331 -1549557
35071 -1549557 -1458533 -1487180 -1656808 -1944427 -2259415 -2504514 -2653730 -2761213 -2893022 -3052663
35061 -3052663 -3165476 -3113857 -2775685 -2060514 -974864 312265 1506297 2355192 2805358
35052 2805358 2979431 3010450 2929712 2708679 2351725 1911737 1442220 967819 485405 -37912
35042 -37912 -656433 -1394089 -2182480 -2863602 -3274323 -3350603 -3174930 -2927858 -2764714 -2707799
35032 -2707799 -2655217 -2500902 -2235831 -1927215 -1626325 -1328702 -1020311 -736906 -569345 -611270
35022 -611270 -884327 -1295779 -1679863 -1903400 -1933998 -1807951 -1564088 -1235250 -872746 -524673
$$ packed form
35089B89472M57594M06733L05902J44699j00998m29252p81190j055477j158605
35080a921122j048652p43501l08105J51870N03749O43618N69633L87179K15774
35071a549557R1024k8647j69628k87619l14988k45099j49216j07483j31809j59641
35061c052663j12813N1619L38172P15171J085650J287129J194032Q48895M50166
35052B805358J74073L1019q0738k21033l56954m39988m69517m74401m82414n23317
35042c7912o18521p37656p88391o81122m10721p6280J75673K47072J63144N6915
35032b707799N2582J54315K65071L08616L00890K97623L08391K83405J67561m1925
35022f11270k73057m11452l84084k23537l0598J26047K43863L28838L62504L48073
$$ plain form
35012 -524673 -191784 148084 464754 672977 729881 702272 706675 798501 940229 1062032
35002 1062032 1133629 1191297 1314698 1562998 1906292 2219211 2359822 2264331 1975118 1603765
34992 1603765 1284179 1135485 1220706 1514800 1915934 2295688 2548537 2621787 2533619 2369099
34982 2369099 2229773 2155779 2090986 1935303 1637432 1233777 799707 381971 -1020 -301878
34972 -301878 -428769 -319564 -21175 332859 621194 785609 791361 590770 168133 -392239
34962 -392239 -918976 -1247608 -1302464 -1106060 -737728 -288879 159012 529423 738015 707828
34952 707828 415906 -83698 -703249 -1380890 -2068327 -2657483 -2965876 -2847453 -2328760 -1612426
34942 -1612426 -932384 -412475 -61657 131469 140460 -67315 -477395 -1017114 -1567830 -1976818
$$ packed form
35012e24673L32889L39868L16670K08223N6904k7609M403R1826J41728J21803
35002A062032P1597N7668J23401K48300L43294L12919J40611r5491k89213l71353
34992A603765l19586j48694Q5221K94094M01134L79754K52849P3250q8168j64520
34982B369099j39326p3994o4793j55683k97871m03655m34070m17736l82991l00858
34972c01878j26891J09205K98389L54034K88335J64415N752k00591m22637n60372
34962c92239n26737l28632n4856J96404L68332M48849M47891L70411K08592l0187
34952G07828k91922m99604o19551o77641o87437n89156l08393J18423N18693P16334
34942a612426O80042N19909L50818J93126Q991k07775m10080n39719n50716m08988
$$ plain form
34932 -1976818 -2107481 -1941200 -1628534 -1383617 -1295391 -1258681 -1099035 -737259 -220896 359388
34922 359388 934346 1452855 1871219 2171254 2370535 2496718 2550520 2486891 2221788 1675982
34912 1675982 857064 -82783 -904342 -1443802 -1730537 -1927917 -2153312 -2370821 -2461107 -2366692
34902 -2366692 -2143945 -1890580 -1660937 -1454496 -1247361 -1013201 -742405 -468317 -249309
34893 -249309 -90068 93108 370173 660011 754004 504796 -38276 -692598 -1296469 -1777878
34883 -1777878 -2121331 -2321796 -2360039 -2192457 -1784203 -1186452 -565446 -120387 24450 -155327
34873 -155327 -608390 -1200375 -1723859 -2007274 -2031354 -1889642 -1640172 -1263579 -771932 -274113
34863 -274113 108457 329360 376418 208098 -189653 -701286 -1104570 -1213422 -985973 -519911
$$ packed form
34932a976818j30663J66281L12666K44917Q8226L6710J59646L61776N16363N80284
34922C59388N74958N18509M18364L00035J99281J26183N3802o3629k65103n45806
34912A675982q18918r39847q21559n39460k86735j97380k25395k17509r0286R4415
34902b366692K22747K53365K29643K06441K07135K34160K70796K74088K19008
34893b49309J59241J83176K77065K89838R3993k49208n43072o54322o03871m81409
34883a777878l43453k00465l8243J67582M08254N97751O21006M45059J44837j79777
34873a55327m53063n91985n23484k83415k4080J41712K49470L76593M91647M97819
34863b74113L82570K20903M7058j68320l97751n11633m03284j08852K27449M66062
$$ plain form
34853 -519911 18314 479955 806270 1029750 1187612 1251055 1172483 982505 786086 657269
34843 657269 581476 514144 459362 472837 614265 911018 1340173 1821571 2241514 2504751
34833 2504751 2569628 2443703 2165725 1789586 1356411 867787 300863 -343143 -1019516 -1670682
34823 -1670682 -2256546 -2748755 -3110761 -3284943 -3187051 -2737315 -1955283 -1038812 -290952 87922
34813 87922 134333 41041 -24203 -2038 97475 243334 399330 550966 731485 985389 1298288
34802 1298288 1594551 1804925 1893828 1812307 1482899 880563 109786 -640095 -1220344 -1594337
34792 -1594337 -1809757 -1941404 -2065753 -2255479 -2562841 -2995684 -3513224 -4055041 -4580513
34783 -4580513 -5072459 -5492700 -5752323 -5767994 -5566940 -5310510 -5181785 -5244808 -5411562 -5520435
$$ packed form
34853e19911N38225M61641L26315K23480J57862O3443p8572j89978j96419j28817
34843F57269p5793o7332n4782J3475J41428K96753M29155M81398M19943K63237
34833B504751O4877j25925k77978l76139m33175m88624n66924o44006o76373o51166
34823a670682n85864m92209l62006j74182R7892M49736P82032R16471P47860L78874
34813H7922M6411r3292o5244K2165R9513J45859J55996J51636J80519K53904L12899
34802A298288K96263K10374Q8903q1521l29408o02336p70777p49881n80249l73993
34792a594337k15420j31647j24349j89726l07362m32843n17540n41817n25472
34783d580513m91946m20241k59623j5671K01054K56430J28725o3023j66754j08873
$$ plain form
34773 -5520435 -5433634 -5102205 -4600419 -4102224 -3767010 -3605733 -3474361 -3229704 -2887006 -2595371
34763 -2595371 -2448469 -2341212 -2041506 -1412983 -555747 284154 935493 1415235 1832513
34754 1832513 2220341 2484271 2488402 2157032 1513334 675508 -171686 -850368 -1279980 -1495821
34744 -1495821 -1571345 -1539075 -1395741 -1155436 -871154 -623575 -518228 -672139 -1145283 -1859266
34734 -1859266 -2607501 -3173220 -3443798 -3421411 -3157790 -2709084 -2146850 -1577048 -1114729 -822803
34724 -822803 -670571 -555804 -376677 -91619 280907 704066 1143568 1540479 1780738 1724686
34714 1724686 1296209 555582 -319079 -1133742 -1777936 -2247829 -2600214 -2895617 -3164187
34705 -3164187 -3390295 -3518868 -3496744 -3324248 -3059481 -2765037 -2459708 -2123818 -1729916 -1257735
$$ packed form
34773e520435Q6801L31429N01786M98195L35214J61277J31372K44657L42698K91635
34763b595371J46902J07257K99706O28523Q57236Q39901O51339M79742M17278
34754A832513L87828K63930M131l31370o43698q37826q47194o78682m29612k15841
34744a495821p5524L2270J43334K40305K84282K47579J05347j53911m73144p13983
34734a859266p48235n65719k70578K2387K63621M48706N62234N69802M62319K91926
34724h22803J52232J14767J79127K85058L72526M23159M39502L96911K40259n6052
34714A724686m28477p40627q74661q14663o44194m69893l52385k95403k68570
34705c164187k26108j28573K2124J72496K64767K94444L05329L35890L93902M72181
$$ plain form
34695 -1257735 -710383 -150949 293685 515137 525178 448299 398663 381876 320553 141834
34685 141834 -179243 -622474 -1113397 -1512159 -1661935 -1488805 -1060570 -545252 -112188 143155
34675 143155 214831 155814 28960 -130784 -318933 -532524 -742638 -895894 -941074 -858104
34665 -858104 -669740 -426860 -176514 55417 242693 325350 223116 -97110 -571841 -1072333
34655 -1072333 -1481453 -1731494 -1787156 -1635271 -1311156 -911512 -552353 -312215 -218610 -262706
34645 -262706 -391122 -485471 -390250 4604 697921 1584184 2511580 3339529 3972380 4367029
34635 4367029 4515359 4420258 4095068 3582160 2950773 2262478 1545606 811259 87955 -565552
34625 -565552 -1080693 -1423190 -1636860 -1833821 -2096795 -2368227 -2466603 -2246604 -1734247 -1089537
$$ packed form
34695a257735N47352N59434M44634K21452J0041p6879m9636j6787o1323j78719
34685A41834l21077m43231m90923l98762j49776J73130M28235N15318M33064K55343
34675A43155P1676n9017j26854j59744j88149k13591k10114j53256m5180Q2970
34665h58104J88364K42880K50346K31931J87276Q2657j02234l20226m74731n00492
34655a072333m09120k50041n5662J51885L24115L99644L59159K40138R3605m4096
34645b62706j28416r4349R5221L94854O93317Q86263R27396Q27949O32851L94649
34635D367029J48330r5101l25190n12908o31387o88295p16872p34347p23304o53507
34625e65552n15141l42497k13670j96961k62974k71432r8376K19999N12357O44710
$$ plain form
34615 -1089537 -464020 74671 509743 827513 1006571 1013963 813988 431374 17476 -202876
34605 -202876 -97887 267918 711217 1085539 1342816 1480112 1481672 1323673 1008954 578848
34595 578848 89746 -419175 -922687 -1358566 -1598623 -1527240 -1181532 -783845 -592633 -716869
34585 -716869 -1077228 -1509075 -1871106 -2098366 -2228205 -2381431 -2653149 -2991305 -3225350 -3247927
34575 -3247927 -3134318 -3041293 -3008360 -2904285 -2566862 -1958614 -1189313 -440804 101099 291284
34565 291284 88211 -388891 -892175 -1179116 -1142243 -829876 -374100 80416 403640 498086
34555 498086 336326 -5229 -349503 -466638 -162264 616012 1721025 2865856 3774823
34546 3774823 4308644 4483397 4411333 4227144 4026059 3831862 3622490 3387241 3135162 2844212
$$ packed form
34615a089537O25517N38691M35072L17770J79058P392j99975l82614m13898k20352
34605b02876J04989L65805M43299L74322K57277J37296J560j57999l14719m30106
34595E78848m89102n08921n03512m35879k40057P1383L45708L97687J91212j24236
34585g16869l60359m31847l62031k27260j29839j53226k71718l38156k34045k2577
34575c247927J13609R3025L2933J04075L37423O08248P69301P48509N41903J90185
34565B91284k03073m77102n03284k86941L6873L12367M55776M54516L23224R4446
34555D98086j61760l41555l44274j17135L04374P78276J105013J144831R08967
34546C774823N33821J74753p2064j84189k01085j94197k09372k35249k52079k90950
$$ plain form
34536 2844212 2453015 1948689 1441149 1104010 1043906 1251350 1651134 2145240 2617114 2968505
34526 2968505 3188469 3351404 3521819 3687648 3801976 3850015 3840176 3755889 3559329 3239662
34516 3239662 2830966 2385482 1951051 1571453 1280717 1075950 891934 613302 142749
34507 142749 -507712 -1196200 -1763483 -2187693 -2597799 -3105363 -3644019 -4006634 -4028145 -3704523
34497 -3704523 -3152399 -2503502 -1849024 -1243446 -721829 -308186 -13093 178639 312955
34488 312955 441702 581697 701860 755050 722660 633378 546487 513553 542830 592540 599980
34477 599980 522653 361975 162026 -11657 -109770 -136587 -154808 -247492 -466581 -800568
34467 -800568 -1170532 -1460148 -1579144 -1515415 -1316650 -1025269 -662451 -276228 55517 313537
$$ packed form
34536B844212l91197n04326n07540l37139o0104K07444L99784M94106M71874L51391
34526B968505K19964J62935J70415J65829J14328M8039r839q4287j96560l19667
34516C239662m08696m45484m34431l79598k90736k04767j84016k78632m70553
34507A42749o50461o88488n67283m24210m10106n07564n38656l62615k1511L23622
34497c704523N52124O48897O54478O05578N21617M13643K95093J91732J34316
34488C12955J28747J39995J20163N3190l2390q9282q6891l2934K9277M9710P440
34477E99980p7327j60678j99949j73683r8113k6817j8221r2684k19089l33987
34467h00568l69964k89616j18996O3729J98765K91381L62818L86223L31745K58020
$$ plain form
34457 313537 580940 922797 1230522 1260256 850342 60111 -907275 -1847973 -2592613 -2982331
34447 -2982331 -2917415 -2447224 -1761225 -1062747 -454934 66556 546160 1000751 1389361 1630122
34437 1630122 1654625 1456711 1093211 646717 192013 -219388 -563523 -826851 -967082 -903061
34427 -903061 -579501 -56063 484273 828393 837687 486542 -151064 -926661 -1658335 -2197257
34417 -2197257 -2483375 -2551731 -2504808 -2481859 -2613171 -2944245 -3385236 -3766771 -3982605 -4083461
34407 -4083461 -4217760 -4472931 -4773861 -4934988 -4817065 -4451097 -4022033 -3721200 -3594968
34398 -3594968 -3532730 -3405228 -3199557 -2998656 -2846149 -2684930 -2453252 -2199645 -2049770 -2065702
34388 -2065702 -2182534 -2289856 -2333462 -2318246 -2252273 -2132012 -1971412 -1806929 -1666271 -1551831
$$ packed form
34457C13537K67403L41857L07725K9734m09914p90231r67386r40698p44640l89718
34447b982331O4916M70191O85999O98478O07813N21490M79604M54591L88610K40761
34437A630122K4503j97914l63500m46494m54704m11401l44135k63328j40231O4021
34427i03061L23560N23438N40336L44120R294l51145o37606p75597p31674n38922
34417b197257k86118o8356M6923K2949j31312l31074m40991l81535k15834j00856
34407d083461j34299k55171l00930j61127J17923L65968M29064L00833J26232
34398c594968O2238J27502K05671K00901J52507J61219K31678K53607J49875j5932
34388b065702j16832j07322m3606J5216O5973J20261J60600J64483J40658J14440
$$ plain form
34378 -1551831 -1456565 -1374535 -1286661 -1150504 -915722 -545800 -23800 648723 1441907 2282833
34368 2282833 3059318 3655126 4001000 4102549 4016577 3797873 3474449 3072269 2640591 2229351
34358 2229351 1847768 1471335 1098039 778081 568047 457849 360985 193804 -31550 -205254
34348 -205254 -226990 -112608 27071 118624 211693 418574 798233 1327392 1949244 2582835
34338 2582835 3080683 3248553 2962675 2259420 1296652 254670 -712314 -1487419 -2034932
34329 -2034932 -2444569 -2881241 -3451321 -4113356 -4715967 -5112516 -5249128 -5170391 -4956752 -4659104
34319 -4659104 -4300084 -3932430 -3653429 -3520613 -3471886 -3384682 -3222908 -3075228 -3022728 -3012758
34309 -3012758 -2909947 -2652339 -2309383 -1987157 -1722537 -1491430 -1289398 -1165583 -1176319 -1329713
$$ packed form
34378a551831R5266Q2030Q7874J36157K34782L69922N22000O72523P93184Q40926
34368B282833P76485N95808L45874J01549q5972k18704l23424m02180m31678m11240
34358B229351l81583l76433l73296l19958k10034j10198r6864j67181k25354j73704
34348b05254k1736J14382J39679R1553R3069K06881L79659N29159O21852O33591
34338B582835M97848J67870k85878p03255r62768j041982r66984p75105n47513
34329b034932m09637m36672n70080o62035o02611l96549j36612P8737K13639K97648
34319d659104L59020L67654K79001J32816M8727Q7204J61774J47680N2500R970
34309c012758J02811K57608L42956L22226K64620K31107K02032J23815j0736j53394
$$ plain form
34299 -1329713 -1583661 -1874057 -2119484 -2214296 -2072879 -1719298 -1311932 -1031759 -933347 -923736
34289 -923736 -881659 -764609 -599765 -418619 -230064 -32637 168150 329034 340413 79384
34279 79384 -451951 -1063171 -1514328 -1724554 -1797423 -1838416 -1808081 -1587242 -1147640 -620716
34269 -620716 -217629 -103016 -310834 -729604 -1165937 -1456297 -1536071 -1407932 -1074501 -537831
34259 -537831 144150 843463 1420179 1774281 1836340 1548012 897027 -24647 -1023735 -1884566
34249 -1884566 -2450581 -2648647 -2479916 -2026809 -1459055 -974748 -682141 -533773 -399290
34240 -399290 -205693 12203 194055 347511 536069 790356 1046767 1153719 921831 208591
34230 208591 -971916 -2387332 -3660676 -4456975 -4647303 -4338516 -3773920 -3188091 -2704524
$$ packed form
34299a329713k53948k90396k45427r4812J41417L53581M07366K80173R8412R611
34289i23736M2077J17050J64844J81146J88555J97427K00787J60884J1379k61029
34279G9384n31335o11220m51157k10226p2869m0993L0335K20839M39602N26924
34269f20716M03087J14613k07818m18770m36333k90360p9774J28139L33431N36670
34259e37831O81981O99313N76716L54102O2059k88328o50985r21674r99088q60831
34249a884566n66015j98066J68731M53107N67754M84307K92607J48368J34483
34240c99290J93597K17896J81852J53456J88558K54287K56411J06952k31888p13240
34230B08591j180507j415416j273344p96299j90328L08787N64596N85829M83567
$$ plain form
34221 -2704524 -2331997 -2043937 -1842131 -1721412 -1589527 -1280235 -683718 148359 1040185
34212 1040185 1807888 2321421 2498117 2307835 1803772 1112410 368792 -330294 -915065
34203 -915065 -1323444 -1519793 -1520311 -1380236 -1159224 -906448 -666618 -480514 -371064 -324824
34193 -324824 -285338 -184274 -13873 126816 96188 -151222 -508347 -817482 -1002902 -1074350
34183 -1074350 -1035710 -859222 -559090 -235074 -11382 44431 -66755 -302313 -589517 -847074
34173 -847074 -1034288 -1159109 -1209451 -1113998 -831613 -465338 -210499 -156760 -185129 -96308
34163 -96308 187312 579852 961972 1297665 1616258 1923192 2162075 2256120 2164205 1895151
34153 1895151 1489160 1004007 510828 73646 -282887 -568015 -767292 -809242 -631568 -290635
$$ packed form
34221b704524L72527K88060K01806J20719J31885L09292N96517Q32077Q91826
34212A040185P67703N13533J76696j90282n04063o91362p43618o99086n84771
34203i15065m08379j96349n18J40075K21012K52776K39830J86104J09450M6240
34193c24824L9486J01064J70401J40689l0628k47410l57125l09135j85420p1448
34183a074350L8640J76488L00132L24016K23692N5813j11186k35558k87204k57557
34173h47074j87214j24821n0342R5453K82385L66275K54839N3739k8369Q8821
34163i6308K83620L92540L82120L35693L18593L06934K38883R4045r1915k69054
34153A895151m05991m85153m93179m37182l56533k85128j99277m1950J77674L40933
$$ plain form
34143 -290635 27662 132247 -44754 -446196 -984681 -1606251 -2265814 -2870897 -3274006 -3340333
34133 -3340333 -3049796 -2544446 -2052985 -1738764 -1614604 -1598620 -1616345 -1621519 -1557532 -1374936
34123 -1374936 -1109990 -902575 -902458 -1166303 -1641100 -2198092 -2657107 -2840499 -2698472 -2404714
34113 -2404714 -2271747 -2512971 -3064394 -3622340 -3840171 -3523889 -2728921 -1732010 -875020
34104 -875020 -345245 -56340 246847 748607 1418207 2071669 2527018 2696777 2595800 2320338
34094 2320338 2002817 1730366 1495088 1251319 1015070 861558 817363 807639 741890 614295
34084 614295 480763 369284 265982 171812 105288 33184 -146168 -509829 -1019627 -1545223
34074 -1545223 -1952063 -2142139 -2046007 -1647427 -1042568 -433232 -4886 210624 343598 550292
$$ packed form
34143b90635L18297J04585j77001m01442n38485o21570o59563o05083m03109o6327
34133c340333K90537N05350M91461L14221J24160J5984j7725n174O3987J82596
34123a374936K64946K07415J17k63845m74797n56992m59015j83392J42027K93758
34113b404714J32967k41224n51423n57946k17831L16282P94968R96911Q56990
34104h75020N29775K88905L03187N01760O69600O53462M55349J69759j00977k75462
34094B320338l17521k72451k35278k43769k36249j53512m4195r724o5749j27595
34084F14295j33532j11479j03302r4170o6524p2104j79352l63661n09798n25596
34074a545223m06840j90076R6132L98580O04859O09336M28346K15510J32974K06694
$$ plain form
34064 550292 868650 1202946 1426609 1474913 1347879 1076820 732495 443748 341717 454880
34054 454880 687929 928188 1144865 1351921 1504332 1497232 1284439 953041 648113 445729
34044 445729 328398 263159 253905 304862 372397 394112 366950 371323 501797 775607 1109737
34033 1109737 1374706 1459946 1302578 893795 291544 -373592 -933702 -1255327 -1298932 -1127369
34023 -1127369 -866982 -646984 -542852 -550586 -605607 -620179 -498175 -138120 517120 1384082
34013 1384082 2203063 2653837 2551348 1945435 1048216 86778 -788502 -1515842 -2102217
34004 -2102217 -2595581 -3046505 -3475370 -3863934 -4160953 -4295415 -4220390 -3978203 -3705727 -3530849
33994 -3530849 -3453602 -3356151 -3140191 -2836709 -2578159 -2484636 -2575875 -2756479 -2866302 -2773869
$$ packed form
34064E50292L18358L34296K23663M8304j27034k71059l44325k88747j02031J13163
34054D54880K33049K40259K16677K07056J52411p100k12793l31398l04928k02384
34044D45729j17331o5239r254N0957O7535K1715k7162M373J30474K73810L34130
34033A109737K64969Q5240j57368m08783o02251o65136n60110l21625m3605J71563
34023a127369K60387K19998J04132p734n5021j4572J22004L60055O55240Q66962
34013A384082Q18981M50774j02489o05913q97219r61438q75280p27340n86375
34004b102217m93364m50924m28865l88564k97019j34462P5025K42187K72476J74878
33994c530849P7247R7451K15960L03482K58550R3523r1239j80604j09823R2433
$$ plain form
33984 -2773869 -2456975 -1998411 -1505984 -1060264 -745409 -683218 -979496 -1627790 -2489625 -3379767
33974 -3379767 -4172564 -4844011 -5428215 -5923681 -6235315 -6237937 -5924188 -5463812 -5075251 -4848649
33964 -4848649 -4725269 -4617032 -4473644 -4238312 -3836805 -3272167 -2678870 -2210510 -1882687
33955 -1882687 -1575327 -1183947 -721976 -271393 116689 440899 693259 823532 774764 546737
33945 546737 211474 -137206 -434452 -629438 -640945 -382159 141959 791915 1386172 1831217
33935 1831217 2144035 2373765 2544929 2668014 2752826 2792699 2767963 2683015 2572500 2448973
33925 2448973 2266362 1964630 1547859 1103350 745825 544446 483151 471433 404409 238995
33915 238995 20869 -167781 -284993 -353411 -426509 -548647 -735058 -957665 -1141655 -1204581
$$ packed form
33984b773869L16894M58564M92427M45720L14855O2191k96278o48294q61835q90142
33974c379767p92797o71447n84204m95466l11634k622L13749M60376L88561K26602
33964d848649J23380J08237J43388K35332M01507N64638N93297M68360L27823
33955a882687L07360L91380M61971M50583L88082L24210K52360J30273m8768k28027
33945E46737l35263l48680k97246j94986j1507K58786N24118O49956N94257M45045
33935A831217L12818K29730J71164J23085Q4812L9873k4736q4948j10515j23527
33925B448973j82611l01732m16771m44509l57525k01379o1295j1718o7024j65414
33915B38995k18126j88650j17212o8418p3098j22138j86411k22607j83990o2926
$$ plain form
33905 -1204581 -1128757 -994096 -918350 -952220 -1035939 -1061690 -970967 -782291 -532538 -218198
33895 -218198 186854 669564 1164534 1608177 1977970 2259997 2406238 2371032 2197844 2032481
33885 2032481 2015649 2159341 2335216 2377617 2197344 1823557 1372161 980080 743058 686173
33875 686173 775721 947353 1122276 1221613 1202326 1090932 961313 861759 770824 632376
33865 632376 419894 152563 -137444 -429475 -709023 -961140 -1177452 -1357921 -1498483 -1580309
33855 -1580309 -1571047 -1439609 -1193410 -922659 -782812 -875584 -1127081 -1321469 -1286072 -1024143
33845 -1024143 -649504 -235768 212382 657166 974494 1039777 839738 484143 142245 -13399
33835 -13399 145383 635681 1331133 2033257 2596619 2984569 3229594 3386579 3525110 3707323
$$ packed form
33905a204581P5824J34661P5746l3870q3719k5751R0723J88676K49753L14340
33895b18198M05052M82710M94970M43643L69793K82027J46241l5206j73188j65363
33885B032481j6832J43692J75875M2401j80273l73787m51396l92081k37022n6885
33875F86173Q9548J71632J74923R9337j9287j11394j29619r9554r0935j38448
33865F32376k12482k67331k90007k92031k79548k52117k16312j80469j40562q1826
33855a580309R262J31438K46199K70751J39847r2772k51497j94388L5397K61929
33845a024143L74639M13736M48150M44784L17328O5283k00039l55595l41898j55644
33835a3399J58782M90298O95452P02124N63362L87950K45025J56985J38531J82213
$$ plain form
33825 3707323 3930385 4117142 4204550 4226470 4265125 4323129 4291709 4068136 3679887 3277200
33815 3277200 3025326 3010505 3200273 3439988 3504886 3228997 2628722 1887238 1196423 619941
33805 619941 114223 -346683 -703530 -868420 -821735 -637179 -416209 -205400 23190 318051
33795 318051 684521 1078112 1446784 1756281 1974386 2069255 2059987 2053843 2180443 2460688
33785 2460688 2763414 2926527 2927557 2923630 3123471 3625392 4364404 5182350 5929559 6512692
33775 6512692 6875581 6958932 6694792 6053632 5102882 4010577 2973227 2123116 1491175
33766 1491175 1042368 731623 524965 385360 267251 149338 77209 152022 447035 927924
33756 927924 1472718 1974718 2400748 2738803 2933447 2924070 2729741 2437201 2102441 1724731
$$ packed form
33825C707323K23062J86757Q7408K1920L8655N8004l1420k23573l88249m02687
33815C277200k51874j4821J89768K39715O4898k75889o00275p41484o90815n76482
33805F19941n05718m60906l56847j64890M6685J84556K20970K10809K28590K94861
33795C18051L66470L93591L68672L09497K18105R4869r268o144J26600K80245
33785B460688L02726J63113J030l927J99841N01921P39012Q17946P47209N83133
33775F512692L62889Q3351k64140o41160r50750j092305j037350q50111o31941
33766A491175m48807l10745k06658j39605j18109j17913p2129P4813K95013M80889
33756I27924N44794N02000M26030L38055J94644r377j94329k92540l34760l77710
$$ plain form
33746 1724731 1331689 1011744 801489 590254 217254 -345069 -965487 -1503999 -1922443
33737 -1922443 -2243139 -2472497 -2603167 -2647367 -2634494 -2606448 -2633313 -2785937 -3056178 -3342640
33727 -3342640 -3557711 -3716338 -3870977 -3988056 -3955088 -3710882 -3316646 -2889296 -2506512 -2185794
33717 -2185794 -1908651 -1633060 -1306605 -903789 -459694 -66782 158651 124913 -178554 -646882
33707 -646882 -1092207 -1336560 -1298963 -1020588 -625384 -247604 26002 153302 86607 -236464
33697 -236464 -813666 -1506221 -2102162 -2475072 -2660841 -2778414 -2912669 -3082325 -3267668 -3422572
33687 -3422572 -3480950 -3397511 -3186318 -2901452 -2592916 -2305227 -2096877 -2007431 -1991073 -1920425
33677 -1920425 -1686843 -1290943 -831586 -436055 -223780 -301921 -720930 -1391771 -2068845 -2461961
$$ packed form
33746A724731l93042l19945k10255k11235l73000n62323o20418n38512m18444
33737a922443l20696k29358j30670m4200J2873K8046k6865j52624k70241k86462
33727c342640k15071j58627j54639j17079L2968K44206L94236M27350L82784L20718
33717b185794K77143K75591L26455M02816M44095L92912K25433l3738l03467m68328
33707f46882m45325k44353L7597K78375L95204L77780K73606J27300o6695l23071
33697b36464n77202o92555n95941l72910j85769j17573j34255j69656j85343j54904
33687c422572n8378Q3439K11193K84866L08536K87689K08350Q9446J6358P0648
33677a920425K33582L95900M59357L95531K12275p8141m19009o70841o77074l93116
$$ plain form
33667 -2461961 -2395178 -1878491 -1066430 -184927 524612 876455 833253 538249 225521 76440
33657 76440 144488 378317 681226 962234 1175732 1331231 1452334 1525821 1505836 1358859
33647 1358859 1077059 654537 93614 -549588 -1158612 -1621325 -1891311 -1985205 -1954920 -1881732
33637 -1881732 -1862132 -1955820 -2146964 -2370779 -2564685 -2680597 -2678223 -2552020 -2369024 -2252651
33627 -2252651 -2312992 -2582855 -2993966 -3398438 -3645112 -3678515 -3557655 -3349825 -3030064 -2545442
33617 -2545442 -1979553 -1579257 -1567921 -1960639 -2596787 -3314035 -4026928 -4651605 -5046644 -5091660
33607 -5091660 -4804639 -4338804 -3863091 -3464065 -3145873 -2879513 -2640486 -2435073 -2315890
33598 -2315890 -2349721 -2542307 -2807342 -3031896 -3155198 -3156460 -2995771 -2634013 -2122115 -1609259
$$ packed form
33667b461961O6783N16687Q12061Q81503P09539L51843m3202k95004l12728j49081
33657G6440O8048K33829L02909K81008K13498J55499J21103P3487j9985j46977
33647A358859k81800m22522n60923o43202o09024m62713k69986r3894L0285P3188
33637a881732J9600r3688j91144k23815j93906j15912K374J26203J82996J16373
33627b252651o0341k69863m11111m04472k46674l3403J20860K07830L19761M84622
33617b545442N65889M00296J1336l92718o36148p17248p12893o24677l95039m5016
33607e091660K87021M65835M75713L99026L18192K66360K39027K05413J19183
33598b315890l3831j92586k65035k24554j23302j262J60689L61758N11898N12856
$$ plain form
33588 -1609259 -1218707 -938099 -658414 -296254 147393 617795 1053657 1418726 1724089
33579 1724089 2010868 2279826 2450769 2429552 2211213 1884578 1542962 1227487 951193 732755
33569 732755 600941 604385 813835 1256218 1826116 2316612 2579616 2632801 2593904 2559288
33559 2559288 2583373 2720506 3002193 3369971 3688844 3847231 3818965 3632834 3327365 2949762
33549 2949762 2557551 2185054 1818994 1432527 1046640 747677 634353 732969 952247 1130671
33539 1130671 1152052 1025143 846827 693312 556669 373350 87069 -315726 -801348 -1302416
33529 -1302416 -1749431 -2101447 -2341537 -2447065 -2387363 -2160092 -1810338 -1394424 -926391 -365207
33519 -365207 346815 1220717 2167911 3004601 3541333 3700513 3549395 3219177 2812153 2389996
$$ packed form
33588a609259L90552K80608K79685L62160M43647M70402M35862L65069L05363
33579A724089K86779K68958J70943k1217k18339l26635l41616l15475k76294k18438
33569G32755j31814L444K09450M42383N69898M90496K63004N3185l8897l4616
33559B559288K4085J37133K81687L67778L18873J58387k8266j86131l05469l77603
33549B949762l92211l72497l66060l86467l85887k98963j13324R8616K19278J78424
33539A130671K1381j26909j78316j53515j36643j83319k86281m02795m85622n01068
33529a302416m47015l52016k40090j05528N9702K27271L49754M15914M68033N61184
33519c65207P12022Q73902R47194Q36690N36732J59180j51118l30218m07024m22157
$$ plain form
33509 2389996 2004490 1685799 1405619 1100383 752877 427914 205408 85593 -25191
33500 -25191 -234441 -569715 -951478 -1243630 -1330591 -1166007 -784823 -302848 99040 239020
33490 239020 33686 -451428 -1052940 -1600607 -1959426 -2037055 -1826302 -1455188 -1135327 -1006555
33480 -1006555 -1037655 -1102762 -1138835 -1191524 -1305689 -1410322 -1345830 -1007688 -448969 165978
33470 165978 701088 1132169 1504613 1845880 2141656 2365249 2474400 2377474 1968098 1247841
33460 1247841 402736 -281517 -594628 -501021 -107588 419632 913645 1239872 1324177 1168993
33450 1168993 848469 484689 204094 84044 126397 280312 480609 659693 748615 703858
33440 703858 540180 320876 114850 -26600 -67655 792 143446 306666 476691 686543
$$ packed form
33509B389996l85506l18691k80180l05236l47506l24963k22506j19815j10784
33500b5191k09250l35274l81763k92152q6961J64584L81184M81975M01888J39980
33490B39020k05334m85114o01512n47667l58819p7629K10753L71114L19861J28772
33480a006555l1100o5107l6073n2689j14165j04633O4492L38142N58719O14947
33470A65978N35110M31081L72444L41267K95776K23593J09151r6926m09376p20257
33460A247841q45105o84253l13111R3607L93433N27220M94013L26227Q4305j55184
33450A168993l20524l63780k80595j20050M2353J53915K00297J79084Q8922m4757
33440G03858j63678k19304k06026j41450m1055O8447J42654J63220J70025K09852
$$ plain form
33430 686543 947388 1198084 1355483 1410110 1443150 1535287 1666674 1715138 1554134 1154795
33420 1154795 599531 6793 -548054 -1042462 -1462690 -1775157 -1943872 -1963545 -1872385 -1739742
33410 -1739742 -1640349 -1628791 -1727303 -1924463 -2168825 -2369473 -2443992 -2398443 -2337855 -2354222 -2406982
33399 -2406982 -2353901 -2106812 -1724035 -1343719 -1064460 -905238 -837213 -809566 -751967 -584333
33389 -584333 -242252 290524 950495 1599412 2103267 2432973 2667788 2881479 3042619 3038049
33379 3038049 2769299 2215778 1446199 606447 -128418 -634777 -875674 -848697 -538817 29739
33369 29739 714100 1285389 1562192 1500680 1175681 722066 293813 17706 -66139 -23520
33359 -23520 22577 -38099 -265069 -664349 -1199049 -1796734 -2351215 -2745931 -2927092 -2971772
$$ packed form
33430F86543K60845K50696J57399N4627L3040R2137J31387M8464j61004l99339
33420A154795n55264n92738n54847m94408m20228l12467j68715j9673R1160J32643
33410a739742R9393J1558r8512j97160k44362k00648p4519M5549O0588j6367n2760
33399b406982N3081K47089L82777L80316K79259J59222O8025K7647N7599J67634
33389e84333L42081N32776O59971O48917N03855L29706K34815K13691J61140m570
33379C038049k68750n53521p69579q39752p34865n06359k40897K6977L09880N68556
33369B9739O84361N71289K76803o1512l24999m53615m28253k76107q3845M2619
33359b3520M6097o0676k26970l99280n34700n97685n54481l94716j81161m4680
$$ plain form
33349 -2971772 -3034989 -3184579 -3324008 -3338206 -3290047 -3388054 -3742696 -4217965 -4549577 -4560762
33339 -4560762 -4244803 -3705549 -3075067 -2452645 -1860145 -1255670 -618501 -6239 499718
33330 499718 886055 1210065 1524421 1836750 2135149 2409670 2640569 2804710 2921246 3074672
33320 3074672 3360109 3785902 4225338 4474162 4380655 3945723 3311519 2661677 2131363 1782969
33310 1782969 1617840 1588997 1626578 1676972 1712518 1699796 1586553 1345561 1019045 697790
33300 697790 459829 332385 286100 246189 140184 -22082 -123643 -33917 264386 653418
33290 653418 965456 1059806 843467 292088 -514846 -1416530 -2268249 -3014227 -3660491 -4206386
33280 -4206386 -4631301 -4936831 -5173426 -5414239 -5696592 -5974048 -6127273 -6053135 -5764746 -5385573
$$ packed form
33349b971772o3217j49590j39429j4198M8159r8007l54642m75269l31612j1185
33339d560762L15959N39254O30482O22422N92500O04475O37169O12262N05957
33330D99718L86337L24010L14356L12329K98399K74521K30899J64141J16536J53426
33320C074672K85437M25793M39436K48824r3507m34932o34204o49842n30314l48394
33310A782969j65129k8843L7581N0394L5546j2722j13243k40992l26516l21255
33300F97790k37961j27444m6285l9911j06005j62266j01561Q9726K98303L89032
33290F53418L12038R4350k16339n51379q06934r01684q51719p45978o46264n45895
33280d206386m24915l05530k36595k40813k82353k77456j53225P4138K88389L79173
$$ plain form
33270 -5385573 -5021528 -4650647 -4160115 -3478648 -2644496 -1752302 -870242 -17498 806936
33261 806936 1590770 2286469 2812232 3098230 3153598 3071415 2937212 2730208 2334859 1660397
33251 1660397 749670 -219330 -1028510 -1531839 -1707492 -1618262 -1323280 -838213 -188006 532346
33241 532346 1197953 1758397 2259587 2746235 3182018 3487783 3612063 3519977 3154163 2483950
33231 2483950 1597321 683116 -101939 -716585 -1184477 -1517061 -1717792 -1822367 -1891273 -1976554
33221 -1976554 -2120078 -2357674 -2680442 -2995787 -3171800 -3154434 -3045785 -3047343 -3280591 -3619715
33211 -3619715 -3718355 -3277393 -2331789 -1242667 -375018 187678 592802 957076 1236427
33202 1236427 1320619 1151333 726752 77875 -700021 -1432290 -1934916 -2099083 -1906589 -1408977
$$ packed form
33270e385573L64045L70881M90532O81467Q34152Q92194Q82060Q52744Q24434
33261H06936P83834O95699N25763K85998N5368q2183j34203k07004l95349o74462
33251A660397r10727r69000q09180n03329j75653Q9230K94982M85067O50207P20352
33241E32346O65607N60444N01190M86648M35783L05765J24280r2086l65814o70213
33231B483950q86629r14205p85055o14646m67892l32584k00731j04575o8906q5281
33221a976554j43524k37596l22768l15345j76013J7366J08649j558k33248l39124
33211c619715r8640M40962R45604J089122Q67649N62696M05124L64274K79351
33202A236427Q4192j69286m24581o48877p77896p32269n02626j64167J92494M97612
$$ plain form
33192 -1408977 -723217 -7263 616465 1115201 1506663 1791952 1964159 2065781 2188721
33183 2188721 2408708 2744116 3172087 3645146 4084343 4395359 4518233 4448677 4205030 3805214
33173 3805214 3298402 2789595 2385075 2107339 1894304 1693415 1526964 1436124 1376078 1213988
33163 1213988 862260 405097 65237 29202 300275 707611 1034076 1135235 979945 633377
33153 633377 217029 -145706 -379890 -468566 -422168 -259990 -30248 179718 291235 298835
33143 298835 270312 281335 363747 508001 680276 828169 910396 957445 1084543 1403606
33133 1403606 1916242 2511150 3058371 3481391 3750797 3857111 3810457 3640261 3379083 3068469
$$ packed form
33192a408977O85760P15954O23728M98736L91462K85289J72207J01622J22940
33183B188721K19987L35408M27971M73059M39197L11016J22874o9556k43647l99816
33173C805214n06812n08807m04520k77736k13035k00889j66451r0840o0046j62090
33163A213988l51728m57163l39860l6035K71073M07336L26465J01159j55290l46568
33153F33377m16348l62735k34184q8676M6398J62178K29742K09966J11517P600
33143B98835k8523J1023Q2412J44254J72275J47893Q2227M7049J27098L19063
33133A403606N12636N94908N47221M23020K69406J06314m6654j70196k61178l10614
$$ [...]
##END NTUPLES=NMR SPECTRUM
##END=
