##TITLE=31Pdec_IPACAT-33-3
  CDCl3
  64 sc
 4.10.2023
##JCAMPDX= 6.0         $$ Bruker NMR JCAMP-DX V2.0
##DATA TYPE= NMR SPECTRUM
##DATA CLASS= NTUPLES
##ORIGIN= UXNMR, Bruker Analytische Messtechnik GmbH
##OWNER= root
$$ XWIN-NMR		Version 3.5
$$ Wed Oct  4 15:06:15 2023 Russian Standard Time (UT+4h)  she@DPX200
##.OBSERVE FREQUENCY= 81.013821
##.OBSERVE NUCLEUS= ^31P
##.ACQUISITION MODE= SIMULTANEOUS
##.ACQUISITION SCHEME= undefined
##.AVERAGES= 64
##.DIGITISER RES= 16
##SPECTROMETER/DATA SYSTEM= spect
##.PULSE SEQUENCE= zgpg30
##.SOLVENT NAME= CDCl3
##.SHIFT REFERENCE= (INTERNAL, CDCl3, 0, 248.564)
##AUDIT TRAIL= $$ (NUMBER, WHEN, WHO, WHERE, WHAT)
$$ ##TITLE= Audit trail, XWIN-NMR		Version 3.5
$$ ##JCAMPDX= 5.01
$$ ##ORIGIN= Bruker BioSpin GmbH
$$ ##OWNER= she
$$ F:/spectra/data/she/nmr/P31/1/pdata/1/auditp.txt
$$ ##AUDIT TRAIL=  $$ (NUMBER, WHEN, WHO, WHERE, WHAT)
(   1,<2023-10-04 15:00:49.56 +0400>,<she>,<DPX200>,
      <continue with go, POWCHK disabled, PULCHK disabled
       configuration hash MD5:
       00 E9 B6 7A A2 85 ED C7 34 08 36 98 17 FE 4E 26
       data hash MD5: 32K
       F9 F1 95 BD 13 7C 22 9F 7F A8 0A C7 E6 D0 D2 B9>)
(   2,<2023-10-04 15:05:11.43 +0400>,<she>,<DPX200>,
      <Start of raw data processing
       efp BC_mod = 2 LB = 5 FT_mod = 6 PKNL = 1 PHC0 = -10741.11 PHC1 = 265.8862 SI = 64K 
       data hash MD5: 64K
       5A E9 A8 6A 36 41 F2 81 91 B5 B3 84 2E 0B 6B 08>)
(   3,<2023-10-04 15:05:30.78 +0400>,<she>,<DPX200>,
      <pk PHC0 = 5.327156 PHC1 = 0 
       data hash MD5: 64K
       6D 1F 78 35 DC 49 E9 51 9F 4D E0 C8 3F A1 BA 38>)
(   4,<2023-10-04 15:05:46.17 +0400>,<she>,<DPX200>,
      <pk PHC0 = 118.3566 PHC1 = -252.6 
       data hash MD5: 64K
       17 A1 F0 CA B4 85 F0 B5 F3 FA 43 F0 88 6B 9E 47>)
$$ ##END=
$$ 
$$ hash MD5
$$ 03 27 58 1C 4B F8 CC 0D EA 17 41 DB 9D B2 F9 FE
##$RELAX= 
##$RELAX= 
##$RELAX= 
##$RELAX= 
##$RELAX= 
##$RELAX= 
##$RELAX= 
##$RELAX= 
##$RELAX= 
$$ Bruker specific parameters
$$ --------------------------
##$DU= <F:/spectra>
##$EXPNO= 1
##$NAME= <P31>
##$PROCNO= 1
##$TYPE= <nmr>
##$USER= <she>
##$AMP= (0..31)
100 100 100 100 100 100 100 100 100 100 100 100 100 100 100 100 100 100 
100 100 100 100 100 100 100 100 100 100 100 100 100 100 
##$AQSEQ= 0
##$AQ_mod= 1
##$AUNM= <au_zg>
##$AUTOPOS= <>
##$BF1= 81.014009
##$BF2= 200.13
##$BF3= 200.13
##$BF4= 200.13
##$BF5= 200.13
##$BF6= 200.13
##$BF7= 200.13
##$BF8= 200.13
##$BYTORDA= 1
##$CFDGTYP= 0
##$CFRGTYP= 5
##$CHEMSTR= <none>
##$CNST= (0..31)
1 1 145 1 1 1 1 1 1 1 1 1 1 1 1 1 1 1 1 1 1 1 1 1 1 1 1 1 1 1 1 1 
##$CPDPRG= <waltz16>
##$CPDPRG1= <>
##$CPDPRG2= <waltz16>
##$CPDPRG3= <>
##$CPDPRG4= <mlev>
##$CPDPRG5= <mlev>
##$CPDPRG6= <mlev>
##$CPDPRG7= <mlev>
##$CPDPRG8= <mlev>
##$CPDPRGB= <>
##$CPDPRGT= <>
##$D= (0..31)
0 1 0 0 0 0 0 0 0 0 0 0.03 2e-05 3e-06 0 0 0 0 0 0 0 0 0 0 0 0 0 0 0 0 
0 0 
##$DATE= 1696417158
##$DBL= (0..7)
120 120 120 11 120 120 24 19 
##$DBP= (0..7)
150 150 150 150 150 150 150 150 
##$DBP07= 0
$$ [...]
##$SUBNAM2= <"">
##$SUBNAM3= <"">
##$SUBNAM4= <"">
##$SUBNAM5= <"">
##$SUBNAM6= <"">
##$SUBNAM7= <"">
##$SUBNAM8= <"">
##$SUBNAM9= <"">
##$SW= 501.771253377433
##$SWIBOX= (0..15)
0 1 3 0 0 0 0 0 0 0 0 0 0 0 0 0 
##$SW_h= 40650.406504065
##$TD= 32768
##$TD0= 1
##$TE= 0
##$TE2= 300
##$TE3= 300
##$TEG= 300
##$TL= (0..7)
0 120 53 12 22 120 120 120 
##$TP= (0..7)
150 150 150 150 150 150 150 150 
##$TP07= 0
##$TPNAME0= <>
##$TPNAME1= <>
##$TPNAME2= <>
##$TPNAME3= <>
##$TPNAME4= <>
##$TPNAME5= <>
##$TPNAME6= <>
##$TPNAME7= <>
##$TPOAL= (0..7)
0.5 0.5 0.5 0.5 0.5 0.5 0.5 0.5 
##$TPOFFS= (0..7)
0 0 0 0 0 0 0 0 
##$TUNHIN= 0
##$TUNHOUT= 0
##$TUNXOUT= 0
##$USERA1= <user>
##$USERA2= <user>
##$USERA3= <user>
##$USERA4= <user>
##$USERA5= <user>
##$V9= 5
##$VALIST= <valist>
##$VCLIST= <CCCCCCCCCCCCCCC>
##$VD= 0
##$VDLIST= <DDDDDDDDDDDDDDD>
##$VPLIST= <PPPPPPPPPPPPPPP>
##$VTLIST= <TTTTTTTTTTTTTTT>
##$WBST= 1024
##$WBSW= 4
##$XGAIN= (0..3)
0 0 0 0 
##$XL= 0
##$YL= 0
##$YMAX_a= 11441
##$YMIN_a= -4450
##$ZGOPTNS= <>
##$ZL1= 120
##$ZL2= 120
##$ZL3= 120
##$ZL4= 120
##$ABSF1= 0
##$ABSF2= 0
##$ABSG= 0
##$ABSL= 0
##$ALPHA= 0
##$AQORDER= 0
##$ASSFAC= 0
##$ASSFACI= 0
##$ASSFACX= 0
##$ASSWID= 0
##$AUNMP= <proc_1d>
##$AZFE= 0.1
##$AZFW= 0.5
##$BCFW= 0
##$BC_mod= 2
##$BYTORDP= 0
##$COROFFS= 0
##$CY= -3
##$DATMOD= 1
##$DC= 0
##$DFILT= <>
##$DTYPP= 0
##$F1P= 0
##$F2P= 0
##$FCOR= 1
##$FTSIZE= 65536
##$FT_mod= 6
##$GAMMA= 0
##$GB= 0
##$INTBC= 1
##$INTSCL= 6.047779e-11
##$ISEN= 30
##$LB= 5
##$LEV0= 0
##$LPBIN= 0
##$MAXI= 10000
##$MC2= 0
##$MEAN= 0
##$ME_mod= 0
##$MI= 50
##$NCOEF= 0
##$NC_proc= -8
##$NLEV= 6
##$NOISF1= 182.463
##$NOISF2= 159.3651
##$NSP= 0
##$NTH_PI= 0
##$NZP= 0
##$OFFSET= 248.5645
##$PC= 4
##$PHC0= -10617.42
##$PHC1= 13.28619
##$PH_mod= 1
##$PKNL= yes
##$PPARMOD= 0
##$PSCAL= 0
##$PSIGN= 0
##$REVERSE= no
##$SF= 81.0140089999694
##$SI= 65536
##$SIGF1= 159.3651
##$SIGF2= -187.1042
##$SINO= 113.3802
##$SIOLD= 16384
##$SREGLST= <1H.CDCl3>
##$SSB= 0
##$STSI= 65536
##$STSR= 0
##$SW_p= 40650.406504065
##$SYMM= 0
##$S_DEV= 0
##$TDeff= 32768
##$TDoff= 0
##$TI= <>
##$TILT= no
##$TM1= 0
##$TM2= 0
##$TOPLEV= 0
##$USERP1= <user>
##$USERP2= <user>
##$USERP3= <user>
##$USERP4= <user>
##$USERP5= <user>
##$WDW= 1
##$XDIM= 65536
##$YMAX_p= 307285311
##$YMIN_p= -12184513
$$ End of Bruker specific parameters
$$ ---------------------------------
##NTUPLES= NMR SPECTRUM
##VAR_NAME=  FREQUENCY,     SPECTRUM/REAL,   SPECTRUM/IMAG
##SYMBOL=    X,             R,               I
##VAR_TYPE=  INDEPENDENT,   DEPENDENT,       DEPENDENT
##VAR_FORM=  AFFN,          ASDF,            ASDF
##VAR_DIM=   65536,         65536,           65536
##UNITS=     HZ,            ARBITRARY UNITS, ARBITRARY UNITS
##FACTOR=    0.620285442955139, 1,           1
##FIRST=     20137.2065510682, 0,            0
##LAST=      -20513.1999529968, 0,           0
##MIN=       -20513.1999529968, -12184513,   0
##MAX=       20137.2065510682, 307285311,    0
$$ Real data points
##PAGE= N=1
##DATA TABLE= (X++(R..R)), XYDATA
$$ [...]
$$ plain form
38930 6213556 5673007 4928453 4055817 3219677 2588820 2278133 2344986 2778671 3477530 4275483
38920 4275483 5013077 5566941 5818790 5658119 5066947 4185942 3252318 2460393 1885303
38911 1885303 1507448 1260604 1065614 885571 783075 880783 1217910 1662547 2005506 2132163
38901 2132163 2070746 1894184 1636824 1316875 978151 665877 391060 157263 924 -37443
38891 -37443 25608 121742 195919 233443 225985 158092 50119 -17041 46382 267227 599447
38880 599447 967636 1300760 1538816 1641515 1607852 1485026 1352148 1280456 1285023 1309505
38870 1309505 1282418 1204144 1158507 1220594 1373678 1536854 1644832 1663213 1553792 1292489
38860 1292489 934061 609446 432557 431769 576218 830582 1169675 1571534 2003752 2378585
$$ packed form
38930F213556n40549p44554q72636q36140o30857l10687O6853M33685O98859P97953
38920D275483P37594N53864K51849j60671n91172q81005r33624p91925n75090
38911A885303l77855k46844j94990j80043j02496R7708L37127M44637L42959J26657
38901B132163o1417j76562k57360l19949l38724l12274k74817k33797j56339l8367
38891c7443O3051R6134P4177L7524p458o7893j07973o7160O3423K20845L32220
38880E99447L68189L33124K38056J02699l3663j22826j32878p1692M567K4482
38870A309505k7087p8274m5637O2087J53084J63176J07978J8381j09421k61303
38860A292489l58428l24615j76889p88J44449K54364L39093M01859M32218L74833
$$ plain form
38850 2378585 2527005 2301187 1757209 1187998 919241 1099090 1708910 2685799 3922421
38841 3922421 5186845 6189181 6786394 7068739 7232106 7425321 7712604 8069751 8355795
38832 8355795 8361815 7957101 7154653 6017555 4602541 3076097 1789394 1072879 931434
38823 931434 1034789 1032684 815408 475037 135358 -111870 -196971 -128202 -62096 -228899
38813 -228899 -735535 -1459482 -2154861 -2643502 -2883347 -2875155 -2562499 -1871600 -851264 259043
38803 259043 1124624 1483043 1236819 439065 -755251 -2124486 -3420672 -4429728 -5025044
38794 -5025044 -5185704 -4972348 -4464945 -3692226 -2618889 -1225806 388320 2004729 3402592
38785 3402592 4479668 5254571 5764871 5988986 5886132 5504457 5012801 4590068 4283215
$$ packed form
38850B378585J48420k25818n43978n69211k68757J79849O09820R76889J236622
38841C922421J264424J002336N97213K82345J63367J93215K87283L57147K86044
38832H355795O020m04714q02448j137098j415014j526444j286703p16515j41445
38823I31434J03355k105k17276l40371l39679k47228q5101O8769O6106j66803
38813b28899n06636p23947o95379m88641k39845Q192L12656O90899J020336J110307
38803B59043Q65581L58419k46224p97754j194316j369235j296186j009056n95316
38794e025044j60660K13356N07403P72719J073337J393083J614126J616409J397863
38785C402592J077076P74903N10300K24115j02854l81675m91656m22733l06853
$$ plain form
38776 4283215 3993240 3588060 2994329 2199837 1254622 313888 -393119 -724791 -735767 -552770
38766 -552770 -169919 525529 1508353 2513860 3269250 3779144 4302017 5058827 6026290
38757 6026290 7007677 7839054 8503575 9084233 9631717 10063777 10190477 9872267 9179122
38748 9179122 8376454 7722523 7272788 6887828 6410793 5793057 5037684 4083677 2832538
38739 2832538 1306563 -282512 -1670566 -2713537 -3381393 -3633253 -3405317 -2743930 -1864763
38730 -1864763 -1019993 -339414 178533 598326 1042910 1693576 2668806 3884688 5112140
38721 5112140 6179986 7032920 7572794 7579360 6914819 5764080 4550429 3596773 2943239
38712 2943239 2491938 2215333 2158287 2307416 2540843 2680983 2544131 1984346 984766 -281147
$$ packed form
38776D283215k89975m05180n93731p94492r45215r40734p07007l31672j0976J82997
38766e52770L82851O95448R82824J005507P55390N09894N22873P56810R67463
38757F026290R81387Q31377O64521N80658N47484M32060J26700l18210o93145
38748I179122q02668o53931m49735l84960m77035o17736p55373r54007j251139
38739B832538j525975j589075j388054j042971o67856k51860K27936O61387Q79167
38730a864763Q44770O80579N17947M19793M44584O50666R75230J215882J227452
38721E112140J067846Q52934N39874O566o64541j150739j213651r53656o53534
38712B943239m51301k76605n7046J49129K33427J40140j36852n59785r99580j265913
$$ plain form
38702 -281147 -1536957 -2566279 -3267475 -3600005 -3586024 -3369747 -3147047 -2960590 -2646738
38693 -2646738 -2072246 -1364390 -811957 -579770 -618697 -813728 -1078104 -1292083 -1303676 -1078105
38683 -1078105 -757024 -480084 -207516 190563 706429 1148199 1316914 1171917 841323
38674 841323 541068 470794 694180 1079784 1407789 1570973 1651531 1801003 2089562 2475695
38664 2475695 2853151 3087683 3070045 2814008 2499826 2369955 2566768 3074630 3772600 4481454
38654 4481454 4985199 5113077 4863157 4412419 3967853 3634776 3452308 3490246 3815000 4354907
38644 4354907 4874040 5120491 4982352 4508005 3841388 3171089 2685205 2505358 2658815
38635 2658815 3123597 3856698 4737626 5532257 5997460 6032154 5680374 4996696 3979497
$$ packed form
38702b81147j255810j029322p01196l32530J3981K16277K22700J86457L13852
38693b646738N74492P07856N52433K32187l8927j95031k64376k13979j1593K25571
38683a078105L21081K76940K72568L98079N15866M41770J68715j44997l30594
38674H41323l00255p0274K23386L85604L28005J63184Q0558J49472K88559L86133
38664B475695L77456K34532j7638k56037l14182j29871J96813N07862O97970P08854
38654D481454N03745J27878k49920m50738m44566l33077j82468L7938L24754N39907
38644D354907N19133K46451j38139m74347o66617o70299m85884j79847J53457
38635B658815M64782P33101Q80928P94631M65203L4694l51780o83678j017199
$$ plain form
38626 3979497 2654887 1161013 -299580 -1570263 -2584607 -3334856 -3825452 -4038851 -3932973
38617 -3932973 -3502904 -2868891 -2275645 -1965924 -2039816 -2410302 -2844333 -3046917 -2798415 -2109152
38607 -2109152 -1249656 -580056 -316900 -442501 -789004 -1169240 -1452961 -1578130 -1517250 -1239604
38597 -1239604 -733821 -86950 494149 791861 716179 330604 -216930 -746065 -1073913 -1098138
38587 -1098138 -893797 -681725 -651928 -813134 -1013818 -1092023 -1014235 -915587 -1025758 -1510144
38577 -1510144 -2316955 -3154881 -3648522 -3575043 -3013173 -2295559 -1795427 -1701233 -1939025 -2268799
38567 -2268799 -2437933 -2276736 -1727698 -843757 245896 1396115 2479121 3378420 4012239
38558 4012239 4400587 4661763 4881261 5004762 4916814 4609813 4214331 3864473 3587772 3332225
$$ packed form
38626C979497j324610j493874j460593j270683j014344p50249m90596k13399J05878
38617c932973M30069O34013N93246L09721p3892l70486m34031k02584K48502O89263
38607b109152Q59496O69600K63156j25601l46503l80236k83721j25169O0880K77646
38597a239604N05783O46871N81099K97712p5682l85575n47534n29135l27848k4225
38587a098138K04341K12072K9797j61206k00684p8205P7788R8648j10171m84386
38577a510144q06811q37926m93641P3479N61870P17614N00132R4194k37792l29774
38567b268799j69134J61197N49038Q83941J089653J150219J083006Q99299O33819
38558D012239L88348K61176K19498J23501q7948l07001l95482l49858k76701k55547
$$ plain form
38548 3332225 3060132 2821822 2775022 3092336 3759910 4479948 4892220 4942777 4956208 5298734
38538 5298734 6041049 6982034 7875176 8509773 8654486 8118239 6931917 5379002 3787610
38529 3787610 2339823 1112878 221439 -197403 -167527 16440 -73055 -717185 -1886742
38520 -1886742 -3314852 -4685419 -5752875 -6361710 -6457726 -6116572 -5516130 -4836493 -4178297
38511 -4178297 -3554791 -2914378 -2173079 -1299349 -415811 217838 365254 -48432 -934120
38502 -934120 -2075508 -3119692 -3642105 -3382924 -2457567 -1270593 -202500 592935 1134944
38493 1134944 1486333 1720490 1928619 2168193 2405663 2553165 2575510 2554468 2641434 2928376
38483 2928376 3347310 3712592 3888617 3904713 3884711 3891769 3876819 3738963 3374488 2708565
$$ packed form
38548C332225k72093k38310m6800L17314O67574P20038M12272N0557J3431L42526
38538E298734P42315R40985Q93142O34597J44713n36247j186322j552915j591392
38529C787610j447787j226945q91439m18842K9876J83967q9495o44130j169557
38520a886742j428110j370567j067456o08835r6016L41154O00442O79637O58196
38511d178297O23506O40413P41299Q73730Q83538O33649J47416m13686q85688
38502i34120j141388j044184n22413K59181R25357J186974J068093P95435N42009
38493A134944L51389K34157K08129K39574K37470J47502K2345k1042Q6966K86942
38483B928376M18934L65282J76025J6096k0002P058j4950j37856l64475o65923
$$ plain form
38473 2708565 1790923 874436 291898 188710 416833 706432 868338 810062 479348 -93840
38463 -93840 -751404 -1312394 -1713892 -1969765 -2009436 -1656115 -793486 490986 1921118 3132240
38453 3132240 3786635 3724530 3090592 2276814 1671223 1431747 1469513 1591202 1654201 1669419
38443 1669419 1815134 2296293 3097382 3863309 4084792 3450697 2053123 309746 -1264906
38434 -1264906 -2268180 -2544567 -2231184 -1660042 -1127395 -693779 -204178 477701 1251139
38425 1251139 1803939 1868219 1464292 912461 623946 860802 1619036 2648770 3562966
38416 3562966 4000844 3789842 3004658 1874467 627577 -584659 -1650332 -2440492 -2829421
38407 -2829421 -2784701 -2432789 -2005959 -1674369 -1406296 -1027407 -458361 129492 454556 425499
$$ packed form
38473B708565r17642r16487n82538j03188K28123K89599J61906n8276l30714n73188
38463i3840o57564n60990m01498k55873l9671L53321Q62629J284472J430132J211122
38453C132240O54395o2105o33938q13778o05591k39476L7766J21689O2999J5218
38443A669419J45715M81159Q01089P65927K21483o34095j397574j743377j574652
38434a264906j003274k76387L13383N71142N32647M33616M89601O81879P73438
38425A251139N52800O4280m03927n51831k88515K36856P58234J029734R14196
38416C562966M37878k11002p85184j130191j246890j212236j065673p90160l88929
38407b829421M4720L51912M26830L31590K68073L78889N69046N87853L25064k9057
$$ plain form
38397 425499 243610 180076 301909 458241 485285 344065 66792 -334394 -840038 -1334982
38387 -1334982 -1610701 -1484232 -919412 -43056 949346 1918601 2835715 3719592 4527376
38378 4527376 5129639 5416602 5424878 5338530 5352284 5524451 5743605 5825598 5667414 5353073
38368 5353073 5123288 5203054 5612983 6142227 6525028 6650146 6593930 6469880 6288234 5971711
38358 5971711 5461669 4765982 3928694 3013563 2122951 1374115 822090 437372 183105
38349 183105 68796 81083 101220 -31521 -370554 -825961 -1266200 -1588289 -1700591 -1559717
38339 -1559717 -1296189 -1216845 -1563633 -2275087 -3057218 -3676844 -4115157 -4454373 -4720385 -4864152
38329 -4864152 -4804891 -4436929 -3669696 -2545141 -1287680 -168937 675783 1273274 1707604
$$ packed form
38397D25499j81889o3534J21833J56332K7044j41220k77273m01186n05644m94944
38387a334982k75719J26469N64820Q76356R92402R69255R17114Q83877Q07784
38378D527376O02263K86963Q276q6348J3754J72167K19154Q1993j58184l14341
38368E353073k29785P9766M09929N29244L82801J25118n6216j24050j81646l16523
38358E971711n10042o95687q37288r15131q90612p48836n52025l84718k54267
38349A83105j14309J2287K0137j32741l39033m55407m40239l22089j12302J40874
38339a559717K63528P9344l46788p11454p82131o19626m38313l39216k66012j43767
38329d864152N9261L67962P67233J124555J257461J118743Q44720N97491M34330
$$ plain form
38320 1707604 2060162 2414451 2799012 3080979 2997044 2377249 1342950 256276 -523521
38311 -523521 -837482 -739760 -381071 110141 664565 1221345 1666320 1856626 1726125 1344004
38301 1344004 844502 319383 -189484 -618591 -870849 -899703 -775914 -655029 -695369 -994107
38291 -994107 -1536706 -2164434 -2626197 -2724245 -2431651 -1871407 -1204372 -540647 96594 769904
38281 769904 1552596 2389259 3052926 3320782 3197691 2894261 2575268 2216235 1743642 1227375
38271 1227375 857229 776890 1005330 1466593 2005740 2411968 2549129 2495020 2473059 2605491
38261 2605491 2778164 2768993 2466797 1956630 1451750 1163799 1172596 1372148 1574998 1691821
38251 1691821 1762795 1801767 1708606 1418029 1067757 898729 993973 1213147 1389411 1481095
$$ packed form
38320A707604L52558L54289L84561K81967q3935o19795j034299j086674p79797
38311e23521l13961R7722L58689M91212N54424N56780M44975J90306j30501l82121
38301A344004m99502n25119n08867m29107k52258k8854J23789J20885m0340k98738
38291i94107n42599o27728m61763r8048K92594N60244O67035O63725O37241O73310
38281G69904P82692Q36663O63667K67856j23091l03430l18993l59033m72593n16267
38271A227375l70146q0339K28440M61263N39147M06228J37161n4109k1961J32432
38261B605491J72673r171l02196n10167n04880k87951Q797J99552K02850J16823
38251A691821P0974L8972r3161k90577l50272j69028R5244K19174J76264R1684
$$ plain form
38241 1481095 1483272 1294858 792002 24833 -744691 -1239497 -1380915 -1300463 -1175556 -1090465
38231 -1090465 -1057916 -1131128 -1425649 -1989550 -2678940 -3225862 -3452528 -3385424 -3144325 -2772566
38221 -2772566 -2230619 -1526009 -769323 -84168 475511 882485 1072242 1004774 781504 614620
38211 614620 635377 777972 899657 977334 1114009 1357489 1595671 1678330 1602481 1528017
38201 1528017 1625551 1946023 2421491 2935866 3376573 3659082 3748481 3670032 3490664 3280443
38191 3280443 3078339 2879489 2650688 2365196 2031283 1696786 1435570 1323422 1401657 1646358
38181 1646358 1976441 2287479 2453799 2305606 1681267 584569 -711314 -1784123 -2333619
38172 -2333619 -2346855 -2033117 -1649095 -1368484 -1219959 -1082497 -779046 -242989 404793 971184
$$ packed form
38241A481095K177j88414n02856p67169p69524m94806j41418Q0452J24907Q5091
38231a090465L2549p3212k94521n63901o89390n46922k26666O7104K41099L71759
38221b772566N41947P04610P56686O85155N59679M06974J89757o7468k23270j66884
38211F14620K0757J42595J21685P7677J36675K43480K38182Q2659p5849p4464
38201A528017R7534L20472M75468N14375M40707K82509Q9399p8449j79368k10221
38191C280443k02104j98850k28801k85492l33913l34497k61216j12148P8235K44701
38181A646358L30083L11038J66320j48193o24339j096698j295883j072809n49496
38172b333619j3236L13738L84022K80611J48525J37462L03451N36057O47782N66391
$$ plain form
38162 971184 1362251 1603388 1722378 1695035 1528736 1333682 1253233 1342942 1562818 1881237
38152 1881237 2339960 3001154 3861577 4843147 5843195 6746762 7381195 7513626 6972012
38143 6972012 5812730 4362225 3065191 2261472 2063298 2376898 2989342 3653589 4169972
38134 4169972 4454536 4541627 4507253 4394779 4224384 4043996 3907786 3778421 3500121 2940351
38124 2940351 2172831 1477385 1126846 1179487 1473578 1780711 1949580 1971163 1989761 2237314
38114 2237314 2861002 3762304 4636814 5199602 5350622 5131755 4613677 3887971 3102421
38105 3102421 2392092 1774042 1198912 729169 582512 936065 1723204 2673946 3534077
38096 3534077 4203655 4690008 5001826 5119421 5028470 4735985 4251982 3589416 2808925 2050917
$$ packed form
38162I71184L91067K41137J18990k7343j66299j95054q0449Q9709K19876L18419
38152A881237M58723O61194Q60423R81570J000048R03567O34433J32431n41614
38143F972012j159282j450505j297034q03719j98174L13600O12444O64247N16383
38134D169972K84564Q7091l4374j12474j70395j80388j36210j29365k78300n59770
38124B940351p67520o95446l50539N2641K94091L07133J68869K1583J8598K47553
38114B237314O23688R01302Q74510N62788J51020k18867n18078p25706p85550
38105C102421p10329o18050n75130m69743j46657L53553P87139R50742Q60131
38096C534077O69578M86353L11818J17595r0951k92485m84003o62566p80491p58008
$$ plain form
38086 2050917 1475498 1133839 913934 650896 286085 -121030 -529651 -996895 -1588550
38077 -1588550 -2267067 -2920318 -3457586 -3806832 -3847808 -3454899 -2647181 -1633773 -654707
38068 -654707 207565 1038710 1944601 2913070 3786082 4340316 4439495 4166210 3787576 3530619
38058 3530619 3383706 3160216 2753526 2265963 1866563 1595792 1381941 1215582 1214823 1494084
38048 1494084 2029190 2686845 3333391 3855419 4111389 3965023 3413110 2640055 1904557
38039 1904557 1382870 1128131 1124848 1313744 1567019 1700023 1543279 1002677 69991 -1177088
38029 -1177088 -2570035 -3878800 -4875827 -5382128 -5296025 -4657310 -3703080 -2772722 -2060641
38020 -2060641 -1462910 -724199 259742 1328430 2236692 2879292 3309067 3599983 3772259
$$ packed form
38086B050917n75419l41659k19905k63038l64811m07115m08621m67244n91655
38077a588550o78517o53251n37268l49246m0976L92909Q07718J013408R79066
38068f54707Q62272Q31145R05891R68469Q73012N54234R9179k73285l78634k56957
38058C530619j46913k23490m06690m87563l99400k70771k13851j66359p59K79261
38048A494084N35106O57655O46546N22028K55970j46366n51913p73055p35498
38039A904557n21687k54739l283J88896K53275J33004j56744n40602r32686j247079
38029a177088j392947j308765r97027n06301Q6103O38715R54230R30358P12081
38020b060641N97731P38711R83941J068688R08262O42600M29775K90916J72276
$$ plain form
38011 3772259 3841003 3853217 3827983 3702259 3400524 2953009 2483183 2060489 1628968 1130377
38001 1130377 642744 307072 126860 -64721 -407126 -853542 -1249767 -1508257 -1651391
37992 -1651391 -1738906 -1824309 -1946657 -2081834 -2101592 -1839148 -1206924 -237671 940519 2116067
37982 2116067 3046163 3620143 3976889 4360011 4832582 5218151 5343683 5243192 5070331
37973 5070331 4886184 4589617 4000277 2979890 1571477 101076 -941967 -1256169 -961505
37964 -961505 -427538 82469 513292 837043 953770 829794 613948 511442 575223 685199
37954 685199 709096 621556 463281 237822 -104412 -571791 -1049811 -1359768 -1416698 -1294079
37944 -1294079 -1100560 -828588 -382593 255304 948562 1504701 1812081 1888872 1859718 1891669
$$ packed form
38011C772259O8744J2214k5234j25724l01735m47515m69826m22694m31521m98591
38001A130377m87633l35672j80212j91581l42405m46416l96225k58490j43134
37992a651391q7515q5403j22348j35177j9758K62444O32224R69253J178190J175548
37982B116067R30096N73980L56746L83122M72571L85569J25532j00491j72861
37973E070331j84147k96567n89340j020387j408413j470401j043043l14202K94664
37964i61505N33967N10007M30823L23751J16727j23976k15846j02506O3781J09976
37954F85199K3897q7540j58275k25459l42234m67379m78020l09957n6930J22619
37944a294079J93519K71972M45995O37897O93258N56139L07380P6791k9154L1951
$$ plain form
37934 1891669 2073271 2299217 2310813 1908725 1129582 203183 -629766 -1225694 -1509949 -1432453
37924 -1432453 -999319 -327908 372217 902928 1185082 1287751 1367194 1569862 1963583 2528137
37914 2528137 3200495 3937588 4735407 5577417 6377406 7006681 7382015 7499604 7393165
37905 7393165 7120822 6808046 6620628 6623173 6699891 6673835 6473192 6130638 5677576 5135697
37895 5135697 4586498 4141831 3836584 3631856 3520916 3537595 3659138 3818810 4047595 4482783
37885 4482783 5162535 5900683 6447962 6717409 6783905 6730435 6583314 6352057 6037858 5613989
37875 5613989 5061755 4415056 3734293 3080877 2568125 2376950 2629785 3264008 4087917
37866 4087917 4926237 5646254 6096292 6134373 5725398 4945331 3915366 2813321 1907753
$$ packed form
37934A891669J81602K25946J1596m02088p79143r26399q32949n95928k84255P7496
37924a432453M33134O71411P00125N30711K82154J02669P9443K02668L93721N64554
37914B528137O72358P37093P97819Q42010P99989O29275L75334J17589j06439
37905G393165k72343l12776j87418K545P6718k6056k00643l42554m53062n41879
37895E135697n49199m44667l05247k04728j10940J6679J21543J59672K28785M35188
37885D482783O79752P38148N47279K69447O6496n3470j47121k31257l14199m23869
37875E613989n52234o46699o80763o53416n12752j91175K52835O34223Q23909
37866D087917Q38320P20017M50038L8081m08975p80067j029965j102045r05568
$$ plain form
37857 1907753 1437728 1418271 1648805 1935363 2223499 2507572 2733713 2858531 2914729 2933890
37847 2933890 2848359 2534751 1931977 1087530 133903 -748115 -1405500 -1816350 -2088003 -2309739
37837 -2309739 -2444826 -2412236 -2230568 -2018678 -1878140 -1829399 -1840935 -1860787 -1826531 -1699243
37827 -1699243 -1499147 -1283360 -1093225 -938866 -808753 -663916 -447453 -132201 267272
37818 267272 756483 1382979 2139042 2890343 3488184 3928676 4301479 4581923 4584827 4163398
37808 4163398 3365886 2354275 1272670 283748 -356082 -419073 69850 818654 1504671
37799 1504671 1972192 2209390 2249026 2159330 2048015 1961437 1791323 1371422 684756 -88010
37789 -88010 -745111 -1225863 -1562630 -1735972 -1663911 -1345211 -963251 -806481 -1060437 -1641184
$$ packed form
37857A907753m70025j9457K30534K86558K88136K84073K26141J24818N6198J9161
37847B933890q5531l13608o02774q44447r53627q82018o57385m10850k71653k21736
37837b309739j35087L2590J81668K11890J40538M8741j1536j9852L4256J27288
37827a699243K00096K15787J90135J54359J30113J44837K16463L15252L99473
37818B67272M89211O26496P56063P51301N97841M40492L72803K80444K904m21429
37808D163398p97512j011611j081605r88922o39830o2991M88923P48804O86017
37799A504671M67521K37198L9636q9696j11315q6578j70114m19901o86666p72766
37789h8010o57101m80752l36767j73342P2061L18700L81960J56770k53956n80747
$$ plain form
37779 -1641184 -2204939 -2340119 -1806401 -648637 857630 2325374 3361294 3689362 3284653
37770 3284653 2376796 1258092 89240 -1077789 -2149987 -2983400 -3525549 -3852119 -4013694
37761 -4013694 -3937107 -3546558 -2908086 -2164926 -1374532 -503073 437744 1337203 2067515 2542045
37751 2542045 2695801 2511618 2112319 1744051 1575933 1524558 1332836 831806 100911 -623362
37741 -623362 -1166428 -1543903 -1911063 -2416764 -3099321 -3885374 -4650472 -5279888 -5715237 -5983153
37731 -5983153 -6166621 -6307966 -6336023 -6120899 -5606374 -4855561 -3959009 -2946096 -1827341
37722 -1827341 -699442 244915 831486 1023781 939095 761791 629297 581783 625512 846224
37712 846224 1413353 2407056 3637691 4703054 5279685 5357924 5187423 5030580 4997808 5076176
$$ packed form
37779a641184n63755j35180N33718J157764J506267J467744J035920L28068m04709
37770C284653r07857j118704j168852j167029j072198q33413n42149l26570j61575
37761d013694P6587L90549O38472P43160P90394Q71459R40817Q99459P30312M74530
37751B542045J53756j84183l99299l68268j68118n1375j91722n01030p30895p24273
37741f23362n43066l77475l67160n05701o82557p86053p65098o29416m35349k67916
37731e983153j83468j41345k8057K15124N14525P50813Q96552J012913J118755
37722a827341J127899R44357N86571J92295q4686j77304j32494m7514M3729K20712
37712H46224N67129R93703J230635J065363N76631P8239j70501j56843l2772P8368
$$ plain form
37702 5076176 5230425 5435398 5631740 5680921 5391215 4644180 3555785 2498603 1875139
37693 1875139 1803897 2040600 2226004 2176743 1916431 1502974 936101 238408 -475404 -1084602
37683 -1084602 -1593172 -2119779 -2747380 -3405246 -3913139 -4142644 -4134742 -4056069 -4037928 -4063270
37673 -4063270 -4006902 -3759930 -3303783 -2706064 -2101268 -1667590 -1554207 -1784254 -2234166 -2718178
37663 -2718178 -3089771 -3282684 -3299659 -3173270 -2907576 -2454550 -1789343 -1020002 -367946 7244
37653 7244 145618 219979 345004 466443 403505 -33151 -920316 -2123692 -3278654 -3924333
37643 -3924333 -3760936 -2858506 -1633630 -577850 55358 337690 475536 582338 657428
37634 657428 706973 761160 757562 518905 -78860 -962725 -1929851 -2798702 -3438366 -3719982
$$ packed form
37702E076176J54249K04973J96342M9181k89706p47035j088395j057182o23464
37693A875139p1242K36703J85404m9261k60312m13457n66873o97693p13812o09198
37683a084602n08570n26607o27601o57866n07893k29505P902P8673J8141k5342
37673d063270N6368K46972M56147N97719O04796M33678J13383k30047m49912m84012
37663b718178l71593j92913j6975J26389K65694M53026O65207P69341O52056L75190
37653G244J38374P4361J25025J21439o2938m36656q87165j203376j154962o45679
37643c924333J63397R02430J224876J055780O33208K82332J37846J06802P5090
37634F57428M9545N4187l598k38657n97765q83865r67126q68851o39664k81616
$$ plain form
37624 -3719982 -3551385 -2961739 -2084860 -1065279 -41935 797842 1257052 1278391 1018088
37615 1018088 736071 619892 698347 864825 954088 831823 453442 -148028 -915457 -1792241
37605 -1792241 -2712195 -3601304 -4389776 -5002364 -5354500 -5394730 -5144452 -4675045 -4084261 -3547511
37595 -3547511 -3343436 -3705413 -4599668 -5704687 -6638105 -7167121 -7220325 -6828408 -6147102
37586 -6147102 -5467018 -5065253 -5005072 -5118242 -5189384 -5122539 -4928407 -4602737 -4069105 -3256896
37576 -3256896 -2223760 -1175703 -346555 138586 281269 141116 -190539 -567873 -830800
37567 -830800 -911421 -860335 -745447 -577893 -369330 -192689 -106460 -46025 125018 439594
37557 439594 756234 884691 749697 416305 -6291 -439281 -814066 -1027614 -980507 -687117
$$ packed form
37624c719982J68597N89646Q76879J019581J023344Q39777M59210K1339k60303
37615A018088k82017j16179P8455J66478Q9263j22265l78381o01470p67429q76784
37605a792241r19954q89109p88472o12588l52136m0230K50278M69407N90784N36750
37595c547511K04075l61977q94255j105019r33418n29016n3204L91917O81306
37586f147102O80084M01765O0181j13170p1142O6845J94132L25670N33632Q12209
37576c256896J033136J048057Q29148M85141J42683j40153l31655l77334k62927
37567h30800q0621N1086J14888J67554K08563J76641Q6229O0435J71043L14576
37557D39594L16640J28457j34994l33392m22596m32990l74785k13548M7107K93390
$$ plain form
37547 -687117 -315423 -62226 23708 67356 213897 474273 708640 706949 283232 -626412
37537 -626412 -1890094 -3222810 -4347854 -5125589 -5548661 -5691617 -5709170 -5808794 -6118456
37528 -6118456 -6571488 -6976613 -7206059 -7271141 -7209833 -6945252 -6284373 -5065636 -3334592
37519 -3334592 -1391200 373797 1740994 2768294 3631537 4394110 4953314 5155620 4905505
37510 4905505 4208494 3202045 2143305 1279091 682891 238871 -218841 -778869 -1423101
37501 -1423101 -2035575 -2430236 -2451200 -2099526 -1542523 -982634 -526426 -152411 247911 782752
37491 782752 1440693 2046165 2388271 2395693 2127475 1610838 795424 -301933 -1498976 -2538862
37481 -2538862 -3208228 -3350352 -2895398 -1974430 -909103 39569 874037 1713252 2492897
$$ packed form
37547f87117L71694K53197Q5934M3648J46541K60376K34367j691m23717r09644
37537f26412j263682j332716j125044p77735m23072j42956j7553r9624l09662
37528f118456m53032m05125k29446o5082O1308K64581O60879J218737J731044
37519c334592J943392J764997J367197J027300Q63243P62573N59204K02306k50115
37510D905505o97011j006449j058740q64214n96200m44020m57712n60028o44232
37501a423101o12474l94661k0964L51674N57003N59889M56208L74015M00322N34841
37491G82752O57941O05472L42106P422k68218n16637q15414j097357j197043j039886
37481b538862o69366j42124M54954R20968J065327R48672Q34468Q39215P79645
$$ plain form
37472 2492897 2949122 2910546 2499598 2018329 1716397 1688185 1898690 2240692 2601447 2914235
37462 2914235 3132004 3161094 2888383 2307996 1577936 908158 392514 -63912 -692584 -1717584
37452 -1717584 -3168251 -4785006 -6168472 -7083415 -7597591 -7902107 -8058580 -7990097 -7681406
37443 -7681406 -7294093 -7062984 -7122756 -7436156 -7830303 -8071544 -7951356 -7374027 -6409961 -5277432
37433 -5277432 -4243082 -3468593 -2896972 -2306273 -1534433 -663737 58187 492513 757439
37424 757439 1068569 1462132 1722856 1584483 975903 80834 -803360 -1456600 -1834036 -2034250
37414 -2034250 -2198658 -2433040 -2787940 -3253749 -3728205 -4009136 -3903592 -3416541 -2825544
37405 -2825544 -2504540 -2622449 -3007083 -3309233 -3292180 -2965059 -2479792 -1961235 -1457433 -1007444
$$ packed form
37472B492897M56225l8576m10948m81269l01932k8212K10505L42002L60755L12788
37462B914235K17769K9090k72711n80387p30060o69778n15644m56426o28672j025000
37452a717584j450667j616755j383466r14943n14176l04516j56473O8483L08691
37443g681406L87313K31109n9772l13400l94147k41241J20188N77329R64066J132529
37433e277432J034350P74489N71621N90699P71840Q70696P21924M34326K64926
37424G57439L11130L93563K60724j38373o08580q95069q84194o53240l77436k00214
37414b034250j64408k34382l54900m65809m74456k80931J05544M87051N90997
37405b825544L21004j17909l84634l02150J7053L27121M85267N18557N03802M49989
$$ plain form
37395 -1007444 -687380 -562354 -620700 -787489 -991071 -1177040 -1249747 -1046077 -416063 665447
37385 665447 2079858 3637103 5134659 6368775 7168047 7467806 7327374 6838977 6045999
37376 6045999 4999734 3881460 2997577 2616845 2831162 3572139 4691940 5966213 7066529
37367 7066529 7662790 7643820 7221745 6761115 6489284 6386463 6323795 6225566 6068517 5809951
37357 5809951 5421940 4982128 4622703 4348532 3989159 3407080 2712301 2194989 2064098
37348 2064098 2317563 2838271 3497896 4121378 4444639 4220694 3389978 2121896 688915
37339 688915 -701995 -1995192 -3241469 -4459576 -5540093 -6324950 -6789190 -7074515 -7297603
37330 -7297603 -7395296 -7242137 -6866912 -6429571 -5988903 -5423746 -4627501 -3663801 -2647908
$$ packed form
37395a007444L20064J25026n8346j66789k03582j85969p2707K03670O30014J081510
37385F65447J414411J557245J497556J234116P99272K99759j40432m88397p92978
37376F045999j046265j118274q83883l80732K14317P40977J119801J274273J100316
37367G066529N96261j8970m22075m60630k71831j02821o2668r8229j57049k58566
37357E809951l88011m39812l59425k74171l59373n82079o94779n17312j30891
37348B064098K53465N20708O59625O23482L23261k23945q30716j268082j432981
37339F88915j390910j293197j246277j218107j080517p84857m64240k85325k23088
37330g297603r7693J53159L75225M37341M40668N65157P96245R63700J015893
$$ plain form
37321 -2647908 -1567744 -341737 993548 2286827 3469265 4634163 5878547 7144035
37313 7144035 8252022 9015420 9263516 8855766 7808174 6408563 5105492 4230096 3837895
37304 3837895 3785634 3873961 3917681 3813822 3649146 3688334 4145172 4958603 5857193 6629086
37294 6629086 7248636 7751125 8107577 8276463 8274973 8105421 7683018 6962701 6122225 5498437
37284 5498437 5305409 5484459 5841416 6230368 6549565 6652770 6387146 5729788 4840742
37275 4840742 3984527 3411746 3249743 3416553 3648530 3697515 3535873 3335354 3249987 3282012
37265 3282012 3365481 3482413 3615009 3627106 3298929 2525027 1454585 415184 -303600
37256 -303600 -613738 -623542 -490803 -258515 190368 1007493 2173312 3390592 4201670 4276286
$$ packed form
37321b647908J080164J226007J335285J293279J182438J164898J244384J265488
37313G144035J107987P63398K48096m07750j047592j399611j303071q75396l92201
37304C837895n2261Q8327M3720j03859j64676L9188M56838Q13431Q98590P71893
37294F629086O19550N02489L56452J68886j490j69552m22403p20317q40476o23788
37284E498437j93028J79050L56957L88952L19197J03205k65624o57358q89046
37275D840742q56215n72781j62003J66810K31977M8985j61642k00519q5367L2025
37265C282012Q3469J16932J32596J2097l28177p73902j070442j039401p18784
37256c03600l10138r804J32739K32288M48883Q17125J165819J217280Q11078P4616
$$ plain form
37246 4276286 3653080 2725834 1977160 1689110 1852257 2264209 2655489 2774873 2489663
37237 2489663 1874911 1152743 486351 -131849 -750436 -1292781 -1627678 -1785968 -1992946
37228 -1992946 -2456834 -3202930 -4124023 -5069641 -5817487 -6084323 -5735096 -4981992 -4259452
37219 -4259452 -3862514 -3755208 -3716733 -3580292 -3312703 -2965104 -2614147 -2294754 -1930282 -1372443
37209 -1372443 -571792 316983 1049573 1494823 1701219 1821246 2032323 2473291 3140317
37200 3140317 3833204 4295941 4448345 4425203 4371176 4272187 4036473 3684218 3385059 3311161
37190 3311161 3479181 3719146 3781944 3514522 2970870 2343119 1772013 1251523 723455 202525
37180 202525 -235058 -529946 -638156 -495167 -83675 449581 824896 830909 492449 57669
$$ packed form
37246D276286o23206r27246p48674k88050J63147M11952L91280J19384k85210
37237B489663o14752p22168o66392o18200o18587n42345l34897j58290k06978
37228a992946m63888p46096r21093r45618p47846k66836L49227P53104P22540
37219d259452L96938J07306L8475J36441K67589L47599L50957L19393L64472N57839
37209a372443Q00651Q88775P32590M45250K06396J20027K11077M40968O67026
37200C140317O92887M62737J52404k3142n4027r8989k35714l52255k99159p3898
37190C311161J68020K39965O2798k67422n43652o27751n71106n20490n28068n20930
37180B02525m37583k94888j08210J42989M11492N33256L75315O013l38460m34780
$$ plain form
37170 57669 -138943 166819 1031497 2244572 3435036 4297612 4739835 4841026 4739248
37161 4739248 4589943 4560912 4757410 5114363 5400090 5371942 4955851 4293717 3618742 3061958
37151 3061958 2560695 1962466 1225974 506677 35574 -72171 112936 416469 676940
37142 676940 804052 779127 631638 408788 146843 -147196 -497949 -938386 -1461422 -1987075
37132 -1987075 -2393963 -2590880 -2543636 -2234868 -1638685 -768406 266935 1289741 2147099
37123 2147099 2770927 3156942 3309142 3225865 2960407 2704104 2767685 3389568 4496463 5664194
37113 5664194 6366426 6311545 5601938 4644928 3916266 3697019 3915690 4241608 4404106 4432810
37103 4432810 4541295 4796401 4994780 4892578 4477438 3964010 3588016 3475188 3654733
$$ packed form
37170E7669j96612L05762Q64678J213075J190464Q62576M42223J01191j01778
37161D739248j49305k9031J96498L56953K85727k8148m16091o62134o74975n56784
37151C061958n01263n98229p36492p19297m71103j07745J85107L03533K60471
37142F76940J27112k4925j47489k22850k61945k94039l50753m40437n23036n25653
37132a987075m06888j96917M7244L08768N96183Q70279J035341J022806Q57358
37123B147099O23828L86015J52200q3277k65458k56303O3581O21883J106895J167731
37113E664194P02232n4881p09607r57010p28662k19247K18671L25918J62498K8704
37103D432810J08485K55106J98379j02202m15140n13428l75994j12828J79545
$$ plain form
37094 3654733 4075761 4576699 4923695 4964610 4752478 4487838 4331909 4281695 4213085 4018875
37084 4018875 3702831 3373050 3177099 3233861 3580127 4147507 4801539 5433433 6022518 6603150
37074 6603150 7181104 7700706 8086599 8294947 8327831 8225467 8049527 7849105 7631056 7376886
37064 7376886 7090622 6814647 6604290 6508427 6554167 6691851 6750327 6525502 5972761 5276032
37054 5276032 4675041 4253509 3944695 3693977 3516254 3402714 3288154 3156950 3086008 3099194
37044 3099194 3036176 2665496 1923513 981927 106410 -468872 -560890 -101823 711391 1417169
37034 1417169 1588839 1175715 505428 -42137 -307871 -333528 -202621 20133 261777 468194
37024 468194 669648 943849 1274483 1483451 1346308 779145 -85020 -975989 -1636954 -1957830
$$ packed form
37094C654733M21028N00938L46996M0915k12132k64640j55929n0214o8610j94210
37084D018875l16044l29781j95951N6762L46266N67380O54032O31894N89085N80632
37074F603150N77954N19602L85893K08348L2884j02364j75940k00422k18049k54170
37064G376886k86264k75975k10357r5863M5740J37684N8476k24825n52741o96729
37054E276032o00991m21532l08814k50718j77723j13540j14560j31204p0942J3186
37044C099194o3018l70680p41983r41586q75517n75282r2018M59067Q13214P05778
37034A417169J71670m13124o70287n47565k65734k5657J30907K22754K41644K06417
37024D68194K01454K74201L30634K08968j37143n67163q64165q90969o60965l20876
$$ plain form
37014 -1957830 -2037297 -2121140 -2415795 -2911478 -3402047 -3710665 -3882078 -4112014 -4489599 -4861327
37004 -4861327 -4977190 -4737647 -4262760 -3747399 -3300528 -2916766 -2540485 -2129512 -1701457
36995 -1701457 -1365886 -1293806 -1598784 -2215778 -2900339 -3357686 -3385905 -2928800 -2047045 -883892
36985 -883892 344511 1382425 2028501 2231101 2091590 1788986 1534972 1579590 2144407
36976 2144407 3238238 4545032 5576535 5975721 5674702 4824269 3671747 2489215 1473939
36967 1473939 636184 -147275 -913742 -1523937 -1853263 -1984823 -2105797 -2272432 -2405280
36958 -2405280 -2488907 -2633421 -2915490 -3277696 -3629729 -3947223 -4204762 -4289112 -4069182 -3538811
36948 -3538811 -2848951 -2206772 -1738665 -1397355 -988785 -355632 434205 1141008 1620871
$$ packed form
37014a957830p9467q3843k94655m95683m90569l08618j71413k29936l77585l71728
37004d861327j15863K39543M74887N15361M46871L83762L76281M10973M28055
36995a701457L35571P2080l04978o16994o84561m57347k8219M57105Q81755J163153
36985h83892J228403J037914O46076K02600j39511l02604k54014M4618N64817
36976B144407J093831J306794J031503L99186l01019q50433j152522j182532j015276
36967A473939q37755p83459p66467o10195l29326j31560j20974j66635j32848
36958b405280q3627j44514k82069l62206l52033l17494k57539q4350K19930N30371
36948c538811O89860O42179M68107L41310M08570O33153P89837P06803M79863
$$ plain form
36939 1620871 1954269 2246698 2392038 2159578 1500891 670629 32023 -194335 -11395
36930 -11395 407291 807606 980527 887202 654629 419015 196170 -72291 -395526 -730647
36920 -730647 -1102372 -1644425 -2445920 -3353189 -3980281 -3971150 -3267216 -2114817 -838928 337583
36910 337583 1254422 1699157 1463661 561474 -666227 -1734433 -2329689 -2447435 -2257751
36901 -2257751 -1909296 -1495919 -1142916 -999118 -1088771 -1234610 -1207869 -946276 -573170 -220773
36891 -220773 94597 423250 789127 1174399 1535314 1808112 1968795 2123723 2455086 2993178
36881 2993178 3496872 3662356 3442802 3088270 2882717 2917560 3106479 3311230 3417979 3384182
36871 3384182 3282789 3254616 3357145 3493136 3549961 3591678 3840270 4430916 5199641 5726146
$$ packed form
36939A620871L33398K92429J45340k32460o58687q30262o38606k26358J82940
36930a1395M18686M00315J72921r3325k32573k35614k22845k68461l23235l35121
36920g30647l71725n42053q01495r07269o27092R131P03934J152399J275889J176511
36910C37583R16839M44735k35496r02187j227701j068206n95256j17746J89684
36901b257751L48455M13377L53003J43798q9653j45839K6741K61593L73106L52397
36891b20773L15370L28653L65877L85272L60915K72798J60683J54928L31363N38092
36881B993178N03694J65484k19554l54532k05553L4843J88919K04751J06749l3797
36871C384182j01393k8173J02529J35991N6825M1717K48592N90646P68725N26505
$$ plain form
36861 5726146 5591005 4622654 2960419 947610 -1009005 -2529786 -3343114 -3392381 -2872915
36852 -2872915 -2084436 -1188040 -122130 1216857 2732007 4095948 4957528 5166763 4830076
36843 4830076 4202089 3529850 2937782 2392982 1771658 998460 146385 -613392 -1168411
36834 -1168411 -1540388 -1779685 -1829322 -1570890 -1010927 -349766 168077 419893 399513 138415
36824 138415 -275740 -655018 -820508 -792818 -795025 -1015073 -1395287 -1672593 -1587805 -1051362
36814 -1051362 -172164 830660 1781343 2655859 3521291 4353423 4957409 5106295 4734440
36805 4734440 3976954 3070059 2256818 1735789 1606543 1842611 2348194 3029138 3771210
36796 3771210 4389145 4703888 4712482 4615296 4606156 4643139 4456071 3768877 2509366 862437
$$ packed form
36861E726146j35141r68351j662235k012809j956615j520781q13328m9267N19466
36852b872915P88479Q96396J065910J338987J515150J363941Q61580K09235l36687
36843D830076o27987o72239n92068n44800o21324p73198q52075p59777n55019
36834a168411l71977k39297m9637K58432N59963O61161N17843K51816k0380k61098
36824A38415m14155l79278j65490K7690k207k20048l80214k77306Q4788N36443
36814a051362Q79198J002824R50683Q74516Q65432Q32132O03986J48886l71855
36805D734440p57486r06895q13241n21029j29246K36068N05583O80944P42072
36796C771210O17935L14743Q594r7186r140L6983j87068o87194j259511j646929
$$ plain form
36786 862437 -808880 -2114038 -2815701 -2948366 -2764219 -2535871 -2401430 -2374122 -2424998 -2490384
36776 -2490384 -2429002 -2070337 -1359724 -430439 496971 1271450 1863027 2310436 2668687 2987528
36766 2987528 3281900 3508421 3602646 3552495 3411585 3227688 2980357 2619383 2177512 1834032
36756 1834032 1825397 2234690 2845000 3236449 3080556 2368197 1378310 466106 -128063 -359750
36746 -359750 -358870 -301130 -228334 2554 553785 1422149 2469608 3577173 4656019 5531323
36736 5531323 5969734 5887216 5439444 4850803 4232681 3617776 3067925 2644034 2327749 2078347
36726 2078347 1939106 1990118 2199606 2400199 2420536 2191136 1736289 1129958 465252 -182602
36716 -182602 -764128 -1190540 -1292670 -932707 -184376 646478 1213688 1345269 1104674 696686
$$ packed form
36786H62437j671317j305158p01663j32665J84147K28348J34441K7308n0876o5386
36776b490384O1382L58665P10613R29285R27410P74479N91577M47409L58251L18841
36766B987528K94372K26521R4225n0151j40910j83897k47331l60974m41871l43480
36756A834032q635M09293O10310L91449j55893p12359r89887r12204n94169k31687
36746c59750Q80N7740P2796K30888N51231Q68364J047459J107565J078846Q75304
36736E531323M38411q2518m47772n88641o18122o14905n49851m23891l16285k49402
36726B078347j39241N1012K09488K00593K0337k29400m54847o06331o64706o47854
36716a82602n81526m26412j02130L59963P48331Q30854N67210J31581k40595m07988
$$ plain form
36706 696686 308322 -9078 -313992 -620197 -806756 -730787 -388251 115817 724411 1443735
36696 1443735 2195262 2770418 2986647 2813602 2307275 1508588 470611 -692909 -1877446
36687 -1877446 -3070331 -4294034 -5498488 -6572331 -7428523 -8015788 -8286027 -8241284 -7999393
36678 -7999393 -7711677 -7379962 -6814641 -5814337 -4370009 -2697789 -1120727 73304 728129
36669 728129 857354 621064 255851 -22695 -138060 -231744 -576962 -1318646 -2277147 -3051422
36659 -3051422 -3314035 -2971636 -2103481 -899231 303326 1085654 1226980 903450 509143
36650 509143 286963 218275 243199 437388 906046 1605558 2367578 3049785 3569417 3817483
36640 3817483 3661594 3086099 2269448 1459718 782212 202476 -330043 -742425 -867118
$$ packed form
36706F96686l88364l17400l04914l06205j86559P5969L42536N04068O08594P19324
36696A443735P51527N75156K16229j73045n06327p98687j037977j163520j184537
36687a877446j192885j223703j204454j073843q56192n87265k70239M4743K41891
36678g999393K87716L31715N65321J000304J444328J672220J577062J194031O54825
36669G28129J29225k36290l65213k78546j15365r3684l45218p41684r58501p74275
36659c051422k62613L42399Q68155J204250J202557P82328J41326l23530l94307
36650E09143k22180o8688K4924J94189M68658O99512P62020O82207N19632K48066
36640C817483j55889n75495q16651q09730o77506n79736n32519m12382j24693
$$ plain form
36631 -867118 -608987 -72599 486026 836278 903606 753449 507841 314450 343175 704952
36621 704952 1329152 1976178 2428179 2652356 2758022 2856673 3039825 3441969 4168288 5085166
36611 5085166 5776403 5837417 5232983 4316008 3500901 2968729 2665108 2468316 2287825 2058517
36601 2058517 1740552 1349163 950041 622006 449180 526832 904882 1498930 2104329 2538657
36591 2538657 2750604 2771717 2612656 2269405 1810203 1379783 1097155 995195 1068434 1310008
36581 1310008 1654921 1942092 2013551 1851282 1567346 1264548 958430 629182 270475 -148391
36571 -148391 -695289 -1364415 -1967292 -2219037 -1980660 -1402005 -810858 -467457 -406831 -461245
36561 -461245 -406013 -133134 241223 428597 190585 -425007 -1060362 -1293370 -948209 -198696
$$ packed form
36631h67118K58131N36388N58625L50252O7328j50157k45608j93391K8725L61777
36621G04952O24200O47026M52001K24177J05666R8651J83152M02144P26319R16878
36611E085166O91237O1014o04434r16975q15107n32172l03621j96792j80491k29308
36601B058517l17965l91389l99122l28035j72826P7652L78050N94048O05399M34328
36591B538657K11947K1113j59061l43251m59202m30420k82628j01960P3239K41574
36581A310008L44913K87171P1459j62269k83936l02798l06118l29248l58707m18866
36571a48391n46898o69126o02877k51745K38377N78655N91147L43401O0626n4414
36561d61245N5232K72879L74357J87374k38012o15592o35355k33008L45161P49513
$$ plain form
36551 -198696 606622 1221444 1649435 2073968 2657871 3381430 4043977 4422730 4448513 4242326
36541 4242326 3995611 3831692 3778536 3831257 3989872 4234000 4508210 4767477 5020133 5294089
36531 5294089 5569442 5782381 5901473 5958815 5976819 5893509 5609833 5117159 4548101 4092182
36521 4092182 3878031 3926837 4170088 4486998 4760325 4934536 5006659 4942127 4640521 4040157
36511 4040157 3238682 2440356 1766224 1163646 520049 -178390 -814915 -1207633 -1173290 -602148
36501 -602148 430728 1633391 2659671 3345872 3767510 4070780 4305622 4441694 4479108
36492 4479108 4468843 4429849 4301226 3997590 3490860 2834635 2147757 1605498 1412659 1698973
36482 1698973 2381008 3151419 3682140 3886078 3964293 4170414 4541511 4885196 5019501 4993558
$$ packed form
36551a98696Q05318O14822M27991M24533N83903P23559O62547L78753K5783k06187
36541D242326k46715j63919n3156N2721J58615K44128K74210K59267K52656K73956
36531E294089K75353K12939J19092N7342J8004q3310k83676m92674n69058m55919
36521D092182k14151M8806K43251L16910K73327J74211P2123o4532l01606o00364
36511D040157q01475p98326o74132o02578o43597o98439o36525l92718L4343N71142
36501f02148J032876J202663J026280O86201M21638L03270K34842J36072L7414
36492D479108j0265l8994j28623l03636n06730o56225o86878n42259j92839K86314
36482A698973O82035P70411N30721K03938P8215K06121L71097L43685J34305k5943
$$ plain form
36472 4993558 5070567 5512514 6363324 7385507 8185454 8458113 8200964 7735552 7498503
36463 7498503 7757357 8478667 9432827 10400323 11276047 12013220 12529836 12708902 12472346
36454 12472346 11812765 10751761 9315851 7587594 5755551 4068765 2733465 1867062
36446 1867062 1528452 1727038 2359784 3171925 3862326 4292552 4597081 5053209 5826147
36437 5826147 6860470 8014400 9216424 10401441 11330962 11632145 11118280 10024657 8844168
36428 8844168 7943859 7395315 7127383 7107702 7322952 7671344 7975830 8107679 8056230 7877413
36418 7877413 7605574 7226505 6722397 6126635 5521232 4976911 4514361 4144049 3925173
36409 3925173 3942740 4217354 4664409 5147959 5549887 5790925 5836207 5713430 5497250 5238868
$$ packed form
36472D993558P7009M41947Q50810J022183P99947K72659k57149m65412k37049
36463G498503K58854P21310R54160R67496Q75724P37173N16616J79066k36556
36454A2472346o59581j061004j435910j728257j832043j686786j335300q66403
36446A867062l38610J98586O32746Q12141O90401M30226L04529M56128P72938
36437E826147J034323J153930J202024J185017R29521L01183n13865j093623j180489
36428H844168r00309n48544k67932j9681K15250L48392L04486J31849n1449j78817
36418G877413k71839l79069n04108n95762o05403n44321m62550l70312k18876
36409C925173J7567K74614M47055M83550M01928K41038M5282j22777k16180k58382
$$ plain form
36399 5238868 4922265 4522397 4105680 3841118 3886480 4257890 4818181 5402902 5952877 6498945
36389 6498945 7011194 7313979 7218778 6755164 6229734 6023064 6313419 6963146 7633676 8032525
36379 8032525 8121446 8115135 8245788 8520683 8749434 8803698 8768507 8793476 8860695 8776025 8370963
36368 8370963 7661983 6834084 6123150 5691279 5533779 5479573 5331949 5050356 4786278 4730799
36358 4730799 4944671 5349825 5866335 6521711 7405381 8525385 9741465 10856418 11747049
36349 11747049 12374724 12700694 12668201 12290821 11711214 11147094 10797996 10771418 10997261 11185522
36339 11185522 10982358 10274987 9314298 8482857 7995271 7878399 8137793 8786316 9726210
36330 9726210 10745379 11659953 12370650 12788952 12848091 12627803 12333458 12064337 11695164
$$ packed form
36399E238868l16603l99868m16717k64562M5362L71410N60291N84721N49975N46068
36389F498945N12249L02785r5201m63614n25430k06670K90355O49727O70530L98849
36379H032525Q8921o311J30653K74895K28751N4264l5191K4969O7219q4670m05062
36368H370963p08980q27899p10934m31871j57500n4206j47624k81593k64078n5479
36358D730799K13872M05154N16510O55376Q83670J120004J216080J114953Q90631
36349A1747049O27675L25970l2493l77380n79607n64120l49098k6578K25843J88261
36339A1185522k03164p07371r60689q31441m87586j16872K59394O48523R39894
36330I726210J019169R14574P10697M18302N9139k20288k94345k69121l69173
$$ plain form
36321 11695164 11079728 10304450 9650068 9358898 9535151 10216686 11390595 12893381 14391285
36312 14391285 15551278 16254126 16645224 16981876 17401794 17802492 17952929 17745550 17320974
36303 17320974 16921883 16659993 16478759 16325649 16292497 16562731 17245598 18264545 19386312
36294 19386312 20373868 21155440 21857229 22658973 23630791 24720726 25842964 26904386 27777499
36285 27777499 28367260 28755826 29213336 30003174 31200000 32722406 34485984 36461188 38616149
36276 38616149 40892578 43270870 45828604 48716717 52088396 56044918 60624117 65834480
36268 65834480 71715908 78372006 85937778 94526897 104226236 115128009 127336850 140938548
36260 140938548 155965581 172361115 189923819 208277171 226915902 245250923 262504335
$$ packed form
36321A1695164o15436p75278o54382k91170J76253O81535J173909J502786J497904
36312A4391285J159993P02848L91098L36652M19918M00698J50437k07379m24576
36303A7320974l99091k61890j81234j53110l3152K70234O82867J018947J121767
36294A9386312R87556P81572P01789Q01744R71818J089935J122238J061422Q73113
36285B7777499N89761L88566M57510P89838J196826J522406J763578J975204K154961
36276C8616149K276429K378292K557734K888113L371679L956522M579199N210363
36268F5834480N881428O656098P565772Q589119R699339J0901773J2208841J3601698
36260A40938548J5027033J6395534J7562704J8353352J8638731J8335021J7253412
$$ plain form
36253 262504335 277503136 288677302 294476782 293998396 287358482 275573952 260128860
36246 260128860 242543814 224102927 205733425 188011700 171264222 155688418 141433003
36239 141433003 128647484 117508716 108169508 100617884 94580368 89609305 85289596 81360246
36231 81360246 77681162 74176262 70850019 67796196 65108369 62773197 60685579 58767619
36223 58767619 57042958 55594658 54477464 53671109 53086931 52607058 52141771 51673056 51244386
36214 51244386 50911841 50722712 50742631 51065926 51752727 52743989 53864670 54943530 55947858
36205 55947858 57011796 58353109 60182454 62678243 65982304 70143002 75042749 80429976
36197 80429976 86085669 91995883 98387109 105621579 114053499 123918366 135272215 148002834
$$ packed form
36253B62504335J4998801J1174166N799480m78386o639914j1784530j5445092
36246B60128860j7585046j8440887j8369502j7721725j6747478j5575804j4255415
36239A41433003j2785519j1138768r339208p551624o037516m971063m319709l929350
36231H1360246l679084l504900l326243l053823k687827k335172k087618j917960
36223E8767619j724661j448300j117194q06355n84178m79873m65287m68715m28670
36214E1244386l32545j89129J9919L23295O86801R91262J120681J078860J004328
36205E5947858J063938J341313J829345K495789L304061M160698M899747N387227
36197H0429976N655693N910214O391226P234470Q431920R864867J1353849J2730619
$$ plain form
36189 148002834 161931138 176946308 193059767 210315283 228599218 247445871 265923046
36182 265923046 282663155 296066877 304629990 307285311 303661343 294189570 279998998
36175 279998998 262590418 243430214 223695926 204269373 185825290 168821477 153421604
36168 153421604 139543640 127070599 116005903 106396167 98151781 91034373 84841026
36161 84841026 79534146 75140409 71556217 68506526 65684393 62885866 60019287 57056370
36153 57056370 54025342 51032052 48239141 45794994 43763892 42100694 40684094 39396792
36145 39396792 38202804 37157681 36342878 35785012 35415163 35073708 34559886 33736015 32640123
36136 32640123 31494404 30561516 29965265 29648699 29501468 29511994 29783044 30395326 31261414
$$ packed form
36189A48002834J3928304J5015170J6113459J7255516J8283935J8846653J8477175
36182B65923046J6740109J3403722Q563113K655321l623968r471773j4190572
36175B79998998j7408580j9160204j9734288j9426553j8444083j7003813j5399873
36168A53421604j3877964j2473041j1064696r609736q244386p117408o193347
36161H4841026n306880m393737l584192l049691k822133k798527k866579k962917
36153E7056370l031028k993290k792911k444147k031102j663198j416600j287302
36145C9396792j193988j045123q14803n57866l69849l41455n13822q23871j095892
36136C2640123j145719r32888n96251l16566j47231J0526K71050O12282Q66088
$$ plain form
36127 31261414 32131622 32759511 33051917 33042898 32758931 32184666 31371005 30487892 29697787 29017215
36117 29017215 28371860 27750504 27202936 26679650 25978052 24909622 23474138 21831472 20160783
36108 20160783 18609695 17335459 16497239 16180742 16366359 16968519 17855741 18825614 19626727
36099 19626727 20066202 20100910 19821570 19381847 18964574 18766443 18930898 19466608 20268196
36090 20268196 21242418 22385330 23702968 25074429 26234164 26898591 26906258 26273739 25182684
36081 25182684 23928104 22823535 22100798 21883888 22227007 23106947 24351691 25648674 26707915
36072 26707915 27417676 27809782 27914550 27725208 27293186 26772930 26338773 26090421 26030825
36063 26030825 26069622 26040421 25797221 25339781 24792363 24226133 23567993 22740122 21833647 21070023
$$ packed form
36127C1261414Q70208O27889K92406r019k83967n74265q13661q83113p90105o80572
36117B9017215o45355o21356n47568n23286p01598j068430j435484j642666j670689
36108B0160783j551088j274236q38220l16497J85617O02160Q87222R69873Q01113
36099A9626727M39475L4708k79340m39723m17273j98131J64455N35710Q01588
36090B0268196R74222J142912J317638J371461J159735O64427P667o32519j091055
36081B5182684j254580j104569p22737k16910L43119Q79940J244744J296983J059241
36072B6707915P09761L92106J04768j89342m32022n20256m34157k48352n9596
36063B6030825L8797k9201k43200m57440n47418n66230o58140q27871r06475p63624
$$ plain form
36053 21070023 20618954 20516496 20726032 21186700 21794274 22409592 22917320 23242446 23312523
36044 23312523 23072391 22575705 22024570 21667995 21645583 21922253 22356219 22826344 23305566
36035 23305566 23809969 24276877 24532924 24433532 24031895 23567752 23276323 23223782 23310237 23381334
36025 23381334 23326382 23112207 22757024 22280221 21700924 21107270 20684025 20593983 20821127 21181618
36015 21181618 21491252 21667067 21677982 21504102 21198457 20908654 20755890 20726679 20742600 20797910
36005 20797910 20958371 21249610 21625226 22048913 22546434 23156506 23861543 24575066 25184327
35996 25184327 25628254 25964934 26331529 26780328 27165389 27250459 26934547 26327468 25612174
35987 25612174 24898452 24219902 23591728 23009839 22428644 21803234 21159009 20585472 20144117
$$ packed form
36053B1070023m51069j02458K09536M60668O07574O15318N07728L25126P0077
36044B3312523k40132m96686n51135l56575k2412K76670M33966M70125M79222
36035B3305566N04403M66908K56047r9392m01637m64143k91429n2541Q6455P1097
36025B3381334n4952k14175l55183m76803n79297n93654m23245r0042K27144L60491
36015B1181618L09634J75815J0915j73880l05645k89803j52764k9211J5921N5310
36005B0797910J60461K91239L75616M23687M97521O10072P05037P13523O09261
35996B5184327M43927L36680L66595M48799L85061Q5070l15912o07079p15294
35987B5612174p13722o78550o28174n81889n81195o25410o44225n73537m41355
$$ plain form
35978 20144117 19789679 19398530 18896466 18366584 18002951 17923228 18035421 18119979 18038982 17846737
35968 17846737 17729567 17891076 18464710 19432857 20590500 21658487 22494399 23167419 23802185
35959 23802185 24403821 24887574 25231897 25517264 25807166 26042590 26071761 25768232 25131379
35950 25131379 24297957 23445774 22664390 21938209 21275025 20803857 20681277 20916806 21353776
35941 21353776 21810257 22155982 22242886 21879798 20984919 19739523 18499888 17525673 16818966
35932 16818966 16220776 15615295 15028603 14579013 14371371 14419068 14635715 14918750 15280886
35923 15280886 15893160 16943339 18414282 20013753 21342117 22127852 22318825 22016059 21381097
35914 21381097 20583076 19760596 19009791 18433075 18172726 18305350 18666391 18862057 18561630
$$ packed form
35978B0144117l54438l91149n02064n29882l63633p9723J12193Q4558q0997j92245
35968A7846737j17170J61509N73634R68147J157643J067987Q35912O73020O34766
35959B3802185O01636M83753L44323K85367K89902K35424K9171l03529o36853
35950B5131379q33422q52183p81384p26181o63184m71168j22580K35529M36970
35941B1353776M56481L45725Q6904l63088q94879j245396j239635r74215p06707
35932A6818966n98190o05481n86692m49590k07642M7697K16647K83035L62136
35923A5280886O12274J050179J470943J599471J328364P85735J90973l02766o34962
35914B1381097p98021q22480p50805n76716k60349J32624L61041J95666l00427
$$ plain form
35905 18561630 17801915 16976419 16523815 16626787 17154158 17813603 18348779 18649861 18736132
35896 18736132 18669560 18511318 18347988 18284329 18348792 18440913 18445488 18398757 18493979 18938168 19858809
35885 19858809 21311756 23247585 25414326 27384170 28774475 29444296 29467293 28981439 28115421
35876 28115421 26990154 25690719 24245885 22703815 21212242 19943056 18929590 18049039
35868 18049039 17186114 16357152 15655912 15145735 14849404 14790222 14971945 15327200 15737432
35859 15737432 16111888 16416023 16613155 16604389 16257741 15523531 14541289 13620070 13058315 12932139
35849 12932139 13058507 13189233 13241900 13328607 13577840 13973704 14386006 14723238 15014488 15339234
35839 15339234 15705787 16019690 16171880 16158138 16123132 16288212 16805855 17642928 18591740 19411612
$$ packed form
35905A8561630p59715q25496m52604J02972N27371O59445N35176L01082Q6271
35896A8736132o6572j58242j63330o3659O4463R2121M575m6731R5222M44189R20641
35885A9858809J452947J935829K166741J969844J390305O69821K2997m85854q66018
35876B8115421j125267j299435j444834j542070j491573j269186j013466q80551
35868A8049039q62925q28962p01240n10177k96331n9182J81723L55255M10232
35859A5737432L74456L04135J97132q766l46648p34210r82242r21219n61755j26176
35849A2932139J26368J30726N2667Q6707K49233L95864M12302L37232K91250L24746
35839A5339234L66553L13903J52190j3742l5006J65080N17643Q37073R48812Q19872
$$ plain form
35829 19411612 19976738 20300836 20459538 20539690 20645436 20851795 21087566 21133259 20845068 20375152
35819 20375152 20079969 20210424 20797780 21856294 23527297 25876202 28622405 31239154
35811 31239154 33332176 34801184 35626608 35662335 34739578 32883251 30317357 27308314 24108627
35802 24108627 21021472 18382779 16417634 15155947 14501759 14324552 14455433 14663791 14729171
35793 14729171 14568137 14278083 14037274 13932052 13846291 13516600 12730194 11498278 10043980
35784 10043980 8634431 7436879 6502424 5815750 5329299 4986852 4746647 4562313 4332654
35775 4332654 3927809 3327275 2715772 2378314 2477227 2953651 3642570 4436551 5311745 6230250
35765 6230250 7071200 7673629 7929597 7829046 7438387 6863718 6223727 5606688 5019117
$$ packed form
35829A9411612N65126L24098J58702Q0152J05746K06359K35771M5693k88191m69916
35819B0375152k95183J30455N87356J058514J671003K348905K746203K616749
35811C1239154K093022J469008Q25424L5727r22757j856327k565894l009043l199687
35802B4108627l087155k638693j965145j261687o54188j77207J30881K08358O5380
35793A4729171j61034k90054k40809j05222q5761l29691p86406j231916j454298
35784A0043980j409549j197552r34455o86674m86451l42447k40205j84334k29659
35775D332654m04845o00534o11503l37458R8913M76424O88919P93981Q75194R18505
35765F230250Q40950O02429K55968j00551l90659n74669o39991o17039n87571
$$ plain form
35756 5019117 4403303 3749575 3176451 2842627 2773591 2834132 2896090 2977282 3175967 3521522
35746 3521522 3950198 4393707 4825334 5239851 5658210 6140555 6712972 7266657 7603147
35737 7603147 7615762 7381119 7050510 6701628 6313255 5808316 5067569 3973453 2548852
35728 2548852 1056681 -111329 -678825 -613119 -52232 816920 1794847 2662505 3218887
35719 3218887 3351846 3079555 2543712 1966878 1577247 1518315 1793472 2283927 2828513 3319042
35709 3319042 3753922 4201500 4684903 5092239 5220777 4929332 4247509 3344744 2428353
35700 2428353 1691804 1314485 1419029 1974925 2770232 3532262 4090441 4407490 4475997 4253134
35690 4253134 3729563 3016154 2308889 1782903 1554639 1702319 2226573 2974543 3695862
$$ packed form
35756E019117o15814o53728n73124l33824o9036O0541O1958Q1192J98685L45555
35746C521522M28676M43509M31627M14517M18359M82345N72417N53685L36490
35737G603147J2615k34643l30609l48882l88373n04939p40747j094116j424601
35728B548852j492171j168010n67496O5706N60887Q69152R77927Q67658N56382
35719C218887J32959k72291n35843n76834l89631n8932K75157M90455N44586M90529
35709C319042M34880M47578M83403M07336J28538k91445o81823r02765r16391
35700B428353p36549l77319J04544N55896P95307P62030N58179L17049O8507k22863
35690D253134n23571p13409p07265n25986k28264J47680N24254P47970P21319
$$ plain form
35681 3695862 4249573 4730610 5344648 6181752 7159557 8165105 9183650 10268440 11419954
35672 11419954 12518770 13375126 13855351 13974486 13845060 13511487 12870937 11821566 10486284
35663 10486284 9220447 8360414 7987851 7942590 8005284 8028329 7943333 7728419 7391746 6957420
35653 6957420 6458958 5964475 5597935 5491164 5690487 6125644 6680326 7267521 7813391
35644 7813391 8201183 8303883 8103854 7729508 7304844 6774763 5968060 4879094 3817067
35635 3817067 3180994 3094518 3343059 3676079 4071756 4648643 5402216 6140027 6662835 6918525
35625 6918525 6972256 6918013 6853441 6844903 6823196 6555624 5832986 4716162 3545275 2686459
35615 2686459 2309373 2402565 2900849 3719753 4723486 5766203 6768812 7680596 8366674
$$ packed form
35681C695862N53711M81037O14038Q37104R77805J005548J018545J084790J151514
35672A1419954J098816Q56356M80225J19135j29426l33573o40550j049371j335282
35663A0486284j265837q60033l72563m5261O2694K3045q4996k14914l36673m34326
35653F957420m98462m94483l66540j06771J99323M35157N54682N87195N45870
35644G813391L87792J02700k00029l74346m24664n30081q06703j088966j062027
35635C817067o36073q6476K48541L33020L95677N76887P53573P37811N22808K55690
35625F918525N3731n4243o4572q538k1707k67572p22638j116824j170887q58816
35615B686459l77086R3192M98284Q18904J003733J042717J002609R11784O86078
$$ plain form
35606 8366674 8633687 8417041 7872431 7216795 6526098 5761246 4959377 4308371 4015583
35597 4015583 4147128 4584959 5076729 5328340 5137166 4502279 3599982 2650703 1839372
35588 1839372 1334833 1266361 1596786 2064073 2335097 2233422 1804541 1209950 626040 217107
35578 217107 98228 263922 581274 889728 1106493 1235368 1296480 1258918 1035471 558892
35568 558892 -105119 -732410 -1084554 -1104695 -934893 -712747 -386628 221874 1183122 2325320
35558 2325320 3335116 3969203 4183910 4112554 3941451 3773485 3570335 3230408 2748197
35549 2748197 2290906 2083470 2205534 2523657 2829012 3006221 3052066 2994349 2878466 2820240
35539 2820240 2963093 3321050 3720977 3970058 4056419 4132585 4336414 4699105 5192527 5743872
$$ packed form
35606H366674K67013k16646n44610o55636o90697p64852q01869o51006k92788
35597D015583J31545M37831M91770K51611j91174o34887r02297r49279q11331
35588A839372n04539o8472L30425M67287K71024j01675m28881n94591n83910m08933
35578B17107j18879J65694L17352L08454K16765J28875O1112l7562k23447m76579
35568E58892o64011o27291l52144k0141J69802K22146L26119O08502R61248J142198
35558B325320J009796O34087K14707p1356j71103j67966k03150l39927m82211
35549B748197m57291k07436J22064L18123L05355J77209M5845n7717j15883n8226
35539B820240J42853L57957L99927K49081Q6361P6166K03829L62691M93422N51345
$$ plain form
35529 5743872 6174573 6246135 5876037 5280538 4828597 4759006 5079597 5701570 6573690 7649003
35519 7649003 8765683 9607147 9808561 9169081 7846851 6360464 5321801 5081635 5587529
35510 5587529 6535183 7600159 8538032 9171843 9391117 9185216 8657143 8004858 7473959
35501 7473959 7253288 7344642 7547884 7630399 7517552 7292643 7044122 6784018 6509842 6256570
35491 6256570 6046052 5847197 5635341 5438203 5260927 5011923 4595767 4076114 3659812
35482 3659812 3494228 3547228 3711877 3940381 4195397 4330580 4151665 3633755 3006505 2576645
35472 2576645 2499371 2738788 3172758 3650323 3981249 3996445 3688920 3245725 2865018 2540765
35462 2540765 2082384 1370729 561936 1 -72422 303828 903653 1554996 2241877 2994208
$$ packed form
35529E743872M30701P1562l70098n95499m51941o9591L20591O21973Q72120J075313
35519G649003J116680Q41464K01414o39480j322230j486387j038663k40166N05894
35510E587529R47654J064976R37873O33811K19274k05901n28073o52285n30899
35501G473959k20671R1354K03242Q2515j12847k24909k48521k60104k74176k53272
35491F256570k10518j98855k11856j97138j77276k49004m16156n19653m16302
35482C659812j65584N3000J64649K28504K55016J35183j78915n17910o27250m29860
35472B576645p7274K39417M33970M77565L30926J5196l07525m43195l80707l24253
35462B540765m58381p11655q08793n61935p2423L76250N99825O51343O86881P52331
$$ plain form
35452 2994208 3743163 4324258 4594384 4511988 4137997 3621423 3165047 2905011 2774527 2548835
35442 2548835 2090323 1516598 1067415 835071 698644 511228 269266 80996 40322 166053
35432 166053 409779 683206 918403 1135620 1411982 1754459 2067089 2311688 2653725 3341170
35422 3341170 4414064 5596981 6508534 6940596 6926172 6610814 6134695 5623894 5205411
35413 5205411 4952663 4807814 4607401 4235284 3747662 3303244 2963883 2629876 2225150
35404 2225150 1896510 1930568 2452669 3271770 4053123 4596297 4916517 5120467 5287308 5464802
35394 5464802 5701788 6030676 6423809 6781571 6958380 6809049 6255871 5358544 4318366
35385 4318366 3369027 2627580 2059198 1603138 1306519 1285397 1554728 1956279 2291539 2492100
$$ packed form
35452B994208P48955N81095K70126q2396l73991n16574m56376k60036j30484k25692
35442B548835m58512n73725m49183k32344j36427j87416k41962j88270m0674J25731
35432A66053K43726K73427K35197K17217K76362L42477L12630K44599L42037O87445
35422C341170J072894J182917R11553M32062j4424l15358m76119n10801m18483
35413E205411k52748j44849k00413l72117m87622m44418l39361l34007m04726
35404B225150l28640L4058N22101Q19101P81353N43174L20220K03950J66841J77494
35394E464802K36986L28888L93133L57762J76809j49331n53178q97327j040178
35385D318366r49339p41447n68382m56060k96619k1122K69331M01551L35260K00561
$$ plain form
35375 2492100 2619297 2722923 2755248 2627292 2314645 1900830 1529447 1295396 1160786 1012093
35365 1012093 846376 863879 1291795 2112595 3040260 3776063 4213612 4385372 4328741 4090004
35355 4090004 3782205 3522469 3325118 3140095 2990151 2989042 3207337 3573063 3910992 4031763
35345 4031763 3793868 3167670 2288849 1408260 744365 388853 344876 594764 1098053 1775859
35335 1775859 2553158 3392380 4238631 4959518 5411898 5583994 5625456 5716894 5938633 6268712
35325 6268712 6646369 6987502 7173560 7097492 6738782 6168286 5490366 4823778 4325174 4145744
35315 4145744 4316800 4723964 5233357 5789318 6334978 6709969 6748328 6470307 6061579 5631848
35305 5631848 5088412 4289571 3232272 2030789 800134 -352110 -1291485 -1934114 -2339107
$$ packed form
35375B492100J27197J03626L2325j27956l12647m13815l71383k34051j34610j48693
35365A012093j65717J7503M27916Q20800R27665P35803M37549J71760n6631k38737
35355D090004l07799k59736j97351j85023j49944j109K18295L65726L37929J20771
35345D031763k37895o26198q78821q80589o63895l55512m3977K49888N03289O77806
35335A775859P77299Q39222Q46251P20887M52380J72096M1462R1438K21739L30079
35325F268712L77657L41133J86058p6068l58710n70496o77920o66588m98604j79430
35315D145744J71056M07164N09393N55961N45660L74991L8359k78021m08728m29731
35305E631848n43436p98841j057299j201483j230655j152244r39375o42629m04993
$$ plain form
35296 -2339107 -2626935 -2812681 -2802671 -2541164 -2057843 -1364649 -425808 705789 1797233
35287 1797233 2557293 2831593 2656526 2180147 1589807 1081187 811929 842236 1121873 1541327
35277 1541327 2011443 2520844 3116866 3802117 4447361 4840905 4838507 4450005 3797231 3039524
35267 3039524 2337417 1812285 1495911 1355374 1391161 1659348 2155268 2717505 3103361 3155343
35257 3155343 2886770 2455709 2092166 1993083 2206123 2611553 3051545 3462625 3858882 4236307
35247 4236307 4564641 4859191 5196375 5652740 6264388 7027426 7882475 8704185 9358993
35238 9358993 9776689 9931923 9782944 9298291 8541127 7659673 6784070 5983417 5310554
35229 5310554 4803452 4431517 4135207 3957756 4050789 4488567 5142834 5800675 6338463 6711748
$$ packed form
35296b339107k87828j85746J0010K61507M83321O93194R38841J131597J091444
35287A797233P60060K74300j75067m76379n90340n08620k69258L0307K79637M19454
35277A541327M70116N09401N96022O85251O45244L93544k398l88502o52774p57707
35267C039524p02107n25132l16374j40537L5787K68187M95920N62237L85856N1982
35257C155343k68573m31061l63543r9083K13040M05430M39992M11080L96257L77425
35247D236307L28334K94550L37184M56365O11648P63038Q55049Q21710O54808
35238I358993M17696J55234j48979m84653p57164q81454q75603q00653o72863
35229E310554n07102l71935k96310j77451R3033M37778O54267O57841N37788L73285
$$ plain form
35219 6711748 6859148 6745586 6471549 6205006 5986429 5714098 5358179 5071795 4995763 5014061
35209 5014061 4808975 4167499 3192523 2236106 1681219 1756584 2445109 3492722 4535556
35200 4535556 5296699 5711233 5883891 5940344 5910039 5709664 5206722 4324643 3149527 1965478
35190 1965478 1153442 997427 1547536 2640424 4014409 5384963 6452815 6935408 6667162
35181 6667162 5683388 4196677 2505330 934739 -187321 -606046 -263488 656112 1828066
35172 1828066 2929738 3698903 3951091 3664000 3064536 2531611 2322010 2395980 2533882
35163 2533882 2571045 2457495 2144344 1550237 695892 -199623 -828311 -995234 -712947 -157066
35153 -157066 438156 906845 1253109 1617602 2111899 2726306 3436291 4309879 5385030
$$ packed form
35219F711748J47400j13562k74037k66543k18577k72331l55919k86384p6032J8298
35209E014061k05086o41476r74976r56417n54887P5365O88525J047613J042834
35200D535556P61143M14534J72658N6453l0305k00375n02942q82079j175116j184049
35190A965478q12036j56015N50109J092888J373985J370554J067852M82593k68246
35181F667162r83774j486711j691347j570591j122060m18725L42558R19600J171954
35172A828066J101672P69165K52188k87091n99464n32925k09601P3970J37902
35163B533882L7163j13550l13151n94107q54345q95515o28688j66923K82287N55881
35153a57066N95222M68689L46264L64493M94297O14407P09985Q73588J075151
$$ plain form
35144 5385030 6474227 7249487 7574568 7641973 7706414 7762172 7568630 6945916 5967188 4888926
35134 4888926 3952248 3211537 2479488 1464865 52578 -1537737 -2915431 -3836057 -4333509
35125 -4333509 -4602938 -4844830 -5181607 -5586200 -5860839 -5796934 -5408563 -4921081 -4478866 -3958102
35115 -3958102 -3142152 -1994865 -661707 719406 2055492 3160456 3742994 3623073 2913938
35106 2913938 1952867 1094625 579332 500821 799774 1293575 1788790 2211605 2630903 3151142
35096 3151142 3787233 4451086 5070243 5711637 6541013 7614557 8734857 9584303 10021637
35087 10021637 10199682 10368737 10606769 10765090 10627415 10083672 9204807 8227919 7455079
35078 7455079 7079171 7053966 7136862 7062799 6682689 5993242 5123007 4308409 3800247 3699574
$$ packed form
35144E385030J089197P75260L25081O7405O4441N5758j93542o22714r78728j078262
35134D888926r36678p40711p32049j014623j412287j590315j377694r20626m97452
35125d333509k69429k41892l36777m04593k74639O3905L88371M87482M42215N20764
35115c958102Q15950J147287J333158J381113J336086J104964N82538j19921p09135
35106B913938r61071q58242n15293p8511K98953M93801M95215M22815M19298N20239
35096C151142O36091O63853O19157O41394Q29376J073544J120300Q49446M37334
35087A0021637J78045J69055K38032J58321j37675n43743q78865r76888p72840
35078G455079l75908k5205Q2896p4063l80110o89447q70235q14598n08162j00673
$$ plain form
35068 3699574 3864662 4015238 3964872 3771395 3670351 3858764 4327370 4885124 5332122 5600613
35058 5600613 5745720 5847303 5952296 6081099 6231793 6368795 6444878 6445013 6376428 6209076
35048 6209076 5872440 5343214 4707392 4098519 3582439 3119286 2615094 1983304 1181999
35039 1181999 244258 -711943 -1520672 -2022332 -2096366 -1700637 -939859 -77068 598785 952277
35029 952277 1031531 934401 708020 393204 86799 -109029 -166336 -102641 97692 459052
35019 459052 911427 1276746 1377735 1122463 488640 -496259 -1716758 -2966624 -4047375
35010 -4047375 -4858868 -5369375 -5543350 -5363225 -4903637 -4310584 -3689659 -3060105 -2429939
35001 -2429939 -1865866 -1458982 -1250314 -1209870 -1255665 -1267833 -1121992 -763231 -252346 284419
$$ packed form
35068C699574J65088J50576n0366j93477j01044J88413M68606N57754M46998K68491
35058E600613J45107J01583J04993J28803J50694J37002P6083J35o8585j67352
35048F209076l36636n29226o35822o08873n16080m63153n04192o31790q01305
35039A181999r37741r56201q08729n01660p4034L95729P60778Q62791O75853L53492
35029I52277P9254r7130k26381l14816l06405j95828n7307O3695K00333L61360
35019D59052M52375L65319J00989k55272o33823r84899j220499j249866j080751
35010d047375q11493n10507j73975J80125M59588N93053O20925O29554O30166
35001b429939N64073M06884K08668M0444m5795j2168J45841L58761N10885N36765
$$ plain form
34991 284419 750622 1113950 1368267 1500761 1505851 1416338 1319469 1346473 1618280 2153008
34981 2153008 2807962 3330859 3488525 3165820 2388731 1311998 187077 -731304 -1325507
34972 -1325507 -1681881 -1998115 -2412121 -2914367 -3394764 -3731337 -3830855 -3636568 -3156449 -2495927
34962 -2495927 -1826703 -1282190 -870569 -499358 -91611 325250 644305 783430 765278 708379
34952 708379 745358 929502 1193100 1393151 1419806 1280382 1079359 912078 784850 655407
34942 655407 560161 686364 1281606 2453527 4037932 5659864 6930847 7619126 7696737
34933 7696737 7286293 6563866 5661237 4630508 3516801 2461073 1677466 1293823 1251851
34924 1251851 1410067 1715516 2211603 2884902 3576985 4084807 4323536 4376042 4408469 4550047
$$ packed form
34991B84419M66203L63328K54317J32494N090q9513r6869K7004K71807N34728
34981B153008O54954N22897J57666l22705p77089j076733j124921r18381n94203
34972a325507l56374l16234m14006n02246m80397l36573r9518J94287M80119O60522
34962b495927O69224N44513M11621L71211M07747M16861L19055J39125j8152n6899
34952G08379L6979J84144K63598K00051K6655j39424k01023j67281j27228j29443
34942F55407r5246J26203N95242J171921J584405J621932J270983O88279P7611
34933G696737m10444p22427r02629j030729j113707j055728p83607l83643m1972
34924A251851J58216L05449M96087O73299O92083N07822K38729N2506L2427J41578
$$ plain form
34914 4550047 4828746 5200575 5635257 6143808 6679752 7035153 6928786 6261827 5261579
34905 5261579 4329863 3756742 3585147 3686421 3891148 4069045 4178814 4289306 4517520
34896 4517520 4911103 5406625 5916009 6419520 6937735 7434988 7809304 7998874 8061870 8110126
34886 8110126 8166924 8119639 7823002 7239028 6483987 5767754 5284920 5107797 5134328 5155103
34876 5155103 5016729 4729117 4404378 4123330 3905571 3780743 3806024 3988804 4243321 4443852
34866 4443852 4475987 4233717 3659858 2860533 2126916 1751785 1814014 2172078 2631311 3052660
34856 3052660 3329056 3372312 3191887 2955154 2913267 3235382 3885633 4639107 5241708 5606574
34846 5606574 5872865 6261918 6886223 7705080 8603415 9429283 9976342 10054821 9653838 8990046
$$ packed form
34914D550047K78699L71829M34682N08551N35944L55401j06367o66959j000248
34905E261579r31716n73121j71595J01274K04727J77897J09769J10492K28214
34896D517520L93583M95522N09384N03511N18215M97253L74316J89570O2996M8256
34886H110126N6798m7285k96637n83974p55041p16233m82834j77123K6531K0775
34876E155103j38374k87612l24739k81048k17759j24828K5281J82780K54517K00531
34866D443852L2135k42270n73859p99325p33617l75131O2229L58064M59233M21349
34856C052660K76396M3256j80425k36733m1887L22115O50251P53474O02601L64866
34846E606574K66291L89053O24305Q18857Q98335Q25868N47059P8479m00983o63792
$$ plain form
34836 8990046 8350434 7923776 7809397 8099653 8837225 9900802 11035964 12032000 12800342
34827 12800342 13256252 13230499 12611817 11545331 10362737 9277348 8247149 7211996 6374683
34818 6374683 6093715 6482528 7238047 7932308 8402378 8799468 9343538 10134191 11144578
34809 11144578 12250825 13236542 13874565 14069297 13880623 13398030 12668056 11781777 10952117
34800 10952117 10422363 10316737 10613139 11206960 11936162 12587994 12978843 13043569 12797329
34791 12797329 12218122 11237606 9866919 8272296 6683846 5245429 3960696 2751855
34783 2751855 1561046 441782 -414469 -775268 -537557 200863 1254496 2502303 3887544
34774 3887544 5301725 6556391 7498108 8090094 8335695 8175526 7541874 6508232 5309380
$$ packed form
34836H990046o39612m26658j14379K90256P37572J063577J135162R96036P68342
34827A2800342M55910k5753o18682j066486j182594j085389j030199j035153q37313
34818F374683k80968L88813P55519O94261M70070L97090N44070P90653J010387
34809A1144578J106247R85717O38023J94732j88674m82593p29974q86279q29660
34800A0952117n29754j05626K96402N93821P29202O51832L90849O4726k46240
34791A2797329n79207r80516j370687j594623j588450j438417j284733j208841
34783B751855j190809j119264q56251l60799K37711P38420J053633J247807J385241
34774C887544J414181J254666R41717N91986K45601j60169o33652j033642j198852
$$ plain form
34765 5309380 4184292 3237386 2461163 1830830 1337695 982667 794472 820877 1043550
34756 1043550 1330642 1544309 1678918 1811743 1917051 1826467 1420034 793569 190360 -182870
34746 -182870 -234782 39365 570793 1219059 1842775 2387169 2864408 3254512 3479058 3485545
34736 3485545 3321864 3117493 3014633 3103503 3364980 3650093 3756347 3569809 3136229 2585817
34726 2585817 2002227 1376399 673247 -77506 -759180 -1231321 -1419268 -1350795 -1114366 -792641
34716 -792641 -438457 -95162 189257 384053 514778 678422 999250 1531762 2193890 2829695
34706 2829695 3369967 3912408 4612971 5518775 6547999 7607789 8648085 9567080 10133136
34697 10133136 10092936 9387340 8241561 7029667 6047540 5392489 5012164 4828592 4815130
$$ packed form
34765E309380j125088r46906p76223o30333m93135l55028j88195K6405K22673
34756A043550K87092K13667J34609J32825J05308r0584m06433o26465o03209l73230
34746a82870n1912K74147N31428O48266O23716N44394M77239L90104K24546O487
34736C485545j63681k04371j02860Q8870K61477K85113J06254j86538m33580n50412
34726B585817n83590o25828p03152p50753o81674m72141j87947O8473K36429L21725
34716g92641L54184L43295K84419J94796J30725J63644L20828N32512O62128O35805
34706B829695N40272N42441P00563R05804J029224J059790J040296R18995N66056
34697A0133136m0200p05596j145779j211894r82127o55051l80325j83572j3462
$$ plain form
34688 4815130 4989734 5365706 5902570 6478590 6920137 7109682 7093013 7040170 7049019 7001125
34678 7001125 6669259 5986853 5181205 4621378 4541760 4896822 5429891 5850608 5981154 5801609
34668 5801609 5407847 4947778 4589038 4501187 4801850 5478907 6371647 7258040 7987198 8544492
34658 8544492 8992722 9342449 9480968 9251455 8617365 7728447 6801039 5951289 5175158
34649 5175158 4469168 3913931 3625758 3657708 3947134 4314083 4502941 4292065 3629964 2672323
34639 2672323 1672461 840416 292133 64556 113889 311827 513776 680861 933207 1452553
34629 1452553 2299983 3315400 4210692 4784596 5053029 5181441 5334143 5612539 6068429
34620 6068429 6666840 7225656 7486484 7297912 6690749 5771121 4630582 3398639 2270281
$$ packed form
34688D815130J74604L75972N36864N76020M41547J89545j6669n2843Q849m7894
34678G001125l31866o82406q05648n59827p9618L55062N33069M20717J30546j79545
34668E801609l93762m60069l58740q7851L00663O77057Q92740Q86393P29158N57294
34658H544492M48230L49727J38519k29513o34090q88918r27408q49750p76131
34649E175158p05990n55237k88173L1950K89426L66949J88858k10876o62101r57641
34639B672323r99862q32045n48283k27577M9333J97938K01949J67085K52346N19346
34629A452553Q47430J015417Q95292N73904K68433J28412J52702K78396M55890
34620F068429N98411N58816K60828j88572o07163r19628j140539j231943j128358
$$ plain form
34611 2270281 1368491 627016 -86007 -748362 -1176604 -1223067 -897194 -312588 382414 1020406
34601 1020406 1470102 1708728 1765139 1590303 1101188 391750 -223210 -466875 -336952 -23381
34591 -23381 319622 630645 866111 1022465 1216870 1607641 2191194 2743434 2978531 2727701
34581 2727701 2008171 1027018 115234 -468439 -730754 -882288 -1058177 -1170744 -1053537
34572 -1053537 -642805 40670 977426 2099024 3206336 4064009 4587180 4870007 5049337
34563 5049337 5220804 5470609 5867830 6362734 6751202 6810084 6478619 5912120 5389375 5165340
34553 5165340 5349950 5867354 6518853 7094882 7443822 7483790 7214327 6729031 6168497 5628137
34543 5628137 5127562 4678567 4353133 4264146 4496053 5062321 5901258 6889098 7871604 8708419
$$ packed form
34611B270281r01790p41475p13023o62355m28242m6463L25873N84606O95002O37992
34601A020406M49696K38626N6411j74836m89115p09438o14960k43665J29923L13571
34591b3381L43003L11023K35466J56354J94405L90771N83553N52240K35097k50830
34581B727701p19530r81153r11784n83673k62315j51534j75889j12567J17207
34572a053537M10732O83475R36756J121598J107312Q57673N23171K82827J79330
34563E049337J71467K49805L97221M94904L88468N8882l31465n66499n22745k24035
34553E165340J84610N17404O51499N76029L48940L9968k69463m85296n60534n40360
34543E628137n00575m48995l25434q8987K31907N66268Q38937R87840R82506Q36815
$$ plain form
34533 8708419 9302155 9611226 9666920 9568459 9414413 9225635 8971199 8678292 8465522 8432493
34523 8432493 8543619 8645965 8576922 8247482 7687483 7072293 6665349 6637078 6901309 7161231
34513 7161231 7144503 6800527 6293602 5840956 5555476 5402805 5273037 5078927 4785412 4376577
34503 4376577 3860524 3345471 3069225 3272601 3996116 4991140 5833756 6164352 5899577
34494 5899577 5264737 4585446 3992512 3337658 2419800 1251117 59525 -904836 -1471617
34485 -1471617 -1511599 -962016 42839 1160164 2044042 2540754 2662694 2444001 1887069
34476 1887069 1008463 -125461 -1383905 -2548344 -3347424 -3593060 -3293092 -2616433 -1793450
34467 -1793450 -1081476 -723970 -788032 -1033245 -1073015 -733290 -187576 290068 601029 782187
$$ packed form
34533H708419N93736L09071N5694r8461j54046j88778k54436k92907k12770l3029
34523H432493J11126J02346o9043l29440n59999o15190m06944k8271K64231K59922
34513G161231j6728l43976n06925m52646k85480j52671j29768j94110k93515m08835
34503D376577n16053n15053k76246K03376P23515R95024Q42616L30596k64775
34494E899577o34840o79291n92934o54854r17858j168683j191592r64361n66781
34485a471617l9982N49583J004855J117325Q83878M96712J21940k18693n56932
34476A887069q78606j133924j258444j164439p99080k45636K99968O76659Q22983
34467a793450P11974L57506o4062k45213l9770L39725N45714M77644L10961J81158
$$ plain form
34457 782187 811064 627891 348856 289390 675226 1395050 2116014 2602229 2852482 2970128
34447 2970128 3000089 2896966 2563563 1898298 897991 -223376 -1091165 -1454175 -1422531
34438 -1422531 -1368211 -1585229 -2082407 -2677869 -3198417 -3549056 -3667311 -3508562 -3094002 -2532943
34428 -2532943 -1971969 -1519903 -1214320 -1042914 -982640 -1009605 -1072438 -1075553 -914046 -536179
34418 -536179 23986 660170 1230045 1598282 1673844 1417654 833754 955 -870342 -1483228
34408 -1483228 -1644043 -1407660 -982304 -505342 16906 554450 938853 959754 543686 -174300
34398 -174300 -905465 -1333902 -1287447 -850141 -265313 301008 838465 1316368 1553897 1378946
34388 1378946 854392 231936 -277069 -560479 -466763 216134 1562600 3369359 5263472
$$ packed form
34457G82187K8877j83173k79035n9466L85836P19824P20964M86215K50253J17646
34447B970128K9961j03123l33403o65265j000307j121367q67789l63010L1644
34438a422531N4320k17018m97178n95462n20548l50639j18255J58749M14560N61059
34428b532943N60974M52066L05583J71406O0274k6965o2833l115J61507L77867
34418e36179N60165O36184N69875L68237P5562k56190n83900q32799q71297o12886
34408a483228j60815K36383M25356M76962N22248N37544L84403K0901m16068p17986
34398a74300p31165m28437M6455M37306N84828N66321N37457M77903K37529j74951
34388A378946n24554o22456n09005k83410R3716O82897J346466J806759J894113
$$ plain form
34379 5263472 6885140 7947122 8254090 7813915 6921923 6026962 5455321 5262319 5320236
34370 5320236 5490629 5700459 5900103 5996499 5849882 5355846 4553130 3650465 2916377 2503904
34360 2503904 2361750 2318652 2266344 2262673 2453427 2911117 3581519 4378473 5265876 6205449
34350 6205449 7073621 7708625 8044083 8144862 8103353 7942644 7629140 7139629 6505576 5827118
34340 5827118 5248733 4878563 4717463 4697162 4779903 4962880 5182886 5297714 5198164 4868695
34330 4868695 4296306 3411397 2215599 909254 -237025 -1139338 -1925846 -2696118 -3371766
34321 -3371766 -3837422 -4120766 -4323758 -4421878 -4242339 -3645118 -2646855 -1363172 74860
34312 74860 1498152 2675230 3420545 3744366 3839715 3890029 3909749 3792394 3496897 3152451
$$ packed form
34379E263472J621668J061982L06968m40175q91992q94961n71641j93002N7917
34370E320236J70393K09830J99644R6396j46617m94036q02716r02665p34088m12473
34360B503904j42154m3098n2308l671J90754M57690O70402P96954Q87403R39573
34350F205449Q68172O35004L35458J00779m1509j60709l13504m89511o34053o78458
34340E827118n78385l70170j61100k0301Q2741J82977K20006J14828r9550l29469
34330D868695n72389q84909j195798j306345j146279r02313p86508p70272o75648
34321c371766m65656k83344k02992r8120J79539N97221R98263J283683J438032
34312G4860J423292J177078P45315L23821R5349N0314J9720j17355k95497l44446
$$ plain form
34302 3152451 2961024 3003666 3171575 3313975 3438766 3714492 4249399 4911605 5417662 5579976
34292 5579976 5418336 5051278 4566554 4032682 3567899 3315051 3331461 3512880 3617311 3381791
34282 3381791 2689383 1673048 621149 -271133 -1043264 -1834519 -2647944 -3311855 -3662995
34273 -3662995 -3702078 -3555070 -3325927 -3001690 -2470465 -1627976 -504011 701897 1735469
34264 1735469 2452204 2867222 3074985 3167199 3213342 3246834 3234873 3099453 2802756 2398472
34254 2398472 1985239 1627295 1332036 1088233 911807 851585 935776 1104897 1235995 1282793
34244 1282793 1380053 1755575 2521475 3561090 4591140 5303049 5501473 5203880 4607856
34235 4607856 3892604 3068925 2110359 1193807 634375 511643 498205 179488 -525344 -1348419
$$ packed form
34302C152451j91427M2642J67909J42400J24791K75726N34907O62206N06057J62314
34292E579976j61640l67058m84724n33872m64783k52848J6410J81419J04431k35520
34282C381791o92408j016335j051899q92282p72131p91255q13425o63911l51140
34273c662995l9083J47008K29143L24237N31225Q42489J123965J205908J033572
34264A735469P16735M15018K07763R2214M6143L3492j1961j35420k96697m04284
34254B398472m13233l57944k95259k43803j76426o0222Q4191J69121J31098M6798
34244A282793R7260L75522P65900J039615J030050P11909J98424k97593n96024
34235D607856p15252q23679r58566r16552n59432j22732j3438l18717p04832q23075
$$ plain form
34225 -1348419 -1987227 -2304767 -2286131 -1986824 -1573459 -1289617 -1277017 -1435614 -1483190 -1152605
34215 -1152605 -367226 712583 1802612 2684241 3284831 3575746 3474675 2943112 2143216
34206 2143216 1363250 735695 103046 -781483 -1960129 -3217520 -4287784 -5068569 -5634314
34197 -5634314 -6072942 -6347859 -6361494 -6158310 -5990558 -6094633 -6400450 -6520112 -6038935 -4808217
34187 -4808217 -3022101 -1121672 382242 1144837 1180585 836289 548785 620208 1157111
34178 1157111 2080335 3130822 3977280 4455235 4703007 4998723 5472381 6021647 6470212
34169 6470212 6725650 6796895 6763885 6775838 7001388 7485363 8044495 8353806 8174599 7513650
34159 7513650 6579464 5611909 4762942 4105214 3687242 3534222 3607738 3800123 3971741 3981892
$$ packed form
34225a348419o38808l17540J8636K99307M13365K83842J2600j58597m7576L30585
34215a152605P85379J079809J090029Q81629O00590K90915j01071n31563p99896
34206B143216p79966o27555o32649q84529j178646j257391j070264p80785n65745
34197e634314m38628k74917j3635K03184J67752j04075l05817j19662M81177J230718
34187d808217J786116J900429J503914P62595L5748l44296k87504P1423N36903
34178A157111R23224J050487Q46458M77955K47772K95716M73658N49266M48565
34169F470212K55438P1245l3010J1953K25550M83975N59132L09311j79207o60949
34159G513650r34186r67555q48967o57728m17972j53020P3516J92385J71618J0151
$$ plain form
34149 3981892 3713707 3128006 2304047 1381922 439907 -549602 -1640513 -2829557 -4056823
34140 -4056823 -5225195 -6174661 -6682321 -6561696 -5786355 -4517341 -3033888 -1639785 -569424
34131 -569424 92249 408449 491636 422114 271015 137115 90381 110923 164080 324128
34121 324128 733737 1424124 2259866 3100929 3942452 4827194 5673556 6282813 6519736 6430669
34111 6430669 6183793 5948784 5844256 5937006 6231867 6660239 7097942 7399011 7430305 7126027
34101 7126027 6547623 5864238 5214730 4570357 3768364 2712269 1530724 516970 -95327
34092 -95327 -304520 -319218 -385665 -615466 -940543 -1218380 -1392162 -1557465 -1867470 -2369029
34082 -2369029 -2936275 -3370455 -3569847 -3606392 -3629926 -3685219 -3633395 -3286996 -2628403 -1852163
$$ packed form
34149C981892k68185n85701q23959r22125r42015r89509j090911j189044j227266
34140d056823j168372r49466n07660J20625P75341J269014J483453J394103J070361
34131e69424O61673L16200Q3187o9522j51099j33900m6734K0542N3157J60048
34121C24128M09609O90387Q35742Q41063Q41523Q84742Q46362O09257K36923q9067
34111F430669k46876k35009j04528R2750K94861M28372M37703L01069L1294l04278
34101G126027n78404o83385o49508o44373q01993j056095j181545j013754o12297
34092i5327k09193j4698o6447k29801l25077k77837j73782j65303l10005n01559
34082b369029n67246m34180j99392l6545k3534n5293N1824L46399O58593P76240
$$ plain form
34072 -1852163 -1168167 -614109 -116041 312444 532577 456540 182822 -80327 -174396 -53098
34062 -53098 235799 567029 788303 836599 794287 774960 771682 681795 472454 246265 121686
34051 121686 103144 96558 11230 -183909 -475017 -843541 -1304159 -1908823 -2680314 -3525201
34041 -3525201 -4250985 -4704572 -4872330 -4819357 -4576384 -4159397 -3690388 -3395795 -3403253 -3558288
34031 -3558288 -3509646 -2998673 -2041880 -840657 415034 1605132 2603957 3263878 3519069
34022 3519069 3451617 3206705 2870325 2467830 2048861 1713551 1557944 1632672 1935303 2377595
34012 2377595 2762348 2883139 2707975 2425311 2251451 2205326 2110482 1800112 1279021 708017
34002 708017 300159 244549 652850 1491463 2541413 3457616 3925111 3826053 3307466 2682598
$$ packed form
34072a852163O83996N54058M98068M28485K20133p6037k73718k63149r4069J21298
34062e3098K88897L31230K21274M8296m2312j9327l278q9887k09341k26189j24579
34051A21686j8542o586q5328j95139k91108l68524m60618o04664p71491q44887
34041c525201p25784m53587j67758N2973K42973M16987M69009K94593p458j55035
34031c558288M8642N10973R56793J201223J255691J190098R98825O59921K55191
34022C519069o7452k44912l36380m02495m18969l35310j55607P4728L02631M42292
34012B377595L84753J20791j75164k82664j73860m6125r4844l10370n21091n71004
34002G08017m07858n5610M08301Q38613J049950R16203M67495r9058n18587o24868
$$ plain form
33992 2682598 2210728 1923672 1653911 1227059 617446 -61473 -659443 -1058315 -1197445
33983 -1197445 -1100617 -871725 -607562 -296686 165622 843700 1643723 2313149 2552811 2198483
33973 2198483 1387007 542647 103374 203267 644462 1157801 1592303 1846786 1797559 1450195
33963 1450195 1080088 1035311 1380935 1858368 2201796 2365068 2421467 2409728 2381391 2481378
33953 2481378 2836418 3391611 3949673 4354501 4583273 4714519 4888998 5249463 5799940
33944 5799940 6328625 6575380 6502434 6332311 6304898 6456814 6636568 6649106 6360335 5751815
33934 5751815 4952315 4190799 3658861 3397193 3302936 3225213 3069859 2861553 2710162 2676951
33924 2676951 2679696 2586023 2401412 2294631 2415231 2745257 3144178 3455209 3527035 3229290
$$ packed form
33992B682598m71870k87056k69761m26852o09613o78919n97970l98872j39130
33983a197445R6828K28892K64163L10876M62308O78078Q00023O69426K39662l54328
33973B198483q11476q44360m39273R9893M41195N13339M34502K54483m9227l47364
33963A450195l70107m4777L45624M77433L43428J63272N6399j1739k8337R9987
33953B481378L55040N55193N58062M04828K28772J31246J74479L60465N50477
33944E799940N28685K46755p2946j70123k7413J51916J79754J2538k88771o08520
33934E751815p99500p61516n31938k61668r4257p7723j55354k08306j51391l3211
33924B676951K745r3673j84611j06781J20600L30026L98921L11031P1826k97745
$$ plain form
33914 3229290 2552751 1670845 833896 221317 -68489 26157 442797 868430 852121 150311
33904 150311 -1059589 -2342374 -3352415 -4010058 -4410624 -4651604 -4768127 -4793685 -4829424
33895 -4829424 -5006116 -5349989 -5705584 -5838513 -5624521 -5106005 -4368361 -3431159 -2308220
33886 -2308220 -1131971 -150295 406727 438585 -6628 -752413 -1528676 -2059563 -2178804
33877 -2178804 -1871471 -1219965 -349635 576328 1383076 1965474 2323950 2485653 2424304 2113663
33867 2113663 1640295 1194373 939146 938685 1210636 1767692 2559542 3425545 4166798 4657564
33857 4657564 4870419 4842960 4675091 4522994 4510233 4620763 4715963 4667616 4451600 4125467
33847 4125467 3766405 3444390 3213972 3101578 3108019 3223465 3418400 3617542 3706500 3576640
$$ packed form
33914C229290o76539q81906q36949o12579k89806R4646M16640M25633j6309p01810
33904A50311j209900j282785j010041o57643m00566k40980j16523k5558l5739
33895d829424j76692l43873l55595j32929K13992N18516P37644R37202J122939
33886b308220J176249R81676N57022L1858m45213p45785p76263n30887j19241
33877b178804L07333O51506Q70330R25963Q06748N82398L58476J61703o1349l10641
33867B113663m73368m45922k55227m61K71951N57056P91850Q66003P41253M90766
33857D657564K12855k7459j67869j52097j2761J10530R5200m8347k16016l26133
33847D125467l59062l22015k30418j12394O441J15446J94935J99142Q8958j29860
$$ plain form
33837 3576640 3168280 2502898 1709224 995791 538519 375858 428930 601505 817780 993348
33827 993348 1058030 1028832 997781 1026325 1107175 1237636 1444585 1700166 1904832 2028455
33817 2028455 2197043 2539941 2983330 3286611 3268876 2920697 2317695 1543382 734211 106640
33807 106640 -146082 19438 486513 1064071 1575084 1918981 2106610 2236651 2414473 2679850
33797 2679850 2989745 3236871 3289451 3066731 2615189 2095010 1657166 1320863 972944 491941
33787 491941 -111429 -663240 -955275 -941923 -812330 -839407 -1145733 -1618563 -2020748 -2140991
33777 -2140991 -1867789 -1220858 -364923 466076 1139593 1723364 2373573 3122868 3811773
33768 3811773 4233104 4312434 4135562 3834298 3490806 3158519 2923272 2866416 2938158 2926568
$$ packed form
33837C576640m08360o65382p93674p13433m57272j62661N3072J72575K16275J75568
33827I93348O4682k9198l1051K8544Q0850J30461K06949K55581K04666J23623
33817B028455J68588L42898M43389L03281j7735l48179o03002p74313q09171o27571
33807A06640k52722J65520M67075N77558N11013L43897J87629J30041J77822K65377
33797B679850L09895K47126N2580k22720m51542n20179m37844l36303l47919m81003
33787D91941o03370n51811k92035J3352J29593k7077l06326m72830m02185j20243
33777b140991K73202O46931Q55935Q30999O73517N83771O50209P49295O88905
33768C811773M21331P9330j76872l01264l43492l32287k35247n6856P1742j1590
$$ plain form
33758 2926568 2642285 2151768 1760143 1710846 1932447 2129858 2099729 1888389 1640336 1381805
33748 1381805 1023807 536588 18892 -439088 -890511 -1457116 -2144134 -2808960 -3327353
33739 -3327353 -3718652 -4064346 -4362617 -4533177 -4533271 -4386926 -4106085 -3675003 -3148068 -2687545
33729 -2687545 -2433491 -2365112 -2354808 -2353925 -2465698 -2809455 -3342851 -3849664 -4102039 -4020118
33719 -4020118 -3672523 -3146451 -2459844 -1626260 -781153 -181351 -27704 -272753 -613721
33710 -613721 -701691 -398555 139794 631152 922955 1072607 1184382 1234320 1121108 856657
33700 856657 608760 528600 607457 748125 923188 1199624 1625186 2139443 2598873 2870653
33690 2870653 2912967 2776595 2512162 2078237 1389133 476585 -446566 -1132495 -1489603 -1610938
$$ packed form
33758B926568k84283m90517l91625m9297K21601J97411l0129k11340k48053k58531
33748A381805l57998m87219n17696m57980m51423n66605o87018o64826n18393
33739c327353l91299l45694k98271j70560r4J46345K80841M31082N26935M60523
33729b687545K54054O8379J0304Q83j11773l43757n33396n06813k52375Q1921
33719d020118L47595N26072O86607Q33584Q45107N99802J53647k45049l40968
33710f13721q7970L03136N38349M91358K91803J49652J11775M9938j13212k64451
33700H56657k47897q0160P8857J40668J75063K76436M25562N14257M59430K71780
33690B870653M2314j36372k64433m33925o89104r12548r23151o85929l57108j21335
$$ plain form
33680 -1610938 -1663639 -1789067 -2045511 -2355838 -2521772 -2363233 -1854022 -1092484 -188910 732122
33670 732122 1454098 1736695 1524199 1017626 495696 116994 -87032 -131790 -83415 -85245
33660 -85245 -272326 -648741 -1094469 -1473398 -1680419 -1610298 -1173264 -377466 642836 1701796
33650 1701796 2646341 3384631 3897301 4250073 4552139 4857217 5110976 5210668 5101857 4806860
33640 4806860 4386056 3899560 3394917 2908645 2485879 2211668 2198558 2501052 3039511 3643952
33630 3643952 4187492 4653269 5064952 5396257 5584049 5594129 5415523 5009942 4354322 3561122
33620 3561122 2871230 2443850 2185542 1873462 1448599 1108294 1085269 1403557 1890556 2362300
33610 2362300 2723662 2923068 2909257 2671994 2285686 1875362 1537803 1289773 1066847 759936
$$ packed form
33680a610938n2701j25428k56444l10327j65934J58539N09211P61538R03574R21032
33670G32122P21976K82597k12496n06573n21930l78702k04026m4758M8375j830
33660h5245j87081l76415m45728l78929k07021P0121M37034P95798J020302J058960
33650A701796R44545P38290N12670L52772L02066L05078K53759R9692j08811k94997
33640D806860m20804m86496n04643m86272m22766k74211j3110L02494N38459O04441
33630C643952N43540M65777M11683L31305J87792J0080j78606m05581o55620p93200
33620C561122o89892m27380k58308l12080m24863l40305k3025L18288M86999M71744
33610B362300L61362J99406j3811k37263l86308m10324l37559k48030k22926l06911
$$ plain form
33600 759936 270539 -439396 -1319634 -2228985 -2979339 -3451053 -3708682 -3955003 -4291932 -4531969
33590 -4531969 -4326100 -3512981 -2298571 -1074789 -121860 482939 763015 780140 671238
33581 671238 621926 712895 813771 687497 218419 -462703 -1059173 -1299310 -1081682 -493422
33571 -493422 272643 1015876 1579306 1874531 1925908 1898919 2018906 2389817 2881613 3227239
33561 3227239 3247261 2976236 2577603 2154856 1651942 935627 -15397 -999841 -1700074 -1930101
33551 -1930101 -1767964 -1428065 -1053688 -707602 -528275 -738104 -1392250 -2179763 -2592541
33542 -2592541 -2319126 -1441015 -276350 883218 1878380 2632702 3086154 3176469 2863160
33533 2863160 2182330 1284287 385167 -343384 -830047 -1063790 -1050775 -831881 -497131 -142409
$$ packed form
33600G59936m89397p09935q80238r09351p50354m71714k57629k46321l36929k40037
33590d531969K05869Q13119J214410J223782R52929O04799K80076J7125j08902
33581F71238m9312R0969J00876j26274m69078o81122n96470k40137K17628N88260
33571d93422P66065P43233N63430K95225N1377k6989J19987L70911M91796L45626
33561C227239K0022k71025l98633m22747n02914p16315r51024r84444p00233k30027
33551a930101J62137L39899L74377L46086J79327k09829o54146p87513m12778
33542b592541K73415Q78111J164665J159568R95162P54322M53452R0315l13309
33533B863160o80830q98043q99120p28551m86663k33743J3015K18894L34750L54722
$$ plain form
33523 -142409 169829 392176 479587 435000 334587 262581 243873 275962 382635 567590
33513 567590 744844 807455 772664 775444 892595 1048756 1134733 1144118 1129860 1086493 967158
33502 967158 798385 686408 683040 695566 555696 155297 -481553 -1209042 -1818632 -2134592
33492 -2134592 -2110663 -1847701 -1501661 -1161088 -800531 -336346 274450 978477 1665539 2266040
33482 2266040 2788530 3234572 3501289 3438228 3031736 2490721 2108546 2057684 2335884 2854662
33472 2854662 3505001 4159140 4710317 5153556 5562200 5926190 6057972 5742994 4996217
33463 4996217 4116852 3459957 3170522 3143631 3201481 3269742 3396522 3651654 4040327 4501140
33453 4501140 4952057 5326376 5598802 5822122 6132096 6652107 7343953 7975153 8286260
$$ packed form
33523a42409L12238K22347Q7411m4587j00413p2006j8708L2089J06673J84955
33513E67590J77254O2611l4791K780J17151J56161Q5977R385j4258m3367j19335
33502I67158j68773j11977l368J2526j39870m00399o36850p27489o09590l15960
33492b134592K3929K62962L46040L40573L60557M64185O10796P04027O87062O00501
33482B266040N22490M46042K66717o3061m06492n41015l82175n0862K78200N18778
33472B854662O50339O54139N51177M43239M08644L63990J31782l14978p46777
33463D996217q79365o56895k89435k6891N7850O8261J26780K55132L88673M60813
33453D501140M50917L74319K72426K23320L09974N20011O91846O31200L11107
$$ plain form
33444 8286260 8201269 7850722 7395022 6864375 6181281 5303137 4316470 3405438 2742247 2393656
33434 2393656 2316996 2444660 2763520 3299633 4046345 4947429 5942252 6970319 7915622
33425 7915622 8604010 8897369 8762282 8227981 7335944 6185639 4984746 3970611 3271457
33416 3271457 2875660 2709461 2688671 2721204 2749743 2817630 3035012 3449597 3982159 4497629
33406 4497629 4900695 5157922 5279063 5299072 5241299 5082821 4790717 4401664 4029838 3793649
$$ packed form
33444H286260q4991l50547m55700n30647o83094q78144r86667r11032o63191l48591
33434B393656p6660J27664L18860N36113P46712R01084R94823J028067R45303
33425G915622O88388K93359j35087n34301q92037j150305j200893j014135o99154
33416C271457l95797j66199k0790L2533K8539O7887K17382M14585N32562N15470
33406D497629M03066K57227J21141K0009n7773j58478k92104l89053l71826k36189
$$ [...]
##END NTUPLES=NMR SPECTRUM
##END=
