##TITLE=31Pdec_IPACAT-33-2
  CDCl3
  64 sc
 4.10.2023
##JCAMPDX= 6.0         $$ Bruker NMR JCAMP-DX V2.0
##DATA TYPE= NMR SPECTRUM
##DATA CLASS= NTUPLES
##ORIGIN= UXNMR, Bruker Analytische Messtechnik GmbH
##OWNER= root
$$ XWIN-NMR		Version 3.5
$$ Wed Oct  4 13:57:19 2023 Russian Standard Time (UT+4h)  she@DPX200
##.OBSERVE FREQUENCY= 81.013821
##.OBSERVE NUCLEUS= ^31P
##.ACQUISITION MODE= SIMULTANEOUS
##.ACQUISITION SCHEME= undefined
##.AVERAGES= 64
##.DIGITISER RES= 16
##SPECTROMETER/DATA SYSTEM= spect
##.PULSE SEQUENCE= zgpg30
##.SOLVENT NAME= CDCl3
##.SHIFT REFERENCE= (INTERNAL, CDCl3, 0, 248.564)
##AUDIT TRAIL= $$ (NUMBER, WHEN, WHO, WHERE, WHAT)
$$ ##TITLE= Audit trail, XWIN-NMR		Version 3.5
$$ ##JCAMPDX= 5.01
$$ ##ORIGIN= Bruker BioSpin GmbH
$$ ##OWNER= she
$$ F:/spectra/data/she/nmr/P31/1/pdata/1/auditp.txt
$$ ##AUDIT TRAIL=  $$ (NUMBER, WHEN, WHO, WHERE, WHAT)
(   1,<2023-10-04 13:51:07.35 +0400>,<she>,<DPX200>,
      <continue with go, POWCHK disabled, PULCHK disabled
       configuration hash MD5:
       00 E9 B6 7A A2 85 ED C7 34 08 36 98 17 FE 4E 26
       data hash MD5: 32K
       31 67 89 E1 7C 59 58 47 FD 4E 6E 57 9B 30 C8 40>)
(   2,<2023-10-04 13:55:09.54 +0400>,<she>,<DPX200>,
      <Start of raw data processing
       efp BC_mod = 2 LB = 5 FT_mod = 6 PKNL = 1 PHC0 = -10792.84 PHC1 = 432.4862 SI = 64K 
       data hash MD5: 64K
       48 DC 4A E4 05 0B 69 3F 09 2F 7A 23 05 40 49 A5>)
(   3,<2023-10-04 13:55:31.20 +0400>,<she>,<DPX200>,
      <pk PHC0 = 147.3529 PHC1 = -339.4001 
       data hash MD5: 64K
       55 42 79 89 6A 4D 8A 82 85 CC 38 7F FE 8E 2E 77>)
$$ ##END=
$$ 
$$ hash MD5
$$ 64 3F C4 85 92 19 91 B3 3C 7A DE F8 B7 D1 60 34
##$RELAX= 
##$RELAX= 
##$RELAX= 
##$RELAX= 
##$RELAX= 
##$RELAX= 
##$RELAX= 
##$RELAX= 
##$RELAX= 
$$ Bruker specific parameters
$$ --------------------------
##$DU= <F:/spectra>
##$EXPNO= 1
##$NAME= <P31>
##$PROCNO= 1
##$TYPE= <nmr>
##$USER= <she>
##$AMP= (0..31)
100 100 100 100 100 100 100 100 100 100 100 100 100 100 100 100 100 100 
100 100 100 100 100 100 100 100 100 100 100 100 100 100 
##$AQSEQ= 0
##$AQ_mod= 1
##$AUNM= <au_zg>
##$AUTOPOS= <>
##$BF1= 81.014009
##$BF2= 200.13
##$BF3= 200.13
##$BF4= 200.13
##$BF5= 200.13
##$BF6= 200.13
##$BF7= 200.13
##$BF8= 200.13
##$BYTORDA= 1
##$CFDGTYP= 0
##$CFRGTYP= 5
##$CHEMSTR= <none>
##$CNST= (0..31)
1 1 145 1 1 1 1 1 1 1 1 1 1 1 1 1 1 1 1 1 1 1 1 1 1 1 1 1 1 1 1 1 
##$CPDPRG= <waltz16>
##$CPDPRG1= <>
##$CPDPRG2= <waltz16>
##$CPDPRG3= <>
##$CPDPRG4= <mlev>
##$CPDPRG5= <mlev>
##$CPDPRG6= <mlev>
##$CPDPRG7= <mlev>
##$CPDPRG8= <mlev>
##$CPDPRGB= <>
##$CPDPRGT= <>
##$D= (0..31)
0 1 0 0 0 0 0 0 0 0 0 0.03 2e-05 3e-06 0 0 0 0 0 0 0 0 0 0 0 0 0 0 0 0 
0 0 
##$DATE= 1696412959
##$DBL= (0..7)
120 120 120 11 120 120 24 19 
##$DBP= (0..7)
150 150 150 150 150 150 150 150 
##$DBP07= 0
##$DBPNAM0= <>
##$DBPNAM1= <>
##$DBPNAM2= <>
##$DBPNAM3= <>
##$DBPNAM4= <>
##$DBPNAM5= <>
##$DBPNAM6= <>
##$DBPNAM7= <>
##$DBPOAL= (0..7)
0.5 0.5 0.5 0.5 0.5 0.5 0.5 0.5 
$$ [...]
##$SUBNAM2= <"">
##$SUBNAM3= <"">
##$SUBNAM4= <"">
##$SUBNAM5= <"">
##$SUBNAM6= <"">
##$SUBNAM7= <"">
##$SUBNAM8= <"">
##$SUBNAM9= <"">
##$SW= 501.771253377433
##$SWIBOX= (0..15)
0 1 3 0 0 0 0 0 0 0 0 0 0 0 0 0 
##$SW_h= 40650.406504065
##$TD= 32768
##$TD0= 1
##$TE= 0
##$TE2= 300
##$TE3= 300
##$TEG= 300
##$TL= (0..7)
0 120 53 12 22 120 120 120 
##$TP= (0..7)
150 150 150 150 150 150 150 150 
##$TP07= 0
##$TPNAME0= <>
##$TPNAME1= <>
##$TPNAME2= <>
##$TPNAME3= <>
##$TPNAME4= <>
##$TPNAME5= <>
##$TPNAME6= <>
##$TPNAME7= <>
##$TPOAL= (0..7)
0.5 0.5 0.5 0.5 0.5 0.5 0.5 0.5 
##$TPOFFS= (0..7)
0 0 0 0 0 0 0 0 
##$TUNHIN= 0
##$TUNHOUT= 0
##$TUNXOUT= 0
##$USERA1= <user>
##$USERA2= <user>
##$USERA3= <user>
##$USERA4= <user>
##$USERA5= <user>
##$V9= 5
##$VALIST= <valist>
##$VCLIST= <CCCCCCCCCCCCCCC>
##$VD= 0
##$VDLIST= <DDDDDDDDDDDDDDD>
##$VPLIST= <PPPPPPPPPPPPPPP>
##$VTLIST= <TTTTTTTTTTTTTTT>
##$WBST= 1024
##$WBSW= 4
##$XGAIN= (0..3)
0 0 0 0 
##$XL= 0
##$YL= 0
##$YMAX_a= 6334
##$YMIN_a= -1797
##$ZGOPTNS= <>
##$ZL1= 120
##$ZL2= 120
##$ZL3= 120
##$ZL4= 120
##$ABSF1= 0
##$ABSF2= 0
##$ABSG= 0
##$ABSL= 0
##$ALPHA= 0
##$AQORDER= 0
##$ASSFAC= 0
##$ASSFACI= 0
##$ASSFACX= 0
##$ASSWID= 0
##$AUNMP= <proc_1d>
##$AZFE= 0.1
##$AZFW= 0.5
##$BCFW= 0
##$BC_mod= 2
##$BYTORDP= 0
##$COROFFS= 0
##$CY= -3
##$DATMOD= 1
##$DC= 0
##$DFILT= <>
##$DTYPP= 0
##$F1P= 0
##$F2P= 0
##$FCOR= 1
##$FTSIZE= 65536
##$FT_mod= 6
##$GAMMA= 0
##$GB= 0
##$INTBC= 1
##$INTSCL= 6.047779e-11
##$ISEN= 30
##$LB= 5
##$LEV0= 0
##$LPBIN= 0
##$MAXI= 10000
##$MC2= 0
##$MEAN= 0
##$ME_mod= 0
##$MI= 50
##$NCOEF= 0
##$NC_proc= -10
##$NLEV= 6
##$NOISF1= 182.463
##$NOISF2= 159.3651
##$NSP= 0
##$NTH_PI= 0
##$NZP= 0
##$OFFSET= 248.5645
##$PC= 4
##$PHC0= -10645.49
##$PHC1= 93.08612
##$PH_mod= 1
##$PKNL= yes
##$PPARMOD= 0
##$PSCAL= 0
##$PSIGN= 0
##$REVERSE= no
##$SF= 81.0140089999694
##$SI= 65536
##$SIGF1= 159.3651
##$SIGF2= -187.1042
##$SINO= 113.3802
##$SIOLD= 16384
##$SREGLST= <1H.CDCl3>
##$SSB= 0
##$STSI= 65536
##$STSR= 0
##$SW_p= 40650.406504065
##$SYMM= 0
##$S_DEV= 0
##$TDeff= 32768
##$TDoff= 0
##$TI= <>
##$TILT= no
##$TM1= 0
##$TM2= 0
##$TOPLEV= 0
##$USERP1= <user>
##$USERP2= <user>
##$USERP3= <user>
##$USERP4= <user>
##$USERP5= <user>
##$WDW= 1
##$XDIM= 65536
##$YMAX_p= 305682637
##$YMIN_p= -337698773
$$ End of Bruker specific parameters
$$ ---------------------------------
##NTUPLES= NMR SPECTRUM
##VAR_NAME=  FREQUENCY,     SPECTRUM/REAL,   SPECTRUM/IMAG
##SYMBOL=    X,             R,               I
##VAR_TYPE=  INDEPENDENT,   DEPENDENT,       DEPENDENT
##VAR_FORM=  AFFN,          ASDF,            ASDF
##VAR_DIM=   65536,         65536,           65536
##UNITS=     HZ,            ARBITRARY UNITS, ARBITRARY UNITS
##FACTOR=    0.620285442955139, 1,           1
##FIRST=     20137.2065510682, 0,            0
##LAST=      -20513.1999529968, 0,           0
##MIN=       -20513.1999529968, -337698773,  0
##MAX=       20137.2065510682, 305682637,    0
$$ Real data points
##PAGE= N=1
##DATA TABLE= (X++(R..R)), XYDATA
$$ [...]
40686 -330346 -2544929 -5509593 -9012456 -12376957 -14906901 -16175172 -16155642 -15266857 -14222209
40677 -14222209 -13637939 -13631234 -13800742 -13760100 -13820639 -15024423 -18226492 -23066782 -28021292
40668 -28021292 -31538692 -32974513 -32437699 -30185700 -26606586 -22617983 -19482962 -17905347
40660 -17905347 -17445663 -16978119 -15612666 -13111357 -9684036 -5730159 -1767184 1724133
40652 1724133 4604276 7126760 9510189 11462344 12249297 11290443 8693431 5289074
40644 5289074 2229019 427423 87366 573420 819560 49263 -1755103 -3931396 -5550034
40635 -5550034 -5897742 -4985820 -3835607 -4029220 -6596108 -11254656 -16803803 -22102871 -26520837
40626 -26520837 -29733612 -31581272 -32120441 -31358649 -28820038 -23839211 -16635120 -8866594
40618 -8866594 -2758043 383794 805833 -251566 -1556507 -2566662 -3441990 -4388179 -4907628
40609 -4907628 -3904871 -796859 3556744 7286002 8950239 8539009 7179737 5966057
40601 5966057 4949874 3175802 -137879 -4333799 -7453054 -7893813 -5841559 -2915207
40593 -2915207 -643198 443864 539623 19866 -707923 -1230039 -1260089 -667514 608161
40584 608161 2510600 4832465 7483969 10673285 14420065 17896345 19693144 18906741
40576 18906741 15717673 10934428 5419843 7790 -4694473 -8891708 -13578533 -19354074
40568 -19354074 -25361111 -29810520 -31506986 -30588487 -27967858 -24516373 -20756128 -16832795
40560 -16832795 -12543795 -7624954 -2178037 3310563 8413549 13020868 17071658 20226339
40552 20226339 21952551 21838109 19746458 15832207 10599829 4910128 -262950 -4224669
40544 -4224669 -6783115 -8153254 -8691330 -8717201 -8528163 -8445909 -8680883 -9114521 -9396403
40535 -9396403 -9452684 -9843966 -11377617 -14240095 -17596885 -20142300 -21036994 -20358249 -18851509
40526 -18851509 -17427405 -16787353 -17183281 -18289058 -19374105 -19829931 -19603503 -18998218 -18008911
40517 -18008911 -16059276 -12638830 -8178418 -4053524 -1552645 -838795 -913642 -511527 962000
40508 962000 3162744 5240047 6495600 6744153 6188456 5064902 3441424 1260409 -1544215
40499 -1544215 -4952278 -8757322 -12532989 -15780017 -18138649 -19441107 -19652473 -18926754
40491 -18926754 -17716993 -16637384 -16082093 -15984986 -15939952 -15509890 -14495828 -13036628 -11394441
40482 -11394441 -9508992 -6883670 -3183873 1089505 4828587 7235200 8194649 7764623
40474 7764623 5871608 2865293 -59680 -1608584 -1570890 -934406 -808810 -1444951 -2227478
40465 -2227478 -2329222 -1357211 380396 2131443 3316133 3924011 4313965 4792610 5484717
40456 5484717 6354799 7078541 7097384 6207652 5059111 4694190 5521900 6988465 8219699
40447 8219699 8639202 7964592 6128597 3559757 1276204 265322 671342 1695486 2298573
40438 2298573 1993795 1084654 255155 -110792 -316126 -1118364 -3102003 -6166675 -9427848
40429 -9427848 -11569533 -11578959 -9449177 -6110030 -2459977 1440154 5989030 11043698 15735551
40420 15735551 19311662 21759307 23488425 24783395 25772358 26589232 27219345 27308913 26362424
40411 26362424 24071967 20375731 15410356 9630431 3874639 -892366 -3948220 -4999462
40403 -4999462 -4251365 -2396944 -306064 1488280 2954867 4252640 5543718 7203369
40395 7203369 9815691 13585926 17890949 21686917 24275366 25509329 25507373 24555967 23212327
40386 23212327 22095577 21431843 20929351 20068430 18376148 15578267 11842130 7924394
40378 7924394 4797023 2952793 2129544 1713120 1323935 1078061 1431632 2726294 4734360
40369 4734360 6708865 8037062 8741733 9139770 9183899 8544317 7319398 6192428 5676304
40360 5676304 5533715 5201309 4532662 3811103 3190527 2484548 1509397 354184 -748008
40351 -748008 -1575766 -1816332 -1016765 1041968 3786129 5756191 5299872 1666159 -4270071
40342 -4270071 -10208610 -13520053 -12632921 -7846239 -989999 5821696 11346829 15432988
40334 15432988 18446903 20738056 22526616 23874767 24511210 23871392 21600742 18028863
40326 18028863 14007221 10278739 7072244 4246166 1729397 -141565 -686937 596729
40318 596729 3511195 7284943 11274732 15313625 19285485 22761557 25423740 27554138
40310 27554138 29594661 31349793 32159612 31823219 30753862 29131017 26573262 23003203
40302 23003203 19270704 16366746 14356005 12663121 11207443 10597294 11162541 12380560
40294 12380560 13492372 14250516 14699738 14466255 12718755 8964176 3764880 -1392920
40286 -1392920 -4954015 -6148374 -5222574 -3002273 -275248 2504872 5155839 7630710
40278 7630710 9944650 12070846 13805803 14786895 14741239 13791534 12572392 12018952 12848895
40269 12848895 14999868 17493462 18999201 18753363 17088938 15159616 14139168 14530332
40261 14530332 16018773 17866638 19467821 20586531 21113436 20693652 18733329 14838286
40253 14838286 9228911 2739047 -3531054 -8613527 -11965832 -13592193 -13879537 -13189479
40245 -13189479 -11593987 -9109231 -6187518 -3805446 -2906387 -3737818 -5740672 -8000548
40237 -8000548 -9774971 -10784544 -11277969 -11848465 -12945338 -14380630 -15379243 -15242805 -13971147
40228 -13971147 -12221701 -10757854 -9998017 -9955404 -10399442 -11040246 -11677134 -12238258 -12677606
40219 -12677606 -12901925 -12899533 -12909276 -13327407 -14404828 -16102640 -18236782 -20628495 -23021259
40210 -23021259 -24915173 -25617149 -24555594 -21614978 -17198323 -11941567 -6326953 -562310
40202 -562310 5197927 10603291 15105198 18113520 19135999 17961808 14920235 10909956
40194 10909956 6980006 3844675 1864543 1335282 2459042 4946818 7920485 10459880
40186 10459880 12242129 13580253 14900451 16248901 17257420 17533112 17097008 16438293
40178 16438293 16122889 16444248 17549551 19712913 23111259 27260888 30991529 33188333
40170 33188333 33435697 31898389 28916387 24996738 20959080 17642686 15382393 13933942
40162 13933942 12856551 11747983 10157884 7595331 3800194 -1039601 -6304114 -11043490
40154 -11043490 -14177561 -14964577 -13490958 -10613511 -7345527 -4388833 -2219491 -1272211
40146 -1272211 -1715741 -3113696 -4600760 -5544853 -6011047 -6568379 -7668370 -9143414 -10192047
40137 -10192047 -9872597 -7792026 -4463964 -981591 1765340 3633770 5053946 6400576
40129 6400576 7619424 8468387 8998853 9652612 10836567 12426146 13678172 13619152 11650719
40120 11650719 8031704 3885605 552082 -1355294 -2356753 -3527222 -5504100 -8099303
40112 -8099303 -10775056 -13265088 -15670141 -18194856 -21060003 -24611716 -29177419 -34553852
40104 -34553852 -39663844 -42919847 -43119433 -40137746 -34896918 -28754088 -22833194 -17695158
40096 -17695158 -13415654 -9912932 -7255910 -5698463 -5422448 -6277377 -7796034 -9413329
40088 -9413329 -10618854 -11015702 -10491295 -9460021 -8784563 -9217324 -10843186 -13118436 -15420138
40079 -15420138 -17441895 -19077631 -20147110 -20421398 -19840308 -18497959 -16383757 -13317466
40071 -13317466 -9244379 -4463520 565744 5505818 10010598 13420337 14989602 14627867
40063 14627867 13206536 11885860 11185250 10801341 10127903 8713090 6404394 3501077
40055 3501077 866604 -430626 192107 2560460 6100710 10155977 13868576 16188908
40047 16188908 16499612 15268796 13817022 13294153 13875537 14848328 15306762 14753809 13209428
40038 13209428 10972816 8497433 6575670 6387838 8870058 13751373 19371186 23702446
40030 23702446 25601013 25115933 22925648 19795531 16433857 13405903 10916536 8705615
40022 8705615 6204527 2816794 -1775306 -7325558 -12993814 -17746450 -20898908 -22345985
40014 -22345985 -22447851 -21819158 -21039131 -20256711 -19079323 -17106838 -14640953 -12669471 -12058864
40005 -12058864 -12877809 -14515402 -16254304 -17652369 -18588016 -19159797 -19539173 -19850789 -20192564
39996 -20192564 -20670464 -21162494 -20965194 -18961481 -14507676 -8229801 -1772413 3364761
39988 3364761 6761439 8947952 10563026 11799079 12593389 13044307 13342700 13327577 12461784
39979 12461784 10528540 8264991 7030714 7735742 10137988 13138185 15606537 16928758
39971 16928758 16987673 15858767 13612742 10393884 6594199 2779875 -654709 -3672849
39963 -3672849 -6353857 -8621824 -10421916 -12058788 -14035669 -16469264 -18875688 -20642993
39955 -20642993 -21562901 -21802159 -21489944 -20454686 -18304288 -14727361 -9833017 -4266006
39947 -4266006 1096333 5608652 8979284 11041628 11701889 11234660 10404520 10047474 10517406
39938 10517406 11551317 12517185 12715480 11680634 9512405 6985110 5211525 5076189
39930 5076189 6821560 9936104 13376305 16128843 17763803 18392402 18090685 16686755
39922 16686755 14349806 12061379 10941298 11019548 11068894 9880075 7529854 5276591 4418610
39913 4418610 5391339 7675225 10154547 11572146 11077721 8705893 5334472 2049671
39905 2049671 -465543 -1959917 -2329418 -1667719 -596217 -133168 -913980 -2641481 -4493630
39896 -4493630 -5909871 -6702562 -6577631 -5084558 -2223951 1265555 4516376 7225293
39888 7225293 9490609 11162305 11749438 11042301 9623137 8658774 9178836 11395990 14520501
39879 14520501 17267020 18747673 18971063 18491420 17721754 16748006 15684421 14901278 14808910
39870 14808910 15555563 16949251 18489826 19437705 19112825 17395065 14948784 12838177
39862 12838177 11848017 12094948 13121413 14221270 14735506 14268004 12832378 10852936 8950035
39853 8950035 7630770 7152033 7643354 9215340 11775041 14755563 17254233 18604561
39845 18604561 18771224 18124895 16940950 15261926 13219337 11347244 10481529 11260683 13588863
39836 13588863 16551985 19006089 20368900 20793217 20600306 19837557 18610839 17602457
39828 17602457 17779929 19435409 21724915 23304811 23349913 21939633 19660018 17026809
39820 17026809 14257569 11403174 8521025 5674491 2882065 230026 -1995028 -3515393
39812 -3515393 -4493145 -5532921 -7069299 -8900464 -10516039 -11717126 -12639107 -13273656 -13299000
39803 -13299000 -12386987 -10420221 -7435850 -3675709 261458 3632903 6044516 7528219
39795 7528219 8126142 7779513 6824208 6266419 7198847 9975118 14076058 18612948 22779176
39786 22779176 26009255 28054839 29004281 29134889 28718174 27920635 26706436 24767280 21778777
39777 21778777 17916758 13964393 10705246 8312586 6477479 4935806 3600902 2328998
39769 2328998 930566 -541263 -1758394 -2415228 -2378503 -1560236 114792 2551394 5464560
39760 5464560 8550705 11512518 13903559 15173278 14996776 13506891 11246238 9050726
39752 9050726 7882695 8360352 10166935 12035682 12553557 11106820 8191742 5015061
39744 5015061 2778164 2036701 2506092 3487810 4459398 5117843 5005714 3627693 1198096
39735 1198096 -1144532 -2376779 -2756868 -3572714 -5755592 -9056271 -12514674 -15301331
39727 -15301331 -17021895 -17655054 -17498011 -16950861 -16111294 -14738167 -12786095 -10740996 -9127245
39718 -9127245 -7815411 -6151628 -3758025 -915936 1880862 4475064 7023439 9628002
39710 9628002 12153697 14295239 15666227 15900104 14878786 12962125 10919790 9490429
39702 9490429 8871813 8589409 7934127 6638921 5149319 4190746 4076027 4439244 4523094
39693 4523094 3590010 1172544 -2730431 -7497353 -12051677 -15430898 -17317221 -18059316
39685 -18059316 -18214582 -17993216 -16956250 -14215988 -9173501 -2294646 4893706 10763332
39677 10763332 14595862 16647406 17372969 16781848 14526268 10452656 5046211 -554060
39669 -554060 -5014277 -7496376 -8049971 -7349696 -6105378 -4793497 -3814024 -3587743 -4354891
39660 -4354891 -6017744 -8305107 -11006215 -13942841 -16790867 -19076219 -20409630 -20759135
39652 -20759135 -20543534 -20419241 -20828426 -21683329 -22560008 -23221772 -23846765 -24712373 -25805585
39643 -25805585 -26840268 -27528110 -27684639 -27147023 -25779832 -23631500 -21049535 -18627263
39635 -18627263 -16993484 -16507806 -17038674 -18050659 -18936226 -19230965 -18601734 -16925808 -14554865
39626 -14554865 -12284631 -10764970 -9976663 -9498076 -9217295 -9493114 -10561803 -12004304 -12875300
39617 -12875300 -12222979 -9551518 -5159286 -255410 3487862 4886066 3946488 1732882
39609 1732882 -334216 -1118120 -132898 2340248 5525212 8760539 11876068 14920871
39601 14920871 17690198 19751526 20858833 21087194 20589885 19516267 18230557 17313143
39593 17313143 17120273 17428535 17626472 17202880 16078831 14721414 14073688 15110641 18091731
39584 18091731 22188891 26025621 28677453 30159773 31053535 31784228 32203036 31721452 29861858
39575 29861858 26764349 23094678 19356808 15428046 10996455 6391307 2678538 838257
39567 838257 1029065 2706927 5223512 8170691 11354712 14674492 17975391 20888208
39559 20888208 22871008 23500018 22632299 20249814 16417162 11659438 7184117 4252897
39551 4252897 3162932 3064461 2914540 2462287 2231506 2792228 4308877 6699264 9907302
39542 9907302 13849869 18174123 22184091 25041904 26091277 25143447 22647909 19656562
39534 19656562 17462777 16969667 18165849 20152027 21724833 22012223 20700127 17902787
39526 17902787 13995948 9505735 4953821 725142 -2868606 -5430035 -6545257 -6129480
39518 -6129480 -4676439 -3083738 -2166932 -2254822 -3142025 -4370528 -5571799 -6596733 -7434419
39509 -7434419 -8165575 -9022117 -10276598 -11851004 -13122987 -13409654 -12733857 -11938484 -11952882
39500 -11952882 -13061634 -14886420 -16788895 -18097227 -18206310 -16893381 -14609860 -12200213
39492 -12200213 -10196099 -8492162 -6714164 -4664550 -2293004 501369 3727904 7066988
39484 7066988 10131549 13028808 16321692 20185604 23800153 25897350 25891499 24233099 21697077
39475 21697077 18691754 15433224 12475007 10631170 10279082 10882586 11270079 10390547 7951836
39466 7951836 4543288 1164975 -1540613 -3760462 -6275239 -9731787 -14042280 -18334836
39458 -18334836 -21444492 -22616516 -21928601 -20093854 -17894904 -15880142 -14454915 -13832622
39450 -13832622 -13701806 -13347334 -12555606 -12193323 -13334349 -15782525 -17935517 -18241898 -16401685
39441 -16401685 -13025260 -8638933 -3421804 2394911 8335327 13827307 18298692 21281498
39433 21281498 22722047 23090128 22894317 22158629 20650623 18554136 16584567 15388483
39425 15388483 15052053 15201900 15334898 15015797 14034283 12527031 10815685 9052056 7157598
39416 7157598 5150495 3342553 2109296 1619022 1903796 3026830 4925480 7049435
39408 7049435 8323084 7689375 4903207 913218 -2622536 -4447711 -4549723 -3986264 -3910346
39399 -3910346 -4723067 -5968033 -6793460 -6504080 -4914220 -2363292 630553 3794067 7171110
39390 7171110 10823083 14584941 18100260 20896375 22385064 22109876 20314364 18152567
39382 18152567 16937946 16998025 17406272 16946993 15246290 12934870 10956440 9940657 10057086
39373 10057086 11028484 12122310 12427330 11480409 9636776 7685026 6133993 5004733
39365 5004733 4232847 4014831 4674675 6337410 8799960 11591785 14109271 15871155 16808330
39356 16808330 17242177 17466160 17406503 16812722 15758720 14834566 14756251 15712310 17021667
39347 17021667 17491421 16316389 13766437 10955841 8890488 7743978 6935546 5669934
39339 5669934 3422457 302469 -2757421 -4369650 -3634627 -831129 2886212 6409545
39331 6409545 9286543 11712689 14219441 17220960 20503005 23136027 24160269 23426506
39323 23426506 21640099 19689989 18204567 17642407 18279890 19818401 21275817 21642227
39315 21642227 20720323 19287640 18518784 19267362 21685323 25266502 29175733 32616791
39307 32616791 35048173 36282039 36534634 36269550 35759901 34787169 32927385 30145013 26994072
39298 26994072 24291016 22704486 22454067 23022849 23184576 21736014 18376284 13644719
39290 13644719 8018448 1556509 -5349408 -11372234 -14956095 -15591775 -14148744 -12089848
39282 -12089848 -10596754 -10195310 -10682658 -11278175 -11144753 -9968078 -8017340 -5730877 -3410461
39273 -3410461 -1234654 694064 2357934 3714334 4595079 4918175 4997408 5397257 6394634
39264 6394634 7757048 9105340 10260841 11061728 11004900 9375560 5875369 1107661 -3612072
39255 -3612072 -7029101 -8714970 -9241674 -9682310 -10900223 -13119628 -15861007 -18116095
39247 -18116095 -18787172 -17340646 -14188861 -10314972 -6452347 -2715843 986887 4438933
39239 4438933 7196433 9050259 10142365 10578411 10115725 8395098 5461265 1961012
39231 1961012 -1204909 -3431733 -4709950 -5528642 -6486757 -7770067 -8778943 -8348814 -5672699
39222 -5672699 -1208409 3446023 6761275 8366007 8917650 9095404 8989622 8459075 7761557
39213 7761557 7571876 8403653 10147097 12185188 13872803 14876005 15147626 14731669 13683980
39204 13683980 12141031 10344988 8531676 6810362 5154146 3437914 1445590 -1073373
39196 -1073373 -4205475 -7635683 -10591742 -12084540 -11374080 -8444964 -4193857 -127053
39188 -127053 2321911 2471909 696161 -1828925 -3833525 -4665351 -4384917 -3187074 -972654
39179 -972654 2225143 5565723 7725158 8160639 7729501 7755596 8708410 10079816 11266765
39170 11266765 12063977 12352524 11858331 10467200 8525208 6657578 5449975 5348092 6566548
39161 6566548 8866851 11549746 13824406 15135824 15182092 13985514 12238147 11354698 12701630
39152 12701630 16558058 21912134 27298288 31732649 34874415 36561105 36490740 34469778
39144 34469778 30897767 26847061 23503235 21439240 20432463 19969622 19845074 20241130
39136 20241130 21359817 23131240 25235520 27199741 28383949 28065524 25837288 22036983
39128 22036983 17660747 13704652 10574253 8138961 6208053 4760906 3779841 3177241
39120 3177241 3068446 3939100 6280130 10027047 14450001 18549022 21466400 22647560
39112 22647560 21897518 19430605 15812295 11799207 8201903 5730584 4742027 5107336
39104 5107336 6452249 8491849 10945234 13170689 14250568 13695697 11961931 10095170
39096 10095170 8908178 8568960 8805566 9240258 9516568 9334745 8530467 7104832 5124126
39087 5124126 2593384 -539979 -4210624 -8014737 -11203600 -13059440 -13430843 -12908965
39079 -12908965 -12395222 -12423176 -12834416 -13032468 -12520547 -11242617 -9466180 -7407058 -5120915
39070 -5120915 -2886011 -1531470 -1979564 -4237053 -7030559 -8721092 -8581784 -7074824
39062 -7074824 -5042704 -2937275 -812937 1330439 3479451 5737383 8250582 10954842
39054 10954842 13494693 15417289 16413968 16431937 15673923 14536022 13500841 13030963 13482818
39045 13482818 14971628 17179033 19304619 20366780 19714078 17320340 13623717 9140569
39037 9140569 4272742 -567842 -4779484 -7624698 -8502675 -7201488 -3986728 425269
39029 425269 4987153 8643160 10828849 11775321 12257532 12983147 14210776 15793637 17251492
39020 17251492 17686769 16052831 12075296 6951236 2650213 201104 -1143735 -2854624
39012 -2854624 -5493637 -8410522 -10761675 -12244504 -12769515 -11973681 -9469981 -5405152
39004 -5405152 -497416 4371460 8410836 10961921 11678568 10783479 8975080 6961443
38996 6961443 5075947 3259964 1283848 -993516 -3445587 -5731142 -7584357 -8967665
38988 -8967665 -9751393 -9269967 -6523081 -1152673 5696500 11627829 14340045 13020828
38980 13020828 8698931 3388749 -1156951 -4123703 -5509819 -5696103 -5173969 -4416455
38972 -4416455 -3759025 -3398710 -3565144 -4566907 -6488160 -8866158 -10849952 -11766322 -11510934
38963 -11510934 -10437063 -8999043 -7562568 -6477620 -6175626 -7014430 -8913506 -11231007
38955 -11231007 -13232708 -14752422 -16200864 -17804325 -19013861 -18863949 -16841507 -13282613
38947 -13282613 -9054702 -5042981 -1843839 309215 1434160 1657937 1331956 1284421 2567292
38938 2567292 5590918 9629580 13423347 16087220 17209377 16508201 14127705 11230639
38930 11230639 9523863 9801376 11279246 12552401 12864296 12317881 11355766 10438202 9962221
38921 9962221 10117809 10874022 12160226 13766223 15002252 15005011 13766185 12438425 12107475
38912 12107475 12510152 12454695 11294018 9452965 7685038 6491288 6313601 7594761 10250320
38903 10250320 13408370 15985052 17382526 17557558 16751945 15410525 14114281 13224574
38895 13224574 12571321 11666842 10282637 8807916 8092131 8904308 11351721 14686603 17753322
38886 17753322 19772606 20783350 21420411 22356326 23876026 25734604 27260548 27691725
38878 27691725 26640647 24403615 21856872 19961084 19208147 19453364 20274989 21441492
38870 21441492 22939596 24652235 26295646 27728488 28995654 29835321 29381645 26696325
38862 26696325 21570876 14652005 6923023 -727318 -7615478 -13328218 -17735752 -20806426
38854 -20806426 -22515632 -23084888 -23059274 -22826424 -22260123 -21206624 -20070139 -19350112 -18723227
38845 -18723227 -17273369 -14737773 -11914963 -9659555 -8052000 -6757192 -5504861 -3791770
38837 -3791770 -783951 3743083 8676035 12438342 14445014 15159221 14937070 13562193
38829 13562193 10990515 7883418 5065238 2771067 636522 -1805849 -4723022 -7777651
38821 -7777651 -10154852 -11013464 -10112461 -7943283 -5264538 -2693403 -713161 292524
38813 292524 252345 -485987 -1422962 -2219594 -2721193 -2859367 -2663458 -2275532 -1871922 -1647948
38803 -1647948 -1895382 -2929032 -4823606 -7279921 -9765947 -11707957 -12639427 -12482296 -11828850
38794 -11828850 -11720859 -12901381 -15308758 -18390497 -21799253 -25635276 -30053737 -34731431
38786 -34731431 -38691332 -40670500 -39891774 -36698572 -32415356 -28476718 -25669756 -24103641
38778 -24103641 -23545851 -23509044 -23198448 -21797842 -18978701 -15064282 -10743856 -6758402 -3742308
38769 -3742308 -2034783 -1498688 -1627698 -1833172 -1475736 276241 4131778 9861052 15953851
38760 15953851 20488209 22513858 22568513 21949983 21695789 22252310 23785448 26408647 29942583
38751 29942583 33576000 36053607 36468892 34957107 32526297 30168342 28214223 26523734
38743 26523734 25006111 23694706 22464317 21066534 19561667 18487982 18459149 19712032
38735 19712032 22090672 25230443 28576905 31442920 33409381 34726162 36113573 38066297
38727 38066297 40399571 42435953 43511119 43348515 42168143 40519300 38853659 37132354
38719 37132354 34906028 31830668 28012864 23802813 19410996 14900331 10467752 6477287
38711 6477287 3110305 130371 -2810127 -5595570 -7504330 -7780633 -6380494 -4074050
38703 -4074050 -1747079 373775 2795738 6180353 10791821 16394432 22420864 28140263
38695 28140263 32837906 36031684 37538013 37304657 35282190 31587314 26759687 21697819
38687 21697819 17216486 13621602 10699746 8109116 5767979 3842039 2383441 1125870
38679 1125870 -219350 -1499688 -2110174 -1492751 408606 3115744 5857283 7886793
38671 7886793 8867044 9080220 9054185 8849175 7943009 6019343 3652327 1939213 1604306
38662 1604306 2704377 4936616 7699941 9894439 10309982 8602381 5639354 2621385
38654 2621385 39163 -2337254 -4741739 -7048133 -8983901 -10327034 -10868910 -10483989
38646 -10483989 -9367942 -8065894 -7165325 -6977499 -7437243 -8147953 -8544437 -8234646 -7313246
38637 -7313246 -6264314 -5469055 -4818164 -3792190 -1856221 1172757 4941919 8610723
38629 8610723 11190531 12067073 11344315 9717816 7990459 6638350 5727322 5130911 4759637
38620 4759637 4589719 4572772 4649845 4879808 5443746 6431942 7670245 8825617 9646173
38611 9646173 10051782 10081292 9875148 9654580 9541651 9360391 8754707 7601324 6250696
38602 6250696 5273201 4955630 5073818 5187016 5179943 5475654 6583571 8362911 9836326
38593 9836326 9856662 7919179 4284988 -457706 -5651668 -10481204 -14038108 -15687024
38585 -15687024 -15266307 -12967944 -9313966 -5273119 -1922055 381947 2278418 4544010
38577 4544010 7168240 9676770 12185560 15503583 19979848 24677312 28052187 29307317
38569 29307317 28856063 27620388 26184011 24626538 22890861 21082975 19400175 17881655
38561 17881655 16364976 14728526 13043653 11335458 9295266 6519378 3099833 -306151
38553 -306151 -3225608 -6040885 -9630956 -14308038 -19248937 -22977797 -24282409 -22715121
38545 -22715121 -18531710 -12462020 -5553920 1029613 6369908 10110027 12433323 13722569
38537 13722569 14248459 14131168 13476082 12522485 11792088 12098583 14087752 17451500 20756287
38528 20756287 22515840 22589932 22264665 22821207 24256694 25538341 25818986 25117786 23978373
38519 23978373 22793519 21466482 19515685 16487278 12416588 7923130 3797765 511587
38511 511587 -1919644 -3830369 -5776330 -8193440 -10817443 -12551235 -12292457 -9979859
38503 -9979859 -6651712 -3531106 -1287096 -64089 250440 -14743 -400175 -638744 -801461
38494 -801461 -1000754 -1076296 -692236 353556 1986225 3890484 5617394 6781440 7225324
38485 7225324 6912679 5726133 3635621 1086703 -1141178 -2667953 -3831834 -5042962
38477 -5042962 -6100300 -6503652 -6230349 -5714681 -5069479 -3815705 -1582535 1265693 3977937
38468 3977937 6179309 7954309 9203815 9222201 7094590 2497065 -3888355 -10621321
38460 -10621321 -16081915 -18977554 -18686523 -15491585 -10573890 -5557360 -1751340 354743
38452 354743 964257 474459 -810578 -2549794 -4178371 -5091020 -5141449 -4932562 -5458466
38443 -5458466 -7296407 -10081439 -12769020 -14400323 -14648942 -13778857 -12219258 -10160156
38435 -10160156 -7485046 -4156254 -714097 1824695 2852625 2881306 3056284 3978258 5338841
38426 5338841 6699116 8085443 9552498 10653129 10878198 10439392 10170527 10764627 12484934
38417 12484934 15398443 19222932 22862265 24768267 24207123 21886554 19044961 16215220
38409 16215220 13201456 9931203 6746151 3876070 1173343 -1400671 -3392164 -4314301
38401 -4314301 -4355730 -4289917 -4629819 -5108373 -5127978 -4592366 -4152080 -4700799 -6751657 -10187624
38391 -10187624 -14331128 -18179702 -20840374 -22015668 -22081122 -21598032 -20781551 -19452214 -17297922
38382 -17297922 -14005376 -9344976 -3529860 2440547 7111926 9500074 9675403 8430540
38374 8430540 6522015 4286075 1799670 -773903 -2988573 -4221441 -4053120 -2581968
38366 -2581968 -267941 2535730 5705684 8952425 11615839 13192659 13983096 14851902
38358 14851902 16212349 17433695 17390947 15506300 12188107 8423231 5127037 2778932
38350 2778932 1369834 554864 23805 -62254 981161 3795557 8259785 13357597 17757672
38341 17757672 20507407 21327580 20573776 19062417 17674443 16775746 15993805 14747033 12998691
38332 12998691 11317293 10209497 9644921 9323776 9137593 9091598 8886324 7941970 6028929
38323 6028929 3743935 2137558 1809411 2475965 3473220 4487992 5525431 6212509 5585760
38314 5585760 2936120 -1259396 -5577476 -8817131 -10683799 -11390842 -11079496 -9944592
38306 -9944592 -8662066 -8213549 -9132895 -11061742 -13131651 -14734456 -15881790 -16836318 -17459428
38297 -17459428 -17064820 -15072777 -11796933 -8407462 -6041158 -5053611 -5135844 -5867356 -6895419
38288 -6895419 -7694023 -7474306 -5501992 -1552961 3779826 9080001 12604423 13257195 11368843
38279 11368843 8463318 6122489 5036123 5045763 5811817 7190365 9043707 10988839 12515393
38270 12515393 13301578 13343021 12847026 12103152 11382973 10764536 9987538 8638069 6632873
38261 6632873 4485718 2992434 2668386 3530757 5298472 7621482 10162019 12686376
38253 12686376 15180518 17778511 20522135 23249128 25696340 27603986 28768346 29193880
38245 29193880 29204697 29149816 28855285 27536702 24427862 19452414 13264796 6830345 1059606
38236 1059606 -3408728 -6358482 -7896200 -8085569 -6846185 -4405382 -1624044 539638
38228 539638 1908008 3112100 4703415 6570250 8360710 10116586 12118969 14223796
38220 14223796 15724843 15987395 15027050 13351464 11392732 9307781 7311673 5953568
38212 5953568 5845194 7101354 9114365 10849525 11324108 9971607 6852372 2626302
38204 2626302 -1830972 -5894285 -9221764 -11407066 -11945655 -10773323 -8656673 -6772927
38196 -6772927 -5894101 -6038498 -6730205 -7410597 -7785086 -8077524 -8887111 -10529962 -12552312
38187 -12552312 -14117596 -14805945 -14797126 -14421470 -13951281 -13790838 -14327223 -15370711 -16139485
38178 -16139485 -16087005 -15466611 -14813654 -14145718 -13022066 -11223738 -9021039 -6827473 -4855612
38169 -4855612 -3049506 -1119778 1242325 3863455 5846385 6228174 5070752 3731886
38161 3731886 3910633 6413946 10700092 15329872 18837508 20506378 20610611 19966429 19283350
38152 19283350 19020931 19685054 21807204 25426718 29870636 34309102 38350158 41828116
38144 41828116 44219648 44763670 43292205 40645530 38078495 36391930 35677308 35556297
38136 35556297 35339226 34154678 31475949 27769101 24354058 22277228 21295742 20144206
38128 20144206 17837054 14601724 11535377 9503383 8436239 7538371 6010815 3648013
38120 3648013 968306 -1147923 -2093066 -1966755 -1377042 -757827 65009 1580885 4011661
38111 4011661 7226927 11169103 15990900 21530924 26856147 30687720 32348513 32131017
38103 32131017 30772961 28827553 26546229 23981453 20944188 17109508 12488426 7657069
38095 7657069 3196593 -977132 -5312199 -9655275 -13063372 -14769209 -14934716 -14157608
38087 -14157608 -12612212 -10176628 -7224874 -4680461 -3141661 -2378558 -1898228 -1636441
38079 -1636441 -1773723 -2145443 -2298895 -2123666 -2046410 -2461384 -3189645 -3639589 -3355663 -2314315
38069 -2314315 -876138 355826 780093 228993 -765976 -1362628 -1223137 -857081 -1052630
38060 -1052630 -2071009 -3546653 -5074204 -6601500 -8144554 -9363764 -9715181 -9010140
38052 -9010140 -7595816 -5913515 -4082596 -2067998 -70356 1544235 2672843 3530754
38044 3530754 4200253 4439289 4163813 3850288 4056939 4615563 4714305 3872911 2488661
38035 2488661 1266599 462360 -22363 -71844 675129 2299749 4322467 5937764 6351295
38026 6351295 5083666 2416189 -401140 -1847890 -1342028 435786 2556891 4855627
38018 4855627 7645930 10755030 13377144 14873855 15249425 14705372 13175489 10669249
38010 10669249 7854805 5854321 5351900 6060798 7069602 7547704 7163141 6140349 5097633
38001 5097633 4630096 4794979 5058355 4929971 4581457 4624408 5336182 6381124 7275759
37992 7275759 7739136 7449178 5912903 3037904 -358384 -3115949 -4858133 -6177391
37984 -6177391 -7613468 -8828455 -9036966 -8009837 -6364440 -4955612 -4201108 -3953680 -3812915
37975 -3812915 -3502175 -3054833 -2718538 -2685030 -2900895 -3113124 -3091510 -2889964 -2946492 -3763218
37965 -3763218 -5262323 -6544574 -6611389 -5396738 -3833162 -2856539 -2677150 -3122477 -4201103
37956 -4201103 -5893166 -7656543 -8674045 -8599249 -7725837 -6474133 -5083011 -3777338 -2766340
37947 -2766340 -1917904 -828764 515463 1427373 1180557 -149724 -1779568 -3070974 -4021411
37938 -4021411 -4879673 -5504755 -5270036 -3612565 -670243 2626830 5166056 6441091 6759722
37929 6759722 6686416 6362088 5446035 3688570 1455725 -382838 -1112634 -733080 130046
37920 130046 813462 1015776 637987 -476077 -2317675 -4292900 -5412566 -5106779 -3665267
37911 -3665267 -1693260 694154 3874969 7966906 12302709 15716154 17274788 16811856
37903 16811856 14947374 12624587 10457712 8444627 6391452 4593053 3855397 4669981
37895 4669981 6490306 8061289 8497026 7909129 7011130 6379118 6277244 6993138 8910277
37886 8910277 12037819 15626913 18497034 19800091 19413017 17647546 14773854 10967545
37878 10967545 6680355 2869539 602068 227653 953762 1465382 1144150 605898 903347
37869 903347 2283416 3903323 4686043 4179384 2555060 118889 -2872206 -5973199 -8370626
37860 -8370626 -9091768 -7541272 -4044377 96541 3347883 5031965 5705427 6419175 7738309
37851 7738309 9597726 11883196 14754569 18287698 22003000 24922670 26153183 25549287
37843 25549287 23967186 22778204 22849424 23874268 24775650 24725181 23599463 21538456 18498629
37834 18498629 14501779 10070530 6041700 2934093 701807 -889057 -1823177 -1809647
37826 -1809647 -557624 1957960 5392083 9132101 12575989 15393624 17567235 19234591
37818 19234591 20490049 21219301 21055490 19621106 16951862 13595691 10137783 6705812
37810 6705812 3123880 -545330 -3914037 -6753777 -9275929 -11792645 -14279932 -16360787
37802 -16360787 -17513343 -17232343 -15341252 -12461052 -9995686 -9309263 -10887243 -14371399
37794 -14371399 -19126383 -24393188 -29038519 -31712131 -31538295 -28586278 -23756869 -18464301
37786 -18464301 -14240700 -11990339 -11297014 -10784235 -9432572 -7307452 -4853962 -1993214
37778 -1993214 1525154 5114480 7391150 7438647 5738218 3746304 2766458 3194757 4452873
37769 4452873 5436396 5259195 3822064 1681212 -573934 -2607061 -4049547 -4357861 -3280726
37760 -3280726 -1350411 339779 879470 66081 -1593372 -3212277 -4013560 -3830857 -3282396
37751 -3282396 -3394352 -4942389 -7983197 -11778385 -15102654 -16884189 -16846698 -15558274 -13764648
37742 -13764648 -11745057 -9401919 -6770663 -4101730 -1419738 1674488 5510961 9691060
37734 9691060 13061033 14463570 13672119 11717117 10222751 10182931 11226865 12082662 11769182
37725 11769182 10332991 8561958 7209072 6509364 6186694 5738154 4848175 3759206 3226685
37716 3226685 3913658 5749817 7981365 9912261 11526056 13316081 15560441 17857019
37708 17857019 19376024 19494755 18144179 15620505 12256396 8437799 4878446 2580913
37700 2580913 2248703 3712854 6084347 8514536 10711082 12732347 14514788 15758063
37692 15758063 16119995 15339930 13338293 10531163 8023588 7087113 8200357 10731688
37684 10731688 13625429 16143003 17844755 18324076 17477039 15874773 14313027 12887276
37676 12887276 10898076 7791695 3844593 -235842 -4036632 -7529254 -10746411 -13691175
37668 -13691175 -16351640 -18445705 -19278735 -18260407 -15623226 -12377993 -9506788 -7364061
37660 -7364061 -5810304 -4614689 -3595381 -2555194 -1239503 683948 3619679 7901562
37652 7901562 13572903 20282481 27277414 33413259 37439109 38755280 38032128 36758221
37644 36758221 35907425 35145139 33447834 30291477 26031575 21331477 16590498 11930094
37636 11930094 7405881 3090562 -833076 -3886539 -5383087 -5002404 -3309594 -1453529
37628 -1453529 -143789 1035525 3152704 6745040 11181723 15200719 17957948 19491243
37620 19491243 20292124 20635727 20416828 19579573 18594692 18382083 19618963 22061683 24620131
37611 24620131 26178270 26329557 25338847 23581750 21199449 18222723 14827334 11430593
37603 11430593 8619253 6897314 6280889 6096812 5357200 3444417 411280 -3280886
37595 -3280886 -7068540 -10314988 -12372721 -12905905 -12098112 -10403406 -8171176 -5622746
37587 -5622746 -3021225 -559801 1959499 5104690 9301204 14363636 19581354 24218819
37579 24218819 27899018 30603790 32507588 33954781 35517163 37763837 40676424 43280895
37571 43280895 44113963 42294959 38224238 33291279 28996000 26284865 25395915 25986487
37563 25986487 27340737 28624053 29101809 28217040 25605506 21212048 15475448 9372303
37555 9372303 4202615 1189351 1046075 3678774 8165862 13049686 16841576 18591134
37547 18591134 18306398 16915545 15638173 15168850 15362746 15638152 15592639 15264364 14993998
37538 14993998 15155861 15917977 17125940 18450151 19710185 20970633 22217226 23026623
37530 23026623 22738070 21018708 18248981 15400695 13567434 13476443 15231172 18383519
37522 18383519 22186006 25743080 28073973 28426522 26845109 24343686 22212757 21028387
37514 21028387 20401482 19653935 18573451 17491560 16804204 16521676 16195442 15183099 13024246
37505 13024246 9680862 5546990 1343058 -2020831 -3732591 -3531922 -1948972 39083
37497 39083 1686288 2856467 3862642 5090341 6742722 8773739 11011460 13418426
37489 13418426 16175444 19311203 22216922 23767853 23157789 20628828 17303622 14279645
37481 14279645 11845973 9461295 6410003 2514618 -1718227 -5590986 -8775255 -11355233
37473 -11355233 -13451851 -14993201 -15848851 -16009838 -15571455 -14653521 -13370313 -11740787 -9588733
37464 -9588733 -6732504 -3453290 -693966 419163 -606936 -3189567 -5933185 -7368408
37456 -7368408 -6688603 -4051604 -320999 3412747 6082318 6719750 4787885 709592
37448 709592 -4115799 -8130255 -10525585 -11343798 -10917935 -9521547 -7523716 -5507328 -3969514
37439 -3969514 -2988667 -2374772 -2150341 -2713305 -4375867 -6742217 -8683131 -9091020 -7730644
37430 -7730644 -5357002 -3079565 -1704379 -1549774 -2515512 -4119674 -5707731 -6988043
37422 -6988043 -8378380 -10581569 -13744405 -17170756 -19867839 -21189663 -20921808 -19012280
37414 -19012280 -15452813 -10353010 -3981371 3214931 10530548 17077084 22189881 25791271
37406 25791271 28176364 29411256 29151182 27156588 23786199 19787011 15756763 12093065
37398 12093065 9361128 8228562 8772286 10100243 10997709 10920682 10172310 9234287 8274305
37389 8274305 7360332 6816047 7091139 8342112 10270007 12325984 14023294 15167793 15925307
37380 15925307 16649104 17568330 18634867 19637313 20355721 20594370 20201926 19121784 17332776
37371 17332776 14768574 11525358 8195245 5658792 4297440 3663119 3263202 3455893
37363 3455893 5045213 7965739 10906101 12537594 12815626 12770881 13248659 14204574 15085025
37354 15085025 15433139 15029167 13825211 12044012 10213057 8837940 8001955 7378724 6608324
37345 6608324 5550675 4192208 2448421 124447 -2967277 -6814356 -11005081 -14745249
37337 -14745249 -17319439 -18707877 -19619341 -20733304 -22010204 -22959668 -23470255 -23991173 -24801811
37328 -24801811 -25469864 -25336369 -24365768 -23187234 -22303568 -21520367 -20245585 -18201862 -15733385
37319 -15733385 -13447530 -11600053 -9843315 -7621356 -4835380 -2051012 -7233 994032
37311 994032 1191142 1084447 1280441 2477979 5227520 9497606 14532573 19179774 22338052
37302 22338052 23264292 21845137 18837824 15737771 14091767 14655482 17030856 20050283
37294 20050283 22605379 24270227 25198476 25441738 24497142 21676626 16901617 11027552
37286 11027552 5436634 1416345 -246238 526786 3119148 6630109 10419412 14171004
37278 14171004 17469576 19680532 20507871 20474740 20535220 21215587 22276645 23079089 23014342
37269 23014342 21672723 19005500 15516040 12074512 9313266 7242376 5549071 4184942
37261 4184942 3556459 4232494 6581707 10564274 15629430 20834313 25374127 29179192
37253 29179192 32799937 36461802 39352694 40174244 38444370 34976419 30976890 26993899
37245 26993899 23015830 19333099 16798080 16106467 17044550 18517634 19185594 18167116
37237 18167116 15515257 12200374 9405395 7613136 6460115 5556529 5231288 6252758
37229 6252758 8921072 12615335 16136576 18328477 18533267 16835894 14033481 11225507
37221 11225507 9244899 8333789 8163597 8048311 7323062 5823850 4049196 2703499 2112129
37212 2112129 2266362 3334421 5687014 9201416 12845045 15319572 16072857 15453038 13988363
37203 13988363 11906581 9440010 7189814 5807071 5419056 5705684 6552269 8269730
37195 8269730 10948871 13812089 15549608 15361521 13528358 10973802 8473161 6339526
37187 6339526 4623025 3326849 2390165 1587256 531785 -1163311 -3626690 -6566087
37179 -6566087 -9436741 -11854987 -13791106 -15272036 -15979287 -15326711 -12996244 -9319010
37171 -9319010 -5104715 -1175146 1938336 4045406 5312718 6308826 7864369 10630901
37163 10630901 14641498 19338765 24081449 28542519 32509240 35404665 36320292 34741529
37155 34741529 31186528 26950338 23121643 19810868 16254423 11597527 5648987 -917715
37147 -917715 -6922582 -11243967 -13261265 -13053631 -11305049 -8870546 -6215998 -3258133
37139 -3258133 154562 3667727 6487533 7974197 7962676 6523062 3713866 -296887
37131 -296887 -5100694 -10187801 -14995162 -18661282 -20067976 -18588643 -14822027 -10315615
37123 -10315615 -6497855 -3973001 -2687323 -2395266 -2840900 -3721589 -4684700 -5383438 -5589056
37114 -5589056 -5365170 -5087018 -5114047 -5423488 -5680541 -5609062 -5087138 -3912492 -1804050
37105 -1804050 1157110 4221882 6324530 6837580 6061122 5057315 4922662 5980435 7541562
37096 7541562 8478136 8049223 6212613 3402609 325270 -2117827 -3175287 -2786691 -1618143
37087 -1618143 -399431 644691 1609527 2382068 2557035 1863963 552711 -648693 -973615
37078 -973615 -174320 1262885 2582422 3561819 4804008 7199809 11168807 16329851 21598167
37069 21598167 25534491 27021432 26015575 23573157 20907965 18502297 16265825 14238204
37061 14238204 12640806 11289525 9513166 6959158 4256079 2622946 2878865 4906822
37053 4906822 7881477 10766556 12645616 12910996 11469916 8888791 6200652 4294520
37045 4294520 3307982 2640660 1630469 166391 -1381679 -2643796 -3473444 -3836891 -3796030
37036 -3796030 -3636176 -3738470 -4173176 -4562041 -4474912 -3871278 -3042166 -2197764 -1256297 -66032
37026 -66032 1214389 2003305 1649077 7885 -2324607 -4450105 -5853184 -6596847 -6926121
37017 -6926121 -6915505 -6572834 -6042219 -5466451 -4726185 -3526710 -1758591 350305 2427033
37008 2427033 4179975 5492650 6521966 7756586 9709375 12293166 14605819 15661920
37000 15661920 15447734 15025154 15384534 16298419 16516771 15039501 11963165 8098528 4113798
36991 4113798 259724 -3351588 -6621837 -9624595 -12535282 -15214851 -17021433 -17228115
36983 -17228115 -15640587 -12794481 -9635119 -7011971 -5279533 -4167437 -3035363 -1398351
36975 -1398351 718095 2936864 4981080 6856535 8562954 9754095 9859314 8610117
36967 8610117 6370322 3842310 1458167 -841304 -3228043 -5553733 -7413506 -8546828
36959 -8546828 -9031402 -9134347 -9131847 -9238085 -9479108 -9542624 -8926628 -7408609 -5326905 -3300814
36949 -3300814 -1709005 -505977 531550 1514609 2385792 3014861 3268555 3021731 2183017
36940 2183017 781961 -951570 -2684973 -4306519 -6188610 -9002905 -13141283 -18285154
36932 -18285154 -23495298 -27590692 -29430088 -28130950 -23435138 -16018854 -7309003 1137597
36924 1137597 8104928 12744365 14542729 13575149 10656352 6830418 2526773 -2569743
36916 -2569743 -8605907 -14690944 -19282016 -21476366 -21654211 -20771685 -19356501 -17445729
36908 -17445729 -15183937 -12940010 -10813869 -8514639 -5970343 -3749284 -2579815 -2612929
36900 -2612929 -3386500 -4323656 -4957715 -4842539 -3760802 -2185715 -1172436 -1434884 -2537275
36891 -2537275 -3134540 -2026076 981407 5008544 8647931 10612236 10166236 7332190
36883 7332190 2964811 -1416848 -4310010 -5232336 -5127054 -5483065 -6897411 -8630814 -9567288
36874 -9567288 -9287400 -8060689 -6182552 -3752487 -948026 1955507 4884991 7910438
36866 7910438 10770382 12813010 13679365 13866446 14350612 15689850 17625371 19472326 20752524
36857 20752524 21547607 22452334 24158276 26830579 29750981 31672992 31680369 29753812 26515934
36848 26515934 22480699 17621548 11699342 4978784 -1460909 -6204419 -8320874 -7755484
36840 -7755484 -5072929 -1044996 3437291 7251576 9187629 8488325 5420314 1328957
36832 1328957 -2061881 -3704542 -3768473 -3156548 -2523264 -1833508 -765395 727831 2311437
36823 2311437 3478156 3755466 2944746 1321350 -608984 -2718881 -5366390 -8632910
36815 -8632910 -11708470 -13428441 -13290184 -11562406 -8560707 -4392085 534692 5339221
36807 5339221 9303836 12300747 14339098 15096445 14316023 12435174 10377317 8749681
36799 8749681 7516944 6405068 5371996 4715062 4932763 6458858 9340469 13143096
36791 13143096 17201319 20836324 23300996 23872109 22378085 19560965 16658517 14689310
36783 14689310 14260127 15659752 18496987 21237667 21758898 18852987 13163216 6591798
36775 6591798 941251 -2955742 -5273944 -6735708 -7968849 -9040796 -9569493 -9260486
36767 -9260486 -8182645 -6547812 -4536205 -2476660 -900813 -140564 -14770 -149566 -499360
36758 -499360 -1309744 -2614476 -3993418 -4858118 -4870788 -4142233 -3195574 -2741235 -3297162
36749 -3297162 -4847086 -6769225 -8074232 -7875023 -5974515 -3227100 -1202735 -1197598 -3365462
36740 -3365462 -6675315 -9585812 -10848081 -10065920 -7871151 -5576586 -4451387 -5186466
36732 -5186466 -7883973 -12212290 -17369640 -22196990 -25797327 -28100774 -29569540 -30366716
36724 -30366716 -30121899 -28538763 -25865415 -22602207 -19065845 -15504263 -12380302 -10129329
36716 -10129329 -8659955 -7441163 -6198611 -5284070 -5145636 -5502634 -5245140 -3278552 483620
36707 483620 4942546 8633998 10778949 11616672 11855958 11969944 12039828 12051126 12084469 12235092
36697 12235092 12555314 13095554 13744003 13880891 12455940 8820213 3586508 -1560281 -5121680
36688 -5121680 -6914879 -8012167 -9656369 -12172009 -14704365 -15910812 -15078748 -12779809
36680 -12779809 -10429606 -9103442 -8760249 -8576452 -7843931 -6436440 -4627504 -2757548
36672 -2757548 -1032142 642578 2675244 5408463 8645651 11756410 14323308 16442791
36664 16442791 18234517 19306541 19041963 17389239 15099938 13097847 11759665 10867091
36656 10867091 10059600 9110652 7831256 6063002 4051026 2671062 2800746 4195895
36648 4195895 5265206 4404772 1616920 -1425699 -2922580 -2317435 -227144 2464314
36640 2464314 5111181 7205602 8289427 8163353 7123396 5937426 5476418 6127128 7470886
36631 7470886 8732429 9674245 10875184 13002908 16021362 19269540 22044693 23827584
36623 23827584 24210949 23109427 21042049 18802494 16745717 14682123 12544763 10857685
36615 10857685 10397128 11607333 14458802 18602619 23405024 27979757 31528973 33817120
36607 33817120 35303299 36785254 38838380 41427225 43917354 45453033 45398319 43543186
36599 43543186 40075752 35477572 30353253 25189116 20247750 15707872 11741892 8306973
36591 8306973 5071602 1915386 -531517 -1256561 55384 2562552 5044349 6922000
36583 6922000 8368490 9722226 11174404 12946382 15343182 18370446 21363093 23174369
36575 23174369 22910023 20642858 17463658 14732085 13168305 12649963 12818209 13691591 15583016
36566 15583016 18502519 21716221 23845956 23489872 20121268 14708875 9370210 6068446
36558 6068446 5424888 6727751 8938068 11495357 14220779 16795731 18626866 19215377
36550 19215377 18507970 16831925 14557446 11895645 9013491 6263633 4219821 3444204
36542 3444204 4176286 6167636 8758879 11151876 12697334 12997441 11857494 9367561
36534 9367561 6182845 3565109 2775926 4177444 6913267 9518019 10867934 10667941
36526 10667941 9260597 7145614 4712396 2368466 754035 549856 1922459 4352069
36518 4352069 7278034 10806508 15420629 20962192 26287327 30159050 32283855 33298597
36510 33298597 33929554 34365131 34293144 33282451 31111544 27838503 23584252 18366288 12428751
36501 12428751 6784409 3014883 2146174 3837551 6954390 10808883 15517986 21240802
36493 21240802 27487933 33289925 37750219 40296580 40660441 38913461 35566888 31538504
36485 31538504 27885369 25309107 23661193 21971669 19260033 15492238 11693188 9129983
36477 9129983 8500238 9793051 12486500 15585438 17751297 17984618 16468183 14560968
36469 14560968 13689199 14199468 15358390 16312799 16710316 16354218 14791840 11813207 8229001
36460 8229001 5511438 4415468 4356022 4381973 4313256 4513342 4981282 5381691 5857098 7061681
36450 7061681 9199680 11624124 13702453 15575102 17583085 19283868 19658168 18308542
36442 18308542 15998614 13844409 12239764 10754012 8941222 7092508 6242771 7514416
36434 7514416 11351914 17180629 23651231 29206140 32581966 33093993 30781476 26432579
36426 26432579 21323973 16606168 12700377 9316834 6196170 3767057 2814402 3421579
36418 3421579 4513248 4702348 3503307 1547963 -223923 -1288518 -1556662 -1097944 -19387
36409 -19387 1600103 3811827 6716166 10203850 13903801 17423215 20467707 22702023
36401 22702023 23805333 23934924 24017815 25279166 28322772 32635979 36937913 40010158
36393 40010158 41328523 41068469 39659740 37521711 35276901 33872289 33983737 35239008
36385 35239008 36444071 36785280 36504007 36173209 35674420 34328650 31879840 28868558 25961263
36376 25961263 23247295 20335755 16914684 13045847 9045499 5284515 2158577 168801
36368 168801 -133625 1546691 4986670 9633039 15059233 21001692 26882461 31690470
36360 31690470 34723292 36281967 37233178 37948138 38079011 37368633 36166506 34917161 33545451
36351 33545451 31724381 29529850 27428408 25680963 24138688 22726955 21867754 22230942
36343 22230942 24124867 27179923 30519164 33181906 34578887 34835353 34778299 35383786 36978161
36334 36978161 38922854 40192872 40310528 39630713 38718587 37670144 36233698 34469999
36326 34469999 32991930 32471287 33077168 34461543 36103059 37515698 38271551 38079169 36895454
36317 36895454 34864055 32173732 29152165 26539990 25442959 26729728 30385955 35512145
36309 35512145 40942983 45800802 49547302 51818796 52451358 51566511 49386229 45958230
36301 45958230 41295112 35875158 30792730 27165991 25348640 24753538 24385446 23502283
36293 23502283 21906536 19843071 17745385 16050370 15149483 15370316 16876576 19590319
36285 19590319 23303612 27830966 32888494 37836300 41830691 44439255 45972624 47029888
36277 47029888 47849120 48352056 48776015 49975800 52959167 58151549 65051934 72467176
36269 72467176 79122515 84260412 87806597 90066173 91479107 92833425 95499896 101007709
36261 101007709 110184892 122819090 138192015 155798708 175532807 197363539 220874617
36254 220874617 244884588 267377568 286002489 298936071 305429237 305682637 300413402
36247 300413402 290557454 277104439 260965751 243006519 224226603 205731803 188372125
36240 188372125 172485760 158080414 145117346 133469152 122753220 112489047 102478207
36233 102478207 92922318 84184560 76552062 70193271 65162900 61375610 58676771 57014366
36225 57014366 56473770 57027000 58191903 58979802 58334031 55831255 52056307 48208121 45197963
36216 45197963 43060452 41198037 39129565 36992701 35403595 34863507 35220465 35678494
36208 35678494 35463813 34602821 33991209 34596754 36621870 39512937 42726431 46377486 51158696
36199 51158696 57707771 66015172 75302915 84401305 92313455 98619141 103640176 108465310
36191 108465310 114731195 123937458 136554139 151718426 167939810 184190373 200377213
36184 200377213 216931646 234080110 251393948 267771388 281723112 291762428 296715783
36177 296715783 295931258 289501308 278423158 264383552 249140228 233977912 219595547
36170 219595547 206200254 193556369 181236801 169211765 158151584 148860607 141424169
36163 141424169 135173159 129446518 124029169 118777901 113233753 106904180 99741217 92105552
36155 92105552 84404202 76993450 70321012 64876761 60939390 58440038 56982811 55880548
36147 55880548 54338266 51909741 48817676 45636804 42637905 39636241 36520762 33665096
36139 33665096 31579219 30227891 28925715 27024348 24675671 22856799 22598651 24160939
36131 24160939 26949574 30183772 33502513 36843279 39918318 42152523 43247570 43569711
36123 43569711 43746539 43958507 43831035 42995729 41542510 39868491 38265353 36758348 35202547
36114 35202547 33379696 31079636 28270196 25216982 22339971 19934190 18099724 16938428
36106 16938428 16716916 17774271 20262456 23909428 27934441 31235994 32874196 32567236
36098 32567236 30792774 28430404 26291906 24838827 24096507 23733930 23351036 22806915 22219648
36089 22219648 21602428 20619135 18811627 16000225 12376055 8311787 4239669 643355
36081 643355 -2049856 -3637781 -4124180 -3556847 -2032930 115597 2309733 4014337 5002290
36072 5002290 5315411 5083006 4466879 3699490 3035485 2636558 2553689 2834122 3616371 5107754
36062 5107754 7466295 10682421 14557960 18809552 23192957 27483732 31286870 33893160
36054 33893160 34481694 32700870 29194508 25472142 23035059 22470262 23336888 24811231
36046 24811231 26273318 27328766 27621349 26920318 25342442 23323682 21389483 19995045
36038 19995045 19402682 19502246 19850911 20121180 20463954 21228958 22422778 23753269 25197760
36029 25197760 27154342 29856652 32855895 35229027 36161345 35331988 33102596 30568275
36021 30568275 29116779 29476472 31124930 32809183 33659276 33726117 33591416 33692340 33991303
36012 33991303 34099131 33708600 33044742 32858212 33805725 35805892 38066386 39657374 39961672
36003 39961672 38799187 36526461 34071117 32486928 32160564 32492140 32470815 31543051 29955579
35994 29955579 28463383 27804311 28241034 29354659 30311868 30530101 30147052 29784467 29876086
35985 29876086 30301264 30614945 30470656 29785546 28663614 27336331 26174374 25599636 25830746
35976 25830746 26672250 27620723 28269348 28637125 29071283 29820657 30750888 31492302 31782491
35967 31782491 31560174 30742234 29061236 26258857 22438590 18148010 14096284 10841859
35959 10841859 8722766 7899642 8291054 9523275 11158421 13057946 15396030 18218133
35951 18218133 21097109 23380358 24744103 25358124 25503941 25217065 24444671 23475577 23010345
35942 23010345 23678904 25501978 27885518 30138876 31945540 33347596 34409736 35017362
35934 35017362 34960602 34110511 32549275 30663530 29092675 28372894 28485763 28821871 28683512
35925 28683512 27800686 26348937 24582063 22522922 19914313 16392172 11829262 6659025
35917 6659025 1817430 -1750701 -3532740 -3439085 -1593460 1675373 5768577 9982575
35909 9982575 13719999 16452402 17749266 17772182 17686894 19048967 22461903 27022152 31238023
35900 31238023 34279578 36212057 37388968 38030762 38234568 37941125 36862962 34824839
35892 34824839 32294518 30245319 29254009 28924526 28452660 27661138 27220596 27840622 29447196
35883 29447196 31212601 32205564 31871608 30025719 26694795 22159361 17082492 12395368
35875 12395368 8901607 6932085 6337285 6728628 7666448 8673293 9235990 8968640 7861404
35866 7861404 6370602 5211631 4964048 5747446 7187118 8712146 9999127 11218164
35858 11218164 12832782 15079648 17595767 19576421 20364831 19977577 19136192 18790703 19510647
35849 19510647 21208196 23362540 25435008 27018577 27727949 27298889 26005943 24739958
35841 24739958 24265113 24374989 24106567 22883917 21177197 19944613 19779663 20819064 23077902
35832 23077902 26354895 29917842 32801478 34569389 35514712 36043315 36142244 35567881 34300962
35823 34300962 32638140 30981439 29652687 28745764 27987775 26826604 24819814 22000713
35815 22000713 18918894 16389213 15087415 15135877 16014105 17023424 17869068 18660129 19435544
35806 19435544 20025310 20416386 20842884 21254964 20967814 19158974 15633708 10956949 6041199
35797 6041199 1830385 -853149 -1594454 -622664 1385094 3744225 5990668 7911482
35789 7911482 9573219 11137796 12378504 12549881 11097094 8417692 5568631 3263353
35781 3263353 1521209 263183 -237613 333501 1938085 4285696 6997922 9443522
35773 9443522 10736865 10314381 8512580 6413932 5142798 5266368 6542626 8032409
35765 8032409 8743309 8552579 8437819 9518324 11907615 14736491 17196609 19198567 20973201
35756 20973201 22415281 23074131 22616399 21050765 18535495 15170687 11089809 6736289
35748 6736289 2964067 705505 354151 1401450 2743988 3431447 3196084 2421161 1786750
35739 1786750 1932903 3199650 5440348 8077794 10478418 12336825 13684922 14589915
35731 14589915 14986260 14844181 14358730 13817108 13313277 12744259 12101753 11599201 11420768
35722 11420768 11486526 11598922 11681937 11656419 11170653 9790049 7570642 5229890 3610314
35713 3610314 3110897 3698082 5194029 7326590 9715686 12144525 14751026 17617972
35705 17617972 20215964 21649727 21580203 20605632 19590407 18899717 18462721 18249152 18330182
35696 18330182 18669287 19243097 20240822 21667464 22727045 22126742 19288254 14964859 10420041
35687 10420041 6319314 2767105 57090 -1335196 -1584846 -1730318 -2693422 -4403793
35679 -4403793 -6194221 -7721689 -9000248 -9673005 -8890161 -6196828 -2250498 1633597
35671 1633597 4582311 6717661 8795296 11488442 14921382 18642350 21936221 24211818
35663 24211818 25181483 24832344 23433352 21580917 19970919 18921711 18240289 17719182 17604157
35654 17604157 18297013 19662313 20941174 21415047 20933971 19762249 18194270 16449437
35646 16449437 14665422 12760739 10483645 7814183 5124379 2663072 96205 -2973177
35638 -2973177 -6067472 -7983564 -8143843 -7394060 -7059091 -7435593 -7643752 -6836693 -5041043
35629 -5041043 -2728673 -76677 2976447 6185403 8939100 10812396 11994826 13125285
35621 13125285 14777219 17051301 19509223 21448245 22311178 21912390 20378303 18035062
35613 18035062 15385352 12963825 10989645 9249110 7540730 6189989 5872132 6878124
35605 6878124 8753422 10727778 12340311 13607636 14805835 16220704 17936212 19695671
35597 19695671 21073433 21928483 22620272 23696367 25487765 28061238 31270462 34549955
35589 34549955 36849870 37263290 35888439 33862835 32448102 32201787 32945481 34103374
35581 34103374 34838237 34181201 31483299 26813903 20788664 14104341 7437580 1655234
35573 1655234 -2295336 -3896251 -3309848 -1039786 2481319 6871049 11590841 16006345
35565 16006345 19593696 21944464 22741108 22078356 20816388 20207129 20868733 22257901 23372467
35556 23372467 23877972 24341214 25495043 27626363 30683712 34534857 38813455 42750380
35548 42750380 45551861 46966610 47261024 46669470 45172547 42919131 40579065 38963183
35540 38963183 38270883 37834579 36614519 33903182 29669027 24478318 19239517 14916667
35532 14916667 12205198 11224979 11448157 12043481 12479864 12904756 13943245 16108348 19364393
35523 19364393 23144103 26646508 29114012 30001521 29095246 26588221 23077995 19477336
35515 19477336 16816926 15930436 17145685 20178439 24253799 28304124 31201300 32123901
35507 32123901 30951577 28304945 25092860 21990616 19333353 17344479 16247866 16105669
35499 16105669 16640699 17273899 17350526 16433325 14517690 11971911 9188605 6315184 3398809
35490 3398809 691865 -1412560 -2763870 -3541184 -3872217 -3614822 -2738339 -1748058 -1370215
35481 -1370215 -1714631 -1935815 -874338 1963880 6024082 10144080 13306687 15088046
35473 15088046 15596816 15149689 14045260 12534684 10825240 9057087 7404970 6274764
35465 6274764 6232654 7545563 9853831 12481312 15043162 17582349 20149962 22471669
35457 22471669 24043134 24360101 23098454 20414747 17161173 14392255 12333240 10101776
35449 10101776 6854798 3068943 230400 -753367 -411077 98654 184542 -64721 -580890
35440 -580890 -1610720 -3317090 -5427565 -7366314 -8551034 -8560837 -7288474 -5094458 -2688415
35431 -2688415 -713216 539007 1024591 776554 -7173 -839472 -1144470 -603550 793580
35422 793580 2913255 5399143 7442651 8083676 7114962 5553346 4881862 5834370 8141151
35413 8141151 11303367 15093110 19151048 22632411 24765480 25593249 25711135 25309069 23921705
35404 23921705 21254253 17887828 14890266 12878803 11668538 10737257 9819331 9027299
35396 9027299 8505324 8029734 7033318 5183962 2977646 1545124 1656275 2974696 4481142
35387 4481142 5606597 6718439 8387526 10365223 11564848 11152601 9532310 8093642
35379 8093642 7987924 9265694 11179942 13027712 14432199 14992518 14190033 11940430 9032596
35370 9032596 6661939 5429642 4912477 4260337 3134103 2000464 1570022 2091684 3292555
35361 3292555 4872368 6698060 8324514 8668208 6743082 2885824 -1099005 -3292181
35353 -3292181 -3089608 -1301759 809183 2367766 3084978 3071380 2493705 1278992 -713090
35344 -713090 -3067144 -4624577 -4316363 -2132966 1031820 4385863 7676844 10693021
35336 10693021 12925398 14034420 14312950 14332698 14261893 13770046 12516584 10567076 8433696
35327 8433696 6859607 6438764 7218354 8633740 9877252 10300839 9543305 7578728 4832919
35318 4832919 2044807 -260432 -2090127 -3581228 -4398861 -3862890 -1750691 1244571
35310 1244571 4008416 5910124 7182724 8491544 10207015 12088151 13594883 14375029
35302 14375029 14351112 13460085 11625608 9135503 6846714 5769056 6422666 8603184 11578823
35293 11578823 14405701 16341155 17327296 18041635 19207577 20862158 22484107 23690861
35285 23690861 24437233 24594840 23871620 22374824 20851318 20007296 19794202 19681732 19466878
35276 19466878 19434463 19742230 19984560 19468691 17754359 14921660 11565864 8655725 7204586
35267 7204586 7822544 10475667 14623777 19523817 24439419 28750965 32061984 34280214
35259 34280214 35577414 36189720 36156247 35256486 33357735 30920049 29004885 28555559 29651132
35250 29651132 31568866 33491093 34958750 35745229 35708326 34989758 34156070 33911522 34722430
35241 34722430 36749628 39834883 43231948 45529330 45362809 42489440 38061079 33725244
35233 33725244 30483508 28340003 26747769 25169106 23332499 21266392 19254806 17687135
35225 17687135 16781911 16350630 15847840 14741489 12885508 10531008 8053199 5833747
35217 5833747 4403039 4376619 5942779 8480324 10928597 12522177 12992344 12210785 10098341
35208 10098341 7030052 3971315 1913591 1271000 1900738 3431721 5374600 7213707
35200 7213707 8762276 10281829 11895211 12989848 12630717 10610800 7729535 4931350
35192 4931350 2512362 351523 -1424638 -2407786 -2482404 -2113764 -1908341 -1954697 -1701756
35183 -1701756 -541561 1500652 3737076 5502133 6727633 7723275 8565326 8985853 8801043
35174 8801043 8094163 6897748 5045650 2578614 88036 -1609894 -2086657 -1470379 -157100
35165 -157100 1453158 3046009 4452602 5608386 6315087 6137909 4798696 2727593 1021145
35156 1021145 664480 1750188 3463166 4829956 5518918 5953007 6661874 7580096 8056771
35147 8056771 7509979 5936277 3801115 1637121 -196432 -1591489 -2679868 -3564525
35139 -3564525 -3906301 -2991781 -505659 2814296 5524071 6516767 5698197 3828294 1899140
35130 1899140 494667 -575779 -2015930 -4176683 -6436968 -7622734 -6993302 -4645970
35122 -4645970 -1154594 2742231 6126471 8176479 8841538 8997755 9600638 10743923 11698616
35113 11698616 11724631 10669992 8949861 7215989 6001629 5426583 5127180 4515791 3161775
35104 3161775 1037783 -1398190 -3324632 -4010345 -3352816 -1880088 -130691 1786941
35096 1786941 3881557 5784133 6898533 6971180 6231074 5018000 3569848 2147456 977377
35087 977377 -83189 -1512736 -3488498 -5431758 -6432708 -6074419 -4669474 -2781791
35079 -2781791 -784008 1082158 2477737 3025560 2587013 1417479 97038 -671264 -369984
35070 -369984 1003076 2918031 4795217 6512427 8245866 9809682 10504458 9874309 8369717
35061 8369717 6880840 5720718 4507292 3078418 2033637 2108118 3344367 5189297
35053 5189297 7142208 8931687 10252299 10850001 10975311 11414360 12878763 15468919 18736381
35044 18736381 22054748 24855941 26709255 27366483 26787848 25208150 23242441 21722513
35036 21722513 21101976 21028246 20797511 20262470 19962964 20274126 20822454 21006875 20774624
35027 20774624 20487438 20185369 19417064 17832516 15652025 13508347 12043575 11604493 11942671
35018 11942671 12071369 10794711 7798756 4222079 1901609 1925962 3898761 6479309
35010 6479309 8464680 9392462 9403088 8839892 8065172 7466937 7336412 7587494 7742938
35001 7742938 7456195 7070775 7399332 8761364 10412943 11229014 10943953 10432382 10671763
34992 10671763 11721075 12970154 14157602 15665698 17717851 19670776 20410205 19336319
34984 19336319 16786869 13674018 11005157 9650217 10100781 12156072 14931373 17322053
34976 17322053 18487366 18037157 16118670 13521070 11469267 10996736 12463358 15684481
34968 15684481 20273198 25592943 30540052 33808327 34564315 32806955 29162480 24573224
34960 24573224 20118709 16687111 14508293 13114355 11911382 10692744 9526488 8367013
34952 8367013 6989208 5169915 2741019 -367195 -3823184 -6700781 -7967438 -7319173
34944 -7319173 -5341623 -2758037 255982 3857182 7859659 11575067 14296389 15708232
34936 15708232 15822105 14826901 13244890 12071925 12346225 14306301 17010396 18948907
34928 18948907 19128881 17654871 15476641 13779997 13492973 14921199 17521297 20140882
34920 20140882 21810993 22432275 22610525 22853971 23117807 23182096 23263137 24026674 25971020
34911 25971020 28867529 31819582 33862716 34572278 34193861 33273539 32234170 31315130 30755872
34902 30755872 30763758 31194964 31464580 31051108 30146947 29636322 30262757 31800756 33106629
34893 33106629 33016144 31232159 28463656 25853965 24252293 23772371 23784036 23347782 21898126
34884 21898126 19640359 17235906 15142214 13452972 12371610 12468610 14189627 17290858
34876 17290858 21032179 24776109 28092304 30448332 31314911 30688261 29127778 27117107
34868 27117107 24700182 21905339 19178448 17087970 15768316 14865244 13868541 12358637
34860 12358637 10211672 7840502 6019820 5182239 5064459 5274944 5846087 6728491 7018751
34851 7018751 5463967 1882017 -2494653 -6331459 -9386803 -12134075 -14655199 -16357374
34843 -16357374 -16541717 -14843551 -11300214 -6482768 -1600668 1935549 3332629 2817890
34835 2817890 1325723 -45859 -383012 810023 3400413 6675216 9795820 12331329
34827 12331329 14366095 16077123 17237516 17215661 15514844 12262884 8116349 3781404
34819 3781404 -227298 -3445753 -5381726 -5743532 -4676888 -2726846 -626963 953628
34811 953628 1716436 1886630 1891114 1821295 1402791 514129 -606215 -1828967 -3415901 -5443164
34801 -5443164 -7191337 -7633499 -6562810 -4871002 -3655934 -3367274 -3864645 -4901420 -6311283
34792 -6311283 -8009893 -10159768 -13237888 -17606154 -22905670 -28034693 -31885195 -34133804
34784 -34133804 -35282932 -35939161 -36141932 -35482324 -33784672 -31423922 -28895713 -26318856
34776 -26318856 -23555359 -20595348 -17476629 -13910397 -9407261 -3931207 1787204 6700061
34768 6700061 10074734 11737292 12037248 11681882 11220123 10355850 7987232 3339277 -2930497
34759 -2930497 -9047610 -13634243 -16766078 -19525265 -22736417 -26278445 -29495059 -32044226
34751 -32044226 -34234555 -36548996 -38918971 -40581507 -40749191 -39430074 -37524904 -36071622
34743 -36071622 -35391049 -34955782 -34033052 -32399168 -30450175 -28730580 -27461675 -26495828 -25568183
34734 -25568183 -24495007 -23214841 -21764688 -20193167 -18398276 -16078554 -12968127 -9146433
34726 -9146433 -5053430 -1223456 1914885 4054516 5054126 5072364 4559610 4020386 3779552
34717 3779552 3916401 4277992 4546662 4483675 4231318 4279979 5014018 6295898 7499099
34708 7499099 7861133 6829139 4328799 954664 -2153896 -3913324 -4024083 -3205235 -2698150
34699 -2698150 -3427570 -5473323 -8226936 -11000921 -13446796 -15430913 -16755518 -17287563
34691 -17287563 -17339026 -17612520 -18592408 -20097460 -21507623 -22279467 -22155987 -21091997 -19219269
34682 -19219269 -16823072 -14146951 -11204157 -7905433 -4385207 -1109288 1377521 2818828
34674 2818828 3434640 3792406 4426361 5504816 6838821 8112642 8948889 8799556 7075375
34665 7075375 3591366 -1165837 -6246496 -10607761 -13364519 -14060320 -12895788 -10441874
34657 -10441874 -6920280 -2022657 4275385 10934596 16243256 18943435 18837106 16628121
34649 16628121 13633792 11423667 10995835 12007634 13144666 13433952 12966897 12325262 11770990
34640 11770990 11273069 10953857 11035553 11389719 11462407 10750162 9285955 7682391 6735324
34631 6735324 6892081 8026194 9762247 11988837 14925941 18731133 23262621 28236110
34623 28236110 33311025 37900634 41233985 42952847 43563677 44034162 44911860 45925648
34615 45925648 46351681 45609589 43584753 40617776 37307091 34295576 32173455 31406972
34607 31406972 32072247 33537580 34623688 34365130 32674652 30198301 27567075 24881008
34599 24881008 21885688 18541342 15357975 13117589 12196169 12193138 12342813 12262939 12147156
34590 12147156 12259295 12479466 12386509 11534627 9580391 6463750 2700175 -711483 -2937914
34581 -2937914 -3832662 -3781181 -3284897 -2830223 -2805729 -3160665 -3298180 -2666465 -1408008 -177338
34571 -177338 557590 728783 310627 -847454 -2791138 -5328552 -8088848 -10407198 -11215071
34562 -11215071 -9526652 -5292898 385671 5989223 10413993 13215968 14457824 14499465
34554 14499465 13700579 12146448 9749559 6590534 2925323 -1107236 -5402437 -9413819
34546 -9413819 -12166261 -13013347 -12130762 -10070778 -7206875 -4018528 -1620303 -1313207 -3373936
34537 -3373936 -6602810 -9326548 -10788630 -11505086 -12422777 -13884980 -15345184 -15892522 -14981462
34528 -14981462 -12807339 -10232924 -8425516 -8306631 -10002511 -12743373 -15445587 -17465533
34520 -17465533 -18773522 -19553827 -19887494 -19766906 -19078739 -17480658 -14609182 -10635544 -6471585
34511 -6471585 -3253745 -1636738 -1477716 -1879152 -1511949 602695 4217569 7912332 10284471
34502 10284471 10983186 10483870 9263698 7634308 6127745 5450694 5973995 7586820 9996355
34493 9996355 12759192 15038847 15879352 14985138 12921706 10337313 7277160 3512067
34485 3512067 -713004 -4599613 -7390804 -8837793 -9203022 -9095516 -9303541 -10507388 -12953034
34476 -12953034 -16381655 -20261122 -24050998 -27305042 -29650029 -30747265 -30327257 -28370467
34468 -28370467 -25336703 -22123423 -19581275 -17934579 -16683656 -15084592 -12662553 -9273545
34460 -9273545 -4915007 201936 5374970 9567440 12171124 13540795 14513163 15416522
34452 15416522 15807904 15195967 13737286 12144711 11189573 11376897 12701436 14381242 15066415
34443 15066415 13736395 10455785 6184128 2081264 -825399 -1739095 -512217 2054533
34435 2054533 4866573 7617104 10840124 14824769 18935286 22209514 24239628 25183644
34427 25183644 25221404 24357937 22635234 20288403 17777441 15787932 14979346 15473004 16687259
34418 16687259 17878808 18772281 19521525 20185576 20427995 19657289 17358579 13456760 8547044
34409 8547044 3651652 -458728 -3697846 -6438353 -9138276 -12353418 -16747319 -22565542
34401 -22565542 -29059721 -34748756 -38372843 -39548622 -38699512 -36693029 -34513247 -32893442
34393 -32893442 -32033987 -31711153 -31598719 -31320561 -30319555 -28066038 -24534673 -20262277 -15839601
34384 -15839601 -11542802 -7551064 -4291987 -2355086 -2086895 -3280098 -5121550 -6465608
34376 -6465608 -6489487 -5345936 -4061052 -3552539 -3730481 -3664576 -2597452 -685264 1222250
34367 1222250 2397618 2807782 2990817 3502706 4576068 6300550 8915232 12603422 16891556
34358 16891556 20486595 22043400 21240797 19058098 16913753 15472177 14221996 12145027
34350 12145027 8758372 4537751 453329 -2760492 -4913596 -6222207 -7092259 -7926320
34342 -7926320 -8842866 -9482570 -9236893 -7775854 -5326874 -2470312 221602 2389509 3986037
34333 3986037 5332274 6983467 9380388 12550910 16050161 19075436 20743433 20604565
34325 20604565 19121653 17528329 16961773 17605069 18635650 18966732 18109347 16539018 15362347
34316 15362347 15509688 17069702 19364523 21658895 23702537 25589655 27332385 28789714
34308 28789714 29920656 30856450 31651200 32070999 31695229 30215888 27678481 24508000 21307743
34299 21307743 18585508 16621600 15480129 14967618 14557771 13595204 11816452 9656048
34291 9656048 7878537 6840844 6121708 4840232 2358335 -1151168 -4675240 -6976187
34283 -6976187 -7438604 -6421572 -4861781 -3666578 -3448440 -4463187 -6446196 -8604099
34275 -8604099 -10092719 -10549539 -10014959 -8497814 -6026696 -3159749 -981769 -268366 -794546
34266 -794546 -1633431 -1949654 -1317446 487707 3582543 7762427 12358632 16354018 18608144
34257 18608144 18193586 14943434 9878479 4921974 1904172 1646129 3829944 7557396
34249 7557396 11990405 16654223 21387122 26119934 30697119 34878823 38479848 41467098
34241 41467098 43930679 46006179 47792729 49206544 49831695 49034897 46449959 42454332
34233 42454332 38098307 34439050 31846308 29871055 27719398 24872790 21368088 17605078
34225 17605078 13959219 10623884 7806116 5905643 5268409 5723962 6575307 7196797 7511281
34216 7511281 7726449 7783648 7389863 6544770 5624269 4753297 3387707 827814 -2937205
34207 -2937205 -7102159 -10679758 -13072715 -14132196 -13983439 -12923258 -11345670 -9632212
34199 -9632212 -8066020 -6745928 -5483780 -3891239 -1755102 700556 3069516 5197970
34191 5197970 7151251 8838187 10026971 10804450 11647373 12769296 13589759 13138443 10983880
34182 10983880 7693412 4523339 2763655 3139437 5497982 9007270 12747665 16071846
34174 16071846 18407724 19082723 17763329 15017240 12068719 9878727 8613303 7925474
34166 7925474 7391519 6593737 5168509 3080064 711595 -1485592 -3262579 -4328500
34158 -4328500 -4115689 -2230823 833449 3797276 5622536 6341699 6773301 7563402 8692683
34149 8692683 9880135 11214547 13154174 15874301 18787344 20901406 21675694 21412738
34141 21412738 20813697 20339653 20100435 20131311 20450386 20825036 20741480 19768580 17897584
34132 17897584 15483302 12925674 10405796 7786882 4726978 1064653 -2780464 -5952310
34124 -5952310 -7937879 -9168268 -10605509 -12634982 -14478062 -14755807 -12547008 -7935310
34116 -7935310 -1840876 4401932 9466444 12553174 13835605 14291097 14822767 15496180 15775084
34107 15775084 15498283 15368492 16255745 18068220 19504731 19008877 15966902 11084537 5811947
34098 5811947 1445083 -1489814 -3332338 -4883538 -6734249 -8794227 -10417564 -11002543
34090 -11002543 -10493906 -9377712 -8314281 -7815255 -8129968 -9219080 -10727972 -12045243
34082 -12045243 -12524991 -11803202 -10064885 -8124995 -7177705 -8165322 -11062759 -14673600 -17268596
34073 -17268596 -17635630 -15678246 -12165868 -8061811 -4062397 -493425 2661248 5681830
34065 5681830 8919265 12621981 16988098 22236427 28270996 34139856 38178496 39183162
34057 39183162 37567329 35135274 33562146 33131477 32884921 31705624 29097371 25199287
34049 25199287 20524212 15842866 12030610 9617237 8313407 7101983 5041411 2138528
34041 2138528 -578831 -1913524 -1407966 581588 3475846 6800672 9934503 11989983
34033 11989983 12347507 11196583 9226119 6825967 3934462 696143 -2148558 -3791646
34025 -3791646 -4059321 -3364273 -2171449 -815284 310442 840209 860627 989729 1853253
34016 1853253 3584786 5901726 8481431 11097382 13500145 15368926 16417892 16519289
34008 16519289 15799665 14670789 13611623 12716927 11496277 9318235 6099591 2416561
34000 2416561 -1108249 -4374924 -7664441 -11053371 -14139106 -16333266 -17286518 -16972455
33992 -16972455 -15464982 -12793427 -9093866 -4858106 -909686 1989315 3584732 4245802
33984 4245802 4697159 5613185 7291347 9475667 11395021 12073991 10795895 7462263 2707688
33975 2707688 -2239024 -6006792 -7809689 -7965409 -7572648 -7482783 -7619975 -7391737 -6573702
33966 -6573702 -5478401 -4289928 -2647469 -158726 2867799 5543750 7307133 8533471
33958 8533471 10178698 12907956 16578948 20401574 23462609 25192636 25567669 25024680
33950 25024680 24193114 23640471 23781891 24891462 27037816 29942057 32980259 35445138
33942 35445138 36837445 36888528 35380230 32119664 27200316 21246765 15303916 10401512
33934 10401512 7090658 5197019 3909322 2233953 -356014 -3485669 -5996406 -6570371
33926 -6570371 -4495044 -144074 5148984 9846851 13091035 14983068 16131352 17125671
33918 17125671 18453312 20505756 23213667 25752096 27066952 26888493 26031601 25628119
33910 25628119 26287998 28036093 30662120 33824016 37009543 39693595 41448157 41739072
33902 41739072 39877216 35589206 29628141 23492956 18440922 14870846 12492831 10709930
33894 10709930 8845225 6504791 4063264 2595469 3020795 5321487 8702714 12386816
33886 12386816 16076125 19758695 23347190 26582977 29122029 30585610 30600193 28950130
33878 28950130 25772840 21550798 16809992 11825839 6735128 1940260 -1826512 -4043538
33870 -4043538 -4891802 -4976627 -4623880 -3735732 -2353320 -1011057 -312778 -325761 -588584
33861 -588584 -614135 -206572 664457 2123168 4436620 7768337 11818752 15737448 18524323
33852 18524323 19564797 18762986 16373388 13061455 10079836 8831953 9854872 12342487
33844 12342487 14820307 16120705 15701462 13568226 10353287 7164845 4797759 3138973
33836 3138973 1696130 484004 -170749 -584226 -1744776 -4157753 -7162807 -9649674
33828 -9649674 -11030441 -11261625 -10372308 -8406336 -5586177 -2171747 1658797 5491309
33820 5491309 8478647 9890322 9836072 9199356 8946255 9693738 11685976 14693034 17893113
33811 17893113 20240067 21145636 20729683 19484634 17913973 16418304 15201159 14193894
33803 14193894 13248860 12403945 11769927 11249467 10726036 10577833 11608363 14193122 17637087
33794 17637087 20548492 21785578 21048202 18828150 16002454 13356409 11279215 9830342
33786 9830342 8989084 8647267 8389020 7608539 6044961 4047149 2194474 849667 193138
33777 193138 372154 1261647 2212317 2412428 1561869 12425 -1712941 -3322750 -4742142
33768 -4742142 -6015065 -7321137 -8870534 -10636006 -12275399 -13365486 -13616409 -12880914
33760 -12880914 -11172923 -8780739 -6205626 -3853667 -1855959 -225442 995537 1896218
33752 1896218 2848061 4204210 5773591 6744792 6262343 4104741 836390 -2612599 -5487744
33743 -5487744 -7447701 -8431724 -8392547 -7181926 -4724654 -1384122 1807758 3463568 2766287
33734 2766287 358929 -1806971 -1890037 319930 3293445 5193427 5354666 4409485 3288071
33725 3288071 2431439 1934327 2033496 3066478 4919822 6766652 7576469 6919003 5194467
33716 5194467 3092209 978972 -1086374 -2902920 -4013341 -4186040 -3870694 -3972263 -5147678
33707 -5147678 -7412064 -10396031 -13758782 -17153079 -19888573 -21019249 -20102480 -17837739
33699 -17837739 -15630018 -14329330 -13548608 -12393781 -10690360 -9170651 -8493394 -8480639 -8521853
33690 -8521853 -8453590 -8702183 -9604609 -10864345 -11785966 -11968856 -11734236 -11881612 -12946588
33681 -12946588 -14599328 -15809418 -15685290 -14123579 -11630773 -8732283 -5802960 -3344302
33673 -3344302 -1981264 -1931852 -2624418 -3043829 -2450552 -738358 1715335 4306145 6352033
33664 6352033 7301921 7065076 6153803 5345711 5053103 4969626 4349338 2643109 -111842
33655 -111842 -3388431 -6453270 -8578133 -9339386 -9080781 -9019888 -10484140 -13757112 -17701779
33646 -17701779 -20577056 -21183272 -19328838 -15571279 -10792380 -5874655 -1418707 2408908
33638 2408908 5721021 8567826 10712443 11648551 10843791 8195210 4438306 962538
33630 962538 -1082854 -1596623 -1395860 -1399840 -2116613 -3763403 -6425522 -9873994 -13442572
33621 -13442572 -16317038 -17916111 -17987376 -16593056 -14216593 -11724147 -9922384 -9079848
33613 -9079848 -8918775 -8949950 -8691795 -7758978 -6075152 -4028019 -2167142 -664860 764483
33604 764483 2372314 3979980 5122411 5403153 4653604 2978542 798803 -1347325 -3264812
33595 -3264812 -5249900 -7558082 -9786035 -10990842 -10403516 -7878093 -3768883 1270261
33587 1270261 6263418 10010541 11553523 10643542 7782782 3922406 103168 -2894140
33579 -2894140 -4829664 -5966709 -6685977 -7189720 -7601159 -8111894 -8746520 -9035314 -8234497
33570 -8234497 -6027988 -2907290 205722 2592405 3955443 4253732 3644740 2639657
33562 2639657 2037230 2380244 3404452 4216682 4198633 3668377 3479324 4037912 4992358
33553 4992358 5887813 6693418 7409681 7559060 6678837 5299288 4852266 6315675 9193685
33544 9193685 11971095 13277145 12479654 9624644 5324150 610927 -3519226 -6539941
33536 -6539941 -8303957 -8733263 -7889077 -6205163 -4274150 -2407534 -689299 622471
33528 622471 1163338 967502 508711 160726 44912 559982 2549650 6520246 11947333
33519 11947333 17714727 23022516 27509863 30742262 32151277 31545501 29313837 26074457
33511 26074457 22437414 19109265 16773845 15604326 15099914 14594477 13804918 12816372 11767174
33502 11767174 10731220 9775982 8996044 8589225 8942866 10398506 12727769 14990929 16138893
33493 16138893 15723040 13958670 11340388 8466876 6067290 4751945 4587951 5120515
33485 5120515 5895957 6795365 7809317 8732113 9273205 9358121 9145028 8798072 8387390
33476 8387390 7954260 7460316 6590954 4751736 1438793 -3324586 -8915433 -14424302 -18994526
33467 -18994526 -21945501 -22819778 -21571321 -18785563 -15578614 -13044886 -11590191 -10705380
33459 -10705380 -9473751 -7502596 -5449864 -4484476 -5049801 -6242389 -6638850 -5744574 -4434165
33450 -4434165 -3973594 -4870441 -6699657 -8614165 -9701282 -9175016 -6838181 -3503357 -623002
33441 -623002 712862 352621 -1235338 -3469840 -5669973 -6891397 -6210164 -3314744 1274151
33432 1274151 6584529 11710687 15989585 18897674 20074757 19623175 18287829 17051443
33424 17051443 16381725 15999605 15523284 15157441 15470226 16587269 17960428 18968552 19420454
33415 19420454 19386440 18900457 18026972 16885743 15311623 12782172 9129210 5224777 2517699
33406 2517699 1785413 2573028 3863039 5034030 6175005 7825474 10544703 14404424
33398 14404424 18610734 21762652 22768815 21606139 19241183 17008239 16100988 17259635
33390 17259635 20415946 24510913 27937614 29453760 28814003 26675076 24047334 21777171
33382 21777171 20265440 19446456 19039658 18928724 19322739 20493741 22304708 23974198 24349105
33373 24349105 22574985 18728322 13905477 9611278 6896145 5940246 6298819 7356828
33365 7356828 8545999 9428791 9897836 10260514 10841878 11436022 11404599 10459183 9116059
33356 9116059 8150035 7764546 7580079 7327778 7192509 7457719 8196659 9490195 11635348
33347 11635348 14808448 18599150 22103987 24474011 25286033 24539324 22561192 19923596
33339 19923596 17204919 14652708 12076418 9106117 5582032 1755455 -1844842 -4776289
33331 -4776289 -6944794 -8502266 -9574236 -10243399 -10726582 -11230389 -11494064 -10777802 -8576256
33322 -8576256 -5164342 -1201426 2966550 7253950 11299774 14534403 16834653 18657809
33314 18657809 20377262 21859199 22861660 23465072 23823126 23774459 23031279 21584600 19643812
33305 19643812 17335586 14771672 12301881 10350321 8998886 8026877 7401370 7428323 8255920
33296 8255920 9420710 10122117 9967596 9373596 9235975 10241128 12450818 15419756 18578091
33287 18578091 21485460 23868765 25585886 26555741 26641947 25671370 23705803 21197123 18603522
33278 18603522 15855871 12528829 8641243 4930549 2074635 -74493 -2104699 -4038327
33270 -4038327 -5154973 -4915682 -3787370 -2969406 -3344963 -4703451 -5921976 -5950646 -4714986
33261 -4714986 -3033024 -1661575 -635100 369633 1376045 2202867 3012844 4223895
33253 4223895 5784608 6967994 7124657 6432461 5759651 5953213 7282040 9242829 10721651
33244 10721651 10639861 8804687 6142109 3993678 3240517 4064204 6180386 8991034 11688204
33235 11688204 13605341 14572196 14807435 14498892 13644631 12284256 10720556 9446757 8854557
33226 8854557 8921127 9125310 8813840 7787261 6422349 5106894 3748501 2096416 426763
33217 426763 -428654 219614 2382297 5466089 8530695 10455649 10357266 8278680 5390833
33208 5390833 3224898 2620262 3395712 4809921 6121453 6863146 6952898 6673319 6392684
33199 6392684 6222005 6032704 5816887 5871505 6543209 7888924 9648645 11437234 12867005
33190 12867005 13595372 13431528 12403295 10602641 7959226 4306254 -246825 -5104063
33182 -5104063 -9499049 -13060669 -15987402 -18610793 -20860265 -22269932 -22492636 -21657943
33174 -21657943 -20177055 -18385529 -16555835 -15087602 -14295896 -13925978 -13219715 -11704790
33166 -11704790 -9689642 -7699135 -5646327 -3018960 147031 2979123 4651619 5222602
33158 5222602 5386758 5725306 6489084 7798493 9556027 11223668 12136919 12132851 11566440
33149 11566440 10667376 9264952 7353009 5637654 5201574 6652251 9703793 13475477
33141 13475477 17097641 20215027 23115561 26266169 29516866 31862738 32286863 30892930
33133 30892930 28999298 28035028 28485687 29936554 31841620 33941885 35999972 37489083
33125 37489083 37813888 36831599 35025395 33097657 31381446 29600726 27134851 23538822
33117 23538822 18940415 14045064 9745080 6649867 4932703 4526758 5285735 6859526
33109 6859526 8564350 9613098 9529335 8274734 6086694 3452867 1254370 554443 1871346
33100 1871346 4633214 7495023 9212845 9217204 7599717 4930124 2171309 448060 500534
33091 500534 2181380 4490939 6184427 6505962 5551945 4065467 2857367 2302488 2262547
33082 2262547 2385509 2427148 2343169 2208581 2133752 2223842 2541963 3095422 3900646 5079278
33072 5079278 6828463 9190464 11803485 13960900 15072080 15154152 14837838 14838939 15453351
33063 15453351 16606244 18291542 20735171 23982448 27422699 29976758 30922892 30470196
33055 30470196 29329315 27686744 24839372 20106727 14074421 8636121 5591878 5257934
33047 5257934 6530064 8137458 9602068 11095785 12812289 14721120 16657155 18240288
33039 18240288 18729953 17376834 14203575 10353984 7502562 6879486 8747771 12455803
33031 12455803 16718469 20079760 21642582 21613209 21010985 20751866 21098690 21915480 23079129
33022 23079129 24449902 25742675 26794024 27880309 29472655 31648775 33901853 35461437
33014 35461437 35622919 33938239 30539591 26403574 22923480 20871853 19817169 18695222
33006 18695222 16880971 14599424 12422538 10623698 9150577 8162275 8368591 10511204
32998 10511204 14312405 18137440 20111704 19696779 17950407 16200754 14800453 13342388
32990 13342388 11698339 10368382 9860782 10079222 10354782 9830473 7830559 4244657 -166467
32981 -166467 -3977880 -5945825 -5881688 -4761481 -3924950 -4037872 -4724482 -5169795 -5020700
32972 -5020700 -4608709 -4370537 -4358730 -4504950 -5105171 -6600728 -8768717 -10412392 -10156107
32963 -10156107 -7666297 -4131605 -1539020 -1311019 -3363389 -6310165 -8589888 -9491753
32955 -9491753 -9262645 -8477552 -7471191 -6264158 -4789022 -3096744 -1405904 45975
32947 45975 1234056 2327094 3300331 3666336 2852085 923459 -1195618 -2263863 -1397422
32938 -1397422 1676595 6657705 12706904 18566252 22934649 24953596 24540572 22461049
32930 22461049 20060032 18611983 18624394 19690953 21009948 21973083 22309799 21956139 21007600
32921 21007600 19684916 18133559 16292345 14111089 11839330 9921544 8634789 8000260
32913 8000260 8001317 8612289 9516888 10036312 9575881 8137159 6321494 4895344 4390239
32904 4390239 4942900 6282198 7851434 9109796 9834369 10161673 10385166 10719186 11111085
32895 11111085 11143532 10245635 8248226 5709393 3428070 1594773 -291623 -2564989
32887 -2564989 -4801836 -6372475 -7315270 -8241366 -9448287 -10522671 -10826549 -9987965 -7845488
32878 -7845488 -4365052 80948 4600759 8262576 10616640 11636944 11414046 10193837
32870 10193837 8525075 6964556 5627431 4324527 3167396 2746936 3626127 5898913
32862 5898913 9340949 13680825 18407027 22425993 24329618 23297644 19764089 15121129
32854 15121129 10748152 7321628 4925871 3528061 3108406 3421734 3962622 4348888 4635309
32845 4635309 5121771 5906879 6727631 7227311 7348870 7456393 7963483 8719788 8926297
32836 8926297 8012089 6599446 6149529 7386314 9342271 10208007 8891972 5581201 1244156
32827 1244156 -2892220 -5673741 -6579226 -6094545 -5092744 -3760575 -1551241 1709036
32819 1709036 5100386 7180683 6967816 4282146 -380753 -5936544 -10948491 -14248618
32811 -14248618 -15466719 -14972224 -13463949 -11637462 -9953195 -8504767 -7185793 -5984290
32803 -5984290 -4910405 -3717072 -2161664 -681369 -291802 -1415690 -3127587 -3986278
32795 -3986278 -3453898 -2185689 -1155934 -877952 -1247898 -1634532 -1194274 380070 2339869
32786 2339869 3510985 3541193 3173882 3216919 3670322 4080752 4350664 4788764 5530280 6312609
32776 6312609 6873229 7330700 8082888 9451498 11495033 14092133 17118321 20516985 24194737
32767 24194737 27845730 30916715 32841592 33417281 32973979 32097670 31136911 30074524 28952523
32758 28952523 28224388 28379082 29235128 29956484 29926411 29366916 28932649 28928414 29117269 29012505
32748 29012505 28002781 25371806 20686365 14302327 7266381 641834 -4985237 -9509004
32740 -9509004 -13172621 -16428212 -19546650 -22193446 -23603544 -23308020 -21542329 -18912200
32732 -18912200 -15916861 -12890843 -10067862 -7366664 -4244173 -123371 4902394 9896107
32724 9896107 13684414 15667973 16129986 15854762 15437306 14876295 13742665 11636550 8430223
32715 8430223 4221048 -666861 -5545769 -9470769 -11777094 -12570289 -12561696 -12336338 -11806518
32706 -11806518 -10430983 -7952280 -4819589 -1802226 733176 2974220 5116922 7005328
32698 7005328 8541619 10170716 12481830 15307606 17622004 18506441 17970793 16704461
32690 16704461 15336057 14195902 13553058 13669766 14585700 16064748 17767436 19318492
32682 19318492 20251353 20131839 18834166 16597421 13807795 10867686 8272856 6568514
32674 6568514 6036606 6499742 7566208 8999736 10682413 12245850 13003028 12463271 10882850
32665 10882850 9134698 7956612 7383781 6941776 6280102 5486353 4814099 4291790 3759420
32656 3759420 3274299 3299945 4289480 6022753 7485358 7561161 5863895 2873191 -567369
32647 -567369 -3641361 -5591618 -5934351 -5043958 -4303651 -5179015 -7964878 -11548778 -14356577
32638 -14356577 -15371611 -14418561 -11965835 -8878555 -6041873 -3834079 -1953611 73115
32630 73115 2221509 3885397 4378437 3394401 1063702 -2207828 -5868922 -9332916 -12136236
32621 -12136236 -14058934 -15087094 -15264729 -14623838 -13288334 -11590580 -9952290 -8569983
32613 -8569983 -7280854 -5845442 -4368455 -3372997 -3412087 -4541103 -6053478 -6723692 -5533154
32604 -5533154 -2415882 1677744 5552645 8598203 10831032 12311621 12800009 12020839
32596 12020839 10094201 7646551 5555402 4492818 4539934 5290620 6488024 8415716
32588 8415716 11326226 14532849 16552087 16426989 14704248 12900661 12138279 12389700 12797383
32579 12797383 12504213 11352036 10031021 9482607 9988718 10911848 11400209 11135154 10223002
32570 10223002 8652854 6286997 3323624 344328 -2246193 -4591883 -7054694 -9648438
32562 -9648438 -11902998 -13192805 -13125903 -11710784 -9276450 -6263448 -3052487 90280
32554 90280 3016455 5675664 7985559 9648373 10203249 9407305 7571872 5469008 3917433
32545 3917433 3427926 4077016 5575147 7496371 9545606 11638632 13800458 16125351
32537 16125351 18777215 21741401 24492954 26216492 26564465 25970900 25022309 23824338
32529 23824338 22327279 20991906 20579432 21273298 22421820 23192282 23131184 22088711 20066946
32520 20066946 17340991 14408229 11634907 9197066 7429954 6795150 7204794 7686413
32512 7686413 7080891 4955011 1672572 -2076330 -5419909 -7306019 -7091634 -5319578
32504 -5319578 -3442173 -2434508 -1848488 -445797 2355285 5805954 8431455 9097067
32496 9097067 7596646 4526690 743761 -3166571 -7041687 -10812937 -14049829 -15926610
32488 -15926610 -15714747 -13257690 -8908245 -3146244 3496265 10148983 15599755 18875769
32480 18875769 19798276 18895828 17005884 15192174 14741179 16579798 20445787 24940849
32472 24940849 28609924 30771853 31268132 29950416 26931583 23105604 19780951 17600843
32464 17600843 16091018 14358461 12015292 9403742 7234510 6127913 6201158 6850370
32456 6850370 7106556 6470752 5380692 4760078 5234076 6889908 9532158 12772958 15877218
32447 15877218 17882726 18071564 16241438 12562676 7476310 1851339 -3089380 -6370299
32439 -6370299 -7782868 -7658786 -6247370 -3535102 443163 5456223 11259812 17609773
32431 17609773 23991203 29619572 33879897 36553734 37494591 36426429 33421776 29393826
32423 29393826 25667160 22972631 21059040 19241028 17070488 14537222 11996895 10015664
32415 10015664 8998499 8823367 9012867 9250808 9383761 8893320 6979725 3636853 272456
32406 272456 -1397969 -1087541 -112101 220378 -36222 132236 1321299 2987185 3873444
32397 3873444 2912582 -126115 -4573012 -9368318 -13708399 -17222598 -19669802 -20804335
32389 -20804335 -20686203 -19835142 -18777567 -17564087 -15979007 -14066306 -12081154 -9973573
32381 -9973573 -7367017 -4217071 -1174013 935219 1772063 1450087 122996 -2012588
32373 -2012588 -4421485 -6376801 -7540505 -8188336 -8811456 -9726810 -11105365 -13004322 -15092813
32364 -15092813 -16570785 -16725087 -15566322 -13719128 -11755873 -9875652 -8142281 -6628940
32356 -6628940 -5192683 -3442645 -1220782 1021260 2543225 2918319 2159450 459060
32348 459060 -1818343 -3912810 -4885905 -4339195 -2744796 -840342 1191648 3725832 6965284
32339 6965284 10496509 13624163 15913744 17284239 17798909 17657749 17348615 17479842 18271088
32330 18271088 19319091 20009658 20086213 19676184 18858452 17473945 15428469 12951999 10395283
32321 10395283 7932242 5675812 3961345 3178825 3242111 3470430 3170095 2246871 1199915
32312 1199915 707919 1318862 3228460 5968240 8392263 9409261 8891106 7608764 6163415
32303 6163415 4305382 1573533 -1654694 -4186297 -5088131 -4439207 -3005823 -1518836
32295 -1518836 -415335 34276 -278966 -1171571 -2225811 -3046254 -3430494 -3343097 -2807678
32286 -2807678 -1807764 -249509 1948389 4732756 7988871 11730621 15977250 20270198
32278 20270198 23538749 24846553 24371933 23445282 23506907 25087144 27704011 30425898 32405529
32269 32405529 33191593 32930967 32313058 32084923 32475185 33096741 33384831 33056659 32174539
32260 32174539 30897519 29271474 27287147 25149942 23446245 22898651 23832978 25918508
32252 25918508 28512358 31198603 33884139 36469867 38682423 40281995 41213248 41428813
32244 41428813 40781810 39348625 37763625 36913527 37167040 38021193 38571246 38257743 37213468
32235 37213468 36151279 36035144 37566741 40584410 43908113 46043652 46239646 44864931
32227 44864931 42817115 40758346 38971778 37690404 37235036 37745439 38884144 39899216
32219 39899216 40050082 39100322 37503021 36094612 35555139 36151211 37908244 40788826 44565999
32210 44565999 48745619 52974599 57571763 63365151 70801071 79308841 87677748 94990553
32202 94990553 101076990 106153613 110248771 113049603 114153178 113304178 110432890 105684458
32194 105684458 99583193 93090243 87212508 82312320 77784165 72526344 65807624 57736428
32186 57736428 49054460 40662573 33326986 27614056 23910589 22442355 23188272 25624300
32178 25624300 28560139 30537576 30764559 29771029 28988741 29498196 31109298 32642449 33055129
32169 33055129 32253968 30891720 29600058 28601328 27945004 27743187 27968059 28253552 28221531
32160 28221531 27914717 27557550 26899693 25248213 22393031 19185876 16859649 15932178 16087178
32151 16087178 16963140 18587872 20979173 23755295 26412293 28785261 31038904 33400135
32143 33400135 36153597 39756790 44603210 50598890 57206040 64029771 71206848 79052880
32135 79052880 87392043 95408035 102213530 107511183 111678454 115268635 118470277 120995069
32127 120995069 122391156 122435131 121294444 119412086 117262533 115142318 113064934 110758141
32119 110758141 107768047 103692223 98482356 92601486 86812808 81666689 77109795 72619019
32111 72619019 67773257 62713609 58053047 54383509 51914717 50520342 49925345 49670994
32103 49670994 48969501 46907664 43080293 38048639 33010538 28916767 25950039 23868059
32095 23868059 22665399 22664656 23959046 26032444 28167841 30172881 32438938 35154783 37621926
32086 37621926 38578176 37242960 33983061 30033039 26744038 25052608 25304292 27249771
32078 27249771 30203763 33379811 36168027 38198075 39399248 40170575 41261778 43109555
32070 43109555 45275979 46827341 47326721 47219423 47231153 47748320 48939287 51064350 54212217
32061 54212217 57857491 61117179 63538799 65397753 67184779 69058881 70880235 72488032
32053 72488032 73699300 74174086 73588671 72037530 70125166 68514977 67357925 66204094
32045 66204094 64497157 62126753 59477531 57025265 55027588 53585634 52750734 52366483
32037 52366483 51927751 50874285 49098415 47027631 45147743 43520316 41755442 39318275
32029 39318275 35849159 31392500 26498534 22071715 18978949 17680396 18084057 19580574
32021 19580574 21208538 22003457 21408427 19410489 16315977 12513756 8483346 4820250
32013 4820250 2011830 180534 -844557 -1243999 -1103221 -485605 627012 2451548 5151259
32004 5151259 8305789 10880374 12021394 11804926 10920372 9639365 7438826 3792565
31996 3792565 -913783 -5471032 -8696296 -10032556 -9573701 -7925236 -5996885 -4438781
31988 -4438781 -3029180 -895317 2387779 6087200 8946397 10382468 10763622 10606428
31980 10606428 9906798 8389412 6128828 3692782 1767540 776425 770530 1518657 2676292
31971 2676292 3945716 5145734 6205675 7149930 8020432 8694090 8827794 8173999 6971530
31962 6971530 5812897 5021130 4346413 3460810 2630563 2643056 3994868 6233437 8137516
31953 8137516 8566573 7274842 5079985 3284433 2839717 3936290 6211664 9130360
31945 9130360 12113432 14541134 15915855 16078329 15196177 13585151 11618031 9705416
31937 9705416 8188429 7247237 6995061 7557674 8874377 10495551 11854233 12800192 13652359
31928 13652359 14642933 15517317 15811429 15348796 14303481 12910715 11306673 9586284 7860992
31919 7860992 6306032 5266710 5206287 6315306 8139681 9742270 10299431 9538034 7722657
31910 7722657 5406619 3163805 1350044 42495 -716409 -656342 594782 3166367 6934314
31901 6934314 11828784 17832671 24521564 30860348 35743689 38735597 40229629 41051590
31893 41051590 42007629 43542622 45480789 47109384 47729406 47120411 45385312 42592925
31885 42592925 38932117 35062562 31755949 29040590 26159496 22663992 19182807 16693709
31877 16693709 15247049 13886715 11807061 9154998 6605187 4568267 3087211 2211351
31869 2211351 2034705 2368524 2719467 2757015 2638241 2721482 3088861 3556563 4084408 4864444
31859 4864444 5871558 6584089 6481368 5819858 5665753 7039206 10102046 14163928 18274505
31850 18274505 21713898 24102811 25286259 25180854 23743123 21175835 18179539 15789584
31842 15789584 14710699 14743005 14901729 14102781 11808458 8277034 4441378 1496250 303107
31833 303107 919659 2581840 4158422 4791717 4319157 3115892 1405684 -1225245 -5355702
31824 -5355702 -10706986 -15936337 -19710216 -21758493 -22606500 -22559557 -21447771 -19279697 -16565576
31815 -16565576 -13778243 -10868114 -7598089 -4169397 -1271707 433958 792202 224332
31807 224332 -596763 -1250613 -1821684 -2602424 -3619608 -4635714 -5528600 -6328999 -6853978
31798 -6853978 -6722787 -5958530 -5236080 -5197498 -5703687 -6052105 -5773306 -4914421 -3703633
31789 -3703633 -2357585 -1226503 -722671 -890496 -1208215 -965970 188079 2045183 4029311
31780 4029311 5583573 6539541 7213295 8107734 9517530 11446470 13789173 16410263 19065815
$$ [...]
##END NTUPLES=NMR SPECTRUM
##END=
