##TITLE=31Pdec_IPACAT-33-1
  CDCl3
  128 sc
 3.10.2023
##JCAMPDX= 6.0         $$ Bruker NMR JCAMP-DX V2.0
##DATA TYPE= NMR SPECTRUM
##DATA CLASS= NTUPLES
##ORIGIN= UXNMR, Bruker Analytische Messtechnik GmbH
##OWNER= root
$$ XWIN-NMR		Version 3.5
$$ Tue Oct  3 15:47:07 2023 Russian Standard Time (UT+4h)  she@DPX200
##.OBSERVE FREQUENCY= 81.013821
##.OBSERVE NUCLEUS= ^31P
##.ACQUISITION MODE= SIMULTANEOUS
##.ACQUISITION SCHEME= undefined
##.AVERAGES= 128
##.DIGITISER RES= 16
##SPECTROMETER/DATA SYSTEM= spect
##.PULSE SEQUENCE= zgpg30
##.SOLVENT NAME= CDCl3
##.SHIFT REFERENCE= (INTERNAL, CDCl3, 0, 248.564)
##AUDIT TRAIL= $$ (NUMBER, WHEN, WHO, WHERE, WHAT)
$$ ##TITLE= Audit trail, XWIN-NMR		Version 3.5
$$ ##JCAMPDX= 5.01
$$ ##ORIGIN= Bruker BioSpin GmbH
$$ ##OWNER= she
$$ F:/spectra/data/she/nmr/P31/1/pdata/1/auditp.txt
$$ ##AUDIT TRAIL=  $$ (NUMBER, WHEN, WHO, WHERE, WHAT)
(   1,<2023-10-03 15:45:48.45 +0400>,<she>,<DPX200>,
      <continue with go, POWCHK disabled, PULCHK disabled
       configuration hash MD5:
       00 E9 B6 7A A2 85 ED C7 34 08 36 98 17 FE 4E 26
       data hash MD5: 32K
       0A FB 41 CF 63 F4 E4 BA DD A5 2C 4F 30 AB 35 11>)
(   2,<2023-10-03 15:46:03.35 +0400>,<she>,<DPX200>,
      <Start of raw data processing
       efp BC_mod = 2 LB = 5 FT_mod = 6 PKNL = 1 PHC0 = -10738.24 PHC1 = 248.0864 SI = 64K 
       data hash MD5: 64K
       10 3F AD 93 A9 E8 BB 89 04 7B 18 D2 EF C7 FE 94>)
(   3,<2023-10-03 15:46:19.96 +0400>,<she>,<DPX200>,
      <pk PHC0 = 16.78758 PHC1 = 0 
       data hash MD5: 64K
       45 8E 9B 33 38 E9 9D 93 A0 59 23 F7 5D 46 D7 F8>)
(   4,<2023-10-03 15:46:36.87 +0400>,<she>,<DPX200>,
      <pk PHC0 = -3.029799 PHC1 = -10.2 
       data hash MD5: 64K
       CD A7 DA 61 34 FD D6 83 31 32 76 37 1F F8 A8 D8>)
(   5,<2023-10-03 15:46:43.59 +0400>,<she>,<DPX200>,
      <abs ABSG = 5 
       data hash MD5: 64K
       33 08 DD DA 30 E8 FB 61 EA 3D 51 F7 24 2F 59 10>)
$$ ##END=
$$ 
$$ hash MD5
$$ 22 88 CA 39 D7 CD 9C 09 81 E2 21 E0 98 66 08 4C
##$RELAX= 
##$RELAX= 
##$RELAX= 
##$RELAX= 
##$RELAX= 
##$RELAX= 
##$RELAX= 
##$RELAX= 
##$RELAX= 
$$ Bruker specific parameters
$$ --------------------------
##$DU= <F:/spectra>
##$EXPNO= 1
##$NAME= <P31>
##$PROCNO= 1
##$TYPE= <nmr>
##$USER= <she>
##$AMP= (0..31)
100 100 100 100 100 100 100 100 100 100 100 100 100 100 100 100 100 100 
100 100 100 100 100 100 100 100 100 100 100 100 100 100 
##$AQSEQ= 0
##$AQ_mod= 1
##$AUNM= <au_zg>
##$AUTOPOS= <>
##$BF1= 81.014009
##$BF2= 200.13
##$BF3= 200.13
##$BF4= 200.13
##$BF5= 200.13
##$BF6= 200.13
##$BF7= 200.13
##$BF8= 200.13
##$BYTORDA= 1
##$CFDGTYP= 0
##$CFRGTYP= 5
##$CHEMSTR= <none>
##$CNST= (0..31)
1 1 145 1 1 1 1 1 1 1 1 1 1 1 1 1 1 1 1 1 1 1 1 1 1 1 1 1 1 1 1 1 
##$CPDPRG= <waltz16>
##$CPDPRG1= <>
##$CPDPRG2= <waltz16>
##$CPDPRG3= <>
##$CPDPRG4= <mlev>
##$CPDPRG5= <mlev>
##$CPDPRG6= <mlev>
##$CPDPRG7= <mlev>
##$CPDPRG8= <mlev>
##$CPDPRGB= <>
##$CPDPRGT= <>
##$D= (0..31)
$$ [...]
##$SUBNAM3= <"">
##$SUBNAM4= <"">
##$SUBNAM5= <"">
##$SUBNAM6= <"">
##$SUBNAM7= <"">
##$SUBNAM8= <"">
##$SUBNAM9= <"">
##$SW= 501.771253377433
##$SWIBOX= (0..15)
0 1 3 0 0 0 0 0 0 0 0 0 0 0 0 0 
##$SW_h= 40650.406504065
##$TD= 32768
##$TD0= 1
##$TE= 0
##$TE2= 300
##$TE3= 300
##$TEG= 300
##$TL= (0..7)
0 120 53 12 22 120 120 120 
##$TP= (0..7)
150 150 150 150 150 150 150 150 
##$TP07= 0
##$TPNAME0= <>
##$TPNAME1= <>
##$TPNAME2= <>
##$TPNAME3= <>
##$TPNAME4= <>
##$TPNAME5= <>
##$TPNAME6= <>
##$TPNAME7= <>
##$TPOAL= (0..7)
0.5 0.5 0.5 0.5 0.5 0.5 0.5 0.5 
##$TPOFFS= (0..7)
0 0 0 0 0 0 0 0 
##$TUNHIN= 0
##$TUNHOUT= 0
##$TUNXOUT= 0
##$USERA1= <user>
##$USERA2= <user>
##$USERA3= <user>
##$USERA4= <user>
##$USERA5= <user>
##$V9= 5
##$VALIST= <valist>
##$VCLIST= <CCCCCCCCCCCCCCC>
##$VD= 0
##$VDLIST= <DDDDDDDDDDDDDDD>
##$VPLIST= <PPPPPPPPPPPPPPP>
##$VTLIST= <TTTTTTTTTTTTTTT>
##$WBST= 1024
##$WBSW= 4
##$XGAIN= (0..3)
0 0 0 0 
##$XL= 0
##$YL= 0
##$YMAX_a= 16966
##$YMIN_a= -14963
##$ZGOPTNS= <>
##$ZL1= 120
##$ZL2= 120
##$ZL3= 120
##$ZL4= 120
##$ABSF1= 248.5645
##$ABSF2= -253.2056
##$ABSG= 5
##$ABSL= 3
##$ALPHA= 0
##$AQORDER= 0
##$ASSFAC= 0
##$ASSFACI= 0
##$ASSFACX= 0
##$ASSWID= 0
##$AUNMP= <proc_1d>
##$AZFE= 0.1
##$AZFW= 0.5
##$BCFW= 0
##$BC_mod= 2
##$BYTORDP= 0
##$COROFFS= 0
##$CY= -3
##$DATMOD= 1
##$DC= 0
##$DFILT= <>
##$DTYPP= 0
##$F1P= 0
##$F2P= 0
##$FCOR= 1
##$FTSIZE= 65536
##$FT_mod= 6
##$GAMMA= 0
##$GB= 0
##$INTBC= 1
##$INTSCL= 6.047779e-11
##$ISEN= 30
##$LB= 5
##$LEV0= 0
##$LPBIN= 0
##$MAXI= 10000
##$MC2= 0
##$MEAN= 0
##$ME_mod= 0
##$MI= 50
##$NCOEF= 0
##$NC_proc= -10
##$NLEV= 6
##$NOISF1= 182.463
##$NOISF2= 159.3651
##$NSP= 0
##$NTH_PI= 0
##$NZP= 0
##$OFFSET= 248.5645
##$PC= 4
##$PHC0= -10724.48
##$PHC1= 237.8864
##$PH_mod= 1
##$PKNL= yes
##$PPARMOD= 0
##$PSCAL= 0
##$PSIGN= 0
##$REVERSE= no
##$SF= 81.0140089999694
##$SI= 65536
##$SIGF1= 159.3651
##$SIGF2= -187.1042
##$SINO= 113.3802
##$SIOLD= 16384
##$SREGLST= <1H.CDCl3>
##$SSB= 0
##$STSI= 65536
##$STSR= 0
##$SW_p= 40650.406504065
##$SYMM= 0
##$S_DEV= 0
##$TDeff= 32768
##$TDoff= 0
##$TI= <>
##$TILT= no
##$TM1= 0
##$TM2= 0
##$TOPLEV= 0
##$USERP1= <user>
##$USERP2= <user>
##$USERP3= <user>
##$USERP4= <user>
##$USERP5= <user>
##$WDW= 1
##$XDIM= 65536
##$YMAX_p= 526111284
##$YMIN_p= -114668971
$$ End of Bruker specific parameters
$$ ---------------------------------
##NTUPLES= NMR SPECTRUM
##VAR_NAME=  FREQUENCY,     SPECTRUM/REAL,   SPECTRUM/IMAG
##SYMBOL=    X,             R,               I
##VAR_TYPE=  INDEPENDENT,   DEPENDENT,       DEPENDENT
##VAR_FORM=  AFFN,          ASDF,            ASDF
##VAR_DIM=   65536,         65536,           65536
##UNITS=     HZ,            ARBITRARY UNITS, ARBITRARY UNITS
##FACTOR=    0.620285442955139, 1,           1
##FIRST=     20137.2065510682, 0,            0
##LAST=      -20513.1999529968, 0,           0
##MIN=       -20513.1999529968, -114668971,  0
##MAX=       20137.2065510682, 526111284,    0
$$ Real data points
##PAGE= N=1
##DATA TABLE= (X++(R..R)), XYDATA
$$ [...]
$$ plain form
38600 4416707 -2140236 -8598335 -13528488 -16253238 -17231485 -17458050 -17295394 -16079622 -12996330
38591 -12996330 -8140995 -2562651 2587531 6813640 10313881 13408806 15894612 16940653
38583 16940653 15704092 12027892 6473124 -125828 -6816303 -12398900 -15764451 -16683538
38575 -16683538 -16003419 -14832527 -13680414 -12404494 -10548631 -7486537 -2712146 3458734
38567 3458734 9656054 14446600 17550461 19661047 21065455 20946835 18301882 13242689
38559 13242689 7080583 1243288 -3613559 -7432562 -10022489 -10851607 -9687431 -7241124
38551 -7241124 -4847850 -3390860 -2677415 -1908784 -533361 1475253 3871622 6310369
38543 6310369 8363504 9727972 10501091 11038415 11443950 11319988 10085968 7509414 3998244
$$ packed form
38600D416707o556943o458099m930153k724750r78247k26565J62656J215772L083292
38591a2996330M855335N578344N150182M226109L500241L094925K485806J046041
38583A6940653j236561l676200n554768o598952o690475n582597l365551r19087
38575a6683538O80119J170892J152113J275920J855863L062094M774391O170880
38567C458734O197320M790546L103861K110586J404408j18620k644953n059193
38559A3242689o162106n837295m856847l819003k589927q29118J164176K446307
38551g241124K393274J456990P13445P68631J375423K008614K396369K438747
38543F310369K053135J364468P73119N37324M05535j23962j234020k576554l511170
$$ plain form
38534 3998244 529610 -1724725 -1913777 151097 4014860 8756382 13129541 15906200
38526 15906200 16592478 15927628 15380493 15930103 17399920 18993654 20199000 20902234 20777136
38517 20777136 19061286 15313271 10347536 6075435 4129608 4609118 6237438 7638738
38509 7638738 8278960 8309475 7984091 7511467 7227402 7556104 8815766 11195079 14725665
38500 14725665 19001425 23122391 26410203 29251621 32794011 37543307 42525685 46128478
38492 46128478 47632082 47625636 46959725 45606070 42726082 37778636 31432408 25376189 21271890
38483 21271890 19831775 20679721 22807962 25078208 26545983 26685041 25452891 23066437
38475 23066437 19690245 15428411 10601870 5853218 1848309 -1107515 -3150420 -4645455
$$ packed form
38534C998244l468634k254335j89052K064874L863763M741522M373159K776659
38526A5906200O86278o64850n47135N49610J469817J593734J205346P03234j25098
38517B0777136j715850l748015m965735m272101j945827M79510J628320J401300
38509G638738O40222L0515l25384m72624k84065L28702J259662K379313L530586
38500A4725665M275760M120966L287812K841418L542390M749296M982378L602793
38492D6128478J503604o446o65911j353655k879988m947446o346228o056219m104299
38483B1271890j440115Q47946K128241K270246J467775J39058j232150k386454
38475B3066437l376192m261834m826541m748652m004909k955824k042905j495035
$$ plain form
38467 -4645455 -5915096 -7020492 -7619787 -7035089 -4676892 -690676 3697217 6675406
38459 6675406 7064605 5240997 2746501 867901 -299041 -1320931 -2255287 -2377082 -1063472
38450 -1063472 1347565 3665813 4608588 3428402 176758 -4232811 -8228061 -10257012
38442 -10257012 -9721737 -7424135 -4930237 -3204558 -1769332 673610 4775994 9878609
38434 9878609 14798795 18892329 22096225 24307501 25255714 24902695 23475065 21056298
38426 21056298 17570695 13259582 8783701 4747384 1488037 -631506 -1307278 -945467
38418 -945467 -648779 -1007895 -1247517 -145915 2394041 5242191 7365528 8652064 9446543
38409 9446543 9945192 10287469 10738942 11444818 12278094 13080223 13620372 13039149 9826308
$$ packed form
38467d645455j269641j105396n99295N84698K358197L986216M387893K978189
38459F675406L89199j823608k494496j878600j166942j021890r34356j21795J313610
38450a063472K411037K318248R42775j180186l251644m409569l995250k028951
38442a0257012N35275K297602K493898J725679J435226K442942M102384N102615
38434I878609M920186M093534L203896K211276R48213l53019j427630k418767
38426B1056298l485603m311113m475881m036317l259347k119543o75772L61811
38418i45467K96688l59116k39622J101602K539956K848150K123337J286536P94479
38409I446543M98649L42277M51473P05876Q33276Q02129N40149n81223l212841
$$ plain form
38400 9826308 2992916 -6730519 -17159968 -26041289 -32037295 -34842967 -35080540 -34074838
38392 -34074838 -32993447 -31837654 -29670024 -26108528 -22205845 -19540355 -18849039 -19978120
38384 -19978120 -22693889 -26683204 -30782704 -33093597 -32362411 -28942358 -24192928 -19363342
38376 -19363342 -15335011 -12901336 -12589350 -14233242 -17149681 -20737272 -24645963 -28524247
38368 -28524247 -32012967 -34919097 -36989711 -37596258 -36185191 -33141182 -29688235 -26694161
38360 -26694161 -23977614 -21043872 -18055408 -15623645 -13907125 -12421805 -10681299 -8589456
38352 -8589456 -6133803 -3031997 1125170 6471256 12634704 18810251 24097935 27975059
38344 27975059 30547996 32304813 33587564 34289943 34005211 32468587 30012995 27695181
$$ packed form
38400I826308o833392r723435j0429449q881321n996006k805672k37573J005702
38392c4074838J081391J155793K167630L561496L902683K665490O91316j129081
38384a9978120k715769l989315m099500k310893P31186L420053M749430M829586
38376a9363342M028331K433675L11986j643892k916439l587591l908691l878284
38368b8524247l488720k906130k070614o06547J411067L044009L452947K994074
38360b6694161K716547K933742K988464K431763J716520J485320J740506K091843
38352h589456K455653L101806M157167N346086O163448O175547N287684L877124
38344B7975059K572937J756817J282751P02379k84732j536624k455592k317814
$$ plain form
38336 27695181 26797207 27910035 30395115 32798183 33836085 33064925 30807885 27619870
38328 27619870 23777754 19144315 13500378 7056284 645068 -4552223 -7432500 -7343994
38320 -7343994 -4507608 -270515 3430269 5349036 5757488 5844194 6361044 7042316 7254476
38311 7254476 6920895 6713448 7427315 9144692 10915667 11323045 9471898 5389480 -487057
38302 -487057 -7820806 -16069281 -23969302 -29910397 -33005698 -33633469 -32964427 -32151446 -31809112
38293 -31809112 -31820928 -31496780 -30103786 -27282798 -22898211 -16843064 -9498661 -2181123
38285 -2181123 3671281 8028956 12423913 18183181 24857820 30690040 34221955 35072008
38277 35072008 33614961 30670830 27524186 25611103 25726636 27431376 29133838 28787946
$$ packed form
38336B7695181q97974J112828K485080K403068J037902p71160k257040l188015
38328B7619870l842116m633439n643937o444094o411216n197291k880277Q8506
38320g343994K836386M237093L700784J918767M08452Q6706N16850O81272K12160
38311G254476l33581k07447P13867J717377J770975M07378j851147m082418n876537
38302d87057p333749q248475p900021n941095l095301o27771O69042Q12981L42334
38293c1809112j1816L24148J392994K820988M384587O055147P344403P317538
38285b181123N852404M357675M394957N759268O674639N832220L531915Q50053
38277C5072008j457047k944131l146644j913083J15533J704740J702462l45892
$$ plain form
38269 28787946 25020089 18205395 10526042 4588362 1700424 1378291 2233273 3057451
38261 3057451 3310973 3204163 3582579 5428922 9144704 14278231 19935481 25314650 29850743
38252 29850743 33097379 34669503 34311313 32056688 28422493 24333646 20539564 16983069
38244 16983069 12961804 8092419 3011851 -989038 -2900210 -2444924 178158 4601996
38236 4601996 10198410 15942754 20773732 24295582 27042760 29864928 33010178 35925692
38228 35925692 37970291 39112195 39759244 40046051 39558086 37782571 34634534 30474556
38220 30474556 25784319 20984893 16545149 13139164 11539198 12137282 14397427 16847877
38212 16847877 17886612 16798275 14018070 10465123 6799659 3396906 781037 -355375
$$ packed form
38269B8787946l767857o814694p679353n937680k887938l22133Q54982Q24178
38261C057451K53522j06810L78416J846343L715782N133527N657250N379169M536093
38252B9850743L246636J572124l58190k254625l634195m088847l794082l556495
38244A6983069m021265m869385n080568m000889j911172M55286K623082M423838
38236D601996N596414N744344M830978L521850K747178K822168L145250K915514
38228C5925692K044599J141904O47049K86807m87965j775515l148037m159978
38220C0474556m690237m799426m439744l405985j599966N98084K260145K450450
38212A6847877J038735j088337k780205l552947l665464l402753k615869j136412
$$ plain form
38204 -355375 204350 1675405 2692636 2389557 944183 -998978 -3161470 -5538298 -7617077
38195 -7617077 -8279754 -6807302 -3696201 -161822 2940631 5337149 6707190 6466612
38187 6466612 4403296 1196599 -1974750 -4270844 -5585977 -6301311 -6805855 -7230340 -7626179
38178 -7626179 -8418588 -10506270 -14617279 -20515823 -27007378 -32684749 -36472120 -37639996
38170 -37639996 -35922250 -31943218 -27174474 -23024127 -19951353 -17563399 -15380664 -13325351
38162 -13325351 -11642847 -10539972 -9742521 -8294311 -5173238 -549722 3717546 5338459
38154 5338459 3489384 -711376 -5532707 -10116084 -14666984 -19583554 -24596273 -28557663
38146 -28557663 -29939504 -27767020 -22372104 -15332256 -8655954 -3941603 -2016759 -2918935
$$ packed form
38204c55375N59725J471055J017231l03079j445374j943161k162492k376828k078779
38195g617077o62677J472452L111101L534379L102453K396518J370041k40578
38187F466612k063316l206697l171349k296094j315133p15334n04544m24485l95839
38178g626179p92409k087682m111009n898544o491555n677371l787371j167876
38170c7639996J717746L979032M768744M150347L072774K387954K182735K055313
38162a3325351J682504J102875P97451J448210L121073M623516M267268J620913
38154E338459j849075m200760m821331m583377m550900m916570n012719l961390
38146b8557663j381841K172484N394916P039848O676302M714351J924844r02176
$$ plain form
38138 -2918935 -5953084 -9857591 -13183143 -14835017 -14616822 -13416398 -12565255 -12554248 -12341574
38129 -12341574 -10279176 -5866993 -404108 4097845 6355704 6224383 4312863 1706017
38121 1706017 -175246 -69067 2410958 6471645 10498948 12867769 12868860 11154131 9057744
38112 9057744 7226464 5166847 2420756 -218994 -1291924 -301169 1966271 4792153
38104 4792153 8367084 12855971 17286075 20077171 20437558 18689335 15443559 11105971
38096 11105971 6144228 1157145 -3528701 -7841329 -11338423 -13098765 -12616747 -10490650
38088 -10490650 -7835835 -5205386 -2414001 775798 4192939 7371495 9728245 10687175
38080 10687175 10066301 8398961 6449971 4240463 909899 -4185669 -10466105 -16465589
$$ packed form
38138b918935l034149l904507l325552j651874K18195J200424Q51143J1007K12674
38129a2341574K062398M412183N462885M501953K257859j31321j911520k606846
38121A706017j881263J06179K480025M060687M027303K368821J091j714729k096387
38112I057744j831280k059617k746091k639750j072930R90755K267440K825882
38104D792153L574931M488887M430104K791096L60387j748223l245776m337588
38096A1105971m961743m987083m685846m312628l497094j760342M82018K126097
38088a0490650K654815K630449K791385L189799L417141L178556K356750R58930
38080A0687175o20874j667340j948990k209508l330564n095568o280436n999484
$$ plain form
38072 -16465589 -21007705 -23829636 -25266911 -25728429 -25531065 -24999716 -24592790 -24887379 -26207046
38063 -26207046 -28016657 -28873251 -27464000 -23853447 -19425652 -15462724 -12066692 -8659477
38055 -8659477 -5191345 -2414245 -1044020 -1052721 -1853349 -2875331 -3851330 -4839443 -6209309
38046 -6209309 -8440779 -11631355 -15150551 -17913020 -19031007 -18165586 -15365000 -10855370
38038 -10855370 -5206535 351868 4097041 4742911 2554426 -468165 -1878885 -660585
38030 -660585 2001151 3746978 2798104 -1094362 -6809552 -12421786 -15862958 -15924540 -13212942
38021 -13212942 -9937434 -8273696 -8714335 -9946312 -10131476 -8218105 -4377497 303040
38013 303040 4433562 6942229 7407092 5976516 3198742 46745 -2190054 -2548929 -1122576
$$ packed form
38072a6465589m542116k821931j437275m61518J97364N31349M06926k94589j319667
38063b6207046j809611q56594J409251L610553M427795L962928L396032L407215
38055h659477L468132K777100J370225q701q00628j021982r75999r88113j369866
38046f209309k231470l190576l519196k762469j117987Q65421K800586M509630
38038a0855370N648835N558403L745173O45870k188485l022591j410720J218300
38030f60585K661736J745827r48874l892466n715190n612234l441172o1582K711598
38021a3212942L275508J663738m40639j231977j85164J913371L840608M680537
38013C03040M130522K508667M64863j430576k777774l151997k236799l58875J426353
$$ plain form
38004 -1122576 1011249 2686952 3456163 3656192 3932498 4610815 5198061 4490663 1565102
37995 1565102 -3184048 -8283294 -12588097 -16146782 -19536962 -22781280 -25266842 -26414279
37987 -26414279 -26032655 -24314093 -21981454 -20178348 -19458553 -18770136 -16064557 -10234457
37979 -10234457 -2123542 6474952 14254502 20531008 24641156 26114747 25433767 23900614
37971 23900614 22420189 20732999 18075296 14317680 10177504 6484522 3535324 1116263
37963 1116263 -1095305 -3169089 -4757056 -5287997 -4608410 -3570995 -3702472 -5884632 -9313456
37954 -9313456 -12046490 -12771544 -11957018 -11188908 -11535759 -12725170 -13766327 -14033751 -13640160
37945 -13640160 -13008212 -12346336 -11507480 -10138122 -7880653 -4572083 -412068 4057175
$$ packed form
38004a122576K133825J675703P69211K00029K76306O78317N87246p07398k925561
37995A565102m749150n099246m304803l558685l390180l244318k485562j147437
37987b6414279L81624J718562K332639J803106P19795O88417K705579N830100
37979a0234457Q110915Q598494P779550O276506M110148J473591o80980j533153
37971B3900614j480425j687190k657703l757616m140176l692982k949198k419061
37963A116263k211568k073784j587967n30941O79587J037415j31477k182160l428824
37954i313456k733034p25054Q14526P68110l46851j189411j041157k67424L93591
37945a3640160O31948O61876Q38856J369358K257469L308570M160015M469243
$$ plain form
37937 4057175 8248961 11890516 15093556 18083229 20893304 23298163 24945623 25549257
37929 25549257 25094226 23936624 22561125 21098766 19204248 16598868 13616794 10911784
37921 10911784 8609686 6034263 2368951 -2589749 -8310326 -13805886 -17948139 -19946655
37913 -19946655 -19894537 -18689195 -17189678 -15630702 -14008241 -12626027 -11805706 -11321574 -10704260
37904 -10704260 -10041833 -9910508 -10434909 -10957797 -10880607 -10439241 -10370128 -11067329 -12299502
37895 -12299502 -13548272 -14412387 -14821911 -14999063 -15085221 -14760563 -13445079 -10954331 -7779112
37886 -7779112 -4763827 -2847168 -3057895 -6114991 -11671532 -18387673 -25163786 -31971674
37878 -31971674 -39064731 -45725269 -50357496 -51657336 -49249254 -43498550 -35480250 -27104969
$$ packed form
37937D057175M191786L641555L203040K989673K810075K404859J647460O03634
37929B5549257m55031j157602j375499j462359j894518k605380k982074k705010
37921A0911784k302098k575423l665312m958700n720577n495560m142253j998516
37913a9946655N2118J205342J499517J558976J622461J382214Q20321M84132O17314
37904a0704260O62427J31325n24401n22888P7190M41366O9113o97201j232173
37895a2299502j248770q64115m09524j77152q6158L24658J315484K490748L175219
37886g779112L015285J916659k10727l057096n556541o716141o776113o807888
37878c1971674p093057o660538m632227j299840K408082N750704Q018300Q375281
$$ plain form
37870 -27104969 -20357183 -15834824 -12324867 -8146704 -2765440 2975081 7794700 10868304
37862 10868304 12132762 12195044 11943996 11965265 12199263 12160220 11443094 10072884 8575939
37853 8575939 7791987 8428988 10646050 14117969 18510104 23748939 29822064 36483225
37845 36483225 43132681 48757887 52061709 52099884 48980186 43612466 36630294 28015850
37837 28015850 18118419 8569556 1512140 -2061257 -2807313 -2000269 -508855 1205518
37829 1205518 2649410 3198033 2319271 -74699 -3198767 -5370410 -4952034 -1627875 3464060
37820 3464060 8940397 14119784 18627612 21666200 22320752 20465441 16884849 12507428
37812 12507428 7864064 3224647 -1204332 -5370665 -9385792 -13329198 -17239096 -21303969
$$ packed form
37870b7104969O747786M522359L509957M178163N381264N740521M819619L073604
37862A0868304J264458O2282k51048K1269K33998l9043p17126j370210j496945
37853H575939p83952O37001K217062L471919M392135N238835O073125O661161
37845C6483225O649456N625206L303822L8175l119698n367720o982172q614444
37837B8015850r897431r548863p057416l573397p46056Q07044J491414J714373
37829A205518J443892N48623q78762k393970l124068k171643M18376L324159N091935
37820C464060N476337N179387M507828L038588O54552j855311l580592m377421
37812A2507428m643364m639417m428979m166333m015127l943406l909898m064873
$$ plain form
37804 -21303969 -25761561 -30501077 -35001538 -38738756 -41396433 -42645466 -42184516 -40355355
37796 -40355355 -38442997 -37894305 -39187090 -41632392 -44137615 -45858984 -46213205 -44721835
37788 -44721835 -41099411 -35383342 -27904801 -19246659 -10227442 -1716033 5649143 11482012
37780 11482012 15443070 17277069 17158934 15740669 13573911 10535328 6038420 -144835
37772 -144835 -7380391 -14492086 -20478713 -24923100 -27908436 -29785366 -31065414 -32301225
37764 -32301225 -33755235 -35107184 -35655642 -34877859 -32615425 -28676882 -22699655 -14898067
37756 -14898067 -6822808 -771046 1885729 1662198 283728 -572397 164231 2936498
37748 2936498 7358912 12101528 15552546 16861867 16202184 14044982 10505352 5520445
$$ packed form
37804b1303969m457592m739516m500461l737218k657677j249033M60950J829161
37796d0355355J912358N48692j292785k445302k505223j721369l54221J491370
37788d4721835L622424N716069P478541Q658142R019217Q511409P365176N832869
37780A1482012L961058J833999j18135j418265k166758l038583m496908o183255
37772a44835p235556p111695n986627m444387k985336j876930j280048j235811
37764c2301225j454010j351949n48458P77783K262434L938543N977227P801588
37756a4898067Q075259O051762K656775k23531j378470q56125P36628K772267
37748B936498M422414M742616L451018J309321o59683k157202l539630m984907
$$ plain form
37740 5520445 -593941 -7022694 -12872530 -17658815 -21474147 -24776041 -27958274 -31022621
37732 -31022621 -33601663 -35231394 -35548855 -34317914 -31490831 -27402995 -22858188 -18825865
37724 -18825865 -15852991 -13711031 -11770371 -9912820 -8985162 -9989384 -12651955 -15070227
37716 -15070227 -15100114 -12048626 -6880293 -1071212 4283429 8413177 10733586 11243971
37708 11243971 10744338 10178086 9800945 9279650 8483231 7724968 7098966 5970720 3517546
37699 3517546 -265699 -4370668 -7644499 -9667949 -10702033 -11035803 -10709812 -9806471 -8592920
37690 -8592920 -7196261 -5481081 -3611769 -2534757 -3376951 -6217933 -9761628 -12378338
37682 -12378338 -13267287 -12553984 -10662970 -7929264 -4564890 -569955 4222120 9526416
$$ packed form
37740E520445o114386o428753n849836m786285l815332l301894l182233l064347
37732c1022621k579042j629731l17461J230941K827083M087836M544807M032323
37724a8825865K972874K141960J940660J857551R27658j004222k662571k418272
37716a5070227k9887L051488N168333N809081N354641M129748K320409N10385
37708A1243971m99633n66252l77141n21295p96419p58263o26002j128246k453174
37699C517546l783245m104969l273831k023450j034084l33770L25991R03341J213551
37690h592920J396659J715180J869312J077012q42194k840982l543695k616710
37682a2378338q88949P13303J891014K733706L364374L994935M792075N304296
$$ plain form
37674 9526416 13957699 15512023 13129633 7686392 1201481 -4832777 -10141044 -14944763
37666 -14944763 -19109419 -22185559 -23907134 -24299394 -23475694 -21690640 -19529722 -17656007
37658 -17656007 -16259345 -15014663 -13658059 -12282133 -10886310 -8992782 -6145325 -2741829
37650 -2741829 -59554 591816 -1363626 -5603418 -11032159 -16016615 -19000634 -19366570
37642 -19366570 -17750727 -15404963 -13249555 -11507851 -10036014 -8809518 -8113473 -8356403
37634 -8356403 -9694869 -11821455 -14166122 -16304820 -18103440 -19506520 -20369086 -20590598
37626 -20590598 -20339380 -20090648 -20451819 -21824972 -24014608 -26164317 -27323241 -27168275 -26003273
37617 -26003273 -24055035 -21135516 -17221779 -13067661 -9823588 -8041009 -7250997 -6464386
$$ packed form
37674I526416M431283J554324k382390n443241o484911o034258n308267m803719
37666a4944763m164656l076140j721575l92260Q23700J785054K160918J873715
37658a7656007J396662J244682J356604J375926J395823J893528K847457L403496
37650b741829K682275O51370j955442m239792n428741m984456k984019l65936
37642a9366570J615843K345764K155408J741704J471837J226496O96045k42930
37634h356403j338466k126586k344667k138698j798620j403080q62566k21512
37626b0590598K51218K48732l61171j373153k189636k149709j158924J54966J165002
37617b6003273J948238K919519L913737M154118L244073J782579P90012P86611
$$ plain form
37609 -6464386 -4901236 -2374012 662896 3342471 4937328 5403745 5347694 5421619 5857082
37600 5857082 6625824 7918247 10316531 14443684 20356645 27140031 33098811 36610005
37592 36610005 37117034 35447004 33091033 31003366 28952923 25977949 21454021 15701626
37584 15701626 9602472 3825233 -1374219 -5691238 -8473327 -9100870 -7594098 -4779967
37576 -4779967 -1958108 -336011 -377555 -1386393 -1921363 -999240 1057011 3037856 3883671
37567 3883671 3074372 371391 -4113642 -9507236 -14491743 -18459420 -22009074 -25906489
37559 -25906489 -29824143 -32568831 -33396169 -32570350 -30612313 -27557168 -23230891 -17845047
37551 -17845047 -11861062 -5440835 1463099 8412421 14369091 18637198 21676317 24506381
$$ packed form
37609f464386J563150K527224L036908K679575J594857M66417n6051P3925M35463
37600E857082P68742J292423K398284M127153N912961O783386N958780L511194
37592C6610005N07029j670030k355971k087667k050443k974974m523928n752395
37584A5701626o099154n777239n199452m317019k782089o27543J506772K814131
37576d779967K821859J622097m1544j008838n34970R22123K056251J980845Q45815
37567C883671q09299k702981m485033n393594m984507l967677l549654l897415
37559b5906489l917654k744688q27338Q25819J958037L055145M326277N385844
37551a7845047N983985O420227O903934O949322N956670M268107L039119K830064
$$ plain form
37543 24506381 27285017 28938665 28496607 26523506 24837015 24861534 26586778 29108630
37535 29108630 31710820 34136425 36141826 37346086 37685824 37764609 38487792 40285585 42720366
37526 42720366 44847870 45900640 45561173 43672037 40040631 34879386 29331939 25037196
37518 25037196 22820363 21955636 20927850 18770980 15495148 11547030 7404614 3680883
37510 3680883 1014740 -527359 -1701262 -3383985 -5621311 -7481049 -7760782 -5795448
37502 -5795448 -1848244 2982372 7319454 10283550 11839858 12341346 11841803 10048079
37494 10048079 6882303 2836158 -1282543 -4783419 -7255841 -8516191 -8520522 -7256113
37486 -7256113 -4713943 -1107737 2885027 6331881 8623409 9728883 9846036 9048233
$$ packed form
37543B4506381K778636J653648m42058j973101j686491K4519J725244K521852
37535B9108630K602190K425605K005401J204260L39738P8785P23183J797793K434781
37526D2720366K127504J052770l39467j889136l631406n161245n547447m294743
37518B5037196k216833q64727j027786k156870l275832l948118m142416l723731
37510C680883k666143j542099j173903j682723k237326j859738k79733J965334
37502e795448L947204M830616M337082K964096J556308N01488m99543j793724
37494A0048079l165776m046145m118701l500876k472422j260350m331J264409
37486g256113K542170L606206L992764L446854K291528J105474J17153p97803
$$ plain form
37478 9048233 7494509 5869492 5349719 6982546 10954759 16255337 21064163 23875313
37470 23875313 24622580 24638221 25232563 26280048 26303258 23855565 18722363 12017755 5427551
37461 5427551 195175 -3614763 -6924267 -10385949 -13276475 -14033334 -12024910 -8376827
37453 -8376827 -4777231 -1828005 1012033 4090340 6729553 7855523 7156007 5452953
37445 5452953 4028246 3635585 4107697 4907681 6013246 8046091 11412946 15593327 19630829
37436 19630829 23216087 26849205 30862250 34704354 37444883 38674005 38541922 37090222
37428 37090222 34062547 29563087 24576950 20436600 17672294 15514233 12625147 8322775
37420 8322775 3092617 -2014844 -6401345 -10351354 -14561149 -19346731 -24344117 -28918990
$$ packed form
37478I048233j553724j625017n19773J632827L972213N300578M808826K811150
37470B3875313P47267J5641N94342J047485K3210k447693n133202o704608o590204
37461E427551n232376l809938l309504l461682k890526p56859K008424L648083
37453h376827L599596K949226K840038L078307K639213J125970o99516j703054
37445E452953j424707l92661M72112P99984J105565K032845L366855M180381M037502
37436A9630829L585258L633118M013045L842104K740529J229122j32083j451700
37428C7090222l027675m499460m986137m140350k764306k158061k889086m302372
37420H322775n230158n107461m386501l950009m209795m785582m997386m574873
$$ plain form
37412 -28918990 -32721656 -35719020 -37764111 -38426613 -37439650 -35119265 -31966466 -27807243
37404 -27807243 -21709393 -13088378 -2828300 6925498 14125072 17947248 18815565 17705580
37396 17705580 15532120 12884407 9928950 6407079 1878888 -3739002 -9668095 -14350459
37388 -14350459 -16336019 -15368208 -12608573 -9639301 -7169585 -4717386 -1443147 2886187
37380 2886187 7713143 12135645 15281564 16385568 14931821 11044667 5690267 195202
37372 195202 -4657490 -9064243 -13704449 -18896484 -24305945 -29303345 -33345695 -36077803
37364 -36077803 -37465519 -38049446 -38804035 -40362750 -42305242 -43328028 -42154536 -38348150
37356 -38348150 -32546915 -26207841 -21001341 -18007616 -17201618 -17712393 -18640243 -19671821
$$ packed form
37412b8918990l802666k997364k045091o62502R86963K320385L152799M159223
37404b7807243O097850Q621015J0260078R753798P199574L822176Q68317j109985
37396A7705580k173460k647713k955457l521871m528191n617890n929093m682364
37388a4350459j985560R67811K759635K969272K469716K452199L274239M329334
37380B886187M826956M422502L145919J104004j453747l887154n354400n495065
37372A95202m852692m406753m640206n192035n409461m997400m042350k732108
37364c6077803j387716n83927p54589j558715j942492j022786J173492L806386
37356c8348150N801235O339074N206500K993725Q05998n10775r27850j031578
$$ plain form
37348 -19671821 -21072169 -23265004 -26353850 -29812913 -32595998 -33737572 -32985482 -30863133
37340 -30863133 -28215510 -25824495 -24298421 -23917898 -24411980 -25114230 -25536879 -25672927 -25632641
37331 -25632641 -25229563 -24236692 -22987426 -22381061 -23091268 -24794004 -26203856 -25854796 -22968327
37322 -22968327 -17834864 -11538808 -5261099 326918 5116266 9094390 11944443 13238083
37314 13238083 13008342 11904170 10571295 8976087 6622172 3457314 231133 -2243257
37306 -2243257 -3900477 -5169173 -6099812 -6200925 -5159075 -3312039 -1305879 311124
37298 311124 963102 -14068 -2796218 -6561706 -9995921 -12338788 -13661045 -14180208 -13773571
37289 -13773571 -12391195 -10658273 -9712864 -10381531 -12527398 -15093759 -16747067 -16663538 -14849794
$$ packed form
37348a9671821j400348k192835l088846l459063k783085j141574P52090K122349
37340c0863133K647623K391015J526074L80523m94082p02250m22649j36048M0286
37331b5632641M03078R92871J249266O06365p10207j702736j409852L49060K886469
37322b2968327N133463O296056O277709N588017M789348L978124K850053J293640
37314A3238083k29741j104172j332875j595208k353915l164858l226181k474390
37306b243257j657220j268696r30639j01113J041850J847036K006160J617003
37298C11124O51978r77170k782150l765488l434215k342867j322257n19163M06637
37289a3773571J382376J732922R45409o68667k145867k566361j653308Q3529J813744
$$ plain form
37280 -14849794 -11659781 -7049453 -649677 7189387 14744392 19869857 21738635 21333401
37272 21333401 20108316 18488544 15866933 11696283 6139729 -200961 -6671487 -12542691
37264 -12542691 -16989204 -19416355 -19775136 -18492950 -16232273 -13766257 -11833560 -10847442
37256 -10847442 -10762246 -11307757 -12211380 -13015494 -12828076 -10628602 -6014422 437830 7653702
37247 7653702 14865779 21847901 28323507 33274849 35172643 33234133 28462769 23105467
37239 23105467 18830130 15500746 11780598 6685955 407661 -6016334 -11379190 -14817402
37231 -14817402 -16215479 -16258882 -15757708 -14842923 -13222730 -11353868 -10787275 -12782082 -16743949
37222 -16743949 -20569126 -22599308 -22883676 -22534376 -22428069 -22893675 -24165567 -26303796 -28524654
$$ packed form
37280a4849794L190013M610328O399776P839064P555005N125465J868778m05234
37272B1333401j225085j619772k621611m170650n556554o340690o470526n871204
37264a2542691m446513k427151l58781J282186K260677K466016J932697R86118
37256a0847442Q5196n45511r03623q04114J87418K199474M614180O452252P215872
37247G653702P212077O982122O475606M951342J897794j938510m771364n357302
37239B3105467m275337l329384l720148n094643o278294o423995n362856l438212
37231a4817402j398077m3403N01174R14785J620193J868862N66593j994807l961867
37222a6743949l825177k030182k84368L49300J06307m65606j271892k138229k220858
$$ plain form
37213 -28524654 -29292078 -27662709 -24373147 -21126664 -18840983 -17047677 -15053311 -13096369
37205 -13096369 -11924482 -11541219 -10922664 -9026900 -5794342 -2143634 743793 2089770
37197 2089770 1752163 -3300 -2954517 -7094739 -12291797 -17961663 -23344931 -28002437
37189 -28002437 -31692540 -33827373 -33640322 -31284725 -28488333 -27595722 -29760344 -34103261
37181 -34103261 -38528907 -41196335 -41379569 -39453848 -36475824 -33634675 -31549630 -29745465
37173 -29745465 -27033021 -22808256 -17926190 -13879037 -11069175 -8377307 -4638960 -43779
37165 -43779 4305499 7719667 10164704 11501489 11345058 9781067 7546789 5242368 2806220
37156 2806220 -75100 -3512210 -7529543 -12074896 -16561128 -19843581 -21121227 -20685003
$$ packed form
37213b8524654p67424J629369L289562L246483K285681J793306J994366J956942
37205a3096369J171887L83263O18555J895764L232558L650708K887427J345977
37197B089770l37607j755463k951217m140222n197058n669866n383268m657506
37189b8002437l690103k134833J87051K355597K796392Q92611k164622m342917
37181c4103261m425646k667428j83234J925721K978024K841149K085045J804165
37173b9745465K712444M224765M882066M047153K809862K691868L738347M595181
37165d3779M349278L414168K445037J336785j56431j563991k234278k304421k436148
37156B806220k881320l437110m017333m545353m486232l282453j277646M36224
$$ plain form
37148 -20685003 -19526282 -18445274 -17706552 -17133642 -16162091 -14149848 -11115452 -7977042
37140 -7977042 -5632265 -3936617 -1981193 708045 3537850 5206751 4333142 14926
37132 14926 -7537471 -16748218 -25465081 -32273653 -37009138 -40142975 -42039206 -42861473 -42879239
37123 -42879239 -42622902 -42682565 -43221909 -43599325 -42714291 -40030785 -36167927 -32276330 -29032755
37114 -29032755 -26530059 -24866001 -24302068 -24898308 -26454718 -28750644 -31308807 -32935685
37106 -32935685 -32199092 -28720859 -23607524 -18322421 -13458953 -8833036 -4332442 -233792
37098 -233792 3080170 5306556 6279769 6251103 6058961 6618182 8107530 9864257 11171139
37089 11171139 11987664 12786519 13776471 14510242 14406102 13581643 12899560 13011780 13502055
$$ packed form
37148b0685003J158721J081008P38722N72910R71551K012243L034396L138410
37140g977042K344777J695648J955424K689238K829805J668901q73609m318216
37132A4926p552397r210747q716863o808572m735485l133837j896231q22267j7766
37123d2879239K56337n9663n39344l77416Q85034K683506L862858L891597L243575
37114b9032755K502696J664058N63933n96240j556410k295926k558163j626878
37106c2935685P36593L478233N113335N285103M863468M625917M500594M098650
37098b33792L313962K226386R73213k8666j92142N59221J489348J756727J306882
37089A1171139Q16525P98855R89952P33771j04140q24459o82083J12220M90275
$$ plain form
37080 13502055 13164931 10982784 6601913 148152 -7761275 -15678189 -21600927 -24140905
37072 -24140905 -23404315 -20645733 -17312541 -14502676 -12805107 -12098375 -11633568 -10762192 -9579824
37063 -9579824 -8598497 -7982787 -7577343 -7604231 -8708074 -11058226 -13851866 -16107378 -17757794
37054 -17757794 -19631067 -22461501 -26223714 -30370050 -34346406 -37730346 -40109510 -41091915
37046 -41091915 -40452040 -38186264 -34468698 -29662240 -24364806 -19307475 -15078093 -11893878
37038 -11893878 -9632848 -8087676 -7211496 -7136779 -7950945 -9491141 -11479471 -13916260 -17170804
37029 -17170804 -21449746 -26209740 -30357440 -33095432 -34329788 -34163602 -32364604 -28709445
37021 -28709445 -23696275 -18483344 -14045866 -10646227 -8133063 -6385470 -5254382 -4316245
$$ packed form
37080A3502055l37124k182147m380871o453761p909427p916914n922738k539978
37072b4140905P36590K758582L333192K809865J697569P06732M64807Q71376J182368
37063i579824R81327O15710M05444k6888j103843k350152k793640k255512j650416
37054a7757794j873273k830434l762213m146336l976356l383940k379164r82405
37046d1091915O39875K265776L717566M806458N297434N057331M229382L184215
37038a1893878K261030J545172Q76180P4717q14166j540196j988330k436789l254544
37029a7170804m278942m759994m147700k737992j234356J66186J798998L655159
37021b8709445N013170N212931M437478L399639K513164J747593J131088R38137
$$ plain form
37013 -4316245 -2998300 -950005 1821154 5093740 8532709 11664574 13962143 15122832
37005 15122832 15267748 14775451 13884282 12568760 10937206 9627024 9425527 10283634 10943530
36996 10943530 9907754 6815133 2721986 -853769 -2919794 -3213733 -1969529 235603
36988 235603 2618724 4470526 5413774 5572447 5785910 7609955 12538190 20677370 30173136
36979 30173136 38251573 43044824 44525716 43880624 42183793 39673076 36109378 31587336
36971 31587336 26786928 22404112 18572383 15074230 11951398 9496665 7607844 5599283
36963 5599283 2953758 23876 -2344784 -3810359 -4876602 -6214278 -7833262 -9029525
36955 -9029525 -9121313 -8207723 -7172577 -6900304 -7525777 -8522737 -9420874 -10198546 -10922595
$$ packed form
37013d316245J317945K048295K771159L272586L438969L131865K297569J160689
37005A5122832J44916m92297q91169j315522j631554j310182k01497Q58107O59896
36996A0943530j035776l092621m093147l575755k066025k93939J244204K205132
36988B35603K383121J851802R43248J58673K13463J824045M928235Q139180R495766
36979C0173136Q078437M793251J480892o45092j696831k510717l563698m522042
36971C1587336m800408m382816l831729l498153l122832k454733j888821k008561
36963E599283k645525k929882k368660j465575j066243j337676j618984j196263
36955i029525r1788R13590J035146K72273o25473r96960q98137p77672p24049
$$ plain form
36946 -10922595 -11191990 -10074830 -6639400 -755094 6372117 12600377 16254038 17293802
36938 17293802 16872581 15782965 13811083 10704702 7149474 4361291 3129767 3687033
36930 3687033 6012689 9448452 12084440 11353889 5743271 -4087758 -15731026 -26295382
36922 -26295382 -33610849 -37127391 -38174285 -39070036 -41531388 -45767472 -50871271 -55654639
36914 -55654639 -59068928 -60443848 -59903776 -58426255 -56992023 -55513958 -52834756 -47973207
36906 -47973207 -41364756 -34839743 -30380798 -28803307 -29412925 -30719749 -31459255 -31158816
36898 -31158816 -30047790 -28586917 -27064489 -25649198 -24854377 -25696445 -28905832 -33824712
36890 -33824712 -38526409 -41462960 -42845032 -44061329 -45918082 -47887232 -48980278 -48799133
$$ packed form
36946a0922595k69395J117160L435430N884306P127211O228260L653661J039764
36938A7293802m21221j089616j971882l106381l555228k788183j231524N57266
36930C687033K325656L435763K635988p30551n610618r831029j1643268j0564356
36922b6295382p315467l516542j046894q95751k461352m236084n103799m783368
36914e5654639l414289j374920N40072J477521J434232J478065K679202M861549
36906d7973207O608451O525013M458945J577491o09618j306824p39506L00439
36898c1158816J111026J460873J522428J415291P94821q42068l209387m918880
36890c3824712m701697k936551j382072j216297j856753j969150j093046J81145
$$ plain form
36882 -48799133 -47592140 -45742876 -43467141 -40701789 -37051069 -32132537 -26296179 -20830117
36874 -20830117 -17109241 -15511634 -15310230 -15563718 -15945566 -16709178 -17967539 -19095270 -18975236
36865 -18975236 -17032169 -14006634 -11413285 -10064546 -9305615 -7850372 -5170658 -1857040
36857 -1857040 1191877 3589002 5459062 6866410 7368799 6169866 2871552 -1787838
36849 -1787838 -6100598 -8565293 -8935785 -8039543 -6762872 -5531463 -4673628 -4738835 -6105772
36840 -6105772 -8458543 -10932059 -12716223 -13344329 -12539965 -10171366 -6509552 -2299686
36832 -2299686 1681437 5113102 8019029 10215249 11147494 10480894 8768058 7315446
36824 7315446 7291546 8979312 11850672 15261371 19080258 23753150 29737802 36692195
$$ packed form
36882d8799133J206993J849264K275735K765352L650720M918532N836358N466062
36874b0830117L720876J597607K01404k53488l81848p63612j258361j127731J20034
36865a8975236J943067L025535K593349J348739P58931J455243K679714L313618
36857a857040L048917K397125J870060J407348N02389j198933l298314m659390
36849a787838m312760k464695l70492Q96242J276671J231409Q57835o5207j366937
36840f105772k352771k473516j784164o28106Q04364K368599L661814M209866
36832b299686L981123L431665K905927K196220R32245o66600j712836j452612
36824G315446k3900J687766K871360L410699L818887M672892N984652O954393
$$ plain form
36816 36692195 43133452 47067533 47184099 43545454 37250031 29702450 22303130 16421890
36808 16421890 13016327 12022409 12390375 13010716 13583331 14498930 16031343 17857362 19286040
36799 19286040 19700601 18756078 16414295 12965011 8910977 4726230 839826 -2082253
36791 -2082253 -3161574 -2070198 193934 1711692 1132021 -1342019 -4554407 -7677354
36783 -7677354 -10524959 -12781678 -13587412 -12289146 -9357409 -6126335 -3582663 -1669777
36775 -1669777 129962 1752277 2310238 894846 -2448287 -6476115 -9371451 -9686588
36767 -9686588 -6982365 -1895098 4238898 9902134 13849992 15450384 14853772 12830302
36759 12830302 10238300 7494565 4556139 1401573 -1615684 -3998359 -5609193 -6845429
$$ packed form
36816C6692195O441257L934081J16566l638645o295423p547581p399320n881240
36808A6421890l405563r93918L67966O20341N72615R15599J532413J826019J428678
36799A9286040M14561r44523k341783l449284m054034m184747l886404k922079
36791b082253j079321J091376K264132J517758n79671k474040l212388l122947
36783g677354k847605k256719q05734J298266K931737L231074K543672J912886
36775a669777J799739J622315N57961j415392l343133m027828k895336l15137
36767i686588K704223N087267O133996N663236L947858J600392n96612k023470
36759A2830302k592002k743735k938426l154566l017257k382675j610834j236236
$$ plain form
36751 -6845429 -8364695 -10636880 -13478601 -15755345 -15772723 -12522855 -6760031 -593171
36743 -593171 4136582 6955021 8408926 9213648 9964043 11113948 12673831 14165889 15366949
36734 15366949 16898131 19526184 22969211 25980933 27667113 28176929 27997785 27175429
36726 27175429 25528146 23116748 20061159 16239220 11673243 7098277 3760953 2653819
36718 2653819 4079087 7695196 12613050 17564885 21399874 23529626 23767009 21873250
36710 21873250 17589025 11111294 3256998 -4919784 -12540040 -19044995 -24295543 -28642687
36702 -28642687 -32619143 -36287484 -38879845 -39168575 -36274236 -30289541 -22342221 -14118080
36694 -14118080 -7212619 -2770241 -1444167 -3239839 -7159408 -11352402 -14220407 -15582670
$$ packed form
36751f845429j519266k272185k841721k276744j7378L249868N762824O166860
36743e93171M729753K818439J453905Q04722P50395J149905J559883J492058J201060
36734A5366949J531182K628053L443027L011722J686180N09816j79144q22356
36726B7175429j647283k411398l055589l821939m565977m574966l337324j107134
36718B653819J425268L616109M917854M951835L834989K129752K37383j893759
36710B1873250m284225o477731p854296q176782p620256o504955n250548m347144
36702b8642687l976456l668341k592361k88730K894339N984695P947320Q224141
36694a4118080O905461M442378J326074j795672l919569m192994k868005j362263
$$ plain form
36686 -15582670 -16546474 -18107671 -19966554 -20703054 -18999401 -14817214 -9654397 -5596061
36678 -5596061 -3744413 -3430161 -3107177 -1945277 -230995 1670027 4052657 7214056
36670 7214056 10522611 12692526 12869845 11112984 8000569 4206244 357684 -3186298
36662 -3186298 -6509547 -9716424 -12225881 -12827877 -10639743 -5832911 611069 7506788
36654 7506788 13664033 17918138 19518928 18591599 16034866 12952116 10240666 8519748
36646 8519748 8105578 8990900 11017210 14022800 17541795 20350086 20787304 18020641 13013967
36637 13013967 7951196 4514942 2683343 1038923 -1983667 -7017362 -13305785 -18837414
36629 -18837414 -21159214 -18762908 -12160322 -3633562 4161182 9424107 11443353 10331278
$$ packed form
36686a5582670r63804j561197j858883p36500J703653M182187N162817M058336
36678e596061J851648L14252L22984J161900J714282J901022K382630L161399
36670G214056L308555K169915J77319j756861l112415l794325l848560l543982
36662c186298l323249l206877k509457o01996K188134M806832O443980O895719
36654G506788O157245M254105J600790r27329k556733l082750k711450j720918
36646H519748m14170Q85322K026310L005590L518995K808291M37218k766663n006674
36637A3013967n062771l436254j831599j644420l022590n033695o288423n531629
36629a8837414k321800K396306O602586Q526760P794744N262925K019246j112075
$$ plain form
36621 10331278 6996001 3093421 338501 -491866 172887 1424286 2708129 3945976
36613 3945976 5136638 6121848 6780648 7376519 8642229 11369274 15706103 20830169 25468496
36604 25468496 28802170 30774668 31605445 31337994 29986508 27772501 24853779 20968718
36596 20968718 15780842 9705211 4158876 788380 398445 2521031 5822111 8890958
36588 8890958 10874122 11662772 11673511 11494125 11596639 12124254 12822580 13309166 13532724
36579 13532724 13829887 14383538 14806508 14519756 13414826 11823520 9935130 7711376 5468844
36570 5468844 4062276 4169103 5693544 8200881 11618197 15951623 20407468 23511265
36562 23511265 24536646 24527459 25426442 28150399 31774228 34592194 35623416 34949125 33091999
$$ packed form
36621A0331278l335277l902580k754920q30367O64753J251399J283843J237847
36613C945976J190662R85210O58800N95871J265710K727045M336829N124066M638327
36604B5468496L333674J972498Q30777k67451j351486k214007k918722l885061
36596B0968718n187876o075631n546335l370496l89935K122586L301080L068847
36588H890958J983164P88650J0739j79386J02514N27615O98326M86586K23558
36579A3532724K97163N53651M22970k86752j104930j591306j888390k223754k242532
36570E468844j406568J06827J524441K507337L417316M333426M455845L103797
36562B3511265J025381r187Q98983K723957L623829K817966J031222o74291j857126
$$ plain form
36553 33091999 30786628 29393639 30686650 35355344 41702336 46453464 47248116 44209602
36545 44209602 39033700 32983382 26206623 18799555 11850049 6988567 4994115 5116619
36537 5116619 5858245 6308697 6635369 7400902 8680216 9985407 10902827 11590335 12677789
36528 12677789 14842568 18444785 23354062 29041109 34914747 40550211 45495002 49003268
36520 49003268 50316774 49330937 46799120 43793151 41073417 38906756 37161298 35472805
36512 35472805 33605935 31832473 30788245 30885565 32060178 34028416 36305606 37808424
36504 37808424 37002362 32979956 26278326 18442515 11111481 5719847 3389284 4235983
36496 4235983 6902421 9531469 11398678 13237230 16045726 20061646 24788420 29334610
$$ packed form
36553C3091999k305371j392989J293011M668694O346992M751128P94652l038514
36545D4209602n175902o050318o776759p407068o949506m861482j994452J22504
36537E116619P41626M50452L26672P65533J279314J305191R17420O87508J087454
36528A2677789K164779L602217M909277N687047N873638N635464M944791L508266
36520D9003268J313506r85837k531817l005969k719734k166661j745458j688493
36512C5472805j866870j773462j044228R7320J174613J968238K277190J502818
36504C7808424q06062m022406o701630p835811p331034n391634k330563Q46699
36496D235983K666438K629048J867209J838552K808496M015920M726774M546190
$$ plain form
36488 29334610 32616261 33937889 33761249 33439665 33799040 34260983 33620162 31364815 27976025
36479 27976025 24300515 21027128 18538573 16833110 15610037 14668651 14157658 14257241 14726487
36470 14726487 14948930 14370452 12854395 10825224 9168501 8687818 9383211 10415336 10983979
36461 10983979 11076841 11167655 11396779 11320048 10322461 8067937 4770231 1345296 -907052
36452 -907052 -1268929 -344209 463174 333948 -205691 179144 2577883 7247344 13650297
36443 13650297 20763519 27388166 32380669 34856299 34473955 31668257 27434461 22641102
36435 22641102 17526656 11923235 5863755 -121906 -5133094 -8153496 -8421654 -5946872
36427 -5946872 -1673018 3188533 8136650 13567475 19933827 26841139 33037693 37244328
$$ packed form
36488B9334610L281651J321628j76640l21584L59375M61943o40821k255347l388790
36479B7976025l675510l273387k488555j705463j223073r41386n10993R9583M69246
36470A4726487K22443n78478j516057k029171j656723m80683O95393J032125N68643
36461A0983979R2862R0814K29124p6731r97587k254524l297706l424935k252348
36452i07052l61877R24720Q07383j29226n39639L84835K398739M669461O402953
36443A3650297P113222O624647M992503K475630l82344k805698m233796m793359
36435B2641102n114446n603421o059480n985661n011188l020402k68158K474782
36427e946872M273854M861551M948117N430825O366352O907312O196554M206635
$$ plain form
36419 37244328 39014472 38875728 37621769 35391061 31492964 25293065 17335109 9539536
36411 9539536 4201118 2614104 4427676 8182611 12453389 16470151 19776585 21827692
36403 21827692 22514215 22908325 24591936 27756506 30450758 30252289 26475842 20483721
36395 20483721 14399596 10142084 9114016 11540277 15832800 19538953 21529886 22873143
36387 22873143 25221490 28791090 32350623 34835106 36399928 37937870 39981052 42182520
36379 42182520 43650089 43625535 41845601 38376853 33382185 27247136 20706934 14452986
36371 14452986 8682960 3465655 -456853 -1759906 349753 5425906 12213084 19201996
36363 19201996 24534377 26167842 23134590 16735218 9934045 5257767 3259155 2794829
$$ packed form
36419C7244328J770144j38744j253959k230708l898097o199899p957956p795573
36411I539536n338418j587014J813572L754935M270778M016762L306434K051107
36403B1827692O86523L94110J683611L164570K694252j98469l776447n992121
36395B0483721o084125m257512j028068K426261M292523L706153J990933J343257
36387B2873143K348347L569600L559533K484483J564822J537942K043182K201468
36379D2182520J467569k4554j779934l468748m994668o135049o540202o253948
36371A4452986n770026n217305l922508j303053K109659N076153O787178O988912
36363A9201996N332381J633465l033252o399372o801173m676278j998612m64326
$$ plain form
36355 2794829 2408411 1391737 -155776 -1892695 -3559408 -4695707 -4458678 -2343036
36347 -2343036 841743 3253581 3535564 1684427 -1658112 -6004372 -10585211 -13824525
36339 -13824525 -14250158 -11840023 -7792670 -3123682 1803344 6586246 10693559 14273727
36331 14273727 18088376 22145492 25163400 26052563 25415408 24900013 25409424 26603495 27899979
36322 27899979 29176510 30411959 31238819 31092496 29526061 26360417 21923119 17268572
36314 17268572 13789289 12279309 12374279 12910375 12726756 11248624 8697317 5967443 4158776
36305 4158776 4021854 5762779 9204894 13888962 19064874 23971859 28361564 32586741
36297 32586741 36997306 41344017 44874672 46873534 47020531 45495003 43054623 40934912
$$ packed form
36355B794829l86418j016674j547513j736919j666713j136299K37029K115642
36347b343036L184779K411838K81983j851137l342539m346260m580839l239314
36339a3824525m25633K410135M047353M668988M927026M782902M107313L580168
36331A4273727L814649M057116L017908Q89163o37155n15395N09411J194071J296484
36322B7899979J276531J235449Q26860j46323j566435l165644m437298m654547
36314A7268572l479283j509980R4970N36096j83619j478132k551307k729874j808667
36305D158776j36922J740925L442115M684068N175912M906985M389705M225177
36297C2586741M410565M346711L530655J998862J46997j525528k440380k119711
$$ plain form
36289 40934912 40323328 41774878 45184116 50190618 56281594 62429710 67027889 68669940
36281 68669940 67180904 63817127 60388768 58140337 57344776 57757101 59248013 61843015
36273 61843015 65106136 67701572 68045113 65837388 63003073 62769263 67430309 76833311
36265 76833311 88976011 101989314 115557575 130696080 148501042 169170600 191984491
36258 191984491 216036882 241052760 267597329 296414898 327447876 359541709 391143751
36251 391143751 421066264 448256080 470855347 485911716 490418647 482847364 463907741
36244 463907741 436194099 403235960 368515620 334770428 303759529 276372674 252655728
36237 252655728 231666034 211731963 191469331 170811961 150993039 133577934 119674814
$$ packed form
36289D0934912o11584J451550L409238N006502O090976O148116M598179J642051
36281F8669940j489036l363777l428359k248431p95561M12325J490912K595002
36273F1843015L263121K595436L43541k207725k834315k33810M661046R403002
36265G6833311J2142700J3013303J3568261J5138505J7804962K0669558K2813891
36258A91984491K4052391K5015878K6544569K8817569L1032978L2093833L1602042
36251C91143751K9922513K7189816K2599267J5056369M506931p571283j8939623
36244D63907741k7713642l2958139l4720340l3745192l1010899k7386855k3716946
36237B52655728k0989694j9934071k0262632k0657370j9818922j7415105j3903120
$$ plain form
36230 119674814 109854695 104165833 101772356 100781411 98895739 94481575 87147244 77629747
36222 77629747 67432811 58402845 52080090 48995984 48489898 49286641 50375636 51504259
36214 51504259 52977627 55024780 57359294 59405539 60943661 62372439 64217978 66480821
36206 66480821 68590964 69920209 70225467 69740676 69082406 69033629 70192142 72788224 76940315
36197 76940315 82935302 90931980 100400747 110240473 119636708 128605023 137635194 147186862
36189 147186862 157819184 170501740 186291972 205652930 228324785 253793851 281553460
36182 281553460 310923521 341091423 371631628 402711585 434335531 465274464 492876897
36175 492876897 513936612 525669798 526111284 514271233 490571517 457232054 417868286
$$ packed form
36230A19674814r820119n688862k393477r90945j885672m414164p334331r517497
36222G7629747j0196936r029966o322755l084106n06086P96743J088995J128623
36214E1504259J473368K047153K334514K046245J538122J428778J845539K262843
36206F6480821K110143J329245L05258m84791o58270m8777J158513K596082M152091
36197G6940315N994987P996678R468767R839726R396235Q968315R030171R551668
36189A47186862J0632322J2682556J5790232J9360958K2671855K5469066K7759609
36182B81553460K9370061L0167902L0540205L1079957L1623946L0938933K7602433
36175D92876897K1059715J1733186M41486j1840051k3699716l3339463l9363768
$$ plain form
36168 417868286 376380896 336079219 299517790 268445827 243356918 223291857 206720970
36161 206720970 192845949 181738592 173137933 165636701 157507946 148141959 138292137 129028264
36153 129028264 120798502 113373644 106195826 98693655 90700115 82787049 75900722 70484587
36145 70484587 66224588 62775685 60282360 58792808 57537192 55438804 52312900 48992099
36137 48992099 46153286 43571972 40848585 38413003 37238566 37627501 38720082 39336587
36129 39336587 39108332 38723272 39217328 41053907 43713018 46054322 47132871 46744263 45246546
36120 45246546 43001028 40126892 36741272 33261684 30422972 29023000 29500951 31513654
36112 31513654 33922361 35461047 35600308 34739898 33593846 32535147 31515635 30396652
$$ packed form
36168D17868286m1487390m0301677l6561429l1071963k5088909k0065061j6570887
36161B06720970j3875021j1107357q600659p501232q128755r365987r849822r263873
36153A29028264q229762p424858p177818p502171p993540p913066o886327n416135
36145G0484587m259999l448903k493325j489552j255616k098388l125904l320801
36137D8992099k838813k581314k723387k435582j174437L88935J092581O16505
36129C9336587k28255l85060M94056J836579K659111K341304J078549l88608j497717
36120D5246546k245518k874136l385620l479588k838712j399972M77951K012703
36112C1513654K408707J538686J39261q60410j146052j058699j019512j118983
$$ plain form
36104 30396652 29293174 28786471 29838422 33209929 38762785 45466068 52181886 58251976
36096 58251976 63265665 66685111 68131118 67919300 66942321 65951000 65017379 63512975 60474430
36087 60474430 55385876 49101752 43811028 41451581 41990914 43605108 44568923 44591318 44365437
36078 44365437 44472855 45015239 45811523 46525105 46828853 46657576 45969901 44123431 40111774
36069 40111774 33935671 27256246 21989832 18519423 15986373 14093287 13667233 15341402
36061 15341402 18595811 22469247 26408431 29812371 31416786 30093173 26167226 21255843
36053 21255843 16766186 13080292 10193611 8447732 8244847 9377989 10989082 12079556
36045 12079556 11992963 10729567 9027055 7846653 7436720 7061948 5966305 4431161 3483759
$$ packed form
36104C0396652j103478n06703J051951L371507N552856O703283O715818O070090
36096E8251976N013689L419446J446007k11818r76979r91321r33621j504404l038545
36087F0474430n088554o284124n290724k359447N39333J614194R63815K2395k25881
36078D4365437J07418N42384P96284P13582L03748j71277o87675j846470m011657
36069D0111774o176103o679425n266414l470409k533050j893086m26054J674169
36061A5341402L254409L873436L939184L403940J604415j323613l925947m911383
36053B1255843m489657l685894k886681j745879k02885J133142J611093J090474
36045A2079556q6593j263396j702512j180402m09933l74772j095643j535144r47402
$$ plain form
36036 3483759 3681201 4709291 6214127 8383750 11343561 14500823 17135213 19455090
36028 19455090 22409185 26360199 30466246 33575326 35308859 36010597 36032753 35485784 34461607
36019 34461607 33085681 31481988 30095996 29924856 31812669 35252173 38237787 38660154
36011 38660154 35829213 30644700 24643947 19168012 15163082 13189190 13311650 15041477
36003 15041477 17444804 19299136 19318390 16617761 11240099 4202290 -3135621 -9853036
35995 -9853036 -15734088 -20944182 -25576331 -29423386 -31967721 -32535782 -30716676 -26932801
35987 -26932801 -22551501 -19027143 -16629830 -14164381 -10259453 -4936661 321821 3993812
35979 3993812 5634840 5593906 4296160 2383898 1214836 2299131 5829086 10128498
$$ packed form
36036C483759J97442J028090J504836K169623K959811L157262K634390K319877
36028A9455090K954095L951014M106047L109080J733533P01738K2156n46969j024177
36019C4461607j375926j603693j385992j71140J887813L439504K985614M22367
36011C8660154k830941n184513o000753n475935m004930j973892J22460J729827
36003A5041477K403327J854332J9254k700629n377662p037809p337911o717415
35995i853036n881052n210094m632149l847055k544335n68061J819106L783875
35987b6932801M381300L524358K397313K465449L904928N322792N258482L671991
35979C993812J641028m0934j297746j912262j169062J084295L529955M299412
$$ plain form
35971 10128498 12950308 13284150 11844162 10087297 9002678 8629493 8377150 7789567 7149299
35962 7149299 7233143 8282599 9357157 9003643 6527199 2368261 -2620792 -7804913 -12643027
35953 -12643027 -16503082 -19011867 -20377896 -21034600 -21056787 -20167621 -18206326 -15298707 -11589507
35944 -11589507 -7097050 -1968621 3219657 7520868 10056219 10575923 9736849 8751345
35936 8751345 8578651 9384378 10730346 12091399 13060865 13280429 12545043 11069430 9479726
35927 9479726 8460963 8472612 9755855 12409367 16302912 20888878 25137098 27833163
35919 27833163 28284464 26950593 25247179 24513044 25155423 26733290 28461096 29330940 28155989
35910 28155989 24240424 18168910 11509755 5562973 659293 -3339551 -6385288 -8325707
$$ packed form
35971A0128498K821810L33842j439988j756865j084619l73185k52343n87583o40268
35962G149299Q3844J049456J074558l53514k476444m158938m989053n184121m838114
35953a2643027l860055k508785j366029o56704k2187Q89166J961295K907619L709200
35944a1589507M492457N128429N188278M301211K535351N19704q39074r85504
35936H751345j72694Q05727J345968J361053R69466K19564p35386j475613j589704
35927I479726j018763J1649J283243K653512L893545M585966M248220K696065
35919B7833163M51301j333871j703414p34135O42379J577867J727806Q69844j174951
35910B8155989l915565o071514o659155n946782m903680l998844l045737j940419
$$ plain form
35902 -8325707 -9183905 -8973646 -7568074 -5214100 -2968546 -2031680 -2480957 -2953796 -1752774
35893 -1752774 1787223 6896052 11978512 15530428 16794075 15944601 13818789 11407371
35885 11407371 9451927 8318084 8013275 8136552 7798071 5847604 1631454 -4160470
35877 -4160470 -9465398 -11960158 -10452983 -5424959 1404961 7837508 11990129 13224886
35869 13224886 12701133 12692501 14935150 19522808 25257843 30714941 34897931 37347804 38059203
35860 38059203 37249503 35112355 32036934 29154020 28154257 30041790 34202936 39059748
35852 39059748 43446331 46925537 49007644 48849468 46046538 41313207 35996470 30997975
35844 30997975 26308608 21453520 16208047 10883806 5964951 1471222 -3223957 -8793677
$$ packed form
35902h325707q58198K10259J405572K353974K245554R36866m49277m72839J201022
35893a752774L539997N108829N082460L551916J263647q49474k125812k411418
35885A1407371j955444j133843l04809J23277l38481j950467m216150n791924
35877d160470n304928k494760J507175N028024O829920O432547M152621J234757
35869A3224886n23753q632K242649M587658N735035N457098M182990K449873P11399
35860C8059203q09700k137148l075421k882914r99763J887533M161146M856812
35852C9059748M386583L479206K082107j58176k802930m733331n316737m998495
35844C0997975m689367m855088n245473n324241m918855m493729m695179n569720
$$ plain form
35836 -8793677 -15174714 -21477595 -26657343 -30231905 -32498436 -34236391 -36076682 -37852083
35828 -37852083 -38511851 -36895347 -32726734 -26852306 -20609854 -15085309 -10786386 -7651158
35820 -7651158 -5282807 -3417582 -2279679 -2331556 -3623966 -5572282 -7487589 -9230502
35812 -9230502 -11236048 -13871744 -16714440 -18448699 -17713796 -14363828 -9905043 -6461240
35804 -6461240 -5212054 -5862549 -7415603 -9077718 -10391998 -10938817 -10317351 -8451238 -5770113
35795 -5770113 -3007185 -757781 807244 1769579 2068609 1514010 254192 -1150764 -2462929
35786 -2462929 -4260851 -7128415 -10407025 -12346882 -11676161 -8611397 -4200637 806540
35778 806540 6102365 11258420 15541583 18242807 18952215 17644278 14708585 10705649
$$ packed form
35836h793677o381037o302881n179748l574562k266531j737955j840291j775401
35828c7852083o59768J616504M168613N874428O242452N524545M298923L135228
35820g651158K368351J865225J137903n1877j292410j948316j915307j742913
35812i230502k005546k635696k842696j734259P34903L349968M458785L443803
35804f461240J249186o50495j553054j662115j314280n46819O21466J866113K681125
35795e770113K762928K249404J565025R62335K99030n54599j259818j404956j312165
35786b462929j797922k867564l278610j939857O70721L064764M410760N007177
35778H06540N295825N156055M283163K701224P09408j307937k935693m002936
$$ plain form
35770 10705649 5793706 -448264 -8225262 -16534171 -23358380 -27135155 -27973768 -27304160
35762 -27304160 -26411795 -25507221 -24204247 -22506942 -20861138 -19278270 -17011650 -13512060
35754 -13512060 -9381740 -5896737 -3752649 -2741388 -2437525 -2488169 -2247108 -1031734 785254
35745 785254 1535603 -293259 -4581419 -9804699 -14268096 -16717951 -16371165 -13307723 -8826432
35736 -8826432 -4650819 -1514170 1091217 3691414 5822192 6431663 4928383 1593003
35728 1593003 -2794127 -7458285 -11833873 -15404067 -17341006 -16422829 -11652324 -3217912
35720 -3217912 7171916 17021512 24261948 28095886 29138850 28965389 29299653 31199319
35712 31199319 34615195 38494788 41346041 42030781 40354942 36965497 32622590 27656869
$$ packed form
35770A0705649m911943o241970p776998q308909o824209l776775q38613O69608
35762b7304160Q92365R04574J302974J697305J645804J582868K266620L499590
35754a3512060M130320L485003K144088J011261L03863n0644K41061J215374J816988
35745G85254P50349j828862m288160n223280m463397k449855L46786L063442M481291
35736h826432M175613L136649K605387K600197K130778O09471j503280l335380
35728A593003m387130m664158m375588l570194j936939R18177M770505Q434412
35720c217912J0389828R849596P240436L833938J042964j73461L34264J899666
35712C1199319L415876L879593K851253O84740j675839l389445m342907m965721
$$ plain form
35704 27656869 22211984 16791739 12232807 9129488 7524758 7175851 7852863 9299823
35696 9299823 11197418 13404655 16095311 19400000 22936590 25925323 27852460 28864243
35688 28864243 29363114 29290554 27973296 24683324 19251072 12240908 4849055 -1354142
35680 -1354142 -5147919 -6666033 -7471904 -9041790 -11151394 -12272111 -11583162 -9929689
35672 -9929689 -8555925 -7614790 -6517278 -5235257 -4429223 -4401024 -4648057 -4566058 -4035283
35663 -4035283 -3119834 -1652474 547571 3268080 6025912 8603140 11330224 14718324
35655 14718324 18690750 22229842 24109092 24163730 23560672 23527275 24018102 23863129 21851650
35646 21851650 17247253 9738941 -116128 -10271726 -17870702 -21143124 -20479702 -17560012
$$ packed form
35704B7656869n444885n420245m558932l103319j604730l48907O77012J446960
35696I299823J897595K207237K690656L304689L536590K988733J927137J011783
35688B8864243M98871p2560j317258l289972n432252p010164p391853o203197
35680a354142l793777j518114q05871j569886k109604j120717O88949J653473
35672i929689J373764R41135J097512J282021Q06034K8199k47033Q1999N30775
35663d035283R15449J467360K200045K720509K757832K577228K727084L388100
35655A4718324L972426L539092J879250N4638o03058l3397M90827j54973k011479
35646B1851650m604397p508312r855069j0155598p598976l272422O63422K919690
$$ plain form
35638 -17560012 -13852737 -10117658 -6783638 -4248241 -2926046 -3316146 -5913447 -10784477
35630 -10784477 -17222108 -23899504 -29365095 -32569273 -33273562 -32026605 -29510583 -25933546
35622 -25933546 -21331036 -16259603 -11540890 -7261624 -2798556 1779268 5014368 5445441
35614 5445441 3395012 846156 -248125 847532 3688575 7065176 9397731 9440673
35606 9440673 7021526 3103594 -728718 -2800808 -2029642 1092566 4290621 5097107
35598 5097107 3011070 -166307 -2063554 -1367191 2011480 7300146 12815763 16245878
35590 16245878 16005291 12605491 8454969 6178886 6978579 10179313 14011062 16978183
35582 16978183 18826064 20283694 21893623 23344199 24153945 24805711 26803721 31415469
$$ packed form
35638a7560012L707275L735079L334020K535397J322195l90100k597301m871030
35630a0784477o437631o677396n465591l204178p04289J246957K516022L577037
35622b5933546M602510N071433M718713M279266M463068M577824L235100M31073
35614E445441k050429k548856j094281J095657K841043L376601K332555M2942
35606I440673k419147l917932l832312k072090P71166L122208L198055Q06486
35598E097107k086037l177377j897247O96363L378671N288666N515617L430115
35590A6245878k40587l399800m150522k276083P99693L200734L831749K967121
35582A6978183J847881J457630J609929J450576Q09746O51766J998010M611748
$$ plain form
35574 31415469 38325883 45477953 50314854 51540843 50037800 48117689 47698831 48965316
35566 48965316 50460351 50175703 46711795 40047144 31669245 23769860 17866161 14076062
35558 14076062 11733405 10400638 9946117 9836876 8921740 6173157 1533416 -3980057
35550 -3980057 -8853722 -11842595 -12487161 -11039785 -7874201 -3159725 2596363 7872506
35542 7872506 10652192 10023438 7115913 4274299 3420493 5168382 8967729 13576632
35534 13576632 17540284 19770221 19965074 18493293 15986436 13166433 10824534 9559114
35526 9559114 9493901 10492186 12567368 15663330 18947565 20819884 20075546 16978209 12920485
35517 12920485 9084789 5636207 2099035 -1852393 -6088199 -10213653 -13783107 -16367959
$$ packed form
35574C1415469O910414P152070M836901J225989j503043j920111m18858J266485
35566D8965316J495035k84648l463908o664651q377899p899385n903699l790099
35558A4076062k342657j332767m54521j09241r15136k748583m639741n513473
35550c980057m873665k988873o44566J447376L165584M714476N756088N276143
35542G872506K779686o28754k907525k841614q53806J747889L799347M608903
35534A3576632L963652K229937J94853j471781k506857k820003k341899j265420
35526I559114o5213R98285K075182L095962L284235J872319p44338l097337m057724
35517A2920485l835696l448582l537172l951428m235806m125454l569454k584852
$$ plain form
35509 -16367959 -17630333 -17423350 -15748943 -12587787 -7915809 -2063038 3994731 8963607
35501 8963607 12006895 13106695 12643859 10945314 8524019 6434620 5692476 6122678 6240613
35492 6240613 4645610 1352226 -2456018 -5676537 -7923023 -9159867 -9261600 -8054833
35484 -8054833 -5511268 -1832902 2441526 6436250 9336783 10845805 11036794 9849745
35476 9849745 7192645 3662718 635140 -881147 -1388830 -2578734 -5854504 -11307086
35468 -11307086 -17959970 -24653685 -30621374 -35478748 -38925635 -40578682 -40168221 -37908071
35460 -37908071 -34558756 -31046406 -28078834 -26089952 -25225702 -25115248 -24869847 -23735871
35452 -23735871 -21796877 -19740330 -17892199 -15805353 -12921846 -9306714 -5464485 -1679526
$$ packed form
35509a6367959j262374K06983J674407L161156M671978N852771O057769M968876
35501H963607L043288J099800m62836j698545k421295k089399p42144M30202J17935
35492F240613j595003l293384l808244l220519k246486j236844j01733J206767
35484h054833K543565L678366M274428L994724K900533J509022J90989j187049
35476I849745k657100l529927l027578j516287n07683j189904l275770n452582
35468a1307086o652884o693715n967689m857374l446887j653047M10461K260150
35460c7908071L349315L512350K967572J988882Q64250J10454K45401J133976
35452b3735871J938994K056547J848131K086846K883507L615132L842229L784959
$$ plain form
35444 -1679526 2083988 5711287 8783153 11043978 12774861 14485592 16333865 18034970
35436 18034970 19320755 20310290 21350916 22585674 23765319 24409607 23979921 21873629
35428 21873629 17526999 10889265 2862391 -5012741 -11541115 -16447820 -19842299 -21384181
35420 -21384181 -20461008 -17240288 -13054635 -9371535 -6544550 -3821184 -367298 4045881
35412 4045881 9147088 14384644 18967983 22214676 24145285 25380313 26128445 25599801
35404 25599801 22893015 18320719 13345370 9157180 5781147 2784922 460847 -123861
35396 -123861 1805627 5876113 10784179 15221192 18618927 21171554 23216394 24570693
35388 24570693 24490696 22316880 18104436 12566664 6525902 618280 -4522605 -8166910
$$ packed form
35444a679526L763514L627299L071866K260825J730883J710731J848273J701105
35436A8034970J285785R89535J040626J234758J179645O44288m29686k106292
35428B1873629m346630o637734q026874p875132o528374m906705l394479j541882
35420b1384181R23173L220720M185653L683100K826985K723366L453886M413179
35412D045881N101207N237556M583339L246693J930609J235028P48132n28644
35404B5599801k706786m572296m975349m188190l376033k996225k324075n84708
35396a23861J929488M070486M908066M437013L397735K552627K044840J354299
35388B4570693p9997k173816m212444n537772o040762n907622n140885l644305
$$ plain form
35380 -8166910 -9892022 -10045865 -9581854 -9354191 -9621837 -10131898 -10435049 -10122224 -9126726
35371 -9126726 -8038956 -7829108 -8808409 -9905332 -9421120 -6723109 -3020716 -355526 94848
35362 94848 -1149439 -2328428 -1712295 1019470 4261013 5648230 4223391 1402340 -457026
35353 -457026 -299699 1040597 2135304 2191996 994803 -1658980 -5888389 -11151407 -16049940
35344 -16049940 -18939301 -18972055 -16758250 -13947032 -11942875 -10984160 -10481469 -9963174 -9370593
35335 -9370593 -8671392 -7764890 -6850756 -6428829 -6739604 -7491267 -8205341 -8464092 -7768391
35326 -7768391 -5733222 -2810532 -420275 180441 -880388 -2279670 -2839163 -2478312 -1985024
35317 -1985024 -2127051 -2966961 -3871044 -4209882 -4139176 -4595590 -6419748 -9569419 -13227456
$$ packed form
35380h166910j725112j53843M64011K27663k67646n10061l03151L12825R95498
35371i126726J087770K09848r79301j096923M84212K698011L702393K665190M50374
35362I4848j244287j178989O16133K731765L241543J387217j424839k821051j859366
35353d57026J57327J340296J094707N6692j197193k653783m229409n263018m898533
35344a6049940k889361l2754K213805K811218K004157R58715N02691N18295N92581
35335i370593O99201R06502R14134M21927l10775p51663p14074k58751O95701
35326g768391K035169K922690K390257O00716j060829j399282n59493L60851M93288
35317a985024j42027q39910r04083l38838P0706m56414j824158l149671l658037
$$ plain form
35308 -13227456 -16479343 -18765468 -19869148 -19678014 -17963627 -14455206 -9325174 -3518481
35300 -3518481 1793628 6149979 9780478 12591147 13809785 13059889 11291010 10038224
35292 10038224 9963440 10567028 11053818 10931738 9976644 8277434 6309299 4364042 1807356
35283 1807356 -2565131 -9180239 -16948802 -23929321 -28458485 -29708835 -27704842 -23180631
35275 -23180631 -17348017 -11658442 -7649607 -6567583 -8612219 -12572605 -16590091 -19334908
35267 -19334908 -20312336 -19442099 -17023249 -14003448 -11493718 -9806756 -8542573 -7734798
35259 -7734798 -8162487 -10158804 -12805582 -14943004 -16584929 -18721039 -21935294 -25778381
35251 -25778381 -29414055 -32380171 -34635749 -36164993 -36650433 -35500056 -32334036 -27526805
$$ packed form
35308a3227456l251887k286125j103680J91134J714387L508421N130032N806693
35300c518481N312109M356351L630499K810669J218638p49896j768879j252786
35292A0038224p4784O03588M86790j22080r55094j699210j968135j945257k556686
35283A807356m372487o615108p768563o980519m529164j250350K003993M524211
35275b3180631N832614N689575M008835J082024k044636l960386m017486k744817
35267a9334908r77428Q70237K418850L019801K509730J686962J264183Q07775
35259g734798m27689j996317k646778k137422j641925k136110l214255l843087
35251b5778381l635674k966116k255578j529244m85440J150377L166020M807231
$$ plain form
35243 -27526805 -22032977 -16558810 -11249328 -6399007 -2945595 -1610927 -1705899 -1451702
35235 -1451702 337457 3261595 6096639 8114329 9420690 10388229 11282091 12451856
35227 12451856 14400334 17255371 20303504 22532480 23825508 25232737 27702871 30844590
35219 30844590 33417507 34774107 35106859 34381106 32001471 27917743 23284281 19422343
35211 19422343 16625325 14493587 12882759 11836777 11058688 10309027 10094918 11100967
35203 11100967 12971634 14419573 14578868 13563539 11686801 8987787 5841331 3324954
35195 3324954 2431890 3169496 4669863 5949029 6545156 6887741 8166662 11325455 15937595
35186 15937595 20467345 23793260 26046629 27894223 29672818 31478304 33324627 34650211
$$ packed form
35243b7526805N493828N474167N309482M850321L453412J334668r4972K54197
35235a451702J789159K924138K835044K017690J306361R67539Q93862J169765
35227A2451856J948478K855037L048133K228976J293028J407229K470134L141719
35219C0844590K572917J356600L32752p25753k379635m083728m633462l861938
35211A9422343k797018k131738j610828j045982p78089p49661k14109J006049
35203A1100967J870667J447939J59295j015329j876738k699014l146456k516377
35195C324954q93064P37606J500367J279166N96127L42585J278921L158793M612140
35186A5937595M529750L325915K253369J847594J778595J805486J846323J325584
$$ plain form
35178 34650211 34300257 31759861 28078705 24927390 22988439 21794201 20690391 19138015
35170 19138015 16387477 11965728 6693518 2406275 335657 252602 1190128 2132668 1719855
35161 1719855 -1663596 -8505058 -17189369 -25168464 -31033463 -35006008 -37766586 -39625588
35153 -39625588 -40813192 -41710777 -42404090 -42513679 -41819589 -40637706 -39211065 -37158580 -34120018
35144 -34120018 -30764923 -28509727 -28095517 -28846388 -29399127 -28687529 -26057551 -21086784 -14002042
35135 -14002042 -6125128 749014 5606875 8553116 9927134 9623530 7560328 4401847
35127 4401847 1345928 -705385 -1480367 -1045716 350484 2122253 3492086 4089697 4260485
35118 4260485 4602996 5318614 6203023 7221344 8878338 11915799 16690005 22895939 29850057
$$ packed form
35178C4650211l49954k540396l681156l151315j938951j194238j103810j552376
35170A9138015k750538m421749n272210m287243k070618q3055R37526R42540m12813
35161A719855l383451o841462q684311p979095n864999l972545k760578j859002
35153c9625588j187604q97585o93313j09589O94090J181883J426641K052485L038562
35144c4120018L355095K255196M14210p50871n52739P11598K629978M970767P084742
35135a4002042P876914O874142M857861K946241J374018l03604k063202l158481
35127D401847l055919k051313p74982M34651J396200J771769J369833N97611J70788
35118D260485L42511P15618Q84409J018321J656994L037461M774206O205934O954118
$$ plain form
35109 29850057 36895760 43403153 48441374 50771087 49505970 44876800 38194840 30910140
35101 30910140 23669957 16281338 8503377 780583 -5790244 -10107631 -11622314 -10402446
35093 -10402446 -6967107 -2231845 2621106 6670438 9811319 12566248 15225404 17394885
35085 17394885 18507533 18431447 17246267 14721906 10597794 5366289 193358 -4189645
35077 -4189645 -8097991 -12081051 -15855922 -18535675 -19768695 -20097655 -20056085 -19358362 -17363139
35068 -17363139 -14198519 -11059815 -9259650 -9096549 -9732510 -10098695 -9828452 -9354099 -9246919
35059 -9246919 -9572249 -9882525 -9779226 -9432598 -9501282 -10486146 -12162692 -13715799 -14468763
35050 -14468763 -14445955 -14223471 -14308621 -14673870 -14780152 -14025436 -12332873 -10371864 -8970932
$$ packed form
35109B9850057P045703O507393N038221K329713j265117m629170o681960p284700
35101C0910140p240183p388619p777961p722794o570827m317387j514683J219868
35093a0402446L435339M735262M852951M049332L140881K754929K659156K169481
35085A7394885J112648p6086j185180k524361m124112n231505n172931m383003
35077d189645l908346l983060l774871k679753j233020l28960M1570O97723J995223
35068a7363139L164620L138704J800165J63101o35961l66185K70243M74353J07180
35059i246919l25330l10276J03299L46628o8684r84864j676546j553107p52964
35050a4468763K2808K22484q5150l65249j06282P54716J692563J961009J400932
$$ plain form
35041 -8970932 -8100695 -6622699 -3382970 1443868 6311010 9540736 10408186 9211518
35033 9211518 6824590 4307264 2461576 1399416 729675 341006 694024 2077862 3895993
35024 3895993 5111794 5268196 4716393 3992476 3423452 3316887 4017728 5519324 7269907
35015 7269907 8615372 9404726 10111166 11390733 13420303 15514547 16529178 15937093 14470698
35006 14470698 13404490 13233465 13424867 13479588 13727935 14834671 16970882 19909481 23641455
34997 23641455 28306643 33478178 37973811 40609815 40962098 39272902 35841788 30800065
34989 30800065 24500595 17892849 12247467 8383267 6190834 4946865 3996076 3027181
34981 3027181 1840602 169228 -2182515 -5227663 -8911632 -13126716 -17468134 -21150381
$$ packed form
35041h970932Q70237J477996L239729M826838M867142L229726Q67450j196668
35033I211518k386928k517326j845688j062160o69741l88669L53018J383838J818131
35024C895993J215801J56402n51803p23917n69024j06565P00841J501596J750583
35015G269907J345465P89354P06440J279567K029570K094244J014631n92085j466395
35006A4470698j066208j71025J91402N4721K48347J106736K136211K938599L731974
34997B3641455M665188N171535M495633K636004L52283j689196l431114n041723
34989C0800065o299470o607746n645382l864200k192433j243969r50789r68895
34981C027181j186579j671374k351743l045148l683969m215084m341418l682247
$$ plain form
34973 -21150381 -23362227 -23654602 -21932507 -18274834 -12961135 -6571251 116951 6291983
34965 6291983 11153732 14043905 14737012 13462983 10523405 6163805 1044611 -3583399
34957 -3583399 -6787883 -8976220 -11453897 -14867181 -18520572 -21284431 -22576365 -22155148
34949 -22155148 -19561722 -14500851 -7720642 -985302 4001713 6502165 6708933 5227095
34941 5227095 2725070 -195893 -3096472 -5725063 -7933485 -9629979 -10851972 -11794853
34933 -11794853 -12624252 -13174890 -12871232 -11097937 -7774515 -3486954 1129182 6090796
34925 6090796 11858016 18293078 24096460 27610214 28211817 26817263 25086724 24200155
34917 24200155 24145424 23854086 22107796 18718792 14975682 12696850 12688027 14238996 16124758
$$ packed form
34973b1150381k211846k92375J722095L657673N313699O389884O688202O175032
34965F291983M861749K890173O93107j274029k939578m359600n119194m628010
34957c583399l204484k188337k477677l413284l653391k763859j291934M21217
34949b2155148K593426N060871O780209O735340M987015K500452K06768j481838
34941E227095k502025k920963k900579k628591k208422j696494j221993r42881
34933a1794853q29399n50638L03658J773295L323422M287561M616136M961614
34925F090796N767220O435062N803382L513754O01603j394554j730539q86569
34917B4200155n4731k91338j746290l389004l743110k278832q823J550969J885762
$$ plain form
34908 16124758 17790994 19402314 21073506 22504979 23376543 23764958 24013395 24318760 24563962
34899 24563962 24527555 24223617 24014040 24260837 24736836 24483934 22516577 18740300 14028207
34890 14028207 9388820 5312442 2015897 -55414 -395509 989218 3606799 7187890
34882 7187890 12016215 18273868 25186773 31070850 34302744 34339920 32089202 29470066
34874 29470066 28336138 29315703 31511045 33468857 34510491 35063378 35864842 37175623
34866 37175623 38730006 39967933 40083439 38279314 34474226 29638018 25004392 20951601
34858 20951601 16960950 12571022 7895093 3183454 -1486018 -5704447 -8396011 -8622929
34850 -8622929 -6680980 -3970773 -1794343 -655796 -727419 -2459984 -6346458 -12189724
$$ packed form
34908A6124758J666236J611320J671192J431473Q71564L88415K48437L05365K45202
34899B4563962l6407l03938k09577K46797M75999k52902j967357l776277m712093
34890A4028207m639387m076378l296545k071311l40095J384727K617581L581091
34882G187890M828325O257653O912905N884077L231894L7176k250718k619136
34874B9470066j133928R79565K195342J957812J041634N52887Q01464J310781
34866C7175623J554383J237927J15506j804125l805088m836208m633626m052791
34858B0951601l990651m389928m675929m711639m669472m218429k691564k26918
34850h622929J941949K710207K176430J138547p1623j732565l886474n843266
$$ plain form
34842 -12189724 -18801793 -24466713 -27863465 -28878450 -28609046 -28325049 -28350629 -28211760 -27846268
34833 -27846268 -28107051 -29746382 -32349780 -34756598 -36203119 -36436568 -34895730 -30613502
34825 -30613502 -23277853 -14039772 -5078866 1425288 4039681 2513821 -2107039 -8103129
34817 -8103129 -14137344 -19587196 -23899280 -26249542 -26260420 -24610621 -22335060 -19656865
34809 -19656865 -15968758 -10859671 -4702804 1748425 7933842 13610680 18735382 23299073
34801 23299073 27091659 29699160 30999563 31577527 32310980 33561833 35083605 36688337
34793 36688337 38609310 41107428 44018686 46807520 48878591 49820157 49534961 48082687
34785 48082687 45208032 40278304 33184967 25210453 18367224 13687079 10580383 7939383
$$ packed form
34842a2189724o612069n664920l396752j014985K69404K83997k5580J38869L65492
34833b7846268k60783j639331k603398k406818j446521k33449J540838M282228
34825c0613502P335649R238081Q960906O504154K614393j525860m620860n996090
34817h103129o034215n449852m312084k350262j0878J649799K275561K678195
34809a9656865L688107N109087O156867O451229O185417N676838N124702M563691
34801B3299073L792586K607501J300403N77964P33453J250853J521772J604732
34793C6688337J920973K498118K911258K788834K071071R41566k85196j452274
34785D8082687k874655m929728p093337p974514o843229m680145l106696k641000
$$ plain form
34777 7939383 5292974 2695197 180406 -2128904 -3792715 -4521780 -4747102 -5364078 -7026411
34768 -7026411 -9838514 -13347541 -16497113 -18013876 -17431203 -15604618 -13788643 -12321768
34760 -12321768 -10524532 -7596843 -3189003 2517640 8550361 13117743 14712561 13515870
34752 13515870 11221763 9359878 8303214 7973990 8714874 10898737 14080307 17116024
34744 17116024 19079955 19821203 19796510 19631997 19734784 20104363 20584674 21379004 23060760
34735 23060760 25800647 28709143 30264877 29511040 26799303 23384540 20274689 17319873
34727 17319873 13343335 7305492 -485029 -8241416 -13726660 -15485802 -13484730 -9064372
34719 -9064372 -4277486 -702981 1533671 3497381 6036301 8718431 10218520 9552792
$$ packed form
34777G939383k646409k597777k514791k309310j663811p29065k25322o16976j662333
34768g026411k812103l509027l149572j516763N82673J826585J815975J466875
34760a2321768J797236K927689M407840N706643O032721M567382J594818j196691
34752A3515870k294107j861885j056664l29224P40884K183863L181570L035717
34744A7116024J963931P41248k4693j64513J02787L69579M80311P94330J681756
34735B3060760K739887K908496J555734p53837k711737l414763l109851k954816
34727A7319873l976538o037843p790521p756387n485244j759142K001072M420358
34719i064372M786886L574505K236652J963710K538920K682130J500089o65728
$$ plain form
34711 9552792 6801961 2818790 -1546252 -5932056 -10229681 -13889158 -15782714 -15254248
34703 -15254248 -13292012 -12040852 -12793313 -14795013 -16281830 -16273848 -14990479 -12979718 -10512931
34694 -10512931 -7691911 -4530017 -866266 3344361 7537132 10631860 11726570 10637369
34686 10637369 8005087 5163366 3572734 3775657 4954615 6025531 7060264 8953919
34678 8953919 11650304 13498447 12744647 9131955 3768588 -1876333 -6341843 -8297776
34670 -8297776 -7352621 -4701660 -2258096 -1026322 -699794 -631002 -478920 100040 1546036
34661 1546036 3726935 5668299 6430165 6005685 5022128 3845003 2397036 658625 -1150941
34652 -1150941 -2869513 -4415950 -5408793 -5176982 -3504725 -1281067 -135386 -1265088
$$ packed form
34711I552792k750831l983171m365042m385804m297625l659477j893556N28466
34703a5254248J962236J251160p52461k001700j486817P982J283369K010761K466787
34694a0512931K821020L161894L663751M210627M192771L094728J094710j089201
34686A0637369k632282k841721j590632K02923J178958J070916J034733J893655
34678H953919K696385J848143p53800l612692n363367n644921m465510j955933
34670h297776R45155K650961K443564J231774L26528O8792J52082N78960J445996
34661A546036K180899J941364P61866m24480r83557j177125j447967j738411j809566
34652a150941j718572j546437r92843K31811J672257K223658J145681j129702
$$ plain form
34644 -1265088 -4536344 -8647237 -12146673 -14366490 -15477261 -15825903 -15496673 -14651649 -14047181
34635 -14047181 -14794049 -17493882 -21816898 -26967060 -32245401 -36959289 -40107976 -40685672
34627 -40685672 -38446533 -34169313 -29076507 -24110721 -19745965 -16181851 -13462443 -11496808
34619 -11496808 -10189226 -9563159 -9599524 -9911192 -9718226 -8280788 -5394714 -1515946 2469273
34610 2469273 5552879 6919040 6351650 4536990 2783355 2104242 2448117 2932775 2879358
34601 2879358 2502310 2584579 3725672 6068121 9507513 13775967 18303950 22349419 25490175
34592 25490175 27926581 30270657 33173636 37131155 42295906 48181810 53657587 57503045
34584 57503045 59036920 58177391 55096520 50106456 43808406 36907749 29583411 21200713
$$ packed form
34644a265088l271256m110893l499436k219817j110771l48642L29230Q45024O04468
34635a4047181p46868k699833m323016n150162n278341m713888l148687n77696
34627d0685672K239139M277220N092806M965786M364756L564114K719408J965635
34619a1496808J307582O26067l6365l11668J92966J437438K886074L878768L985219
34610B469273L083606J366161n67390j814660j753635o79113L43875M84658n3417
34601B879358l77048Q2269J141093K342449L439392M268454M527983M045469L140756
34592B5490175K436406K344076K902979L957519N164751N885904N475777L845458
34584E7503045J533875q59529l080871m990064o298050o900657p324338q382698
$$ plain form
34576 21200713 11000577 -784652 -12605719 -22512819 -29452168 -33727385 -36344820 -38062954
34568 -38062954 -39048765 -39201291 -38539853 -37233692 -35401447 -33009970 -30013490 -26630890
34560 -26630890 -23472190 -21219964 -20014162 -19244572 -18176098 -16750027 -15568007 -15224263
34552 -15224263 -16098877 -18803456 -24110807 -31883332 -40407722 -47432498 -51864854 -54063963
34544 -54063963 -54630120 -53505773 -50288797 -44774299 -36943654 -27026433 -16053968 -5949439
34536 -5949439 1554635 6093860 8521345 9798235 10408332 10656727 10922264 11399322 11878163
34527 11878163 11933039 11178212 9367360 6554769 3278391 358593 -1629590 -2601551 -2756741
34518 -2756741 -2439718 -2256841 -2924438 -4666306 -6894306 -8732335 -9809092 -10425876 -11122834
$$ packed form
34576B1200713j0200136j1785229j1821067r907100o939349m275217k617435j718134
34568c8062954r85811j52526O61438J306161J832245K391477K996480L382600
34560b6630890L158700K252226J205802P69590J068474J426071J182020L43744
34552a5224263q74614k704579n307351p772525q524390p024776m432356k199109
34544e4063963n66157J124347L216976N514498P830645R917221J0972465J0104529
34536e949439P504074M539225K427485J276890O10097K48395K65537M77058M78841
34527A1878163N4876p54827j810852k812591l276378k919798j988183r71961j55190
34518b756741L17023J82877o67597j741868k228000j838029j076757o16784o96958
$$ plain form
34509 -11122834 -12314531 -14245461 -17006415 -20504242 -24492835 -28594264 -32201228 -34476981
34501 -34476981 -34686630 -32637945 -28868170 -24578286 -21378395 -20606615 -22336617 -25079720
34493 -25079720 -26914843 -27062263 -26146897 -25036894 -23934783 -22665997 -21143256 -19010114
34485 -19010114 -15299616 -9305462 -1917779 4470364 7727621 7541557 5262388 2607429
34477 2607429 697033 -68783 202198 1027282 1706988 1707413 1158511 1028757 2539235 6017160
34467 6017160 10251115 13272009 13994885 13008726 11705490 10902211 10536002 10434936 10901613
34458 10901613 12479667 15496686 19949409 25479526 31180975 35672161 37766980 37100515
34450 37100515 33886316 28195326 19962320 9876522 -191260 -8169847 -13207686 -15910745
$$ packed form
34509a1122834j191697j930930k760954l497827l988593m101429l606964k275753
34501c4476981k09649K048685L769775M289884L199891P71780j730002k743103
34493b5079720j835123j47420R15366J110003J102111J268786J522741K133142
34485a9010114L710498N994154P387683O388143L257257j86064k279169k654959
34477B607429j910396p65816K70981Q25084O79706M25n48902j29754J510478L477925
34467F017160M233955L020894P22876r86159j303236q03279l66209j01066M66677
34458A0901613J578054L017019M452723N530117N701449M491186K094819o66465
34450C7100515l214199n690990q233006j0085798j0067782p978587n037839k703059
$$ plain form
34442 -15910745 -17359603 -18318740 -19324564 -20840748 -22864795 -24743568 -25953864 -27007580
34434 -27007580 -29077859 -32587086 -36510845 -39278213 -40155954 -39614809 -38581127 -37566276
34426 -37566276 -36373372 -34361667 -31003467 -26437214 -21622689 -17887259 -16179033 -16605199
34418 -16605199 -18514427 -20935797 -23053702 -24477213 -25189413 -25297955 -24918479 -24344503 -24177283
34409 -24177283 -24977181 -26580517 -27842357 -27312947 -24343934 -19537216 -14128203 -9090068
34401 -9090068 -4917144 -1975323 -563816 -508777 -1061951 -1485566 -1575804 -1421423 -883617
34392 -883617 354767 2324088 4636869 6743842 8085650 8174151 6933280 4918982 2836566
34383 2836566 907213 -857113 -1844916 -997003 1966526 5944641 9344031 11149718
$$ packed form
34442a5910745j448858r59137j005824j516184k024047j878773j210296j053716
34434b7007580k070279l509227l923759k767368q77741N41145J033682J014851
34426c7566276J192904K011705L358200M566253M814525L735430J708226m26166
34418a6605199j909228k421370k117905j423511p12200j08542L79476N73976J67220
34409b4177283p99898j603336j261840N29410K969013M806718N409013N038135
34401i090068M172924K941821J411507N5039n53174m23615r0238J54381N37806
34392h83617J238384J969321K312781K106973J341808Q8501j240871k014298k082416
34383B836566j929353j764326r87803Q47913K963529L978115L399390J805687
$$ plain form
34375 11149718 10923456 8425193 3929645 -1294731 -5385031 -6818461 -4926976 -73601
34367 -73601 6108550 11067781 12816576 11250060 7656052 3132242 -1906534 -6834561
34359 -6834561 -10387066 -11533504 -10289442 -7390148 -3628582 194586 3161228 4598010
34351 4598010 4435276 3005319 738689 -1746101 -3640462 -4487135 -4632386 -4861076 -5658459
34342 -5658459 -6978854 -8511570 -9887823 -10764065 -10994160 -10699585 -10049997 -9127811 -8150020
34333 -8150020 -7563386 -7608808 -7924170 -7850669 -6991480 -5178809 -2099894 2489017 8033459
34324 8033459 13058993 16100853 16712674 15475623 13146659 9974140 5878472 1196109
34316 1196109 -2969879 -5374773 -5637671 -4408457 -2444871 200327 3845644 8321392
$$ packed form
34375A1149718k26262k498263m495548n224376m090300j433430J891485M853375
34367g3601O182151M959231J748795j566516l594008m523810n038776m928027
34359f834561l552505j146438J244062K899294L761566L823168K966642J436782
34351D598010j62734j429957k266630k484790j894361q46673j45251k28690p97383
34342e658459j320395j532716j376253q76242k30095K94575O49588R22186R77791
34333h150020N86634m5422l15362P3501Q59189J812671L078915M588911N544442
34324H033459N025534L041860O11821j237051k328964l172519m095668m682363
34316A196109m165988k404894k62898J229214J963586K645198L645317M475748
$$ plain form
34308 8321392 12923657 17259452 21779360 27296393 34076405 41344522 47436668 50485155
34300 50485155 49424260 44705062 38023703 31267978 25760135 22345967 21655303 23799940
34292 23799940 27912256 32409259 35934741 38024553 38938107 39091655 38742038 37982857 36745522
34283 36745522 34740802 31549112 26916004 21037753 14652454 8940187 5232339 4466123
34275 4466123 6562498 10249564 13662996 15345453 14890123 12878265 10334159 8053455
34267 8053455 6115887 3951453 1041346 -2406683 -5629028 -8126924 -10044410 -11649988
34259 -11649988 -12744598 -12795832 -11448113 -8681970 -4669949 251916 5612694 11068191
34251 11068191 16458207 21251146 24107647 23616326 19732942 14169048 9031862 5102219
$$ packed form
34308H321392M602265M335795M519908N517033O780012P268117O092146L048487
34300E0485155j060895m719198o681359o755725n507843l414168o90664K144637
34292B3799940M112316M497003L525482K089812R13554J53548l49617p59181j237335
34283C6745522k004720l191690m633108n878251o385299n712267l707848p66216
34275D466123K096375L687066L413432J682457m55330k011858k544106k280704
34267H053455j937568k164434k910107l448029l222345k497896j917486j605578
34259a1649988j094610n1234J347719K766143M012021M921865N360778N455497
34251A1068191N390016M792939K856501m91321l883384n563894n137186l929643
$$ plain form
34243 5102219 1468459 -3365928 -10093963 -17977524 -25249939 -30244223 -32499559 -32958572
34235 -32958572 -33042205 -33455969 -33809187 -33222777 -31174395 -27838310 -23829496 -19746742 -15910668
34226 -15910668 -12399489 -9199971 -6249757 -3363236 -230274 3390093 7392494 11216528
34218 11216528 14083877 15488799 15555648 14915236 14238544 13946747 14304075 15506714 17444889
34209 17444889 19466036 20634056 20341149 18654795 16129797 13370751 10699225 8081384
34201 8081384 5349215 2537167 -65756 -2258807 -4175106 -6012293 -7625489 -8611280
34193 -8611280 -8764452 -8282399 -7588469 -7125913 -7158691 -7436236 -7155486 -5733699 -3724757
34184 -3724757 -2525706 -2902076 -4083254 -4589774 -3785876 -2443439 -2009730 -3516390 -6865379
$$ packed form
34243E102219l633760m834387o728035p883561p272415m994284k255336m59013
34235c2958572q3633m13764l53218N86410K048382L336085M008814M082754L836074
34226a5910668L511179L199518K950214K886521L132962L620367M002401L824034
34218A1216528K867349J404922O6849o40412o76692k91797L57328J202639J938175
34209A7444889K021147J168020k92907j686354k524998k759046k671526k617841
34201H081384k732169k812048k602923k193051j916299j837187j613196r85791
34193h611280j53172M82053O93930M62556l2778k77545K80750J421787K008942
34184c724757J199051l76370j181178n06520Q03898J342437M33709j506660l348989
$$ plain form
34175 -6865379 -10693109 -12959559 -12128997 -8141373 -2407232 3007522 6306821 6679379
34167 6679379 4724715 2202772 917472 1522615 3347482 5252079 6481627 6837814
34159 6837814 6434347 5509384 4383181 3493246 3440852 4826613 7760550 11492954 14750769
34150 14750769 16573510 16780831 15709204 13765457 11327786 8826426 6667390 5104018
34142 5104018 4265051 4168210 4511181 4528024 3369261 846888 -2251717 -4785997 -6288592
34133 -6288592 -7272194 -8395895 -9430930 -9325905 -7365850 -3988601 -236218 3371411
34125 3371411 7039099 10831484 14027246 15526340 14722180 11924519 8221524 5084059
34117 5084059 3746669 4485381 6410352 8170018 8957303 8847174 8346854 7834773 7317007
$$ packed form
34175f865379l827730k266450Q30562L987624N734141N414754L299299L72558
34167F679379j954664k521943j285300O05143J824867J904597J229548L56187
34159F837814m03467r24963j126203q89935n2394J385761K933937L732404L257815
34150A4750769J822741K07321j071627j943747k437671k501360k159036j563372
34142E104018q38967r6841L42971J6843j158763k522373l098605k534280j502595
34133f288592r83602j123701j035035J05025J960055L377249L752383L607629
34125C371411L667688L792385L195762J499094q04160k797661l702995l137465
34117E084059j337390P38712J924971J759666P87285j10129n00320n12081n17766
$$ plain form
34108 7317007 6406420 4517804 1407775 -2318536 -5459759 -7176071 -7587536 -7328456 -6763508
34099 -6763508 -5933180 -5104870 -4919463 -5844165 -7717750 -9931278 -11800723 -12632559 -11781601
34090 -11781601 -9107956 -5413438 -2140591 -447778 -471380 -1245842 -1188698 975831 5141355
34081 5141355 9502567 11727133 10757065 7378254 3125800 -819511 -3473305 -3621730
34073 -3621730 -572434 4667756 9773025 13024559 14467802 14976102 14755858 13355053
34065 13355053 10878670 8483098 7448462 8101849 9874342 12219342 15211283 19211449
34057 19211449 24043592 28579497 31236374 31019352 28173975 23885268 19442586 15738347
34049 15738347 13370240 12828898 14303755 17328148 20799581 23476037 24501688 23546387
$$ packed form
34108G317007r10587j888616l110029l726311l141223j716312m11465K59080N64948
34099f763508Q30328Q28310J85407r24702j873585k213528j869445q31836Q50958
34090a1781601K673645L694518L272847J692813k3602p74462N7144K164529M165524
34081E141355M361212K224566r70068l378811m252454l945311k653794j48425
34073c621730L049296N240190N105269L251534J443243N08300k20244j400805
34065A3355053k476383k395572j034636O53387J772493K345000K991941M000166
34057A9211449M832143M535905K656877k17022k845377m288707m442682l704239
34049A5738347k368107n41342J474857L024393L471433K676456J025651r55301
$$ plain form
34041 23546387 20652050 16184234 10987842 6349936 3433846 2526423 2860183 3268571
34033 3268571 3066592 2385593 1825581 1860170 2447916 3072875 3193840 2732635 2057476 1416868
34023 1416868 529797 -1087739 -3477209 -6108400 -8290138 -9427616 -8946432 -6436057
34015 -6436057 -2130816 2995398 7863941 11878104 14740916 16011944 15266229 12622588
34007 12622588 8764160 4444141 266963 -3100843 -4958719 -5014461 -3583051 -1293936
33999 -1293936 1084017 2481043 1765423 -1320116 -5603587 -9305865 -11495469 -12604869
33991 -12604869 -13716208 -15703092 -18972408 -23497954 -28751828 -33708506 -37165999 -38271390
33983 -38271390 -36987713 -34196365 -31117290 -28278676 -25081817 -20637598 -14945557 -8915823
$$ packed form
34041B3546387k894337m467816n196392m637906k916090r07423L33760M08388
34033C268571k01979o80999n60012L4589N87746O24959J20965m61205o75159o40608
34023A416868q87071j617536k389470k631191k181738j137478M81184K510375
34015f436057M305241N126214M868543M014163K862812J271028p45715k643641
34007A2622588l858428m320019m177178l367806j857876n5742J431410K289115
33999a293936K377953J397026p15620l085539m283471l702278k189604j109400
33991a2604869j111339j986884l269316m525546n253874m956678l457493j105391
33983c8271390J283677K791348L079075K838614L196859M444219N692041O029734
$$ plain form
33975 -8915823 -3345544 1572756 5628761 8108785 8383402 6679149 3895670 903412
33967 903412 -1641081 -3119597 -3191107 -2184414 -803618 568339 1870794 2697616 2207964
33958 2207964 26735 -3049164 -5536687 -6376401 -5537877 -3869645 -2604766 -2754687 -4539289
33949 -4539289 -7233071 -9565659 -10232368 -8169714 -2861734 5179337 14369913 22915269
33941 22915269 29831719 34991437 38305623 39273808 37457912 33109428 27158567 20786009
33933 20786009 15116434 11004942 8749033 8060135 8546951 10125440 12664025 15309042
33925 15309042 16607082 15511629 12095282 7221561 1817012 -3431848 -8129149 -12361765
33917 -12361765 -16600535 -20915968 -24418810 -26083543 -26233159 -26609368 -28566784 -31489944
$$ packed form
33975h915823N570279M918300M056005K480024K74617j704253k783479k992258
33967I03412k544493j478516p1510J006693J380796J371957J302455Q26822m89652
33958B207964k181229l075899k487523q39714Q38524J668232J264879j49921j784602
33949d539289k693782k332588o66709K062654N307980Q041071R190576Q545356
33941B2915269O916450N159718L314186R68185j815896m348484n950861o372558
33933B0786009n669575m111492k255909o88898M86816J578489K538585K645017
33925A5309042J298040j095453l416347m873721n404549n248860m697301m232616
33917a2361765m238770m315433l502842j664733j49616l76209j957416k923160
$$ plain form
33909 -31489944 -33328570 -32488602 -28981976 -24154998 -19891744 -17907764 -18976130 -22308950
33901 -22308950 -25866385 -27634682 -26815830 -24062448 -20939230 -19151489 -19746380 -22523707
33893 -22523707 -26156170 -29063653 -30272029 -29597509 -27410509 -24494156 -21849358 -20098403
33885 -20098403 -18946521 -17557108 -15651696 -13987874 -13459404 -13853763 -13859340 -12350170 -9343093
33876 -9343093 -5540924 -1307038 3442373 8428635 12672630 15291989 16397427 16890511
33868 16890511 17465682 18035976 18030480 16956758 14664171 11324193 7259020 2655398 -2569546
33859 -2569546 -8416473 -14221436 -18602100 -20230050 -18813966 -15437767 -11944592 -9730942
33851 -9730942 -8771033 -7744428 -5380875 -1868470 1154393 2119518 1012971 -666653
$$ packed form
33909c1489944j838626Q39968L506626M826978M263254J983980j068366l332820
33901b2308950l557435j768297Q18852K753382L123218J787741n94891k777327
33893b2523707l632463k907483j208376O74520K187000K916353K644798J750955
33885b0098403J151882J389413J905412J663822N28470l94359n577J509170L007077
33876i343093L802169M233886M749411M986262M243995K619359J105438M93084
33868A6890511N75171N70294n496j073722k292587l339978m065173m603622n224944
33859b569546n846927n804963m380664j627950J416084L376199L493175K213650
33851i730942R59909J026605K363553L512405L022863R65125j106547j679624
$$ plain form
33843 -666653 -1347947 -797092 -219493 -942268 -2819056 -3932549 -2116398 3084103 10030405
33834 10030405 16510928 21413643 24956140 27802595 30369986 32758831 34841907 36315233
33826 36315233 36945142 36898942 36700910 36785995 37129862 37238293 36382775 33994378 30154985
33817 30154985 25786192 22117208 19776096 18450487 17506580 16863549 17162590 19043590
33809 19043590 22201550 25120478 25903664 23674137 19299347 14647796 11075804 8690705
33801 8690705 6965886 5702416 5202403 5789697 7522182 10276880 13734305 17223654
33793 17223654 19946087 21584084 22503954 23142995 23333666 22469531 20280371 17260186 14439122
33784 14439122 13005368 14055151 18201702 25051449 33115736 40414434 45265304 46765449
$$ packed form
33843f66653o81294N50855N77599p22775j876788j113493J816151N200501O946302
33834A0030405O480523M902715L542497K846455K567391K388845K083076J473326
33826C6315233O29909m6200j98032Q5085L43867J08431q55518k388397l839393
33817C0154985m368793l668984k341112j325609r43907o43031K99041J881000
33809A9043590L157960K918928P83186k229527m374790m651551l571992k385099
33801H690705j724819j263470n00013N87294J732485K754698L457425L489349
33793A7223654K722433J637997R19870O39041J90671q64135k189160l020185k821064
33784A4439122j433754J049783M146551O849747Q064287P298698M850870J500145
$$ plain form
33776 46765449 45022707 41145241 36637088 32367767 28151620 23455474 18241851 12851387
33768 12851387 7441427 2152761 -2282954 -4798047 -5069164 -3903027 -2382062 -1078993
33760 -1078993 -314811 -617626 -2356399 -5088542 -7676788 -9003878 -8416314 -5789617 -1592806
33751 -1592806 3235992 7893891 12212268 16328367 20009107 22672331 24016007 24220714
33743 24220714 23499059 21860066 19502455 17151915 15742838 15781948 17013198 18566657
33735 18566657 19507856 19567202 19455031 20227785 22179327 24486853 26037621 26442232 26156381
33726 26156381 25868155 26050789 27036745 29185471 32692799 37110512 41067845 42676712
33718 42676712 40568499 34786096 26683124 17906026 9467166 1679830 -5345445 -11437338
$$ packed form
33776D6765449j742742l877466m508153m269321m216147m696146n213623n390464
33768A2851387n409960n288666m435715k515093k71117J166137J520965J303069
33760a078993P64182l02815j738773k732143k588246j327090N87564K626697M196811
33751a592806M828798M657899M318377M116099L680740K663224J343676K04707
33743B4220714p21655j638993k357611k350540j409077L9110J231250J553459
33735A8566657R41199N9346j12171P72754J951542K307526J550768M04611k85851
33726B6156381k88226J82634R85956K148726L507328M417713L957333J608867
33718D2676712k108213n782403q102972q777098q438860p787336p025275o091893
$$ [...]
##END NTUPLES=NMR SPECTRUM
##END=
