##TITLE=31Pdec_IPACAT-32
 CDCl3, 124 sc
 24.10.2022
##JCAMPDX= 6.0         $$ Bruker NMR JCAMP-DX V2.0
##DATA TYPE= NMR SPECTRUM
##DATA CLASS= NTUPLES
##ORIGIN= UXNMR, Bruker Analytische Messtechnik GmbH
##OWNER= root
$$ XWIN-NMR		Version 3.5
$$ Mon Oct 24 14:12:02 2022 Russian Standard Time (UT+4h)  she@DPX200
##.OBSERVE FREQUENCY= 81.013821
##.OBSERVE NUCLEUS= ^31P
##.ACQUISITION MODE= SIMULTANEOUS
##.ACQUISITION SCHEME= undefined
##.AVERAGES= 124
##.DIGITISER RES= 16
##SPECTROMETER/DATA SYSTEM= spect
##.PULSE SEQUENCE= zgpg30
##.SOLVENT NAME= CDCl3
##.SHIFT REFERENCE= (INTERNAL, CDCl3, 0, 248.564)
##AUDIT TRAIL= $$ (NUMBER, WHEN, WHO, WHERE, WHAT)
$$ ##TITLE= Audit trail, XWIN-NMR		Version 3.5
$$ ##JCAMPDX= 5.01
$$ ##ORIGIN= Bruker BioSpin GmbH
$$ ##OWNER= she
$$ F:/spectra/data/she/nmr/P31/1/pdata/1/auditp.txt
$$ ##AUDIT TRAIL=  $$ (NUMBER, WHEN, WHO, WHERE, WHAT)
(   1,<2022-10-24 14:10:39.96 +0400>,<she>,<DPX200>,
      <continue with go, POWCHK disabled, PULCHK disabled
       configuration hash MD5:
       00 E9 B6 7A A2 85 ED C7 34 08 36 98 17 FE 4E 26
       data hash MD5: 32K
       1A BB 2C FF A2 52 38 3B D0 6F 54 94 FF 1B 28 5F>)
(   2,<2022-10-24 14:10:42.56 +0400>,<she>,<DPX200>,
      <Start of raw data processing
       efp BC_mod = 2 LB = 1 FT_mod = 6 PKNL = 1 PHC0 = -10391.53 PHC1 = 357.456 SI = 64K 
       data hash MD5: 64K
       B6 84 B5 89 A7 B6 24 26 BB 6A B3 65 1C 59 FF D5>)
(   3,<2022-10-24 14:11:09.67 +0400>,<she>,<DPX200>,
      <pk PHC0 = 235.435 PHC1 = -489.4001 
       data hash MD5: 64K
       75 A4 D4 B6 BD 86 BD E7 7E 3D C3 08 E8 9A 98 93>)
(   4,<2022-10-24 14:11:13.26 +0400>,<she>,<DPX200>,
      <abs ABSG = 5 
       data hash MD5: 64K
       B0 CD 56 75 41 2D AB 55 AA F3 8A 02 81 C1 1E D8>)
(   5,<2022-10-24 14:11:22.03 +0400>,<she>,<DPX200>,
      <abs ABSG = 5 
       data hash MD5: 64K
       45 FD FA 85 2A 62 58 39 48 50 E4 64 4F 5B 8D 24>)
$$ ##END=
$$ 
$$ hash MD5
$$ A2 35 13 36 92 C8 ED B8 D0 B2 44 A5 A8 32 6A B1
##$RELAX= 
##$RELAX= 
##$RELAX= 
##$RELAX= 
##$RELAX= 
##$RELAX= 
##$RELAX= 
##$RELAX= 
##$RELAX= 
$$ Bruker specific parameters
$$ --------------------------
##$DU= <F:/spectra>
##$EXPNO= 1
##$NAME= <P31>
##$PROCNO= 1
##$TYPE= <nmr>
##$USER= <she>
##$AMP= (0..31)
100 100 100 100 100 100 100 100 100 100 100 100 100 100 100 100 100 100 
100 100 100 100 100 100 100 100 100 100 100 100 100 100 
##$AQSEQ= 0
##$AQ_mod= 1
##$AUNM= <au_zg>
##$AUTOPOS= <>
##$BF1= 81.014009
##$BF2= 200.13
##$BF3= 200.13
##$BF4= 200.13
##$BF5= 200.13
##$BF6= 200.13
##$BF7= 200.13
##$BF8= 200.13
##$BYTORDA= 1
##$CFDGTYP= 0
##$CFRGTYP= 5
##$CHEMSTR= <none>
##$CNST= (0..31)
1 1 145 1 1 1 1 1 1 1 1 1 1 1 1 1 1 1 1 1 1 1 1 1 1 1 1 1 1 1 1 1 
##$CPDPRG= <waltz16>
##$CPDPRG1= <>
##$CPDPRG2= <waltz16>
##$CPDPRG3= <>
##$CPDPRG4= <mlev>
##$CPDPRG5= <mlev>
##$CPDPRG6= <mlev>
##$CPDPRG7= <mlev>
##$CPDPRG8= <mlev>
##$CPDPRGB= <>
##$CPDPRGT= <>
##$D= (0..31)
0 1 0 0 0 0 0 0 0 0 0 0.03 2e-05 3e-06 0 0 0 0 0 0 0 0 0 0 0 0 0 0 0 0 
$$ [...]
##$SUBNAM3= <"">
##$SUBNAM4= <"">
##$SUBNAM5= <"">
##$SUBNAM6= <"">
##$SUBNAM7= <"">
##$SUBNAM8= <"">
##$SUBNAM9= <"">
##$SW= 501.771253377433
##$SWIBOX= (0..15)
0 1 3 0 0 0 0 0 0 0 0 0 0 0 0 0 
##$SW_h= 40650.406504065
##$TD= 32768
##$TD0= 1
##$TE= 0
##$TE2= 300
##$TE3= 300
##$TEG= 300
##$TL= (0..7)
0 120 53 12 22 120 120 120 
##$TP= (0..7)
150 150 150 150 150 150 150 150 
##$TP07= 0
##$TPNAME0= <>
##$TPNAME1= <>
##$TPNAME2= <>
##$TPNAME3= <>
##$TPNAME4= <>
##$TPNAME5= <>
##$TPNAME6= <>
##$TPNAME7= <>
##$TPOAL= (0..7)
0.5 0.5 0.5 0.5 0.5 0.5 0.5 0.5 
##$TPOFFS= (0..7)
0 0 0 0 0 0 0 0 
##$TUNHIN= 0
##$TUNHOUT= 0
##$TUNXOUT= 0
##$USERA1= <user>
##$USERA2= <user>
##$USERA3= <user>
##$USERA4= <user>
##$USERA5= <user>
##$V9= 5
##$VALIST= <valist>
##$VCLIST= <CCCCCCCCCCCCCCC>
##$VD= 0
##$VDLIST= <DDDDDDDDDDDDDDD>
##$VPLIST= <PPPPPPPPPPPPPPP>
##$VTLIST= <TTTTTTTTTTTTTTT>
##$WBST= 1024
##$WBSW= 4
##$XGAIN= (0..3)
0 0 0 0 
##$XL= 0
##$YL= 0
##$YMAX_a= 3743
##$YMIN_a= -11714
##$ZGOPTNS= <>
##$ZL1= 120
##$ZL2= 120
##$ZL3= 120
##$ZL4= 120
##$ABSF1= 248.5645
##$ABSF2= -253.2056
##$ABSG= 5
##$ABSL= 3
##$ALPHA= 0
##$AQORDER= 0
##$ASSFAC= 0
##$ASSFACI= 0
##$ASSFACX= 0
##$ASSWID= 0
##$AUNMP= <proc_1d>
##$AZFE= 0.1
##$AZFW= 0.5
##$BCFW= 0
##$BC_mod= 2
##$BYTORDP= 0
##$COROFFS= 0
##$CY= -3
##$DATMOD= 1
##$DC= 0
##$DFILT= <>
##$DTYPP= 0
##$F1P= 0
##$F2P= 0
##$FCOR= 1
##$FTSIZE= 65536
##$FT_mod= 6
##$GAMMA= 0
##$GB= 0
##$INTBC= 1
##$INTSCL= 6.047779e-11
##$ISEN= 30
##$LB= 1
##$LEV0= 0
##$LPBIN= 0
##$MAXI= 10000
##$MC2= 0
##$MEAN= 0
##$ME_mod= 0
##$MI= 50
##$NCOEF= 0
##$NC_proc= -7
##$NLEV= 6
##$NOISF1= 182.463
##$NOISF2= 159.3651
##$NSP= 0
##$NTH_PI= 0
##$NZP= 0
##$OFFSET= 248.5645
##$PC= 4
##$PHC0= -10156.1
##$PHC1= -131.9441
##$PH_mod= 1
##$PKNL= yes
##$PPARMOD= 0
##$PSCAL= 0
##$PSIGN= 0
##$REVERSE= no
##$SF= 81.0140089999694
##$SI= 65536
##$SIGF1= 159.3651
##$SIGF2= -187.1042
##$SINO= 113.3802
##$SIOLD= 16384
##$SREGLST= <1H.CDCl3>
##$SSB= 0
##$STSI= 65536
##$STSR= 0
##$SW_p= 40650.406504065
##$SYMM= 0
##$S_DEV= 0
##$TDeff= 32768
##$TDoff= 0
##$TI= <>
##$TILT= no
##$TM1= 0
##$TM2= 0
##$TOPLEV= 0
##$USERP1= <user>
##$USERP2= <user>
##$USERP3= <user>
##$USERP4= <user>
##$USERP5= <user>
##$WDW= 1
##$XDIM= 65536
##$YMAX_p= 385065813
##$YMIN_p= -105796312
$$ End of Bruker specific parameters
$$ ---------------------------------
##NTUPLES= NMR SPECTRUM
##VAR_NAME=  FREQUENCY,     SPECTRUM/REAL,   SPECTRUM/IMAG
##SYMBOL=    X,             R,               I
##VAR_TYPE=  INDEPENDENT,   DEPENDENT,       DEPENDENT
##VAR_FORM=  AFFN,          ASDF,            ASDF
##VAR_DIM=   65536,         65536,           65536
##UNITS=     HZ,            ARBITRARY UNITS, ARBITRARY UNITS
##FACTOR=    0.620285442955139, 1,           1
##FIRST=     20137.2065510682, 0,            0
##LAST=      -20513.1999529968, 0,           0
##MIN=       -20513.1999529968, -105796312,  0
##MAX=       20137.2065510682, 385065813,    0
$$ Real data points
##PAGE= N=1
##DATA TABLE= (X++(R..R)), XYDATA
$$ [...]
37715a558930n000159j381070K920662K902158P3823j241875j84234J606641L374615
37706A511631M351209K806573r50478l532865l015110j597451j488268j503384
37698c418143m01668r8461k194122m245082l106269L07705K945148M088004M556431
37689a566457L662789O49020k630682m043391m399484m769109k926795K811628
37681a3212481Q145940P077251J059402k248535J01556K878426J731466n54304
37673D978721l0512J745677J414340j69552n43038q63246l233825n336113l392791
37664e430339R90885K601280N57497j057325l43259L66639J40652J129424L036546
37655A992000J958391k406778m099045L70157N448177L987064k194087n011377
$$ plain form
37715 -1558930 -6559089 -7940159 -5019497 -2117339 -2043516 -3285391 -3469625 -1862984 1511631
37706 1511631 5862840 8669413 7718935 4186070 1170960 -426491 -1914759 -3418143
37698 -3418143 -3819811 -3918272 -6112394 -10357476 -13463745 -13156040 -10210892 -6122888 -1566457
37689 -1566457 2096332 2745352 114670 -3928721 -8328205 -13097314 -16024109 -13212481
37681 -13212481 -5066541 2010710 3070112 821577 923133 3801559 5533025 4978721
37673 4978721 4948209 6693886 8108226 7938674 7395636 6532390 3298565 -2037548 -5430339
37664 -5430339 -4439454 -1838174 -1280677 -2338002 -2681261 -2314622 -2173970 -1044546 1992000
37655 1992000 3950391 1543613 -2555432 -2185275 3262902 7249966 5055879 44502
37647D4502j479523L278298L806773J98154l953256n459980l113881J350559L830390
37638a497964K225626m07539p9375K104694K107025j93081j368683r74514j857191
37629E8998l654198k341224K179135M360513J529957j843907j742368n70510j309939
37620c333543j540855J118885K841290k76780m067790k132685L056292L533244
37612h01942j034726k826728R27205L467113M4035m349066l379625J102477L339017
37603c512240K428324J259480N21251p16658j304114r7810N90015j431304l469526
37594e732582j940744J018708P87277j463925l53776M271071O472765L736392
37586F795186M92277L4844m04773l112363m610498j766478J782393R68149k537740
$$ plain form
37647 44502 -1435021 1843277 5650050 5848204 1894948 -3565032 -6678913 -5328354 -1497964
37638 -1497964 727662 320123 240748 2345442 4452467 4259386 2890703 1916189 58998
37629 58998 -3595200 -5936424 -3757289 603224 2133181 289274 -1453094 -2023604 -3333543
37620 -3333543 -4874398 -3755513 -914223 -1191003 -5258793 -7391478 -4335186 -801942
37612 -801942 -1836668 -4663396 -3736191 -269078 -225043 -4574109 -7953734 -6851257 -3512240
37603 -3512240 -1083916 175564 696815 -19843 -1323957 -1421767 -831752 -2263056 -5732582
37594 -5732582 -7673326 -6654618 -5867341 -7331266 -7685042 -3413971 3058794 6795186
37586 6795186 7287463 7322307 6917534 3805171 -805327 -2571805 -789412 178737 -2359003
37577b359003l342138r14013Q53581R81752K158920M704353N563850L625540R67475
37568A2240317j511687m692840p071244n388118n18697K566598K186772J848182
37560c40717K898941J432905m063129p859976m865952J130387K853837O0439j312734
37551a0065999J242703L869425K830259o92280k902425j636946J827433L679373
37543a848457J505855j663089l32741M737790N648606j056900p317552m344470
37535d670958L939714O403212R59821l889937l135073j292049k602001l934457
37527h221728j321251K986053M278175J824119j614255l244301j521363K359678
37519d474873L664970o03918n650591m103435K500537M941611L20801l696672
$$ plain form
37577 -2359003 -5701141 -6615154 -5761573 -4779821 -2620901 2083452 7647302 11272842 12240317
37568 12240317 10728630 6035790 -1035454 -6423572 -6942269 -4375671 -2188899 -340717
37560 -340717 2558224 3991129 -72000 -7931976 -12797928 -11667541 -8813704 -8753265 -10065999
37551 -10065999 -8823296 -4953871 -2123612 -2815892 -5718317 -7355263 -5527830 -1848457
37543 -1848457 -342602 -2005691 -2338432 2399358 8047964 6991064 -326488 -4670958
37535 -4670958 -731244 5671968 6631789 2741852 -393221 -1685270 -4287271 -8221728
37527 -8221728 -9542979 -6556926 -2278751 -454632 -2068887 -5313188 -6834551 -4474873
37519 -4474873 -809903 -1413821 -7064412 -11167847 -8667310 -3725699 -3404898 -7101570
37511g101570j620618J720736O81395j739774l69431K998564L896885L071655
37503A537842L269754L050920L97022k115209k050921k156826m339681m227270
37495f634369R14881M743893J212213l973503j598594N524965O667432L00209
37487G157127m672088l872789j971777j815410m06428K528526K542297n26994
37479a037536j334728Q00051M05814k795868j716046M832177P485694J048648
37471G688206n944795m074564K709599M301594l15834l924937k951363j42329
37463b654423K062586L636081L972144K487754Q72841N00065k45486k336841l026351
37454E268370o50386J030610j643364n486887m797709j17731K850337J560373
$$ plain form
37511 -7101570 -8722188 -7001452 -6320057 -8059831 -8429262 -5430698 -1533813 1537842
37503 1537842 4807596 7858516 8255538 6140329 4089408 1932582 -2407099 -6634369
37495 -6634369 -5719488 -975595 236618 -3736885 -5335479 189486 6856918 7157127
37487 7157127 2485039 -1387750 -3359527 -5174937 -5581365 -3052839 -510542 -1037536
37479 -1037536 -2372264 -1572213 -1166399 -3962267 -5678313 -846136 6639558 7688206
37471 7688206 1743411 -2331153 378446 4680040 4364206 439269 -2512094 -2654423
37463 -2654423 -591837 3044244 7016388 9504142 10376983 10877048 10631562 8294721 5268370
37454 5268370 4617984 5648594 4005230 -1481657 -6279366 -6397097 -3546760 -1986387
37446a986387j187592k325754j371127R40602L134800L052360M67252j762227
37438a038073j680761j010662j247190k70855L424198O405567M820705O58249
37430A0061178j265569n11134n01086k395533l917870l269595q05154J881216
37422g23547K236407j152832m646309k290186M518352O271326p63427o873923
37414c424139k784414N313962M986933k873465o012892m52767M696877K994387
37406B444482r12677j675750j234896k060737j721334Q95731J913122k43177j227702
37397c822938J065696K185527j97802r48389L309631O830442L568415k747506
37389I243076m740811k473327r44593r61732j75841M76828r13949j613766J386944
$$ plain form
37446 -1986387 -3173979 -5499733 -6870860 -5930258 -2795458 256902 724154 -1038073
37438 -1038073 -2718834 -3729496 -4976686 -5247541 -1823343 4582224 9402929 10061178
37430 10061178 8795609 8284475 7783389 5387856 1469986 -1799609 -2604763 -723547
37422 -723547 1512860 360028 -4286281 -6576467 -2058115 4213211 3449784 -3424139
37414 -3424139 -6208553 -894591 4092342 1218877 -4794015 -5246782 -549905 2444482
37406 2444482 1531805 -143945 -1378841 -3439578 -5160912 -4265181 -2352059 -2595236 -3822938
37397 -3822938 -2757242 -571715 -769517 -1717906 1591725 8422167 11990582 9243076
37389 9243076 4502265 2028938 1084345 122613 -53228 423600 -490349 -2104115 -717171
37380g17171M321187K074929j990064p38300L924012L103728m038212p849136
37372a909027l302704K341928J589594k158715j780074J984226L417717J752064
37364A935009P03437P30176r83408l769361l419320N67661L374491J955624j009868
37355H4441k221938k569208l931458m560235j625035L300492N413659L287900
37347b821382P15600R21157K041466O19527k528352l193796r1820K946953K203237
37338H12590r71793k409188p73395J544286K574178K958899L324562K111385j833473
37329G338051n894188n729792r99472L201881K013315l298203o730043m406033
37321a4504484J498233N806906N846866L108982M16185j185464k491647l913381
$$ plain form
37380 -717171 3604016 5678945 3688881 2950581 6874593 9978321 5940109 -1909027
37372 -1909027 -5211731 -2869803 -1280209 -3438924 -5218998 -3234772 182945 1935009
37364 1935009 2638446 3368622 2385214 -1384147 -4803467 -4235806 -861315 1094309 84441
37355 84441 -2137497 -4706705 -8638163 -13198398 -14823433 -11522941 -6109282 -2821382
37347 -2821382 -2105782 -1184625 856841 1476368 -1051984 -4245780 -4337600 -1390647 812590
37338 812590 -159203 -2568391 -3341786 -1797500 776678 3735577 7060139 9171524 7338051
37329 7338051 1443863 -4285929 -5285401 -2083520 -70205 -3368408 -10098451 -14504484
37321 -14504484 -13006251 -7199345 -1352479 1756503 2172688 987224 -1504423 -5417804
37313e417804m201436k039669J452528L183710J756422n94831j050917K8709M48034
37304f435254K32583J242233K898709K108324j357785l174348n70781L079740
37296a976579L022541p0473j883687j180268l60942k86528O58304K091082R93256
37287A006706k837094m747942j386048L847713M704866K51295l856064k527815
37279e544383K370055M224621n4441n612684n104834K014409Q361386P665143
37271H319272J997006k171806k324366r44850l21138m60326j173326k215121j973466
37262a268121J35033R05372k474381o371989m588857J629382M107691k5585l478909
37253a1430364J84412O765451P946968L076218j600114k624402k070948j855468
$$ plain form
37313 -5417804 -9619240 -11658909 -10206381 -7022671 -5266249 -5861080 -6911997 -6883288 -6435254
37304 -6435254 -6202671 -4960438 -2061729 46595 -1311190 -4485538 -5056319 -1976579
37296 -1976579 1045962 975489 -908198 -2088466 -2449408 -2735936 -2077632 13450 1006706
37287 1006706 -1830388 -6578330 -7964378 -4116665 588201 839496 -3016568 -5544383
37279 -5544383 -3174328 1050293 995852 -4616832 -9721666 -7707257 654129 8319272
37271 8319272 10316278 8144472 5820106 4875256 4554118 4093792 2920466 705345 -1268121
37262 -1268121 -1133088 -227716 -2702097 -9074086 -13662943 -12033561 -7925870 -7951455 -11430364
37253 -11430364 -11245952 -4480501 3466467 6542685 4942571 2318169 247221 -1608247
37245a608247j123790L66874Q88361k00643j340868j579749j762915k103187j055677
37236i519841K042998M885999M394828O58852k475428j462571K488520M330563
37228E343920J443586k627490k879608J67037J732473L37668n09889J170091K624281
37219F802069J654862L22665M03796l14409l267504m755310j332447L570403L976004
37210G060129K68138j931883n96093Q85398M75692J13378N72109o14378l771372
37201B461118m527723j71568M967804M709933l70081l923789k891380j007718
37193g53404j880078k842054L99616N476465N436412n14984m366730m30239O185755
37184F710759P197853K828380p60119k244990m907138p416747m719412J404911
$$ plain form
37245 -1608247 -2732037 -2365163 -1476802 -1677445 -3018313 -4598062 -6360977 -8464164 -9519841
37236 -9519841 -7476843 -2590844 1803984 2462836 -12592 -1475163 1013357 5343920
37228 5343920 6787506 4160016 1280408 1447445 3179918 3517586 3007697 4177788 6802069
37219 6802069 8456931 8779596 9183392 8868983 5601479 846169 -486278 3084125 7060129
37210 7060129 7328267 5396384 4800291 5685689 6161381 6274759 6846868 6232490 2461118
37201 2461118 -2066605 -2238173 2729631 7439564 7069483 3145694 254314 -753404
37193 -753404 -2633482 -5475536 -5075920 400545 5836957 5321973 955243 525004 6710759
37184 6710759 13908612 16736992 15976873 13731883 8824745 1407998 -3311414 -1906503
37176a906503K917965j109798k264902K247796L709351k644134p542090k593747
37168i186062M596036K372441n439800n884445J867441O263662K769418q03511
37160c444820N88710J982567n24937k798004j128459J451930J597937Q36292Q28759
37151f10025K75717p79587k01044Q85009q69248l409218r83865N028572O382013
37142E718324J415295j924178k066M92655m193589o652202j062895N575329M260832
37133C627505j823514l721228r28974P42740M31798J310208K164380l60900l606845
37124b164830k006110L278643N742685L112677j376944n185036p182187m893098
37116a0674200J620332N764975K098823m385719m703521P72732M097929K807267
$$ plain form
37176 -1906503 1011462 -98336 -2363238 -115442 3593909 949775 -6592315 -9186062
37168 -9186062 -4590026 -2217585 -7657385 -13541830 -11674389 -5410727 -2641309 -3444820
37160 -3444820 -2856110 -873543 -1398480 -4196484 -5324943 -3873013 -2275076 -1438784 -610025
37151 -610025 -334308 -1113895 -1314939 -429930 -1299178 -4708396 -5692261 -663689 5718324
37142 5718324 7133619 5209441 5207375 5700030 1506441 -5145761 -6208656 -633327 3627505
37133 3627505 1803991 -1917237 -2846211 -2103471 -1671673 -361465 1802915 1442015 -2164830
37124 -2164830 -4170940 -892297 4850388 7963065 6586121 1401085 -5781102 -10674200
37116 -10674200 -9053868 -3288893 -1190070 -5575789 -10279310 -9506578 -5408649 -2601382
37108b601382J547454J764529K9189k999945k154251K073879K676305j984641
37100a648863m719819j416070K407673J505310n98970J257648M623718L676192
37092E086819j420823n094902m009297j05704K490812J441970j411983j417646
37084d440754K609921M960833O83718n217191l699691L898189O784025J416109
37076F995159l196923o99574K785234M78822l202158j371267K727396J996864
37068F513553j555834r37434K717877K128343l062433n725480l281362n64066
37060c766836k12945N81798K367501J201853l343012n619205k543767J586996
37052i747617K050920j34041j871609k522173j943255R15707M574416N098569
$$ plain form
37108 -2601382 -1053928 710601 739790 -2260155 -4414406 -2340527 335778 -1648863
37100 -1648863 -6368682 -7784752 -5377079 -3871769 -4470739 -3213091 1410627 5086819
37092 5086819 3665996 -1428906 -5438203 -5543907 -3053095 -1611125 -3023108 -4440754
37084 -4440754 -1830833 3130000 3813718 -1403473 -5103164 -1204975 5579050 6995159
37076 6995159 3798236 3098662 5883896 6362718 3160560 1789293 4516689 6513553
37068 6513553 4957719 4020285 6738162 8866505 5804072 78592 -3202770 -3766836
37060 -3766836 -3979781 -3397983 -1030482 171371 -3171641 -8790846 -11334613 -9747617
37052 -9747617 -7696697 -7830738 -9702347 -12224520 -14167775 -13252068 -8677652 -3579083
37044c579083K459787J673163M406145N060980l33326o522418o044595N873M323630
37035A450156L797391J416430m61932k430339m028479l213500m84312J151441
37027b803144J020331J360295K477107J808887r46742k185597j2275K276198J085503
37018D080563k023262k844087m53809K439228L788897L867791L136655J176112
37010A3168088j852770m437616m982824l110424J28511K594517K249170p20519
37002C036133l310868k621427O52475K921956K019351n02630j807805j207531
36994h20346j93755L5268l36288r36563j961418l055465k634365K22099L614287
36985f066546M328822J940399k56707N21858K893161L535419J842591N7003n87264
$$ plain form
37044 -3579083 -1119296 553867 4960012 10020992 9687666 3165248 -2879347 -2873474 1450156
37035 1450156 5247547 6663977 6202045 3771706 -256773 -3470273 -3954585 -2803144
37027 -2803144 -1782813 -422518 2054589 3863476 2916734 731137 718862 2995060 4080563
37018 4080563 2057301 -786786 -1240595 1198633 4987530 8855321 11991976 13168088
37010 13168088 11315318 6877702 1894878 -1215546 -1087035 1507482 3756652 3036133
37002 3036133 -274735 -2896162 -2243687 678269 2697620 2194990 387185 -820346
36994 -820346 -1014101 -978833 -1315121 -2251684 -4213102 -7268567 -9902932 -9680833 -6066546
36985 -6066546 -1737724 202675 -54032 467826 3360987 6896406 8738997 8796000 8208736
36976H208736j102363j990553k075239r99817l74817j105072j802708j334192
36968b576025p01677o31401L02636K718483L858097J233902k733786l421513n92308
36959b543592J477641M16601j351317p93180J805144M040451L965816R01023l692221
36950D226366n866033k921876K057375L245881N25816J02171M420651O831799
36942A2622150J030326q306906j0822474m636531J647514J457423j757940j501950
36934a0268388K214845M536989L695357K396673K317212J661403r62081l497518
36926B094492l220282q31086M06174q29227k229410j192121J677546L640884L504472
36917C021442K520779J795243P47266j138224k735653k813224j972426j522921
$$ plain form
36976 8208736 7106373 5115820 3040581 2040764 1665947 560875 -1241833 -2576025
36968 -2576025 -3277702 -3909103 -3606467 -887984 2970113 4204015 1470229 -1951284 -2543592
36959 -2543592 -1065951 -649350 -2000667 -2793847 -988703 3051748 7017564 7918587 4226366
36950 4226366 -1639667 -4561543 -2504168 741713 1267529 1369700 5790351 12622150
36942 12622150 13652476 5345570 -5476904 -10113435 -8465921 -7008498 -8766438 -10268388
36934 -10268388 -8053543 -3516554 178803 2575476 4892688 6554091 5592010 2094492
36926 2094492 -1125790 -1956876 -1550702 -2379929 -4609339 -5801460 -4123914 -483030 3021442
36917 3021442 5542221 7337464 8084730 6946506 4210853 1397629 -574797 -2097718
36909b097718j319726m72541N18197N62254N96003K523386M918848L238371l203931
36900E263143p479989k867759O654272R529664J776254o852630o092384N39600
36892D70171J802948l862948o565690j376741L714556J192223l558607j449421
36884i633509N051978O116203O46986k819211p05216J116808p10234j134332K911061
36875H40534N499721J425150m281003l772890J760224M851247K885669k39004
36867H969648j352818j021229o81640j337933l638738n848153m303568Q24950
36859h389481L920050J945105m19071J366517L680608J183593l231819k929562
36851b874060J364546L480666K338077J613985Q37535l266808p252395l490762
$$ plain form
36909 -2097718 -3417444 -3889985 -3371788 -2809534 -2213531 309855 5228703 8467074 5263143
36900 5263143 -2216846 -5084605 1569667 11099331 12875585 6022955 -69429 470171
36892 470171 2273119 -1589829 -8155519 -9532260 -5817704 -4625481 -8184088 -9633509
36884 -9633509 -4581531 1534672 2181658 -637553 -1342769 -225961 -936195 -2070527 840534
36875 840534 6340255 7765405 3484402 -288488 1471736 6322983 9208652 8969648
36867 8969648 7616830 6595601 5913961 4576028 937290 -4910863 -9214431 -8389481
36859 -8389481 -4469431 -2524326 -2943397 -1576880 2103728 3287321 55502 -2874060
36851 -2874060 -1509514 1971152 4309229 5923214 6760749 3493941 -3758454 -7249216
36843g249216O374456J0786917M237248n066096p305392l007429J224267K075172
36835B069927L91128j718774j294449K940863O578164L890123k703251m784153
36827E369578p47491K119720J51469j879590j107894q50186r20086L984821J1156825
36818A7277166R555370O17518L041017K3284430L6893934J9067365j6975971l5181206
36810E7579623k4656320q320992m545971n715838r49987L501685r86865p985444
36802G919891p633104l108902k032788j759796L151634P233372K253231o565843
36794e42305o773807J687460O539479K363034k595127p19822M238729M606955
36786H804596k67657m721993m394849l85331K245726j53122m450837l120388N042639
$$ plain form
36843 -7249216 -874760 9912157 14149405 9083309 1777917 -1229512 -5245 2069927
36835 2069927 2461055 742281 -552168 2388695 8966859 12856982 10153731 5369578
36827 5369578 4622087 6741807 6893276 5013686 3905792 3055606 2135520 6120341 17277166
36818 17277166 26832536 27450054 30491071 53775501 90669435 109736800 92760829 57579623
36810 57579623 32923303 24602311 20056340 14340502 13390515 16892200 15905335 7919891
36802 7919891 286787 -2822115 -4854903 -6614699 -3463065 3770307 6023538 -542305
36794 -542305 -7316112 -5628652 910827 3273861 678734 -41088 4197641 8804596
36786 8804596 8536939 3814946 -579903 -965234 1280492 1127370 -3323467 -6443855 -1401216
36777a401216J0522075M991499n821557q886649j787307M839714L222038k030824
36769C647773l142777k03946J692226Q84424m23015r50989j224511j384847j075612
36760b181274l88069M76421J049067L4980k468913k757360K129545P869827O567266
36751A0331490j492317o369732k177067M173772L286030l122212n994108k673122
36743d037266J102441J543484J255527K564394L201785R85561k139246l267653
36735A209027k256459m26687J354898J844210j45534k912499k633339J160614
36727b805769L874664J939251j979718k628673P60784L902968L144830o29153
36719E579184l598272k980659N30724L531388L387241J055308n21466o25545j339833
$$ plain form
36777 -1401216 9120859 14112358 8290801 -595848 -2383155 2456559 5678597 3647773
36769 3647773 504996 301050 1993276 2877700 2454685 1503696 279185 -1105662 -2181274
36760 -2181274 -2569343 -2092922 -1043855 -1008875 -3477788 -6235148 -4105603 3764224 10331490
36751 10331490 8839173 2469441 292374 4466146 7752176 4629964 -1364144 -4037266
36743 -4037266 -2934825 -1391341 -135814 2428580 5630365 6615926 4476680 1209027
36735 1209027 -1047432 -1474119 -119221 1724989 1579455 -1333044 -3966383 -2805769
36727 -2805769 1068895 3008146 1028428 -1600245 -839461 3063507 6208337 5579184
36719 5579184 1980912 -999747 -469023 3062365 6449606 7504914 6983448 6357903 5018070
36710E018070l450961m355196j760742K465274M402876K997599P82682J74801
36702F274403R73620J743253K233055L422127N345984O221456N587913P789653
36694C9591464J7840653L0875779L0950565Q577051k2071382l4212105k0134397
36687E1417628j312575P93884n813033K704508K7510166M0219324J9756857j8218536
36679A17058223l9760641l2283087j3268327l111854l261591m122727k580747
36672A8669249k769398n222307n266529j954742o02497l833329o043069j229351
36664h251973P306317J0337036M505118l990018p501659m671833N26072L751512
36656B010572L092637r2704j969461k93315K084132Q96440k656367l380462p26535
$$ plain form
36710 5018070 1567109 -2788087 -4548829 -2083555 2319321 5316920 6099602 6274403
36702 6274403 7248023 8991276 11224331 14646458 19992442 26213898 31801811 39591464
36694 39591464 57432117 88307896 119258461 127835512 105764130 71552025 51417628
36687 51417628 50105053 50898937 45085904 47790412 75300578 115519902 135276759 117058223
36679 117058223 77297582 45014495 31746168 28634314 25372723 21249996 18669249
36672 18669249 15899851 10677544 5411015 3456273 2853776 -979553 -7022622 -8251973
36664 -8251973 -945656 9391380 13896498 9906480 2404821 -2267012 -1740940 2010572
36656 2010572 5103209 5010505 3041044 2747729 4831861 5728301 3071934 -308528 -1035063
36647a035063J67030k221497k566356J461634L448295j519198p275319n262605
36639a4803079K047664N443564L243332J490191J924970L27661l238515l145203
36631f709415J055532K520395j202311l561948j20761M158398L707713J004777
36623H52380Q46521K220152J607277o42487k355258l438481l500504n03518M153772
36614g60146M756947l8743l459094n49190M073318L962121L69573k075309l159595
36605C119882l794639j180734M880221O924057K08294p263646n287826K560654
36597A66263M669061m37925l814500j956728k51592q14806N60632M003589L999670
36588F123664L68905m95167K253112K036768k027519k318886K832124M493733
$$ plain form
36647 -1035063 -868033 -3089530 -5655886 -4194252 -745957 -2265155 -9540474 -14803079
36639 -14803079 -12755415 -7311851 -4068519 -2578328 -653358 -325697 -3564212 -6709415
36631 -6709415 -5653883 -3133488 -4335799 -7897747 -8018508 -3860110 -152397 852380
36623 852380 1698901 3919053 5526330 4883843 2528585 -909896 -4410400 -4913918 -760146
36614 -760146 3996801 3958058 498964 -50226 4023092 7985213 8354786 6279477 3119882
36605 3119882 -674757 -1855491 3024730 9948787 10157081 2893435 -2394391 166263
36597 166263 4835324 4397399 582899 -1373829 -1625421 -2440227 -1879595 2123994 6123664
36588 6123664 6492569 5997402 8250514 10287282 8259763 5940877 8773001 13266734
36580A3266734j148242m973244o51654L887788N86296m214823j309098M607232
36572A0050989L245586l146532m172958R90526M444517M674096O367382P812489
36564C0266095M431236L809785J8457818L9910447L9608610O107034l4028309
36557A08562716m6384482k8986446p807819m18302j588380j959737k403517n418597
36549A3595436o463384j790462L758837L964712K03794k698992m067572m857516
36541A644853k833705K688889N608478P35558o063919m516586M145500P624752
36533I033820M81364p914904p507994j220292J853695L54385j98056J840113K695359
36524e82510R62128m33419m3080L91910K95995R40803J549131m6440k570144k458932
$$ plain form
36580 13266734 12118492 7145248 6493594 10381382 10967678 6752855 5443757 10050989
36572 10050989 13296575 10150043 5977085 6967611 11412128 16086224 22453606 30266095
36564 30266095 34697331 38507116 56964934 96875381 136483991 142591025 108562716
36557 108562716 62178234 33191788 25383969 24965667 23377287 21417550 19014033 13595436
36549 13595436 7132052 5341590 9100427 13065139 13268933 10569941 6502369 1644853
36541 1644853 -1188852 1500037 7108515 7844073 1780154 -2736432 1409068 9033820
36533 9033820 9515184 1600280 -5907714 -7128006 -5274311 -4919926 -5117982 -3277869 -582510
36524 -582510 379618 -53801 -96881 295029 591024 1531827 3080958 3034518 464374 -1994558
36514a994558k55082j17718k120648j379121L190237N730044K445048k091769
36506C406433k071156R84293J863834K2231j195811r37541r14684q54593P34981
36497A037987K191364L61732l334599l497565J387029N776915L946568k607760
36489E261671p029334n145002M52660M291684M259197K641806J651676N41868
36481F926226j470437k147254M83905L509892K395613j744397l427645j621703
36473B904200j109747l492990l798161L65973L186446j20396m390564k245881
36465h701120L604836M366116r01428m306967j801516J802955K015551J140872
36457b780701K520211M485460L888563J303903p85634j780090k130336j490920
$$ plain form
36514 -1994558 -2249640 -2367358 -4488006 -5867127 -2676890 3053154 5498202 3406433
36506 3406433 1335277 2319570 4183404 4205635 3009824 2072283 1157599 303006 1037987
36497 1037987 3229351 3591083 256484 -3241081 -1854052 3922863 7869431 5261671
36489 5261671 -1767663 -6912665 -6460005 -2168321 2090876 4732682 6384358 6926226
36481 6926226 5455789 3308535 3792440 7302332 9697945 7953548 4525903 2904200
36473 2904200 1794453 -1698537 -5496698 -5130725 -1944279 -2064675 -6455239 -8701120
36465 -8701120 -5096284 -730168 -1631596 -5938563 -7740079 -5937124 -3921573 -2780701
36457 -2780701 -260490 4224970 8113533 9417436 8631802 6851712 4721376 3230456
36449C230456j06331L72180n92108j341188r35067o68547j323006j588717p27511
36440c679839j28726n99536p21046L98901J267438O53810l24229m49954k63194
36431c846375N675J536740L817580L396859j216365n728426m748246R25785N147147
36422g09626M155606M64719j200326O04321L374282L925097J442278k144353m299390
36413E612608m209251k773287q30755J414068L316778L685892K179053k93178
36405H101928k572167l479174j740796K116812M403399J972954k644701l586771
36397B571484M2093K457295k81228m343206l986633K79405L510407L648117K549849
36388F447583J444480j03803j549307j803094j836110l150376m283564k692885
$$ plain form
36449 3230456 3124125 3496305 2904197 1563009 627942 -40605 -1363611 -2952328 -3679839
36440 -3679839 -3808565 -4408101 -5129147 -4730246 -3462808 -2808998 -3133227 -3583181 -3846375
36431 -3846375 -3840700 -2303960 1513620 4910479 3694114 -2034312 -6782558 -5856773 -709626
36422 -709626 3445980 3910699 2710373 3314694 6688976 10614073 12056351 9911998 5612608
36413 5612608 1403357 -1369930 -2200685 -786617 2530161 6216053 8395106 8101928
36405 8101928 5529761 2050587 309791 2426603 6830002 8802956 6158255 2571484
36397 2571484 2613577 5070872 4789644 446438 -3540195 -3260790 249617 3897734 6447583
36388 6447583 7892063 7788260 6238953 4435859 2599749 -550627 -4834191 -7527076
36380g527076M77415J755273J121469J694502L465183K724221r19536k503394
36372B88057N06007L393206J213589l325204l916925M0989L457911L508099K267217
36363G432946J484375j40416l077186m594304k663274N79520J744752P36866J36893
36354A640172J249263K832770L151892J646435j060598l515571m113121k511468
36346f80226j40825J374627J689227J024439p60136l073621l837142j824497J093566
36337e134588K326421K388045L344775L966975P86610m948958o346464k20623
36329c837807O805760O577854Q25681k040279k1961L97905l701989n973628j488875
36320b457339M028754K642207l013591l880606R50055L098539j189455n034243
$$ plain form
36380 -7527076 -7049661 -5294388 -4172919 -2478417 986766 3710987 2791451 288057
36372 288057 794064 4187270 5400859 2075655 -1841270 -1800281 1657630 5165729 7432946
36363 7432946 8917321 8776905 5699719 1105415 -1557859 -978339 766413 1503279 1640172
36354 1640172 2889435 5722205 8874097 10520532 9459934 5944363 1831242 -680226
36346 -680226 -821051 553576 2242803 3267242 2507106 -566515 -4403657 -6228154 -5134588
36337 -5134588 -2808167 -420122 2924653 6891628 7678238 2729280 -3617184 -3837807
36329 -3837807 2967953 9545807 10371488 8331209 8309248 8707153 5005164 -968464 -2457339
36320 -2457339 1571415 4213622 1200031 -2680575 -1730520 1368019 178564 -4855679
36312d855679k104822L738072N072042J623580j386147j624496n39767J165845
36304A088628L013278J981519l374184p543588l825301M733276P556107J124087
36296D753822n886568n065391P96876L766962K086669m61989k340840m591097
36288f941556n591802k364466L175263N291940K543052k68117M81220K423230
36280a251236J779376r86711k573246j427915J197087L139459K870659N44167
36272C291640j719812j989537j010490o71792n73765Q10918J975352k01655m130375
36263d219516l783189K203508O650641L227266m163288o620303k366786K133657
36255f938010K176800N7797l97681O24959R70304M12115k2124l67724j148792
$$ plain form
36312 -4855679 -6960501 -3222429 1849613 3473193 2087046 462550 -77217 1088628
36304 1088628 4101906 6083425 2709241 -4834347 -8659648 -3926372 3629735 4753822
36296 4753822 -1132746 -6198137 -5401261 -1634299 452370 -9619 -2350459 -6941556
36288 -6941556 -12533358 -14897824 -11722561 -6430621 -3887569 -4155686 -3674466 -1251236
36280 -1251236 528140 -458571 -3031817 -4459732 -3262645 -123186 2747473 3291640
36272 3291640 1571828 -417709 -1428199 -2099991 -2673756 -1862838 112514 -89141 -4219516
36263 -4219516 -8002705 -5799197 851444 4078710 -84578 -6704881 -9071667 -6938010
36255 -6938010 -4761210 -4703413 -5101094 -4476135 -3505831 -3093716 -3115840 -3483564 -4632356
36246d632356j756524r65461J558365M749522O301419L749010k636395q138074
36238a770494p447437j003076M978694N803271K998678L63516j454444l522115
36230a053407m388754j717068K549368L228103p82111m093275k099964K312201
36222f044907K819782j153910l574091n85461L821123L439936j359752m131629
36214f768909j220888L413451L723694m33969l402872j256591L278465M521121
36206A853502J046190k768718k527140P75106K637478J180389j068039j459597
36198c30829m98572K22713O11919O47773j045134m335929n544853k012596K880416
36189i405092L648090O95910o34629J202405K009690k26597j601533P11541L361186
$$ plain form
36246 -4632356 -6388880 -7354341 -5795976 -1046454 5254965 9003975 6367580 -1770494
36238 -1770494 -9217931 -10221007 -5242313 560958 3559636 3923152 2468708 -1053407
36230 -1053407 -5442161 -7159229 -4609861 -1381758 -2163869 -6257144 -8357108 -6044907
36222 -6044907 -3225125 -4379035 -7953126 -8538587 -4717464 -1277528 -2637280 -6768909
36214 -6768909 -7989797 -4576346 -852652 -1286621 -4689493 -5946084 -2667619 1853502
36206 1853502 2899692 130974 -2396166 -1621060 1016418 2196807 1128768 -330829
36198 -330829 -829401 -606688 5231 653004 -392130 -4728059 -10272912 -12285508 -9405092
36189 -9405092 -5757002 -5061092 -5695721 -4493316 -2483626 -2710223 -4311756 -3600215 -239029
36180b39029K758624J241783K315050L754062J329601l321699m725575k053185
36172A059632K40751l79560k098760l250120l975617l266299M25151M956775N883674
36163d04373L104512J335028K693533L727400J725820q20452q53453K59861l42185
36154A0425691k241733l147441k669285j768094m63235J242412J901209N19723
36146C799247j523732k360369j843346l93934K152973M765573M798823J719867
36138A1115102j098401r51437J34191r99112l188474l020699q97746n22807k520616
36129a949999l050659M9792L513966L224536q4107k358196j926519p21803j17164
36120c420153J330111M501635O431753L473715k797252o368884m535476j429995
$$ plain form
36180 -239029 2519595 3761378 6076428 9830490 11160091 7838392 3112817 1059632
36172 1059632 1300383 920823 -1177937 -4428057 -8403674 -11669973 -11244822 -6288047 -404373
36163 -404373 2700139 4035167 6728700 10456100 12181920 11361468 10508015 10767876 10425691
36154 10425691 8183958 5036517 2367232 599138 135903 1378315 3279524 3799247
36146 3799247 2275515 -84854 -1928200 -2322134 -169161 4596412 9395235 11115102
36138 11115102 10016701 9065264 9199455 8200343 5011869 1991170 1093424 570617 -1949999
36129 -1949999 -5000658 -4950866 -1436900 1787636 1703529 -654667 -2581186 -3302989 -3420153
36120 -3420153 -2090042 2411593 8843346 12317061 9519809 3150925 -1384551 -2814546
36112b814546j525004l050642j854848J030898J377117j38166J274870N162889
36104e37432M846266j447314n834049k230510L729564L238974j828214k205272
36096b267987L682173P154768K857600l319606l407236J648759M818402L001849
36088A4168722n71584k161446j588932p12249o84194j277293j581297j025730
36080D565997j18394N1745q74272k260350l286866l080586o13137L680224O392284
36071D456645L889653k496477o473026l815324K340744N392986L244224j85262
36063F354163r92209O5529l2777j770670k815226j741982J37048J060680J254677
36054A519233J941245K856258K215596q69510m892488p024243n360138o37960
$$ plain form
36112 -2814546 -4339550 -7390192 -9245040 -8214142 -6837025 -6975191 -5700321 -537432
36104 -537432 4308834 2861520 -2972529 -5203039 -1473475 1765499 -62715 -2267987
36096 -2267987 1414186 8568954 11426554 8106948 4699712 6348471 11166873 14168722
36088 14168722 13597138 11435692 9846760 9134511 8450317 7173024 5591727 4565997
36080 4565997 4447603 4499348 3625076 1364726 -1922140 -5002726 -5615863 -1935639 4456645
36071 4456645 8346298 5849821 -623205 -4438529 -2097785 3295201 6539425 6354163
36063 6354163 5361954 5427483 5394706 3624036 808810 -933172 -796124 264556 1519233
36054 1519233 3460478 6316736 8532332 7662822 2770334 -4253909 -9614047 -10252007
36046a0252007L647585L797408p4066l381124k218861J584879L013462R35816
36038b946908p51410M97343K265143J774211M47008Q62894K064199J606133J72608
36029E991221J2564K23456j743740m411097l253764J751127M559320J432579l312938
36020A248728l422873N40114K872525J365126o27095o02602m02130j521549j337454
36011a887210K335142N851224L882875j972418m243660l77582L056293L23689
36003F968353m180810k432515M223793N993658j074807q754729p622032Q15039
35995f064050P096673N654883m14298m581743l442491J040439L630968J181058
35987D101439l052629k799712K404750N597229K098908l360276l480391J129648
$$ plain form
36046 -10252007 -6604422 -2807014 -2881080 -6262204 -8481065 -6896186 -3882724 -2946908
36038 -2946908 -3698318 -3200975 -935832 838379 1285387 2148281 4212480 5818613 5991221
36029 5991221 6003785 6227241 4483501 72404 -3181360 -1430233 3129087 4561666 1248728
36020 1248728 -2174145 -1634031 1238494 2603620 1976525 1373923 971793 -549756 -1887210
36011 -1887210 447932 6299156 10182031 8209613 3965953 3588371 6644664 6968353
36003 6968353 2787543 355028 4578821 10572479 9497672 742943 -6879089 -6064050
35995 -6064050 1032623 6687506 6273208 1691465 -1751026 -710587 2920381 4101439
35987 4101439 1048810 -1750902 653848 6251077 8349985 4989709 1509318 2638966
35979B638966L760799J680618j543609k931186l391071l684247k322015J041857
35971d749888L990928M471911K760203m4808k651903l035203o54571J248487n62024
35962G73132l798859l483480J19176J908319N81739M46772K899150K914041k214120
35953A45870o644692l939354K971313N787652K385476j542736j530025L97582
35945a968914K62560k059666l283759j047491L321133N802704L632941j321613
35937C337895m145257k426879J298500L415003L330635K276027N10523j720012
35929E876435k330336K98378L974930M684121J821582j214533k007972k149638
35921H952967l964157o010587m276167J854677O909783M966198k278844o235704
$$ plain form
35979 2638966 6399765 8080383 6536774 3605588 214517 -3469730 -5791745 -4749888
35971 -4749888 -758960 3712951 6473154 6428346 3776443 741240 86669 1335156 773132
35962 773132 -3025727 -6509207 -6390031 -4481712 -3899973 -3453201 -554051 2359990 145870
35953 145870 -6498822 -10438176 -7466863 -1679211 706265 -836471 -2366496 -1968914
35945 -1968914 -1706354 -3766020 -7049779 -8097270 -4776137 1026567 4659508 3337895
35937 3337895 -807362 -3234241 -1935741 1479262 4809897 7085924 7596447 5876435
35929 5876435 3546099 3844477 7819407 12503528 14325110 13110577 11102605 8952967
35921 8952967 4988810 -1021777 -5297944 -3443267 3466516 8432714 6153870 -81834
35913h1834k034362M528129M334209k655297p470414m545222J485045L360437
35905c079309P08964j514679p27218J279784K434223K764856K825237K195523
35897F887381J53916k871561m759305l367867L11271K169823L12324j577702K33056
35888b508664K865472J268193k346398j237413L679251L740397k831221o250146
35880c620529o22862N472036K213157n503632n804873J752117O801893M435638
35872E122945j81937k535621l679573l971418j466910K026358J822211j249769
35864d113714j424798J767454K477565m76405r13354L192886M816206n32353o681781
35855a888294o432784k214290l34720o52112N50991K157539O99260j740755R2955
$$ plain form
35913 -81834 -2116196 2411933 6746142 4090845 -3379569 -7924791 -6439746 -3079309
35905 -3079309 -2370345 -3885024 -4612242 -3332458 -898235 1866621 4691858 6887381
35897 6887381 7041297 4169736 -589569 -3957436 -3646165 -1476342 -1164018 -2741720 -2508664
35888 -2508664 356808 1625001 -721397 -1958810 1720441 5460838 2629617 -3620529
35880 -3620529 -4243391 1228645 3441802 -2061830 -7866703 -6114586 687307 5122945
35872 5122945 4941008 2405387 -1274186 -5245604 -6712514 -4686156 -2863945 -4113714
35864 -4113714 -5538512 -3771058 -1293493 -1769898 -2683252 509634 5325840 4793487 -1888294
35855 -1888294 -8321078 -10535368 -10870088 -11522200 -10971209 -8813670 -8114410 -9855165 -9762210
35846i762210N605062Q500593N787166J065724j469587j792117k157635l710001
35838B066995n488348n056504r32084M169704M758997l95199n218195l586630
35830i681264K547744O017301L827425j88285j312195R15349L412788L094176
35822H633039j19999k749023j469874K126823L274637J230090L83975K338556
35814A3648224K367684k410265o790107m994486J52107K155215J117263J489600
35806F735235K496328m07886n573244n721305M25366N097237K430567l993037
35798A489261p075269m442922J197775N337937M189832j461769m851915j124677
35790f741747M159579J896650n585689o437527J921310P378010J784829o145448
$$ plain form
35846 -9762210 -4157148 4343445 10130611 11196335 9726748 7934631 5776996 2066995
35838 2066995 -3421353 -8477857 -9409941 -5240237 -481240 -876439 -6094634 -9681264
35830 -9681264 -7133520 -1116219 2711206 2522921 1210726 2126075 5538863 8633039
35822 8633039 8513040 5764017 4294143 6420966 9695603 10925693 11309668 13648224
35814 13648224 16015908 13605643 6815536 1821050 1973157 4128372 5245635 6735235
35806 6735235 9231563 8823677 3250433 -2470872 -2045506 3051731 5482298 1489261
35798 1489261 -5586008 -10028930 -8831155 -3493218 696614 -765155 -5617070 -6741747
35790 -6741747 -2582168 -685518 -6271207 -12708734 -10787424 -3409414 -1624585 -7770033
35782g770033n111709J318092K748420O8665K072757P962534P680851l24908n348362
35773C296307j517807L383106J452972l257511l271493k7313O86549l25852J604342
35764B023300M954732L928782r35841k874276l5210J740908p25018k651491k28654
35755E197232K142230m89878m053038j299549N581923O832821l10811p178794
35747F422136o226142p44089K090680J523993Q97041J35175k371748l840155q32620
35738b945729L084017J746783k337940m60625P369335R959679J488875q655268
35730I249127r118110k184907J847551O5794k505027l756192n695808o330623
35722a8428195o78723R027292J3293921Q164988M27560k941986l265377m238545
$$ plain form
35782 -7770033 -12881742 -11563650 -8815230 -8746565 -6673808 1288726 8969577 8644669 3296307
35773 3296307 1778500 5161606 6614578 3357067 85574 58261 744810 418958 2023300
35764 2023300 6978032 10906814 9970973 7096697 7061487 8802395 8077377 5425886 5197232
35755 5197232 7339462 6849584 2796546 1496997 7078920 13911741 13600930 6422136
35747 6422136 195994 -548095 1542585 3066578 3963619 4098794 1727046 -2113109 -2945729
35738 -2945729 138288 1885071 -452869 -913494 6455841 16415520 17904395 9249127
35730 9249127 131017 -2053890 -206339 -140545 -2645572 -6401764 -12097572 -18428195
35722 -18428195 -19106918 -10079626 3214295 11379283 11806843 8864857 5599480 1360935
35714A360935m459556j431190K140264K133270k71864j186487o39352j204081
35706c558061k106965l30188L413531N076237L448224J318462M20284l79672j431381
35697E870471j134028N02694Q55260j328945l962009m875527m289486k955262
35689a1316832o76197K068054L699538L942231L985784L378624K07605m241695
35681A047112n156954j134468K627189J689489r50158k96108K073909J194380
35673A094391j867716j382779K663183L652702n66649l576158q98817K638202
35665A756359J267431k204206j900232R00602P89561j579241o71173L607747M920543
35656F887391N72664m540000n606850l300727J66571M229403O945192M802011
$$ plain form
35714 1360935 -3098621 -4529811 -2389547 -256277 -528141 -1714628 -2353980 -3558061
35706 -3558061 -5665026 -5995214 -2581683 2494554 5942778 7261240 7681524 7301852 5870471
35697 5870471 4736443 5239137 6094397 4765452 803443 -4072084 -8361570 -11316832
35689 -11316832 -11993029 -9924975 -6225437 -2283206 1702578 5081202 5288807 1047112
35681 1047112 -4109842 -5244310 -2617121 -927632 -1877790 -2173898 -99989 1094391
35673 1094391 -773325 -2156104 507079 4159781 3593132 16974 -881843 1756359
35665 1756359 3023790 819584 -1080648 -180046 609515 -969726 -1640899 1966848 6887391
35656 6887391 7460055 2920055 -2686795 -5987522 -5820951 -1591548 5353644 10155655
35648A0155655j257039m810227k399466J596680J879251n54213j816206j415150
35640A379285j033719p68971m56428j121100j761066P73112N041474M052574l611370
35631B493791q129695j737853P886721P649992j207176n228592J92093M477253
35623F396534m58631p530258n698744M062856J1088098Q781712L08361o763120
35615A0186808p444272k892495Q12417m58187l096042q35602M856560O024899
35607G154086Q51057k863915k8052L808988J950143l030980m769225l236390k348302
35598b512590k037105j33K140611J525879O3360R80399K155875r2065l153311
35589i29080j710007K662309L456397j17737k422126j215221k93567j587606k181996
$$ plain form
35648 10155655 8898616 4088389 1688923 3285603 5164854 4610641 2794435 1379285
35640 1379285 345566 -423405 -879833 -2000933 -3761999 -2988887 2052587 6105161 2493791
35631 2493791 -5635904 -7373757 512964 8162956 6955780 1727188 1919281 6396534
35623 6396534 5937903 -1592355 -7291099 -3228243 7859855 16641567 16949928 10186808
35615 10186808 2742536 -149959 662458 204271 -2891771 -3727373 1129187 7154086
35607 7154086 8005143 5141228 5113176 8922164 10872307 7841327 3072102 -164288 -2512590
35598 -2512590 -4549695 -4549828 -2409217 -883338 -819978 160421 2316296 2224231 -929080
35589 -929080 -2639087 23222 3479619 3361882 939756 -275465 -569032 -2156638 -4338634
35580d338634o60523N49712P92766K422612M743682L616847p42179k639609l71464
35571C373210M31643l232824n628149j555350M418199M664451K3357k382898k18415
35562a06776J946159O71215j956839k418120k80257K087712K134860n18507l289661
35553a730214l325262j443531q89244j695231l16479L734159N888610L825173
35545D047981J426728J620754R03854l590584o952112l582529K758516M187634
35537H20242J081866L73229L126851L405151l19243k247344K47661K087269k19158
35528H356524k642390j236813J091817J55504k721115l991244l174529r69282
35520e131528K945162O489927N106092p08394l731703p59354J583322j934667
$$ plain form
35580 -4338634 -4999157 -4449445 -3656679 -1234067 3509615 7126462 6384283 3744674 3373210
35571 3373210 3804853 572029 -5056120 -6611470 -2193271 2471180 2494537 111639 -106776
35562 -106776 1839383 2510598 553759 -1864361 -2144618 -56906 2077954 1559447 -1730214
35553 -1730214 -5055476 -6499007 -7388251 -9083482 -9399961 -5665802 222808 4047981
35545 4047981 5474709 7095463 7999317 4408733 -2543379 -6125908 -3367392 820242
35537 820242 1902108 2275337 5402188 8807339 8488096 6240752 6488413 8575682 8356524
35528 8356524 5714134 4477321 5569138 5724642 3003527 -987717 -4162246 -5131528
35520 -5131528 -2186366 4303561 9409653 8701259 4969556 4210202 5793524 3858857
35512C858857n151960o17312O236112M373643m582993p789842p96576O313511
35504A843440M967614n76882k588763j380940j349006k339359j458373J025653
35496a856616L007518M232409M464919J796252l193820n580073k699225J187712
35488A359076J265546o25140r4568K032902J744512r53616k600033k300913j762897
35479a935131p15856K227087M955721L526562j486871m958976l875142j61899
35471b424505L129942M635539L631460N5791l781350m574123j785057J940969
35463H28666L808073K579563j353482n330460n591868j683984K265945L105741
35455a371806K490197K228096J83707m365462n935496m23662O092909M559278
$$ plain form
35512 3858857 -1293103 -1910415 4325697 8699340 4116347 -3673495 -4470071 1843440
35504 1843440 6811054 6234172 3645409 2264469 915463 -1423896 -2882269 -1856616
35496 -1856616 1150902 5383311 9848230 11644482 8450662 2870589 171364 1359076
35488 1359076 2624622 1999482 1904914 3937816 5682328 4728712 2128679 -172234 -1935131
35479 -1935131 -2650987 -423900 4531821 8058383 6571512 1612536 -2262606 -2424505
35471 -2424505 705437 5340976 8972436 9028227 5246877 672754 -1112303 828666
35463 828666 4636739 7216302 5862820 532360 -5059508 -6743492 -4477547 -1371806
35455 -1371806 1118391 3346487 3530194 -835268 -6770764 -7194426 -1101517 3457761
35447C457761l186599o807492k860209J759944K255203J911647L358208L225009
35439C113472n26666l804646l255261j385952r77594n12198J310871K468431K166647
35430a402896K467232K847122P9834l956187k643516L691647N595935j003465
35422E675706p388204n579588k23392P82275j087068p08064K59887j300335j292863
35413a0861646M050358Q234336L854323l492742l256349K488447L098750k031104
35405B084373l499629N00464J607386k413845l441845J503301M204080o3790m018304
35396c537809j096671L862893L917636J047322L61440Q46035m77019j381528J078214
35387D620513L855158K619176q29458k016768j029110o64094q73825n03694j211197
$$ plain form
35447 3457761 271162 -6536330 -9396539 -7636595 -5381392 -3469745 -111537 3113472
35439 3113472 2586806 -1217840 -4473101 -5859053 -6836647 -7348845 -6037974 -3569543 -1402896
35430 -1402896 1064336 3911458 3991292 35105 -2608411 1083236 6679171 5675706
35422 5675706 -1712498 -7292086 -7515478 -6733203 -7820271 -8528335 -8268448 -9568783 -10861646
35413 -10861646 -6811288 1423048 5277371 1784629 -1471720 1016727 4115477 2084373
35405 2084373 -1415256 -914792 692594 -1721251 -5163096 -3659795 544285 480495 -3537809
35396 -3537809 -4634480 -771587 3146049 4193371 4554811 5400846 4923827 3542299 4620513
35387 4620513 8475671 11094847 10265389 8248621 7219511 6555417 5681592 5177898 3966701
35378C966701m133131n648196k124595L428618M975700K060605m23095J7776R84350
35369C104733K72692r56938r08943J4772K40237o87744j575058r40961J036675
35360d00535K233469J120774j005941j836782j212624m57706K24319J002677N84308
35351B51959j442191k176147M04991K827172J153651j399158J038784O226735
35343F885796O195473M66393k767894m03993R44435k286638l801944O52046M551305
35334A0434979J786916k184828j12131L507450J64191o570090n663077K601807
35326C965217N674886j708463q872383n086793M888078Q187020J525618n881108
35318B692072n543650L54379L711294J341169k350208k670649p20214m0859k87779
$$ plain form
35378 3966701 -166430 -5814626 -7939221 -4510603 465097 2525702 2102607 2120383 3104733
35369 3104733 3377425 2420487 1511544 1526316 1766553 1078809 -496249 -1437210 -400535
35360 -400535 1832934 2953708 1947767 110985 -1101639 -1559345 -1335026 -332349 251959
35351 251959 -1190232 -3366379 -2961388 -134216 1019435 -379723 659061 6885796
35343 6885796 13081269 13547662 10779768 10375775 11320210 9033572 5231628 5883674 10434979
35334 10434979 12221895 10037067 9924936 13432386 13596577 7026487 1363410 3965217
35326 3965217 9640103 7931640 -940743 -6027536 -1139458 7047562 8573180 2692072
35318 2692072 -2851578 -2497199 1214095 2555264 205056 -2465593 -3185807 -3226666 -3514445
35309c514445J288082L443494J876585k769671m009096P63693N288340L231625
35301E598607k659659n108316k578749K89447M09020p33247j038258n47555m7616
35292f416326L26571Q12714J613659K388983J962059j7902j477723n28189R47836
35283c88318L63j768115l33565L170957L263869o33263k637744j9890K688450
35274C342744J902924J82487k1102n13254j545834M84325N133114N658270j48325
35265A4475349m990193l767321j670902l665748m936413o00743L659549J168818
35257c27604l053933q20460M348501L501819j550078j802883K355925K009446
35249D660733l830630n992547m71850N687398N880123J568716l227478o341814
$$ plain form
35309 -3514445 -2226363 1217131 3093716 324045 -3685051 -2921358 2366982 5598607
35301 5598607 2938948 -2169368 -4748117 -4458670 -4049650 -4782897 -5821155 -6368710 -6416326
35292 -6416326 -6089755 -5277041 -3663382 -1274399 687660 669758 -807965 -1336154 -388318
35283 -388318 -387955 -2156070 -2489635 681322 3945191 3311928 674184 654294 3342744
35274 3342744 5245668 5428155 5407053 4893799 3347965 3832290 8965404 14623674 14475349
35265 14475349 9485156 5717835 4046933 381185 -4555228 -5155971 -1496422 -327604
35257 -327604 -3381537 -4201997 146504 3648323 2098245 295362 2651287 4660733
35249 4660733 830103 -5162444 -5634294 53104 5933227 7501943 4274465 -2067349
35241b067349n283597R93056P313824P088214K016740p26182j21034j279347m576538
35232C357787m731428j126100Q55634J0549J230312N362838O336784J152491n068020
35223G380847o570809l052012K861847P707517O766064j062680q118996n669187
35215B42591L332752P466809K802686l203237m262831k618193k269665k984597
35207a493685l136128k269691J3007K754184K720048j72538l94331M123498O413158
35198H557522J804084k760763o35852K311489l34880j837578L973538O850002
35190A7927562k462218j0704569k016816J1744858R295609j477650K673576J5888932
35182D0869284J2964757n78966M847793K5284854K6958943J6149280M0322850
$$ plain form
35241 -2067349 -7350946 -6357890 955934 8044148 10060888 9334706 9213672 7934325 3357787
35232 3357787 -1373641 -2499741 -1644107 -1633558 -403246 4959592 11296376 12448867 7380847
35223 7380847 810038 -2241974 619873 8327390 15093454 14030774 5911778 242591
35215 242591 3575343 11042152 13844838 10641601 6378770 3760577 1490912 -1493685
35207 -1493685 -4629813 -6899504 -6886497 -4132313 -1412265 -1584803 -1979134 2144364 8557522
35198 8557522 10361606 7600843 6964991 9276480 8941600 7104022 11077560 17927562
35190 17927562 15465344 4760775 2743959 14488817 23784426 22306776 24980352 40869284
35182 40869284 53834041 53255075 58102868 83387722 110346665 126495945 166818795
35175A66818795R4987643J00785944K2473431n4386245l7354671L0883442L2496881
35168C56705220m9375127j11143061q6597719k9827894j3416786k6183918k0353777
35161A9806938J279749M224401r835507j1064249K701716O924655l153758q129908
35153B754037j826149J852130j669537j189393N787424P410775k06062n908323
35145G004902l104834O30441j575895n095920l164159K656977N976482L765180
35137G093174j325138l829643j173374K200630K38244m496948l511085K948139
35129a856001M514142j840240n398476J84812N444708J737553l532919j031940
35121a778361L046622j033425p167588l511212N478784N862968j508344k869752
$$ plain form
35175 166818795 261806438 362592382 385065813 330679568 293324897 324208339 356705220
35168 356705220 307330093 196187032 109589313 79761419 66344633 40160715 19806938
35161 19806938 21086687 25311088 15475581 4411332 7113048 14037703 10883945 2754037
35153 2754037 927888 2780018 1110481 -78912 5708512 13119287 12913225 7004902
35145 7004902 3900068 4530509 2954614 -2141306 -5305465 -2648488 3327994 7093174
35137 7093174 5768036 1938393 765019 2965649 3203893 -1293055 -4804140 -1856001
35129 -1856001 2658141 817901 -4580575 -4395763 1048945 2786498 -746421 -1778361
35121 -1778361 1268261 234836 -6932752 -10443964 -4965180 897788 -610556 -3480308
35113c480308L897623N879150j845784p710355l096276M892301O521006L017190
35105H074547L16572q46709j931367j403297J449440L301786J929789k09809n78151
35096A0102801j70607m45579r92406j537707k272418k095327n28711o368j631173
35087D22505j482866K804567N575943J321493m535736l116368K780523K881289
35079F651350l088712n362983j345558J195979l69010N84966N261888N342513
35071H870433j291335m969650q67604K577658n61634l196208O39260M504661K544101
35062H249682P33841L927897M783056j485115m327101N134247J6582472J6616422
35054E0215401J0560618J0260998J3303213J5924683L1097171O2807063P4919850
$$ plain form
35113 -3480308 417315 6296465 4450681 -3259674 -6355950 -1463649 5057357 8074547
35105 8074547 8391119 7544410 5613043 4209746 5659186 8960972 10890761 10680952 10102801
35096 10102801 9932194 9486615 8494209 6956502 4684084 2588757 2060046 2053678 422505
35087 422505 -1060361 1744206 7320149 8641642 4105906 989538 3770061 6651350
35079 6651350 3562638 -1800345 -3145903 -1949924 -2318934 -1733968 3527920 8870433
35071 8870433 7579098 2609448 1741844 4319502 3757868 561660 1200920 5705581 8249682
35062 8249682 8983523 12911420 17694476 16209361 11882260 17016507 33598979 50215401
35054 50215401 60776019 71037017 84340230 100264913 131362084 194169147 269088997
35047B69088997K9070419m5239424o6592488o942769O0770261N2189650k2438438
35040B69906208q0891623p6957135m0798513j7925317j4086311j2173999p863423
35033A9209887o759399o626524k395978K173713J850209R4481J203240J263947
35025A0013576k981392n108017M22054O550219M016556k955275l626077J281843
35017G613487J661159m073497o507354j679998K382189l85760l998699p36349
35009e724822N922698O569809J54203m763436k359844L211539M479732J70357
35001G660236m634228n425047k395723J462806L589657K924232R4054k575381
34993G00606k998854j977172j917405k439536n11833L544940M411424m22107n189177
$$ plain form
35047 269088997 298159416 252919992 186327504 179384735 240154996 292344646 269906208
35040 269906208 189014585 112057450 71258937 53333620 39247309 27073310 19209887
35033 19209887 12450488 5823964 3427986 5601699 7451908 7546389 8749629 10013576
35025 10013576 7032184 1924167 2346221 8896440 12912996 9957721 6331644 7613487
35017 7613487 9274646 5201149 -1306205 -2986203 -604014 -989774 -4988473 -5724822
35009 -5724822 197876 6767685 6921888 2158452 -201392 3010147 7489879 7660236
35001 7660236 3026008 -2399039 -4794762 -3331956 257701 3181933 3275987 700606
34993 700606 -2298248 -4275420 -6192825 -8632361 -9144194 -5599254 -1187830 -1609937 -6799114
34984f799114l376568K341026M093110P90328j243954Q76805K916429J811894
34976A409956K25490N28342R03928J33876J22103R94124j83149l136085l321746
34967b323161n930J577725n44836j390025J265111J858296k550358n355345j309590
34958h778113L622405K142899j886292r59150K391570R37849l090146j804237
34950g423215L284485L039452l222618o072236j507301L441801K989784J46201
34942e323647r74407j275999j968302j597917l61866k84717J94283M101107P908744
34933D17279M911617k376078l779409K287462N517872O22267m240753k077564
34925A282693J235029j686083o379042m616579J544983M220314K791456K364359
$$ plain form
34984 -6799114 -10175682 -7834656 -3741546 -2951218 -4195172 -3318367 -401938 1409956
34976 1409956 1635446 2163788 3067716 3201592 3323695 4317819 4134670 998585 -2323161
34967 -2323161 -2329091 -751366 -1296202 -2686227 -1421116 437180 -2113178 -7468523 -8778113
34958 -8778113 -5155708 -3012809 -4899101 -5858251 -3466681 -2528832 -5618978 -7423215
34950 -7423215 -4138730 -1099278 -4321896 -10394132 -11901433 -8459632 -5469848 -5323647
34942 -5323647 -6298054 -7574053 -9542355 -11140272 -11502138 -11786855 -11592572 -7491465 417279
34933 417279 5328896 2952818 -826591 1460871 6978743 7601010 3360257 1282693
34925 1282693 2517722 831639 -5547403 -10163982 -8618999 -4398685 -1607229 757130
34917G57130L100501J117889k307080j848970K373486M451892J746809k308143
34909G083514m322359m191092k548253q041J530432J083610R00076K591065L174562
34900E293514k19551m163374l318214P99342J893752j116298k864550o66795J510928
34891b851246o4277l274651l869784j136437K375587M261268L733818J520101
34883F94379o13539j419254j478647j940832k569862k378959j261238M37679K654664
34874g875609M396138L625925L37199k275477k026430r29798j471416k124121
34866h343589j60795L072487L899256K161906J122807K023163K731846J845717
34858H352798M98596l47315j271155k414951k720701j824531p57407l73241o31126
$$ plain form
34917 757130 3857631 4975520 2668440 819470 3192956 7644848 9391657 7083514
34909 7083514 2761155 -1429937 -3978190 -3986231 -2455799 -1372189 -472113 2118952 5293514
34900 5293514 5073963 910589 -2407625 -1608283 285469 -830829 -3695379 -4362174 -2851246
34891 -2851246 -2915523 -6190174 -10059958 -11196395 -8820808 -4559540 -825722 694379
34883 694379 80840 -1338414 -2817061 -4757893 -7327755 -9706714 -10967952 -10530273 -7875609
34874 -7875609 -3479471 146454 483653 -1791824 -3818254 -4748052 -6219468 -8343589
34866 -8343589 -8504384 -5431897 -1532641 629265 1752072 3775235 6507081 8352798
34858 8352798 8851394 8504079 7232924 4817973 2097272 272741 -484666 -857907 -1489033
34849a489033j375399k311421k460325j067668J284198L529953N209374N645807
34841F965486L563245p36221m169690l935668r62348J404182J312496m47461k150586
34832H43435k466761j020846J036314J822891R46126r6676j80992K09994K41288
34823A334773n08552k390947m597114m341493k38072M229810M625954K222176
34815C36535J695027K832351J169601k834050l231822R11227K935239j11724k251026
34806A451358N42359K925569M3941l406654j700831J709902J078412j242766m88662
34797I12628P27438j652474l300763J237283O607484M237357k249194k458699
34789D061060K814159L278644k424351m858259j154555O24957k817167m398011
$$ plain form
34849 -1489033 -2864432 -5175853 -7636178 -8703846 -7419648 -3889695 1319679 6965486
34841 6965486 10528731 9792510 5622820 1687152 724804 2128986 3441482 2994021 843435
34832 843435 -1623326 -2644172 -1607858 215033 1161159 1064483 883491 1093485 1334773
34823 1334773 826221 -1564726 -6161840 -10503333 -10741405 -6511595 -1885641 336535
34815 336535 2031562 4863913 6033514 3199464 -32358 878869 3814108 3702384 1451358
34806 1451358 1993717 4919286 4963227 1556573 -144258 1565644 2644056 1401290 912628
34797 912628 1640066 -12408 -3313171 -2075888 4531596 8768953 6519759 4061060
34789 4061060 6875219 10153863 7729512 2871253 1716698 2341655 -475512 -4873523
34781d873523j043764K16007l578163m299927K499509P880884L749571l449470
34773b898876l330745K423239M913580K355702m33734j764414k839029j906790
34765c481067K461668N605916K569182l208485m697756j976727m83685j176997
34757d387951m05730K051699K520927L16580j572061k051855k229243j196316
34749f953950K460532N932028N021979R56443j439485j383447j860501k736176
34741b577j038132K051630J662775k356213m284704j454481K003655K461013J711756
34732G54722J800040P99794k441397m416195k383529L05169p21238l411442k317125
34723a2031201K538760N324817K990036p10310j198282Q54263J935910J461059
$$ plain form
34781 -4873523 -5917287 -5701280 -9279443 -13579370 -11079861 -3198977 550594 -2898876
34773 -2898876 -6229621 -3806382 1107198 3462900 3029166 1264752 -1574277 -3481067
34765 -3481067 -1019399 4586517 7155699 3947214 -750542 -2727269 -3210954 -4387951
34757 -4387951 -4793681 -2741982 -221055 95525 -1476536 -3528391 -5757634 -6953950
34749 -6953950 -4493418 1438610 6460589 7417032 5977547 4594100 2733599 -2577
34741 -2577 -1040709 1010921 2673696 317483 -3967221 -5421702 -3418047 -957034 754722
34732 754722 2554762 3354556 913159 -3503036 -5886565 -5581396 -6302634 -9714076 -12031201
34723 -12031201 -9492441 -4167624 -1177588 -1887898 -3086180 -2231917 -296007 1165052
34715A165052J751842L247367L259053L43825k853250l138478j366719q26741
34707A581951j939755j878346K11004J172741j111533l580253j934663K957264
34699d521590N995291M681881J759793N72733P62285R4478j519922k059849q03226
34690D961874K62801j034946m109146o007257m604677q36834K414757L224852
34682e728576K031907M85726l98988p37038q60987m69790R11901K628440K853827
34673G16422P79276j678155j882886j31908O29895q24781k171984j154773J218236
34664d500658K688609K826738K228369Q40887o86032k98142K116140L035537J76369
34655H427817l310914l303226j006272k79680r16487q8186J265296l8569k391820
$$ plain form
34715 1165052 2916894 6164261 9423314 9767139 6913889 3775411 2408692 1581951
34707 1581951 -357804 -2236150 -2025146 -852405 -1963938 -5544191 -7478854 -4521590
34699 -4521590 1473701 6155582 7915375 8488108 9250393 9344871 7824949 5765100 4961874
34690 4961874 5224675 4189729 80583 -5926674 -10531351 -11368185 -8953428 -5728576
34682 -5728576 -3696669 -3210943 -3609931 -4346969 -5207956 -5677746 -4765845 -2137405 716422
34673 716422 1495698 -182457 -2065343 -2197251 -1567356 -2392137 -4564121 -5718894 -4500658
34664 -4500658 -1812049 1014689 3243058 4083945 3397913 3099771 5215911 8251448 8427817
34655 8427817 5116903 1813677 807405 527725 -388762 -476948 788348 749779 -1642041
34646a642041j093386K712221K566472k258343m312333J54643M618544K602309
34638C348086k144350k164955K150752M580583L141096J037335l87587k732246
34630F828714n213765m539833o85953K256358K008904P82897R24694J456333N34362
34621D352711j287005k091507j488422r20733j412555j953261q09856J448347
34613d162281J627730j726166m896890l034266K729614O052424L897423J55273
34605F42861p19381N13633Q40967q5423r40562j509830j687592n88308R56049
34596b577586L65590j831764j247598L180571N910644K952328j341524j128491
34588D282170J497436P57153k326088j743849K468226L433280j324130n402861
$$ plain form
34646 -1642041 -2735427 -23206 2543266 284923 -4027410 -3872767 745777 3348086
34638 3348086 1203736 -961219 1189533 5770116 8911212 9948547 9560960 6828714
34630 6828714 1614949 -2924884 -3610837 -1354479 654425 1437322 2362016 3818349 4352711
34621 4352711 3065706 974199 -514223 -1434956 -2847511 -4800772 -5610628 -4162281
34613 -4162281 -2534551 -4260717 -9157607 -12191873 -9462259 -3409835 487588 642861
34605 642861 -76520 437113 1278080 1192657 252095 -1257735 -2945327 -3533635 -2577586
34596 -2577586 -2211996 -4043760 -5291358 -2110787 3799857 6752185 5410661 4282170
34588 4282170 5779606 6536759 4210671 2466822 4935048 8368328 7044198 1641337
34580A641337l120237K319497M042080Q88301k447160k603819j250314j636726
34572b167041l673705l910385n93960K824794J757225k400800l231196J470231
34564i924837O096751N546949K275111R62700R77446l21984j192613O50971J525772
34555F596266k652115p043146l749180M208837N609930j236024m969272O60341
34547b574363O243299J584683p923183r577648k304449L328182J763632j128270
34539a0588117P09185M403730L873696p92267m011236k393231J614937L375540
34531c807763J584962m15309J034907M732433N622109J870203j711632j17478
34523H792432M030040L549319k704678p368821m645573J498127K988063j261668
$$ plain form
34580 1641337 -1478900 840597 4882677 5770978 3323818 719999 -530315 -2167041
34572 -2167041 -5840746 -9751131 -10345091 -7520297 -5763072 -8163872 -11395068 -9924837
34564 -9924837 -3828086 1718863 3993974 4956674 5934120 5612136 4419523 5070494 6596266
34555 6596266 3944151 -3098995 -6848175 -2639338 2970592 1734568 -3234704 -2574363
34547 -2574363 3668936 5253619 -2669564 -12247212 -14551661 -11223479 -9459847 -10588117
34539 -10588117 -9878932 -5475202 -1601506 -2393773 -6405009 -8798240 -7183303 -3807763
34531 -3807763 -2222801 -2638110 -1603203 3129230 8751339 10621542 8909910 8792432
34523 8792432 12822472 16371791 13667113 6298292 1652719 3150846 6138909 4877241
34515D877241m736439l032095P90149J746281l64602k304367k428291j334737
34507f786860M79060K476034K982607J272203l68205L65373J949310J499572k39003
34498C630091m04292N83047l6775j603608q21175J485479O46180l481196m947246
34489d949495j083201K950476K532942L28822K02854L43265j908985l609569j197957
34480f390848K153585J179405k443685k667040J280653M347908L478900K23009
34472A161887l160822m985635l281266J189450L303088K90722k840107o62440
34464h985123L373680K554967j356474j102334L259557M455853N29945k752038
34456b1967k822387l604309n895660m386903K157863O648270M137185q52565j941155
$$ plain form
34515 4877241 140802 -2891293 -2101144 -354863 -719465 -3023832 -5452123 -6786860
34507 -6786860 -6307800 -3831766 -849159 423044 54839 420212 2369522 3869094 3630091
34498 3630091 3225799 3808846 3772071 2168463 1347288 2832767 3478947 -2249 -4949495
34489 -4949495 -6032696 -3082220 -549278 -220456 -17602 325663 -1583322 -5192891 -6390848
34480 -6390848 -4237263 -3057858 -5501543 -8168583 -6887930 -2540022 938878 1161887
34472 1161887 -1998935 -6984570 -10265836 -9076386 -5773298 -5482576 -8322683 -8985123
34464 -8985123 -5611443 -3056476 -4412950 -5515284 -2255727 2200126 2730071 -21967
34456 -21967 -2844354 -6448663 -12344323 -16731226 -14573363 -7925093 -3787908 -4640473 -6581628
34447f581628N76811K909487L638963K712763p0820k574619j612286J230208J059354
34438A288233j652229j285311K374705K698137j836929l988766l71303K283584
34430d89879p31078l629034j001787K396686J158925n82813J922604L589090j003125
34421A629589n534400j958443M063366J788235n486960n242557K977093P072045
34413f92032L034657m984K219635J955078m339316p328479p46345O266208L139679
34404C504101n105186o147713O82930N368885L663104J244097J843592J446252
34396F500062l051235p079701m822008J886928N673496L136876j427724k188006
34388a371312R56384L201665J827966o36088j076906n00004j386604k764551j910470
$$ plain form
34447 -6581628 -6004817 -3095330 543633 3256396 3185576 610957 -1001329 228879 1288233
34438 1288233 -363996 -1649307 725398 3423535 1586606 -2402160 -2773463 -489879
34430 -489879 -1220957 -4849991 -5851778 -3455092 -2296167 -2878980 -956376 2632714 1629589
34421 1629589 -3904811 -5863254 -1799888 -11653 -5498613 -10741170 -7764077 -692032
34413 -692032 2342625 2337641 4557276 6512354 2173038 -5155441 -5901786 364422 3504101
34404 3504101 -1601085 -7748798 -7065868 -1696983 1966121 3210218 5053810 6500062
34396 6500062 3448827 -3630874 -8452882 -6565954 -892458 2244418 816694 -1371312
34388 -1371312 -414928 2786737 4614703 3978615 2901709 2401705 1015101 -1749450 -3659920
34379c659920K76157K11386k124552k597108M57108L533487L644489K406362J894039
34370D041448N02172l223921n716646k363083M633585P314531K023948n308435
34362A903599o413600j044881L240378J399963k650697k102699K877870N525133
34354B735066K261351k628179l723853j544633K27352J001494K389834L369125
34346D087557J301877k870709m840531k568421J592976M388470M376080J646813
34338G114112k042923l345102o96931K859069L212219N43422k082316l758672
34330A802878n035651l987255J184888O408671N237785j360176n337552l058578
34322d144990K99300P5432j163405P7250J813580J508712J741075M921129O827743
$$ plain form
34379 -3659920 -3383763 -3172377 -5296929 -7894037 -7436929 -3903442 -258953 2147409 4041448
34370 4041448 4543620 1319699 -4396947 -6760030 -2126445 5188086 7212034 1903599
34362 1903599 -4510001 -5554882 -2314504 -914541 -3565238 -5667937 -2790067 2735066
34354 2735066 4996417 2368238 -1355615 -2900248 -2672896 -1671402 718432 4087557
34346 4087557 5389434 2518725 -2321806 -4890227 -3297251 1091219 5467299 7114112
34338 7114112 5071189 1726087 1029156 3888225 7100444 7643866 5561550 1802878
34330 1802878 -3232773 -7220028 -6035140 373531 5611316 4251140 -1086412 -4144990
34322 -4144990 -3845690 -3770258 -4933663 -4856413 -3042833 -1534121 206954 5128083 11955826
34313A1955826K245727n731064q789402m475382J808058N113125N451857M023762
34305A1602507P44518k994015l797496r01815J729639K74344l813548n514165
34297b670031k303692K830197M511319Q51734m136628m813031n06983L735570
34289b501545L470599n8689k288291r23476K332388M168806K541391j418347l640086
34280A682750j249829L081487L853150L88882k323432j741886j344758l162951
34272h16587k851346K382785O427831K490285n085766o147983q9127L719182J055235
34263A084509j548822R42792L573648M78883m833345n063216l29081K923953J676755
34254a093924q85674j232015N45179K320620K360019N35819j070949r7834K314349
$$ plain form
34313 11955826 14201553 8470489 -318913 -4794295 -2986237 2126888 7578745 11602507
34305 11602507 12347025 9353010 5555514 4653699 6383338 6657682 2844134 -2670031
34297 -2670031 -4973723 -2143526 2367793 3219527 -917101 -5730132 -6237115 -2501545
34289 -2501545 969054 910365 -1377926 -2301402 30986 4199792 6741183 5322836 1682750
34280 1682750 432921 3514408 7367558 7756440 5433008 3691122 2346364 -816587
34272 -816587 -3667933 -1285148 5142683 7632968 2547202 -3600781 -3689908 29274 1084509
34263 1084509 -464313 478479 4052127 4531010 -302335 -5365551 -5694632 -2770679 -1093924
34254 -1093924 -1979598 -3211613 -2666434 -345814 2014205 2550024 1479075 1381241 3695590
34245C695590K188715j256216l670334k113659K56857m61837k465612j559766
34237e386262J901150M088529L546859J531676j270220l847501l245914J033855
34229a647828L684929O21856l277589p66014N434192N728012j192961n896697
34221B687900k797657K164675K195013n08878q08895N89428L59954j052699j915340
34212I13501l091022m258656j644493M781646P517172J781941n651520n651106
34204e302537j05487K575527J327126J803478M430767L919714J85307q91175J412295
34195I355015R53724l779062o255546l114797M38076L68054J14885K415957L322155
34186C818461K43979j778503J346251M686762K227472k925540m172386k296286
$$ plain form
34245 3695590 5884305 4628089 957755 -1155904 -899047 -1360884 -3826496 -5386262
34237 -5386262 -3485112 603417 4150276 5681952 4411732 564231 -2681683 -1647828
34229 -1647828 2037101 2658957 -618632 -1384646 4049546 9777558 8584597 2687900
34221 2687900 -109757 2054918 4249931 3741053 2932158 3521586 3881540 2828841 913501
34212 913501 -2177521 -6436177 -8080670 -3299024 4218148 6000089 348569 -5302537
34204 -5302537 -5408024 -2832497 -1505371 298107 4728874 8648588 8833895 7942720 9355015
34195 9355015 10308739 6529677 274131 -2840666 -2402590 -2034536 -1919651 496306 3818461
34186 3818461 4062440 2283937 3630188 8316950 10544422 7618882 3446496 1150210
34178A150210k281204l266116q03865L361606L158174r48696j909949K337897
34170G98057N399178K561463k518897m214062k524933r20571n63538j58000O63399
34161a477904O37304r76375k736659j864924K278188N580513K977370l819442
34153E98071o517639j288187M884093L894333j608755k899819J267051L995335
34145B324483J992304n87463o51614l88490j136140m26740K261428L315041J221311
34136G924120r54228j560055k528260l397811m93520M775365M806430k175762
34128F396279o897944k429801M423283L475066k977537m611778K77751L405977
34120A061296Q05732k008985p68958R46101o02213k431022m73788L043110L001507
$$ plain form
34178 1150210 -1130994 -4397110 -5200975 -1839369 1318805 370109 -1539840 798057
34170 798057 6197235 8758698 6239801 2025739 -499194 -1419765 -1983303 -2141303 -1477904
34161 -1477904 -840600 -1816975 -4553634 -6418558 -4140370 1440143 4417513 598071
34153 598071 -5919568 -7207755 -2323662 1570671 -38084 -2937903 -1670852 2324483
34145 2324483 4316787 3729324 3077710 2689220 1553080 1126340 3387768 6702809 7924120
34136 7924120 6969892 5409837 2881577 -516234 -1009754 3765611 8572041 6396279
34128 6396279 -501665 -2931466 1491817 4966883 1989346 -2622432 -2344681 1061296
34120 1061296 1867028 -141957 -910915 35186 -567027 -2998049 -3471837 -428727 2572780
34111B572780p35612l380812j969083J331292K583977P88156j275815n72474K090837
34102A433246K719733k43288l009735j635068J796645K116970p98977j822723
34094E56803J008349L183555J173186j522190J76028M490430M721394j199309
34086A2588246p460246p590576j974431L422212M139017J220072j387804j636125
34078A320365n75120L53626J194073J964420J303255j295377l231626j705850
34070f72234J650836K547547P21872O26173L675882M405712j579479r285190r798470
34061g707351k750715L096418K385711k74035Q83620L547772K247956j816762
34053c87386k785797j2386J408018j7411J93332L529074M483620k07424m613393
$$ plain form
34111 2572780 1837168 -1543644 -3512727 -2181435 402542 1190698 -85117 -657591 1433246
34102 1433246 4152979 3909691 899956 -735112 1061533 3178503 2379526 556803
34094 556803 1565152 4748707 5921893 4399703 4575731 9066161 13787555 12588246
34086 12588246 5128000 -2462576 -4437007 -1014795 3124222 4344294 2956490 1320365
34078 1320365 745245 1098871 2292944 4257364 5560619 4265242 1033616 -672234
34070 -672234 978602 3526149 4248021 4874194 8550076 12955788 11376309 2091119 -7707351
34061 -7707351 -10458066 -7361648 -4975937 -5249972 -4366352 -818580 1429376 -387386
34053 -387386 -3173183 -3185569 -1777551 -1794962 -1601630 1927444 6411064 6203640 1590247
34044A590247k087479L824893M319834j372967n458481l646557N7283J584157
34036a189070K258303L429371K555089j234564l304586k30000L968901L551905
34028I805349l51194k353533j455006j226474k775435l397198k066029r36705
34020d756225p51858M93398L091705L971126J247097k755107m713564m051405
34012h224833k121175P1567J976918L088900L450931L344499K418309O90758k49457
34003D446417N28198P55419j876114m672084k748841K739183M694529L01178m462379
33994b94494l904773p72757k95563r20771J943613N980017M290308k580480n547911
33985b102811l39096N683165M543277p63703k047286J026515J480528k804007
$$ plain form
34044 1590247 -497232 3327661 7647495 6274528 816047 -2830510 -2773227 -1189070
34036 -1189070 1069233 4498604 7053693 5819129 2514543 2284543 6253444 9805349
34028 9805349 9454155 7100622 5645616 4419142 1643707 -1753491 -3819520 -4756225
34020 -4756225 -5508083 -5014685 -1922980 2048146 3295243 540136 -4173428 -8224833
34012 -8224833 -10346008 -10274441 -8297523 -5208623 -1757692 1586807 4005116 4695874 4446417
34003 4446417 4974615 5730034 3853920 -818164 -3567005 -827822 3866707 4167885 -294494
33994 -294494 -4199267 -4972024 -5267587 -6188358 -4244745 1735272 6025580 3445100 -2102811
33985 -2102811 -2441907 3241258 7784535 7020832 4973546 6000061 7480589 4676582
33977D676582n560136k471309J838746J202534k515588k661638J781693M801758
33969A092642K436470j826487k616665Q2507K169576J590857q8404j328428k392014
33960h79946l052213j551436K442080N756714M875065N24298k925878k713705
33952B474979n51979L39913n27961j012119J14971J334605M10104k620603n022778
33943e060868l933517M80995M430783L868352r52755n180946m706736q74099J821724
33934a0107067J866327J839949L384380M400083K788549J51931o42894M34759
33926D116017J456571J803715J788849N25468k611890n419187n088463k301732
33918e730652J74009J984682M278297N305725K321922k030056j560610L527919
$$ plain form
33977 4676582 -883554 -3354863 -1516117 -313583 -2829171 -5490809 -3709116 1092642
33969 1092642 3529112 1702625 -914040 -831533 1338043 2928900 2840496 1512068 -879946
33960 -879946 -3932159 -5483595 -3041515 2715199 7590264 8114562 5188684 2474979
33952 2474979 1923000 2262913 1734952 722833 837804 2172409 2582513 -38090 -5060868
33943 -5060868 -8994385 -8513390 -4082607 -214255 -1167010 -6347956 -11054692 -11928791 -10107067
33934 -10107067 -8240740 -6400791 -3016411 1383672 4172221 4324152 3681258 4116017
33926 4116017 5572588 7376303 9165152 9690620 7078730 1659543 -3428920 -5730652
33918 -5730652 -5556643 -3571961 706336 6012061 8333983 6303927 4743317 8271236
33910H271236N184073n21423o471125n019838K77812R38735k570781k452418K495612
33901A31883M617290N85891k734371J2443L292137j57909o618487o416263R73670
33892f313716N774217K449497k593086j198200M637728O275175O64875o355714
33884C340776q212561m527236N33881L178499K149029j086445k887169n91130
33876h102356L596727M429189P65436k281258o82290K570568K624990M79246J47849
33867C548101P26600j666450n089368l243910L106194M965161j095311o361467
33859e110450k930157M170831N334551Q01323k168398k024368k760333l691966
33851h378967k79803N267134N137301o68209k500895L823556R623271O257328
$$ plain form
33910 8271236 13455309 12933886 6462761 1442923 1720735 2659470 88689 -2363729 131883
33901 131883 4749173 5335064 2600693 2613136 5905273 5747364 -871123 -7287386 -6313716
33892 -6313716 -539499 1909998 -683088 -1881288 2756440 9031615 9696490 3340776
33884 3340776 -4871785 -9399021 -8865140 -5686641 -3537612 -4624057 -7511226 -8102356
33876 -8102356 -4505629 -76440 688996 -1592262 -2274552 296016 2921006 3400252 3548101
33867 3548101 4274701 2608251 -2481117 -5725027 -2618833 2346328 1251017 -5110450
33859 -5110450 -8040607 -3869776 1464775 2266098 97700 -1926668 -4687001 -8378967
33851 -8378967 -8658770 -3391636 1745665 1077456 -1423439 2400117 12023388 18280716
33843A8280716k624256p865731p283068m855868k735599p39203Q2571n34140K82352
33834g992226L574864M863879Q65259l974890l801488n24824J96122j176458o8021
33825h037783K714339K155373j254697j792279J217010K195866j23952J57409
33817b768714N206747Q053788L146089m462440o513915l057439j51750K87859
33809b59775J459065M059565M218541j99083n738990p393348m057490J133218
33801f778297M478301M853423L581078J756282j105183m699315n940969k439263
33793f293943K789093M138321J182956q95617L66172J196682j239460l524653
33785b280449j869380J240610J364611m03047O0662K309943K270584l73277j642567
$$ plain form
33843 18280716 15656460 7790729 507661 -4348207 -7083806 -7823009 -7740438 -8274578 -7992226
33834 -7992226 -4417362 446517 1311776 -2663114 -6464602 -6989426 -6793304 -7969762 -8037783
33825 -8037783 -5323444 -3168071 -4422768 -6215047 -4998037 -2802171 -2926123 -2768714
33817 -2768714 2438033 10491821 13637910 9175470 2661555 -395884 -547634 -259775
33809 -259775 1199290 5258855 9477396 9278313 3539323 -3854025 -7911515 -6778297
33801 -6778297 -2299996 2553427 6134505 7890787 6785604 2086289 -3854680 -6293943
33793 -6293943 -3504850 633471 1816427 920810 1286982 2483664 1244204 -2280449
33785 -2280449 -4149829 -2909219 -1544608 -1947655 -1886993 422950 2693534 2320257 677690
33776F77690j08648J075751j97848j883217j521832N15652K575710L497101K317047
33767F947406p62169k855003j135562K567829L377437Q1023l283684l259965q35794
33758H41518J341033J927489J06669m112327p354367m963377K001218N985527
33750d226617K457002l324524l128483L199537Q086020O433387J026233k447841
33742H074714k129388n13692m86646k262581l535340k089913J579031M533876
33734C170061M504967K036924p61894k495916k837340j770345L37349K334181
33726D517987K763931Q93773k363330m229370k059561K924020N314905J650104
33718I412459m086991m733488L67059M186347J660058l683301n137148j515571
$$ plain form
33776 677690 569042 1644793 1446945 -436272 -1958104 -1442452 1133258 4630359 6947406
33767 6947406 6185237 3330234 2194672 4762501 8139938 8220961 4937277 1677312 841518
33758 841518 2182551 4110040 4216709 104382 -7249985 -12213362 -10212144 -4226617
33750 -4226617 -1769615 -5094139 -8222622 -5023085 3062935 9496322 10522555 8074714
33742 8074714 5945326 5431634 4944988 2682407 -852933 -2942846 -1363815 3170061
33734 3170061 7675028 9711952 8950058 6454142 3616802 1846457 2183806 4517987
33726 4517987 7281918 8175691 5812361 1582991 -476570 2447450 7762355 9412459
33718 9412459 5325468 591980 959039 5145386 6805444 3122143 -2015005 -3530576
33710c530576K593925L151008M37961k361455k505263l77193O55082j546291m342528
33701g825330l812699j076781o53109k534209j772109K647664N101131K515446
33693g409996l17547R28675K756157O65829k228187n22412L760338M386849R86691
33684C006397j415371q44478M87400J539726K368145R13994l370167n307709r03989
33675c526052M396279L105246j330135M83723P274835P660429j405316q995832
33667G663177o870709p12632P38877j788502k857017j718050l61301J540166L864843
33658e01148L737512Q32471o92223L68950l98607m023955m386686R87440M649223
33649E72977Q91499m167507k615800K272403K681004k56201j80673K060322Q83528
$$ plain form
33710 -3530576 -936651 2214357 2652318 290863 -2214400 -2591593 -1936511 -3482802 -7825330
33701 -7825330 -11638029 -12714810 -13367919 -15902128 -17674237 -15026573 -9925442 -7409996
33693 -7409996 -7727543 -6798868 -4042711 -3376882 -5605069 -6127481 -2367143 2019706 3006397
33684 3006397 1591026 746548 1233948 2773674 5141819 6055813 2685646 -2622063 -3526052
33675 -3526052 870227 3975473 2645338 3129061 10403896 18064325 16659009 7663177
33667 7663177 792468 79836 818713 -969789 -3826806 -5544856 -5906157 -4365991 -501148
33658 -501148 3236364 4068835 3376612 3745562 3346955 -677000 -5063686 -4076246 572977
33649 572977 1464476 -2703031 -5318831 -3046428 -365424 -621625 -802298 1258024 2141552
33640B141552k377884j552673K463550K825802r80885k509331o7156J150955n20337
33631E73593o71095J533263P87037m323003p387467m049358J477543L582906K724142
33622e752439K114743K315607K353044J789529l34460m083911n381539j43994
33614g123420P395346P772430j41189o353346l993321J395743J836727j006915
33606b17945o63328K529998K583687j832747n328065l685324J245663M772582
33598e95479M235257Q10023j546749J07039L657030L715135j123640n620337m608772
33589i70493M53343M197142L975113J012572k575808m736116l396618J151242
33581h89623M803133L540696j484158m867363l036667J723232L584997l10436
$$ plain form
33640 2141552 -236332 -1789005 674545 3500347 2519462 10131 -57025 1093930 573593
33631 573593 -97502 1435761 2222798 -2100205 -9487672 -13537030 -12059487 -8476581 -5752439
33622 -5752439 -3637696 -1322089 1030955 2820484 2486024 -1597887 -6979426 -7123420
33614 -7123420 271926 8044356 7903167 1549821 -2443500 -1047757 788970 -217945
33606 -217945 -881273 1648725 4232412 2399665 -2928400 -6613724 -5368061 -595479
33598 -595479 3639778 4449801 2903052 3010091 6667121 10382256 9258616 3638279 -970493
33589 -970493 -517150 3679992 7655105 8667677 6091869 1355753 -2040865 -889623
33581 -889623 3913510 7454206 5970048 1102685 -1933982 -210750 3374247 3063811
33573C063811n598247m767766K990377Q877312N184396l745885p071419k411002
33565c478423K123782R88341j994075k113415q54075n06121Q02144L562146L240833
33556A771137j757321m763148n48044N143864L829319k382929m598645j177898
33548d483665J557681J164858J754137M296490L752366j468143n264976l041200
33540a732452J205139J474242j382156k160245N87656L496958L703265J481311
33532F673718j559844l972226m421309k370417Q30752K636168J434525k062218
33524b810851n192135n191290j502180L408479N929252M251013l41613m515700
33516e965025n220209k016093K458102N042940N005423L450676O94214l271458
$$ plain form
33573 3063811 -2534436 -7302202 -4311825 4565487 9749883 6003998 -1067421 -3478423
33565 -3478423 -1354641 -366300 -2360375 -4473790 -5327865 -5833986 -5031842 -1469696 1771137
33556 1771137 13816 -4749332 -5297376 -153512 3675807 1292878 -3305767 -4483665
33548 -4483665 -2925984 -1761126 -6989 4289501 8041867 6573724 1308748 -1732452
33540 -1732452 -527313 946929 -435227 -2595472 -2007816 1489142 5192407 6673718
33532 6673718 5113874 1141648 -3279661 -5650078 -4819326 -2183158 -748633 -2810851
33524 -2810851 -8002986 -13194276 -14696456 -11287977 -5358725 -1107712 -1449325 -5965025
33516 -5965025 -11185234 -13201327 -10743225 -5700285 -694862 2755814 3450028 178570
33508A78570o090951m531960L61071L287580J673181q82059m38212J595112J768503
33499c079165L71275o3782K93266o44694k437748k357250L54288L387719M288218
33490A12127K648914J87233l12324K084140L921244R08560m961427o443043j426350
33481c280926L088156J200425l210824l381158j85031R74063k08471L0757J631329
33472c341680J480035J46655M48080J032527j005064k828763L95578N566728M658101
33463F552197k255457o392674l878038n48241q60297j266759J672060M911428
33455b065781N061351L722485K489421n16746m923073n780781j589136J932979
33447a669281R06516m74052J937923M504198K438449j762726l283975l115715
$$ plain form
33508 178570 -5912381 -10444341 -10083270 -6795690 -5122509 -6004568 -6442780 -4847668 -3079165
33499 -3079165 -2707890 -2771672 -2478406 -3123100 -5560848 -7918098 -7563810 -4176091 112127
33490 112127 2761041 2948274 2635950 4720090 8641334 9549894 4588467 -1854576 -3280926
33481 -3280926 -192770 1007655 -2203169 -5584327 -5769358 -4795295 -5003766 -4973009 -3341680
33472 -3341680 -1861645 -1714990 -1266910 -234383 -1239447 -4068210 -3672632 1894096 6552197
33463 6552197 4296740 -2095934 -5973972 -6522213 -7382510 -8649269 -6977209 -2065781
33455 -2065781 2995570 6718055 9207476 8690730 3767657 -2013124 -3602260 -1669281
33447 -1669281 -762765 -1236817 701106 5205304 7643753 5881027 2597052 -518663
33439e18663m205304m366992o11901L582663L241544P12437J406701L641670J567665
33430D449820l511405m123090R23783M038065P80571l458440k186686K607908
33422d79474L868278p43775o082045n659169J010469P320805O612514L98204l337727
33413B908080j184351J151591j317850m198129j307435L774523K650991l724170
33405a246750n723378j72029M821729K616606k879316m735883k547998J05070
33397i761949K075309L700149L686864J397751q12522q91362J63971J179978K753438
33388C491627M023058J920185l260042n922318k564453K791627M444192K516383
33380G440259M77752j058677l172926m367185k659679K16217J346554J200806
$$ plain form
33439 -518663 -4723967 -9090959 -9702860 -6120197 -2878653 -2166216 -759515 2882155 4449820
33430 4449820 938415 -3184675 -2260892 1777173 2557744 -900696 -3087382 -479474
33422 -479474 3388804 2645029 -3437016 -9096185 -8085716 -764911 5847603 6245807 2908080
33413 2908080 1723729 2875320 1557470 -2640659 -3948094 -173571 2477420 -1246750
33405 -1246750 -6970128 -7142157 -2320428 296178 -2583138 -7319021 -9867019 -9761949
33397 -9761949 -7686640 -3986491 -299627 1098124 285602 -605760 -441789 738189 3491627
33388 3491627 7514685 9434870 6174828 252510 -2311943 479684 4923876 7440259
33380 7440259 7918011 6859334 3686408 -680777 -3340456 -3124239 -1777685 -576879
33372e76879J283879P009l894532o498603l432656K392608M377821K332626J861373
33363b147354M066566L706875j089773m902687l641800m59046N31763N10052J650227
33354a775177J845605j040174l628788j428590L613374N329614J978933j929847
33346B964950k189482L63695J930638K69529k995989l709416J39378M855943M818985
33337F448231L12563k547990j136272r3462k605087m068006j42226M389597K622388
33328C179736k558647k701046K233647M076605M94070j440256K181783N568253
33320A1034145L188007j954402m643483m865153m057595q49415L951313M610698
33312F414115r34883n497971k570077L325530L794381m08595k037194J81960Q52253
$$ plain form
33372 -576879 707000 714009 -3180523 -9679126 -13111782 -10719174 -6341353 -4008727 -2147354
33363 -2147354 1919212 5626087 4536314 -366373 -4008173 -4467219 -3935456 -3425404 -1775177
33354 -1775177 70428 -969746 -4598534 -6027124 -2413750 2915864 4894797 2964950
33346 2964950 775468 1139163 3069801 3339330 343341 -3366075 -3226697 1629246 6448231
33337 6448231 6760794 4212804 3076532 2983070 377983 -3690023 -3832249 557348 3179736
33328 3179736 621089 -2079957 153690 4230295 4724365 3284109 5465892 11034145
33320 11034145 14222152 12267750 7624267 2759114 -1298481 -2147896 1803417 6414115
33312 6414115 5479232 -18739 -2588816 736714 4531095 4122500 2085306 2267266 3119519
33303C119519j772941l542958k460454j152943o94716R88680L671010M241555
33295B396752K470892J333688J021098j062222l776374k711440J527879K776798
33287C977071o84747k859032j61442K189574j132183o199484n260927J896694
33279h234476P751352O759430R88508l451341k906315P91882K936102J926421
33271F561563J242275L288207M091065p59349p238823p508338k515354p73789
33263c612543l721966l028037M041919P971101K360510m590074l187265K245175
33255a521180K232102q52644J942028Q439388P545533j794518p932569m696359
33247C361781M19582q7791l215924l717757k949205l206931j637891L202981N732652
$$ plain form
33303 3119519 1346578 -2196380 -4656834 -5809777 -6504493 -5515813 -1844803 2396752
33295 2396752 4867644 6201332 7222430 6160208 2383834 -327606 1200273 3977071
33287 3977071 3292324 433292 271850 2461424 1329241 -4870243 -10131170 -8234476
33279 -8234476 -483124 6276306 7264814 3813473 907158 1699040 4635142 6561563
33271 6561563 7803838 11092045 15183110 14423761 7184938 -323400 -2838754 -3612543
33263 -3612543 -7334509 -10362546 -6320627 1650474 4010984 -579090 -3766355 -1521180
33255 -1521180 710922 -141722 1800306 10239694 17785227 15990709 8058140 3361781
33247 3361781 3781363 3693572 477648 -3240109 -6189314 -9396245 -11034136 -7831155 -2098503
33238b098503J820789k816983p17861N242519O353666J721420j491477l27013
33230G686557N03430j598034k409699Q41916L711392J868986j327816n32528K243792
33221A0987996R64509l683273m567867L07817M058519J666453k268167j485960
33213E980027J751349J202121k403748k986367k5518P36081k079781k730603J376881
33204H20442M612124K264472k168359l584712k914133k739794j234177K955459
33196a988678M894590J56148o201503n528954J722797O974078N822452J831760
33188G682690j179839k980793k907882N86616N196364N991146K674872j23707
33180A4939467o34489j948504n146517o752746m943535k445583j074327J049067
$$ plain form
33238 -2098503 -277714 -3094697 -3812558 1429961 7783627 9505047 8013570 7686557
33230 7686557 8189987 6591953 4182254 5024170 8735562 10604548 9276732 8744204 10987996
33221 10987996 11952505 8269232 3701365 4009182 8067701 9734154 7465987 5980027
33213 5980027 7731376 8933497 6529749 3543382 3517864 4253945 2174164 -556439 820442
33204 820442 5432566 7697038 5528679 1943967 -970166 -3709960 -4944137 -1988678
33196 -1988678 2905912 3062060 -3139443 -8668397 -6945600 28478 5850930 7682690
33188 7682690 6502851 3522058 614176 1200792 6397156 12388302 15063174 14939467
33180 14939467 14304978 12356474 7209957 457211 -4486324 -6931907 -8006234 -6957167
33172f957167M385837N436819K322111j547835k251171j33971K257264L296356
33164F808243J820505k254527n458704l547739J712377L568149j26601l741319
33156a219616k548051J064166K895548K788751J774152r99047m433568m013948
33148d691613J169560M929899K536445j995402k593592l86791J09894j72678K490330
33139A396052N858693L936824k698810o565358m188047n05013l71498j698135
33131d835292m02834K382276K515398q8593j201003R57447K671745N23215k526550
33122d191r37839M110905M693038k224049q621918o178415J301432L747938J88161
33113c924938j229715K165305L711194K38688k033624R68306L654573J133090
$$ plain form
33172 -6957167 -2571330 2865489 5187600 3639765 1388594 1254623 3511887 6808243
33164 6808243 8628748 6374221 915517 -2632222 -919845 2648304 2521703 -1219616
33156 -1219616 -3767667 -2703501 192047 2980798 4754950 3755903 -677665 -4691613
33148 -4691613 -3522053 1407846 3944291 1948889 -644703 -1031494 -921600 -1094278 1396052
33139 1396052 7254745 11191569 8492759 1927401 -2260646 -2765659 -3137157 -4835292
33131 -4835292 -5238126 -2855850 -340452 -429045 -1630048 -672601 1999144 2522359 -4191
33122 -4191 -942030 3168875 7861913 5637864 -2984054 -9162469 -7861037 -4113099 -3924938
33113 -3924938 -5154653 -2989348 721846 960534 -1073090 -104784 3549789 4682879
33105D682879j771454M73913L791365J835670k731576l411740j046689o42702
33097A179666j590228l83224R72755j138766l344389n77577L450335J840898k384937
33088a975467o90711N296269N498054j234406m893673j482809R30381k547699
33080a100061n019333p11978M559003L641081k17005k56107K204652J582679j634786
33071C048145k373152M40140L293584L719765J708925j776226l954568j481239
33063B625374L930893N475038O08630m432504l838157p02986q69150l200230k569277
33054b972369J040104L107484J899428o65254l369810n534544m762153k91437
33046a1548551L515031K424314j033302j570663O23365J660566J574449L105145
$$ plain form
33105 4682879 2911425 3385338 7176703 9012373 6280797 2869057 1822368 1179666
33097 1179666 -410562 -793786 178969 -959797 -4304186 -4881763 -1431428 409470 -1975467
33088 -1975467 -2666178 2630091 8128145 6893739 2000066 517257 1447638 -1100061
33080 -1100061 -6119394 -6831372 -2272369 1368712 1151707 895600 3100252 4682931 3048145
33071 3048145 674993 1115133 4408717 8128482 9837407 8061181 4106613 2625374
33063 2625374 6556267 12031305 12639935 8207431 4369274 3666288 2797138 -403092 -2972369
33054 -2972369 -1932265 1175219 3074647 2409393 -960417 -6494961 -11257114 -11548551
33046 -11548551 -8033520 -5609206 -6642508 -8213171 -7589806 -5929240 -4354791 -1249646
33038a249646M486948J459580l683697l503325K488403N414546L63112n342938
33030D32983l030517L790235M480244k628003p461972k804259N323063O247796
33022D349570p04571o329768n040336j302784n87375n66926L195393P578346N879142
33013F470691m39637k815458Q58689K659064k252347p347757n013315J799359
33005f080711N019107L393543J673124J574943J004186n4822J23538L21528j614977
32996E359459l558747k105303P24429L17208k309615k152236O81000J045925j867429
32987c865309k913856r7569J973609O8444k648017k328787L33300L147310N515107
32978h15768O127871K827191k638206m795593k053764Q61682N95307k60517O59811
$$ plain form
33038 -1249646 3237302 4696882 1013185 -2490140 -1737 5412809 5775921 432983
33030 432983 -2597534 1192701 5672945 3044942 -4417030 -7221289 -1898226 4349570
33022 4349570 3644999 -2684769 -7725105 -9027889 -9615264 -10182190 -6986797 591549 6470691
33013 6470691 6031054 3215596 4074285 6733349 4481002 -2866755 -7880070 -6080711
33005 -6080711 -1061604 2331939 4005063 5580006 6584192 6529370 6652908 6974436 5359459
32996 5359459 1800712 -304591 419838 737046 -1572569 -3724805 -3043805 -1997880 -3865309
32987 -3865309 -6779165 -6876734 -4903125 -4834681 -7482698 -9811485 -9478185 -6330875 -815768
32978 -815768 5312103 8139294 5501088 705495 -1348269 -486587 108720 -151797 508014
32969E08014P56575j809165l351772r86148J296460q97352l982614j612923M513589
32960e565336O651485K710078j397974j482029k92809j135602k122324j79432
32952b813943L056913L167120q45944n189928n821170k647792R90767K168709
32944g935268J018374n27361j491827j824684m85223L418562P246964O357725
32936E777262Q08044l201432j492116J994409J243520k791658m406308k348166
32928d416445p50520j447245j579997L07423J670330J256138J487426K984904
32920d87986K098919k352593m877115j059080M342996L499980k473535m837544
32912f145958m59703L659531J383974l605214m239845n18164K192577K242082
$$ plain form
32969 508014 1264589 -544576 -3896348 -4882496 -3586036 -4483388 -8466002 -10078925 -5565336
32960 -5565336 1086149 3796227 2398253 916224 623415 -512187 -2634511 -2813943
32952 -2813943 242970 3410090 2564146 -2625782 -8446952 -11094744 -10103977 -7935268
32944 -7935268 -6916894 -7444255 -8936082 -10760766 -11245989 -7827427 -580463 5777262
32936 5777262 6585306 3383874 1891758 3886167 5129687 2338029 -2068279 -4416445
32928 -4416445 -5166965 -6614210 -8194207 -7886784 -6216454 -4960316 -3472890 -487986
32920 -487986 1610933 -741660 -5618775 -6677855 -2334859 1165121 -1308414 -6145958
32912 -6145958 -6605661 -2946130 -1562156 -5167370 -9407215 -9925379 -7732802 -5490720
32904e490720K595889L727073K342709j776685l877005j780750J34279j628883
32896e754093l153105N04338O018786N862449J51645l043309J27686M045330L074948
32887G834675k56174p39282J119706J507309L42442J03235P1861k221734n073059
32878B688979m217982k89327J269271j265212l102952p74510K398772J917521
32870a375440r70694j982704n03783P44120R72110J901402L611596L736311J309224
32861G442142j515548k347149j070871R45288K203678J331020j923560n303370
32853b38370n545721k135091J905776L563037K639149O22438j204404j707992
32845b101178k20432J712648J156720j797278k858466M91423M126904K382890
$$ plain form
32904 -5490720 -2894831 832242 3174951 1398266 -2478739 -4259489 -4125210 -5754093
32896 -5754093 -8907198 -8402860 -2384074 3478375 3630020 586711 714397 4759727 7834675
32887 7834675 7578501 6839219 7958925 9466234 9808676 9911911 9983772 7762038 2688979
32878 2688979 -1529003 -1818330 -549059 -1814271 -4917223 -5691733 -3292961 -1375440
32870 -1375440 -2346134 -4328838 -4832621 -4088501 -3116391 -1214989 2396607 6132918 7442142
32861 7442142 5926594 3579445 2508574 3453862 5657540 6988560 5065000 -238370
32853 -238370 -5784091 -7919182 -6013406 -2450369 188780 811218 -393186 -2101178
32845 -2101178 -2321610 -608962 547758 -1249520 -4107986 -3616563 510341 2893231
32837B893231l272764n588021j759653K833900K918322M82062L03044K241164
32829A051285K551096M52723j531073k603982m094769n018694k305604L404267
32821h094751O756957M661733O08104o01388O82070R17916o33343j667427j309289
32812A320582j010282j196353n42817Q09704N01627k124155l880468j706333K702151
32803e126344M605969K073006k003361l793744k457626L69401L015351M344900
32795A027552L518847J208403K8136J384218K553113j00970n016733o266356j764098
32786c427888L177999L107020j98290j393421J70442P94697m91958q40077L94062
32777A292586J14833k556677l808615j145147K252625K274781j91213j332565
$$ plain form
32837 2893231 -379533 -5967554 -7727207 -4893307 -1974985 -1492923 -1189879 1051285
32829 1051285 3602381 4055104 2524031 -79951 -4174720 -9193414 -11499018 -8094751
32821 -8094751 -1337794 3323939 3932043 3330655 4012725 4930641 4297298 2629871 1320582
32812 1320582 310300 -886053 -1428870 -619166 -117539 -2241694 -6122162 -7828495 -5126344
32803 -5126344 -520375 1552631 -450730 -4244474 -6702100 -6332699 -3317348 1027552
32795 1027552 4546399 5754802 5782938 7167156 9720269 9619299 4602566 -1663790 -3427888
32786 -3427888 -249889 2857131 2658841 1265420 1435862 2230559 1738601 898524 1292586
32777 1292586 1407419 -1149258 -4957873 -6103020 -3850395 -1575614 -1766827 -3099392
32769c099392K0100K064502L354451L407339J533613j924758m257489l059888
32761a961522M19865K792660K536512N59849j941222l840567l500777n50921K442325
32752c043798K625893O84164l55027M41781J257242R77239N47565O60233O13402
32743D408694J01428r138M55614J13090j887293m119297m342073k160972N74578
32734f865369J873355J542287P70740J35767r32774k214040j784467J125287L641438
32725b707776K574500l31491k23762L451495N610604K975180j494667l859447
32717E994636m504987n004573l957923k79907K913440K622319J297430K673570
32709A754005M800988L038772j775665m293041k891706r66557m21719J91730J134017
$$ plain form
32769 -3099392 -3079292 -1014790 2339661 5747000 7280613 5355855 1098366 -1961522
32761 -1961522 -1541657 1251003 3787515 4347364 2406142 -1434425 -4935202 -5486123 -3043798
32752 -3043798 -417905 266259 -88768 353013 1610255 2587494 3135059 3795292 4408694
32743 4408694 4510122 4500984 4956598 5069688 3182395 -936902 -5278975 -7439947 -6865369
32734 -6865369 -4992014 -3449727 -2678987 -2543220 -3475994 -5690034 -7474501 -6349214 -2707776
32725 -2707776 -133276 -464767 -688529 2762966 8373570 11348750 9854083 5994636
32717 5994636 1489649 -3514924 -7472847 -7752754 -4839314 -2216995 -919565 1754005
32709 1754005 6554993 9593765 7818100 3525059 633353 -333204 -754923 -563193 570824
32700E70824R96130Q33203K706344M083949O47524m756844m096428K756764N588118
32691I329584j072065q548993o399244K266108O102960K128427j877928k66987
32683A661862L400723L366200m11198l682808l495957m51005K444042K374305
32675E206164k45984j661909N14768L563087L145110n75158l517372l657633k664225
32666A06848j623925N91360L393863L031797j952425o605619m901690J700198
32658f259593N135635J120849m923709n012283P49243M697392K236483k624042
32650d880025l694288l55746L810239O460386O806378L658329k035935n009357
32642D759981j561646L818619L678403j429790l939470j255176R03421j138258
$$ plain form
32700 570824 1566954 2400157 5106501 9190450 9837974 5081130 984702 3741466 9329584
32691 9329584 8257519 -291474 -6690718 -4424610 1678350 3806777 1928849 1661862
32683 1661862 5062585 8428785 8017587 4334779 838822 387817 2831859 5206164
32675 5206164 4960180 3298271 3813039 7376126 10521236 9946078 6428706 2771073 106848
32666 106848 -1517077 -925717 2468146 5499943 3547518 -3058101 -7959791 -6259593
32658 -6259593 -1123958 -3109 -4926818 -9939101 -9189858 -4492466 -2255983 -4880025
32650 -4880025 -8574313 -8930059 -5119820 1340566 8146944 11805273 9769338 4759981
32642 4759981 3198335 7016954 10695357 9265567 5326097 4070921 4974342 3836084
32634C836084l139772j113129J625893O42911j958894j629102J161853K871378
32626B297222K721133J665692r59232m827678o113301k655235J687385K813576
32618c370438K661165M107805M004473j317574p139043n702398J380492N077939
$$ plain form
32634 3836084 696312 -416817 1209076 1851987 -106907 -1736009 -574156 2297222
32626 2297222 5018355 6684047 5724815 897137 -5216164 -7871399 -6184014 -3370438
32618 -3370438 -709273 3398532 7403005 6085431 -1053612 -6756010 -5375518 -297579
$$ [...]
##END NTUPLES=NMR SPECTRUM
##END=
