##TITLE=31Pdec_IPACAT-31
 CDCl3, 64 sc
 16.12.2022
##JCAMPDX= 6.0         $$ Bruker NMR JCAMP-DX V2.0
##DATA TYPE= NMR SPECTRUM
##DATA CLASS= NTUPLES
##ORIGIN= UXNMR, Bruker Analytische Messtechnik GmbH
##OWNER= root
$$ XWIN-NMR		Version 3.5
$$ Fri Dec 16 13:57:01 2022 Russian Standard Time (UT+4h)  she@DPX200
##.OBSERVE FREQUENCY= 81.013821
##.OBSERVE NUCLEUS= ^31P
##.ACQUISITION MODE= SIMULTANEOUS
##.ACQUISITION SCHEME= undefined
##.AVERAGES= 64
##.DIGITISER RES= 16
##SPECTROMETER/DATA SYSTEM= spect
##.PULSE SEQUENCE= zgpg30
##.SOLVENT NAME= CDCl3
##.SHIFT REFERENCE= (INTERNAL, CDCl3, 0, 248.564)
##AUDIT TRAIL= $$ (NUMBER, WHEN, WHO, WHERE, WHAT)
$$ ##TITLE= Audit trail, XWIN-NMR		Version 3.5
$$ ##JCAMPDX= 5.01
$$ ##ORIGIN= Bruker BioSpin GmbH
$$ ##OWNER= she
$$ F:/spectra/data/she/nmr/P31/1/pdata/1/auditp.txt
$$ ##AUDIT TRAIL=  $$ (NUMBER, WHEN, WHO, WHERE, WHAT)
(   1,<2022-12-16 13:55:56.18 +0400>,<she>,<DPX200>,
      <continue with go, POWCHK disabled, PULCHK disabled
       configuration hash MD5:
       00 E9 B6 7A A2 85 ED C7 34 08 36 98 17 FE 4E 26
       data hash MD5: 32K
       45 88 38 BE C4 BD 5F 00 E6 6F 76 6D 66 A7 83 4B>)
(   2,<2022-12-16 13:55:58.84 +0400>,<she>,<DPX200>,
      <Start of raw data processing
       efp BC_mod = 2 LB = 1 FT_mod = 6 PKNL = 1 PHC0 = -10960.81 PHC1 = 856.4559 SI = 64K 
       data hash MD5: 64K
       1F A7 D4 C1 2A 5C 39 68 8C 9C 3D 95 56 10 42 13>)
(   3,<2022-12-16 13:56:19.79 +0400>,<she>,<DPX200>,
      <pk PHC0 = 272.5761 PHC1 = -577.6 
       data hash MD5: 64K
       6E 52 64 CF 93 14 79 E6 97 F5 39 7A 93 78 B1 7B>)
(   4,<2022-12-16 13:56:22.82 +0400>,<she>,<DPX200>,
      <abs ABSG = 5 
       data hash MD5: 64K
       13 CF 5D 73 BF DF 43 C0 97 13 44 7A 1E 59 49 E8>)
$$ ##END=
$$ 
$$ hash MD5
$$ E3 E5 8B FD 67 3A 93 7B B0 A2 0E E3 A0 8F 6B C7
##$RELAX= 
##$RELAX= 
##$RELAX= 
##$RELAX= 
##$RELAX= 
##$RELAX= 
##$RELAX= 
##$RELAX= 
##$RELAX= 
$$ Bruker specific parameters
$$ --------------------------
##$DU= <F:/spectra>
##$EXPNO= 1
##$NAME= <P31>
##$PROCNO= 1
##$TYPE= <nmr>
##$USER= <she>
##$AMP= (0..31)
100 100 100 100 100 100 100 100 100 100 100 100 100 100 100 100 100 100 
100 100 100 100 100 100 100 100 100 100 100 100 100 100 
##$AQSEQ= 0
##$AQ_mod= 1
##$AUNM= <au_zg>
##$AUTOPOS= <>
##$BF1= 81.014009
##$BF2= 200.13
##$BF3= 200.13
##$BF4= 200.13
##$BF5= 200.13
##$BF6= 200.13
##$BF7= 200.13
##$BF8= 200.13
##$BYTORDA= 1
##$CFDGTYP= 0
##$CFRGTYP= 5
##$CHEMSTR= <none>
##$CNST= (0..31)
1 1 145 1 1 1 1 1 1 1 1 1 1 1 1 1 1 1 1 1 1 1 1 1 1 1 1 1 1 1 1 1 
##$CPDPRG= <waltz16>
##$CPDPRG1= <>
##$CPDPRG2= <waltz16>
##$CPDPRG3= <>
##$CPDPRG4= <mlev>
##$CPDPRG5= <mlev>
##$CPDPRG6= <mlev>
##$CPDPRG7= <mlev>
##$CPDPRG8= <mlev>
##$CPDPRGB= <>
##$CPDPRGT= <>
##$D= (0..31)
0 1 0 0 0 0 0 0 0 0 0 0.03 2e-05 3e-06 0 0 0 0 0 0 0 0 0 0 0 0 0 0 0 0 
0 0 
##$DATE= 1671184464
##$DBL= (0..7)
120 120 120 11 120 120 24 19 
##$DBP= (0..7)
150 150 150 150 150 150 150 150 
##$DBP07= 0
##$DBPNAM0= <>
##$DBPNAM1= <>
$$ [...]
##$SUBNAM3= <"">
##$SUBNAM4= <"">
##$SUBNAM5= <"">
##$SUBNAM6= <"">
##$SUBNAM7= <"">
##$SUBNAM8= <"">
##$SUBNAM9= <"">
##$SW= 501.771253377433
##$SWIBOX= (0..15)
0 1 3 0 0 0 0 0 0 0 0 0 0 0 0 0 
##$SW_h= 40650.406504065
##$TD= 32768
##$TD0= 1
##$TE= 0
##$TE2= 300
##$TE3= 300
##$TEG= 300
##$TL= (0..7)
0 120 53 12 22 120 120 120 
##$TP= (0..7)
150 150 150 150 150 150 150 150 
##$TP07= 0
##$TPNAME0= <>
##$TPNAME1= <>
##$TPNAME2= <>
##$TPNAME3= <>
##$TPNAME4= <>
##$TPNAME5= <>
##$TPNAME6= <>
##$TPNAME7= <>
##$TPOAL= (0..7)
0.5 0.5 0.5 0.5 0.5 0.5 0.5 0.5 
##$TPOFFS= (0..7)
0 0 0 0 0 0 0 0 
##$TUNHIN= 0
##$TUNHOUT= 0
##$TUNXOUT= 0
##$USERA1= <user>
##$USERA2= <user>
##$USERA3= <user>
##$USERA4= <user>
##$USERA5= <user>
##$V9= 5
##$VALIST= <valist>
##$VCLIST= <CCCCCCCCCCCCCCC>
##$VD= 0
##$VDLIST= <DDDDDDDDDDDDDDD>
##$VPLIST= <PPPPPPPPPPPPPPP>
##$VTLIST= <TTTTTTTTTTTTTTT>
##$WBST= 1024
##$WBSW= 4
##$XGAIN= (0..3)
0 0 0 0 
##$XL= 0
##$YL= 0
##$YMAX_a= 6387
##$YMIN_a= -10151
##$ZGOPTNS= <>
##$ZL1= 120
##$ZL2= 120
##$ZL3= 120
##$ZL4= 120
##$ABSF1= 248.5645
##$ABSF2= -253.2056
##$ABSG= 5
##$ABSL= 3
##$ALPHA= 0
##$AQORDER= 0
##$ASSFAC= 0
##$ASSFACI= 0
##$ASSFACX= 0
##$ASSWID= 0
##$AUNMP= <proc_1d>
##$AZFE= 0.1
##$AZFW= 0.5
##$BCFW= 0
##$BC_mod= 2
##$BYTORDP= 0
##$COROFFS= 0
##$CY= -3
##$DATMOD= 1
##$DC= 0
##$DFILT= <>
##$DTYPP= 0
##$F1P= 0
##$F2P= 0
##$FCOR= 1
##$FTSIZE= 65536
##$FT_mod= 6
##$GAMMA= 0
##$GB= 0
##$INTBC= 1
##$INTSCL= 6.047779e-11
##$ISEN= 30
##$LB= 1
##$LEV0= 0
##$LPBIN= 0
##$MAXI= 10000
##$MC2= 0
##$MEAN= 0
##$ME_mod= 0
##$MI= 50
##$NCOEF= 0
##$NC_proc= -6
##$NLEV= 6
##$NOISF1= 182.463
##$NOISF2= 159.3651
##$NSP= 0
##$NTH_PI= 0
##$NZP= 0
##$OFFSET= 248.5645
##$PC= 4
##$PHC0= -10688.23
##$PHC1= 278.8559
##$PH_mod= 1
##$PKNL= yes
##$PPARMOD= 0
##$PSCAL= 0
##$PSIGN= 0
##$REVERSE= no
##$SF= 81.0140089999694
##$SI= 65536
##$SIGF1= 159.3651
##$SIGF2= -187.1042
##$SINO= 113.3802
##$SIOLD= 16384
##$SREGLST= <1H.CDCl3>
##$SSB= 0
##$STSI= 65536
##$STSR= 0
##$SW_p= 40650.406504065
##$SYMM= 0
##$S_DEV= 0
##$TDeff= 32768
##$TDoff= 0
##$TI= <>
##$TILT= no
##$TM1= 0
##$TM2= 0
##$TOPLEV= 0
##$USERP1= <user>
##$USERP2= <user>
##$USERP3= <user>
##$USERP4= <user>
##$USERP5= <user>
##$WDW= 1
##$XDIM= 65536
##$YMAX_p= 452502810
##$YMIN_p= -10032002
$$ End of Bruker specific parameters
$$ ---------------------------------
##NTUPLES= NMR SPECTRUM
##VAR_NAME=  FREQUENCY,     SPECTRUM/REAL,   SPECTRUM/IMAG
##SYMBOL=    X,             R,               I
##VAR_TYPE=  INDEPENDENT,   DEPENDENT,       DEPENDENT
##VAR_FORM=  AFFN,          ASDF,            ASDF
##VAR_DIM=   65536,         65536,           65536
##UNITS=     HZ,            ARBITRARY UNITS, ARBITRARY UNITS
##FACTOR=    0.620285442955139, 1,           1
##FIRST=     20137.2065510682, 0,            0
##LAST=      -20513.1999529968, 0,           0
##MIN=       -20513.1999529968, -10032002,   0
##MAX=       20137.2065510682, 452502810,    0
$$ Real data points
##PAGE= N=1
##DATA TABLE= (X++(R..R)), XYDATA
$$ [...]
37952c560965Q94513J932078J661505l56094k138754j936908p88770l99746k0753
$$ -3560965 -2666452 -734374 927131 571037 -1567717 -3504625 -4293395 -4693141 -4713894
37943d713894J829791L677973K562121r55424k747923r09906J574848J440820
$$ -4713894 -2884103 793870 3355991 2400567 -347356 -1257262 317586 1758406
37935A758406l50979q89114J5209J85377r37512j456458k00488J462457J632170
$$ 1758406 1407427 518313 533522 718899 -218613 -1675071 -1875559 -413102 1219068
37926A219068K44426j269156j727683j005577J96903Q48200L81402n57905o23312
$$ 1219068 1463494 194338 -1533345 -2538922 -2342019 -1493819 -1112417 -1670322 -2293634
37917b293634N89735J921818K110737J302156M77666l1191n08006p61852l50200
$$ -2293634 -1703899 217919 2328656 3630812 4108478 4077287 3569281 2807429 2457229
37908B457229J69520l53622j663446j971377n59081R20042Q31033r5350k74289
$$ 2457229 2626749 2273127 609681 -1361696 -1920777 -1000735 -169702 -265052 -539341
37899e39341P1966l26782j198494j088488M7318Q03945P95018R34537J170788
$$ -539341 -467375 -794157 -1992651 -3081139 -3033821 -2229876 -1434858 -500321 670467
37890F70467L61805j149334j370341N2661Q74118j57187j151699k20516J436560
$$ 670467 1032272 -117062 -1487403 -1434742 -560624 -717811 -1869510 -2090026 -653466
37881f53466J672460P74777L70626M28911j40323r57646p82414K7102Q1573m59745
$$ -653466 1018994 1793771 2164397 2593308 2452985 1495339 712925 740027 821600 361855
37871C61855k28908O80582P14808m22412j213857p57262J42374O06672P03143
$$ 361855 132947 813529 1528337 1105925 -107932 -865194 -722820 -116148 586995
37862E86995N64165Q1587l06710n4563J85770o55220j900837j612197M35703K128670
$$ 586995 1151160 1232747 926037 871474 1057244 402024 -1498813 -3111010 -2675307 -546637
37852e46637J924009O48148k65347o24823p28285l45785M99693R81483O60071
$$ -546637 1377372 2025520 1760173 1135350 407065 61280 560973 1542456 2202527
37843B202527J66382n6932n26810j424422j747178p85887N40129Q79934K32176
$$ 2202527 2368909 2311977 1785167 360745 -1386433 -2172320 -1632191 -752257 -520081
37834e20081l90004m25085p9548K79536L97447K45856J86905M32317L31602p59055
$$ -520081 -910085 -1335170 -1414718 -1135182 -737735 -491879 -304974 127343 458945 -300110
37824c00110j889979j324844P25024J938225J180750J02626L18385Q87959K51823
$$ -300110 -2190089 -3514933 -2789909 -851684 329066 431692 750077 1638036 1889859
37815A889859r68920j135106l29601J77829K61742N91372P42067p1692r79774
$$ 1889859 920939 -214167 -543768 -365939 -104197 487175 1229242 1157550 177776
37806A77776n72417M03282O1670j138291q63248R28660J503589q5924j217925
$$ 177776 -394641 8641 70311 -1067980 -1931228 -1002568 501021 415097 -802828
37797h02828q6195J259484O09270m95492L07461J599783L84920k415986k948640
$$ -802828 -889023 370461 979731 484239 791700 2391483 2776403 360417 -2588223
37788b588223o60360P91417l67255j244480N67382K813233K348133J70260o77570
$$ -2588223 -3248583 -2457166 -2824421 -4068901 -3501519 -688286 1659847 1830107 1152537
37779A152537j59086m96923j629898j344021L67204R04365m56897j199785J72144
$$ 1152537 993451 496528 -1133370 -2477391 -2110187 -1205822 -1662719 -2862504 -2690360
37770b690360J640509J087255m80867j102639r75591j156451j059350K23842J523397
$$ -2690360 -1049851 37404 -443463 -1546102 -2521693 -3678144 -4737494 -4513652 -2990255
37761b990255J151221r7469j22934R31999R80870m12524j385974q78424R5423
$$ -2990255 -1839034 -1936503 -2059437 -1127438 -146568 -559092 -1945066 -2823490 -2728067
37752b728067O68119J259584J868561J481574Q0299p96618m64530j14243m26899
$$ -2728067 -2059948 -800364 1068197 2549771 2630070 1833452 1368922 1254679 827780
37743H27780k85944P87983J085266n27856k188212j660957J33476P57459K16593
$$ 827780 541836 1329819 2415085 1887229 -300983 -1961940 -1828464 -1071005 -854412
37734h54412L93204J255612Q75347p37621j103589N83538J793787O26640j177033
$$ -854412 -461208 794404 1669751 932130 -171459 412079 2205866 2832506 1655473
37725A655473j205611k14822m72117j720359j645173J80872J564713J116199P3836
$$ 1655473 449862 235040 -237077 -1957436 -3602609 -3421737 -1857024 -740825 -666989
37716f66989L1486P18950J000755O78608K70573k6331k65344l82170n43482j093270
$$ -666989 -635503 83447 1084202 1762810 2033383 2007052 1741708 1359538 816056 -277214
37706b77214j627221j086906N50274J722700J323657K74764l7430J05931l62745
$$ -277214 -1904435 -2991341 -2441067 -718367 605290 880054 842624 948555 585810
37697E85810j070665o64589P57682J470267O01870o88795r32571p7568Q77142
$$ 585810 -484855 -1149444 -391762 1078505 1680375 991580 59009 -18559 858583
37688H58583J013519M8051j346183j791513q01535J42895m73906j540122o39066
$$ 858583 1872102 1920153 573970 -1217543 -2019078 -1876183 -2350089 -3890211 -4529277
37679d529277J933920L037136J320260o92843o38094J99109l11709j160499r7372
$$ -4529277 -2595357 441779 1762039 1069196 431102 630211 318502 -841997 -939369
37670i39369J985964K066320j68946j873597j524224o30898m07848Q9407J279324
$$ -939369 1046595 3112915 2943969 1070372 -453852 -1084750 -1492598 -1403191 -123867
37661a23867J410974m92065k298937j601826P03428J890095J305555N29412L42519
$$ -123867 1287107 795042 -1503895 -3105721 -2402293 -512198 793357 1322769 1665288
37652A665288r4868j083148j509783o54865O36157J194258Q72744J74814n21383
$$ 1665288 1570420 487272 -1022511 -1677376 -1041219 153039 1025783 1200597 679214
37643F79214q66912m92456L56462P34778J30162p29095p23556K65611J266897
$$ 679214 -187698 -680154 -323692 411086 541248 -187847 -911403 -645792 621105
37634F21105J363380N59942m02090p95493m95013j3791M8041l51041p16354p08871
$$ 621105 1984485 2544427 2142337 1346844 851831 838040 886081 535040 -181314 -890185
37624h90185n14754l46842K2847P55364J244908O68073p09184j553494j147270
$$ -890185 -1404939 -1751781 -1728934 -973570 271338 939411 230227 -1323267 -2470537
37615b470537l31476j75524l80342M2528R20269J003313j1957p77669j74123J037335
$$ -2470537 -2802013 -2977537 -3357879 -3315351 -2395082 -1391769 -1403726 -2181395 -2355518 -1318183
37605a318183J254080J82149q95391q37325L4484M69106j36784r13911n14699
$$ -1318183 -64103 118046 -777345 -1614670 -1580186 -1111080 -1247864 -2161775 -2676474
37596b676474R86407J801522P06917j008197j124321L14671J093675K25554p41890
$$ -2676474 -1690067 111455 818372 -189825 -1314146 -999475 94200 319754 -422136
37587d22136n03568K7483j64627j34575J015465J780640M42515j556651j323080
$$ -422136 -925704 -898221 -1062848 -1197423 -181958 1598682 2041197 484546 -838534
37578h38534R41050K136724J065061j11552N5904r8048j980678l567707k134170
$$ -838534 102516 2239240 3304301 3192749 3248653 3150605 1169927 -2397780 -4531950
37569d531950J314546K986298J280477j362701j844654k5953J709521J569687
$$ -4531950 -3217404 -231106 1049371 -313330 -2157984 -2183937 -474416 1095271
37561A095271J53719p78210o79042o33311j292244j451289J86738K484863K837155
$$ 1095271 1248990 470780 -208262 -841573 -2133817 -3585106 -3398368 -913505 1923650
37552A923650P12309j530385j866286r20913j97686K93454J202670J941920J405716
$$ 1923650 2635959 1105574 -760712 -1681625 -1879311 -1585857 -383187 1558733 2964449
37543B964449m3720r31372p59997m04262n28917q01545p49512m64521k93755m11660
$$ 2964449 2920729 1989357 1229360 825098 296181 -505364 -1254876 -1719397 -2013152 -2424812
37533b424812o98843o90084M9623J123802J433017O33047k19590j94163J14947
$$ -2424812 -3123655 -3813739 -3764116 -2640314 -1207297 -574250 -793840 -988003 -873056
37524h73056k82949r60272p15506L66789R45414M66166j91913l14208l17640o45601
$$ -873056 -1156005 -2116277 -2831783 -2464994 -1519580 -1053414 -1245327 -1559535 -1877175 -2522776
37514b522776p66841k1736J166832J670307J026856p4079o98628p63338r41931
$$ -2522776 -3289617 -3311353 -2144521 -474214 552642 478563 -220065 -983403 -1925334
37505a925334j408038j188045M42423K188129J814444n43365j813249n834K658494
$$ -1925334 -3333372 -4521417 -4078994 -1890865 -76421 -619786 -2433035 -2438869 219625
37496B19625K612447m7185j889798j205130J8491k37507r81807l22488J295471
$$ 219625 2832072 2784887 895089 -310041 -291550 -529057 -1510864 -1833352 -537881
37487e37881J862305P90380n66394r23018l61350J21415l42729j452793j477408
$$ -537881 1324424 2114804 1548410 625392 264042 385457 42728 -1410065 -2887473
37478b887473Q49456L763893L598142l47675l942455l187956N28583K638038J619946
$$ -2887473 -2038017 1725876 5324018 4976343 1033888 -2154068 -1625485 1012553 2632499
37469B632499m3849n37814p82650j442859j347858j88239K17649r12762j514392
$$ 2632499 2588650 2050836 1268186 -174673 -1522531 -1710770 -1493121 -2405883 -3920275
37460c920275m6041J700964J531118M64592O58816J460339P21848j097191j535739
$$ -3920275 -3966316 -2265352 -734234 -269642 389174 1849513 2571361 1474170 -61569
37451f1569l06476M65427Q6438Q6886Q68093Q34841l49154p62283L59451J115129
$$ -61569 -368045 97382 183820 270706 1138799 1973640 1624486 862203 1221654 2336783
37441B336783K66845o95439n03404m22582j516762k108528n50047J524308J561111
$$ 2336783 2603628 1908189 1404785 982203 -534559 -2643087 -3193134 -1668826 -107715
37432a07715J39162k71168N77404Q51759J44518j90593Q4835k33042j175002j325827
$$ -107715 31447 -239721 337683 1189442 1333960 1143367 1228202 995160 -179842 -1505669
37422a505669m74612p8855o12270p52223J54536R57652Q09891M44653M76612K73741
$$ -1505669 -1980281 -2059136 -2671406 -3423629 -3269093 -2311441 -1501550 -1056897 -580285 -306544
37412c06544m26243m53302R35319K408654K157831L55197j173294j289612o03058
$$ -306544 -732787 -1186089 -250770 2157884 4315715 4670912 3497618 2208006 1604948
37403A604948l30065p31910q81901J5331J270838J376167K36994m06344M04074
$$ 1604948 1274883 542973 -338928 -323597 947241 2323408 2560402 2154058 2558132
37394B558132J125395L9777j907341k495255j485213l10385O43761J891278K588791
$$ 2558132 3683527 3723304 1815963 -679292 -2164505 -2474890 -1831129 60149 2648940
37385B648940J372547p15409j210453k47592l30269j696624j597558P39671K238727
$$ 2648940 4021487 3306078 2095625 1848033 1517764 -178860 -1776418 -1036747 1201980
37376A201980R26260q08968l91841P27384Q8812j276317q97175N84525O30908
$$ 1201980 2128240 1319272 927431 1654815 1743627 467310 -429865 154660 785568
37367G85568o89239j040984M705N56997k3936k72710M47200Q99299L68043j69606
$$ 785568 96329 -944655 -939950 -382953 -406889 -679599 -232399 666900 1034943 865337
37357H65337J26099P25089Q21817L07077n60417j321505j283029l78993L73862
$$ 865337 991436 1716525 2538342 2845419 2285002 963497 -319532 -698525 -324663
37348c24663L22846K18665N69705K68319j328523k367096j003498J238261J531528
$$ -324663 -1817 216848 786553 1054872 -273651 -2640747 -3644245 -2405984 -874456
37339h74456K93035K98854J673415J572550p07076k135929p58287J300770J442852
$$ -874456 -581421 -282567 1390848 2963398 2256322 120393 -637894 662876 2105728
37330B105728L29784r1288R1259l17954j196644j745800k057020k152113j017278
$$ 2105728 2435512 2344224 2435483 2117529 920885 -824915 -2881935 -5034048 -6051326
37321f051326J407625K823224J476097p67552p77731J252706K230793Q24777r63328
$$ -6051326 -4643701 -1820477 -344380 -1111932 -1889663 -636957 1593836 2418613 1455285
37312A455285j155036l29628J3238k29654j97243L45430Q53070Q29199K16339
$$ 1455285 300249 -29379 -16141 -245795 -443038 -97608 755462 1584661 1801000
37303A801000n96428r09209l69723M11799M93366j59497p51266q95614q96382
$$ 1801000 1204572 295363 -74360 337439 830805 671308 -79958 -975572 -1871954
37294a871954p95852k19233N95871P50140J69573M8360J014880J825758J016213
$$ -1871954 -2667806 -2887039 -2291168 -1541028 -1371455 -1323095 -308215 1517543 2533756
37285B533756p79045j473738l37639J084318J074945k42630j420442j468186o22332
$$ 2533756 1754711 280973 -56666 1027652 2102597 1859967 439525 -1028661 -1650993
37276a650993J76229J52861o22298j206625q11521J13553M80203K72753N73295
$$ -1650993 -1474764 -1321903 -1944201 -3150826 -3962347 -3848794 -3368591 -3095838 -2522543
37267b522543J489864J472323k02018j564230m11979K100055K574112R7990k403419
$$ -2522543 -1032679 439644 237626 -1326604 -1738583 361472 2935584 3033574 630155
37258F30155k236833l08208Q10846M73722q5169k37993m70246q31532o25673K53976
$$ 630155 -1606678 -1914886 -1104040 -630318 -715487 -953480 -1423726 -2255258 -2880931 -2626955
37248b626955R58007Q77994L18342j57409l31938k40525q6235k12936o32275p54865
$$ -2626955 -1668948 -790954 -472612 -630021 -961959 -1202484 -1288719 -1501655 -2133930 -2888795
37238b888795j64848N97479P02159K38849P153K47873L53698j47725r27467j202255
$$ -2888795 -3053643 -2456164 -1754005 -1515156 -1508003 -1260130 -906432 -1054157 -1981624 -3183879
37228c183879m17306J153183K191304J379061p30343j710651j70886K092276K275714
$$ -3183879 -3601185 -2448002 -256698 1122363 392020 -1318631 -1489517 602759 2878473
37219B878473L47822j155964r36035l83109p28843r28098K49395J691098J441022
$$ 2878473 3226295 2070331 1134296 751187 22344 -905754 -656359 1034739 2475761
37210B475761j47771q06277K39856J131220J34452j930910k898446j926247l0154
$$ 2475761 2327990 1521713 1761569 2892789 3027241 1096331 -1802115 -3728362 -3758516
37201c758516J400278J655137P25047o72069j283795n96523J80152m21764j707751
$$ -3758516 -2358238 -703101 21946 -650123 -1933918 -2530441 -2350289 -2772053 -4479804
37192d479804j442822P09916K276457J611310M97839J156427K352159J354262
$$ -4479804 -5922626 -5212710 -2936253 -1324943 -827104 329323 2681482 4035744
37184D035744j195895j903211j78867N76571j422313l118501j343018K083094
$$ 4035744 2839849 936638 757771 1334342 -87971 -3206472 -4549490 -2466396
37176b466396L102801J394403J36284P08621J109361k03274j887638k024269p09792
$$ -2466396 636405 2030808 2167092 2875713 3985074 3781800 1894162 -130107 -839899
37167h39899O54748J193332Q47224n0589q21221q41636k84475J38052J49458p1944
$$ -839899 -185151 1008181 1855405 1804816 983595 141959 -142516 -4464 144994 73050
37157G3050n45748j170893j108284K19558J690537J512110k17458j434000r08471
$$ 73050 -472698 -1643591 -2751875 -2532317 -841780 670330 452872 -981128 -1889599
37148a889599K70468N59427N6415q6400N00720J023550O56247m41134j152922
$$ -1889599 -1619131 -1059704 -1003289 -1089689 -588969 434581 1090828 649694 -503228
37139e03228m94457J062032J705572L70782j653954k124171o53938R15545R76857
$$ -503228 -997685 64347 1769919 2140701 486747 -1637424 -2291362 -1375817 -398960
37130c98960p8934q10094n12240L72496J005431Q92280K00718m37094n65528k82110
$$ -398960 -477894 -1287988 -1800228 -1427732 -422301 469979 670697 233603 -331925 -614035
37120f14035R5106L65714L13983j58258n38158j70231M60416P2383j179620j284068
$$ -614035 -518929 -153215 160768 2510 -535648 -705879 -245463 -173080 -1352700 -2636768
37110b636768O46033K428011J612169q46329j801989k26711J779821K081849O91848
$$ -2636768 -1990735 437276 2049445 1203116 -598873 -825584 954237 3036086 3727934
37101C727934j112102k094717j440744N39998K012351J430654k78543q72384L3421
$$ 3727934 2615832 521115 -919629 -379631 1632720 3063374 2784831 1912447 1945868
37092A945868P15196K39205l50927r6967M27511L41890k92227r60866j269796
$$ 1945868 2661064 2900269 2549342 2452375 2879886 3221776 2929549 1968683 698887
37083F98887p98094M36953J339752Q56961l50461p73345l62908k88283o19573
$$ 698887 -99207 337746 1677498 2534459 2183998 1410653 1047745 759462 139889
37074A39889k71387P31233J084983N48763K81508M73872q1217j468540k045129
$$ 139889 -131498 599735 1684718 2233481 2514989 2988861 2907644 1439104 -606025
37065f06025j230069o14912j156727j450427k15409J449120J882739J281656P18909
$$ -606025 -1836094 -2451006 -3607733 -5058160 -5273569 -3824449 -1941710 -660054 58855
37056E8855K50933l73509m77304L44248R14780J22055j023414p36660P59748J530166
$$ 58855 309788 -63721 -541025 -196777 718003 840058 -183356 -920016 -160268 1369898
37046A369898P12634n47828r55031n39268j7138L50424P60649J165414J049454
$$ 1369898 2082532 1534704 579673 40405 23267 373691 1134340 2299754 3349208
37037C349208M8240j336727k019917j528981n09984K31991N82973O32875K60797
$$ 3349208 3397448 2060721 40804 -1488177 -1998161 -1766170 -1183197 -550322 -289525
37028b89525j41175K96854J180480N98698j853204l371157j514729J835442K877204
$$ -289525 -430700 -133846 1046634 1645332 -207872 -3579029 -5093758 -3258316 -381112
37019c81112J278570n2797k7711m61939j859867j994105O5612J864614J258531
$$ -381112 897458 844661 816950 355011 -1504856 -3498961 -3433349 -1568735 -310204
37010c10204m73565r86177j10346R31708J601540J759053R96132l53716j015910
$$ -310204 -783769 -1769946 -1880292 -948584 652956 2412009 3408141 3054425 2038515
37001B038515o21502k57837m70952m60698J30898N57912O24063R22386J068295
$$ 2038515 1417013 1159176 688224 227526 358424 916336 1540399 2462785 3531080
36992C531080R5730j116981o97588N72349j31885k681731l439974j016110J412645
$$ 3531080 3626810 2509829 1812241 2384590 2252705 -429026 -3869000 -4885110 -3472465
36983c472465J383191O78129J172784J259355m50985j687237n04928P04013o40236
$$ -3472465 -2089274 -1411145 -238361 1020994 570009 -1117228 -1622156 -918143 -1558379
36974a558379k171945l34858L053372L169431j43386k170955n55686J865461J975495
$$ -1558379 -3730324 -4065182 -1011810 2157621 2014235 -156720 -712406 1153055 3128550
36965C128550K91984j039729j264751q97925m67752j73878J87902R11550J394445
$$ 3128550 3420534 2380805 1116054 218129 -249623 -423501 -235599 675951 2070396
36956B070396N15277j182573j436586L02275J484440K89340j439210j329956k24764
$$ 2070396 2585673 1403100 -33486 268789 1753229 2042569 603359 -726597 -951361
36947i51361n9511k42195O61848J565948O92467p59719l81196J176614J268272
$$ -951361 -1010872 -1253067 -591219 974729 1667196 907477 526281 1702895 2971167
36938B971167k84219j288892j107217j096084j498469j046431M46468J732575
$$ 2971167 2686948 1398056 290839 -805245 -2303714 -3350145 -2903677 -1171102
36930a171102K121283J674265K27418j625106j865106J69935J831563P09486j486160
$$ -1171102 950181 2624446 2851864 1226758 -638348 -468413 1363150 2072636 586476
36921E86476j603907Q8468J083688J015636J146569R69405o35091k004915o75391
$$ 586476 -1017431 -928963 154725 1170361 2316930 3286335 2651244 646329 -29062
36912b9062J981971K238176k65274k158514j501281K87038J485599J809397J302331
$$ -29062 1952909 4191085 3925811 1767297 266016 553054 2038653 3848050 5150381
36903E150381K69391j94864J98765J49326n20250O1662J816533J635331o84367
$$ 5150381 5419772 5224908 5423673 5572999 5052749 5114411 6930944 8566275 7881908
36894G881908m48681L700432N650419J978280o81766L189132P125334M925697
$$ 7881908 7433227 11133659 16784078 18762358 18080592 21269724 28395058 33320755
36886C3320755O212894K2193297L9431134K9900821q294203m1147650m0290388
$$ 33320755 39533649 61726946 101158080 131058901 122764698 81617048 41326660
36879D1326660j7136840j875675l082755o218428k688972M51097j940016m094246
$$ 41326660 24189820 22314145 19231390 13012962 10323990 10775087 8835071 4740825
36871D740825j437064J542941L51769k091504j710339J51704N03358k89682o27063
$$ 4740825 3303761 4846702 5198471 3106967 1396628 1548332 2051690 1762008 1134945
36862A134945o83658q02919k53719P40358P43557j55371k87654M68514N60382
$$ 1134945 451287 -351632 -605351 135007 878564 723193 435539 904053 1464435
36853A464435p9606K3953P11856L34191p95441n68339R71959J300855l87662j884947
$$ 1464435 1384829 1408782 2120638 2454829 1659388 1091049 2063008 3363863 2976201 1091254
36843A091254j611482o17065j49065J17147N88087P59674M08504n1761o07712
$$ 1091254 -520228 -1137293 -1286358 -1169211 -581124 178550 587054 535293 -72419
36834g2419j300678j178198L57354J713139J048629n03514l24180J402492J976159
$$ -72419 -1373097 -2551295 -2193941 -480802 567827 64313 -259867 1142625 3118784
36825C118784O81611k89394J36557K15927j238740k615889k076025k16062J210835
$$ 3118784 3800395 3511001 3647558 3863485 2624745 8856 -2067169 -2283231 -1072396
36816a072396J569362J192742L92357l61557m16337J10553K92907k23361p68422
$$ -1072396 496966 1689708 2082065 1720508 1304171 1414724 1707631 1484270 715848
36807G15848q71326q52915q34697k14359J269708K607243K282207j1336k526655
$$ 715848 -155478 -1008393 -1843090 -2057449 -787741 1819502 4101709 4090373 1563718
36798A563718k739833j34922K614234K504904R3943j287280l29902O86971p3577
$$ 1563718 -1176115 -1311037 1303197 3808101 3902044 2614764 2284862 2971833 2898256
36789B898256j169725p32077L88489N28132J19074L12892O03763K44564J68021
$$ 2898256 1728531 996454 1384943 1913075 2032149 2345041 2948804 3193368 3361389
36780C361389J003118J153618m22618j616345m14503J457271J639991J507214
$$ 3361389 4364507 5518125 5095507 3479162 3064659 4521930 6161921 7669135
36772G669135L176753M605396L056430J334523L797324P679471P320788P323659
$$ 7669135 10845888 15451284 18507714 19842237 23639561 31319032 38639820 45963479
36764D5963479J9485909M0669074M5659682J5866023l0060689n1007737l1674649
$$ 45963479 65449388 106118462 151778144 167644167 137583478 86575741 54901092
36757E4901092q50070P565379j437501L794518L0800527M7176956K3914473k2839029
$$ 54901092 54051022 61616401 60178900 63973418 94773945 141950901 165865374 143026345
36749A43026345n0221173m0626532j6569774n057336o738934p334006l181691
$$ 143026345 92805172 52178640 35608866 30551530 23812596 16478590 13296899
36742A3296899j475449l750133l932818o03148Q02650j526821k719511k49472
$$ 13296899 11821450 8071317 4138499 3535351 4338001 2811180 91669 -157803
36734a57803J966028Q71231r33667n29439N65276J1633j187273j093908k25285
$$ -157803 1808225 2679456 1745789 1216350 1781626 1793259 605986 -487922 -713207
36725g13207J3804j65347r003K14742J85572K69846L73248j25120p91666m90376
$$ -713207 -699403 -864750 -873753 -659011 -473439 -203593 169655 44535 -747131 -1237507
36715a237507M28470N09908j07239J32800J145221J052799m78497j499420j028968
$$ -1237507 -809037 -299129 -406368 -273568 871653 1924452 1445955 -53465 -1082433
36706a082433m11267o33302q07747k70523J39544n6057R7004J113707J889499
$$ -1082433 -1493700 -2127002 -2934749 -3205272 -3065728 -3121785 -3024781 -1911074 -21575
36697b1575J437455L99394o2431J71176L39646j64113j114752j448424m36623
$$ -21575 1415880 1815274 1752843 1924019 2263665 2099552 984800 -463624 -900247
36688i00247Q51073N62647r36001j132963N35180J357276r1733j144365M63580
$$ -900247 -49174 513473 -422528 -1555491 -1020311 336965 245232 -899133 -435553
36679d35553K357214J404417q86741j085726L23862M45598n52821l50375N82996
$$ -435553 1921661 3326078 2439337 1353611 1677473 2123071 1570250 1219875 1802871
36670A802871m0520j501480j215258K25544J68945q26847n7340J765177J468899
$$ 1802871 1762351 260871 -954387 -728843 -559898 -1386745 -1444085 321092 1789991
36661A789991n75391r76975M59028O69900o68010p85142N33122O36680n69534
$$ 1789991 1214600 237625 696653 1366553 698543 -86599 446523 1083203 513669
36652E13669n09148P95995R22104J51793O68353J496875L79833p27973J091097
$$ 513669 4521 800516 1722620 1874413 2542766 4039641 4419474 3691501 4782598
36643D782598L020984J084402j171059J772456O051028M470645J041246M726935
$$ 4782598 7803582 8887984 7716925 9489381 15540409 20011054 21052300 25779235
36635B5779235J1067556R119969O634675K3265763N1318476N1174736M561978
$$ 25779235 36846791 45966760 52601435 75867198 127185674 178360410 182922388
36628A82922388n0385426o2919993l3295279m735246j904883q849225o614475
$$ 182922388 132536962 69616969 36321690 31586444 29681561 20832336 14217861
36621A4217861p19417k066710n856609l734338K24329o97746k571085N02117M313669
$$ 14217861 13498444 11431734 5575125 1840787 2065116 1367370 -1203715 -701598 3612071
36612C612071K365751k163729k561243j62225k55299j880919q35514J460265O85316
$$ 3612071 5977822 3814093 1252850 1090625 835326 -1045593 -1881107 -420842 264474
36603B64474j983411j963386O29489J855080R85241M89216O41398k07545j334007
$$ 264474 -1718937 -3682323 -3052834 -1197754 -212513 276703 918101 710556 -623451
36594f23451p53404N14088n7803j760448j693502L26416J819388J840405J544892
$$ -623451 -1376855 -862767 -920570 -2681018 -4374520 -4048104 -2228716 -388311 1156581
36585A156581J239619J73963j200676j578760r51007k09811M97654J033025K76522
$$ 1156581 2396200 2570163 1369487 -209273 -1160280 -1370091 -872437 160588 437110
36576D37110j894766l136674j600876J013522J867252J100754R17400J709394
$$ 437110 -1457656 -4594330 -6195206 -5181684 -3314432 -2213678 -1296278 413116
36568D13116J868917P73208n40334j269101j409224r48269j93055j51057j027899
$$ 413116 2282033 3055241 2514907 1245806 -163418 -1111687 -1304742 -1455799 -2483698
36559b483698j372570l01165P40298K79853n12216L22582K165583K707981J413283
$$ -2483698 -3856268 -4157433 -3417135 -3137282 -3649498 -3326916 -1161333 1546648 2959931
36550B959931j86661j030770j203636o62203N29369J140220R5894j449555j426717
$$ 2959931 2773270 1742500 538864 -123339 406030 1546250 1642144 192589 -1234128
36541a234128L8372R27690N58998K41615N51808K80575j168867k323071j726248
$$ -1234128 -1195756 -268066 290932 532547 1084355 1364930 196063 -2127008 -3853256
36532c853256p9433R17926Q90140P13890P09683K33433q74967j549251q48019
$$ -3853256 -3932689 -3014763 -2124623 -1410733 -701050 -467617 -1342584 -2891835 -3739854
36523c739854N33584J008188K54646l98199p5708L11513k66318j035563o28072
$$ -3739854 -3206270 -2198082 -1943436 -2341635 -2417343 -2105830 -2372148 -3407711 -4035783
36514d035783N00246O77128k20040n44054M26322J458796J469015Q79859L20357
$$ -4035783 -3535537 -2858409 -3078449 -3622503 -3196181 -1737385 -268370 611489 931846
36505I31846k97726p29533j86018R72109J063189l70632j532807j041118O6503
$$ 931846 634120 -95413 -281431 690678 1753867 1383235 -149572 -1190690 -1124187
36496a124187L47463K51282O79530Q35560l15452j566982q49709J449779K824799
$$ -1124187 -776724 -525442 154088 989648 674196 -892786 -1742495 -292716 2532083
36487B532083K132225O31105m36016j053982q47474J290420M689414O012202L000288
$$ 2532083 4664308 5295413 4859397 3805415 2957941 4248361 8937775 14949977 17950265
36478A7950265j831633l529652p45364K593816K317604j101480l988659m293064
$$ 17950265 16118632 12588980 11843616 14437432 16755036 15653556 11664897 7371833
36470G371833k995091j561603m37227m0622q11626j692588q65734J156948J600382
$$ 7371833 4376742 2815139 2377912 2337290 1525664 -166924 -1032658 124290 1724672
36461A724672k43536j459983j21182J389634L88364j410749q07764J399117K157736
$$ 1724672 1481136 21153 -100029 1289605 1677969 267220 -540544 858573 3016309
36452C016309J873603L326274N452194L876709j431715m557343j978165K199687
$$ 3016309 4889912 8216186 13668380 17545089 16113374 11556031 9577866 11777553
36444A1777553K422668p87132l081744k985866k327866j965186j080432J35159
$$ 11777553 14200221 13413089 10331345 7345479 5017613 3052427 1971995 2107154
36436B107154M66541L1401L8888M86053L02835n40996j060702j041233r95092
$$ 2107154 2573695 2605096 2643984 3130037 3432872 2891876 1831174 789941 -205151
36427b05151p38863K31760J281070J219769J39319p77817j010305r49216p62987
$$ -205151 -944014 -712254 568816 1788585 1927904 1150087 139782 -809434 -1572421
36418a572421l26381L8293k6257q7590L67964Q32268N37937j14122j08214N35436
$$ -1572421 -1898802 -1860509 -1886766 -1974356 -1606392 -774124 -236187 -350309 -458523 76913
36408G6913Q43182L97038l03779q05121j053761r35245l21819M68741Q81474P04079
$$ 76913 920095 1317133 1013354 208233 -845528 -1780773 -2102592 -1633851 -752377 -48298
36398d8298J15074n06196o15512K8229P21064N02434k57550j30411J000730J239118
$$ -48298 66776 -439420 -1054932 -1026703 -305639 196795 -60755 -191166 809564 2048682
36388B048682o35188k977718l181968j048977J135218J558858O76830J9596J76169
$$ 2048682 1413494 -1564224 -4746192 -5795169 -4659951 -3101093 -2424263 -2404667 -2228498
36379b228498L89861j19773q57977n69006Q40872J770171J066323k06128l86205
$$ -2228498 -1838637 -1958410 -2816387 -3385393 -2544521 -774350 291973 85845 -300360
36370c00360K57651L14211j89502r8955M52737L16256k13208K68618J592327K387348
$$ -300360 -42709 271502 82000 -16955 435782 752038 538830 807448 2399775 4787123
36360D787123K981859M670219O033050M004640n43150k669720o29635J083652
$$ 4787123 7768982 12439201 18472251 22476891 21933741 19264021 18634386 19718038
36352A9718038j314170m980161n127781k255534m22467p46490j100864p63905
$$ 19718038 18403868 13423707 8295926 6040392 5617925 4871435 3770571 3006666
36344C006666j004636j708505j271054K85912J186445P57091n9738n81441o12004
$$ 3006666 2002030 293525 -977529 -691617 494828 1251919 1192181 610740 -1264
36335a264K93984J674396J635768k25411j211885M47995K220284J423646L34122
$$ -1264 292720 1967116 3602884 3377473 2165588 2613583 4833867 6257513 6591635
36326F591635K415751N388190L989695r68682k838170N53524L194021J53852m959425
$$ 6591635 9007386 14395576 18385271 17416589 14578419 15131943 18325964 18479816 13520391
36317A3520391n803602k481659k27409j260927k618196j492177J051530K256251
$$ 13520391 7716789 5235130 5007721 3746794 1128598 -363579 687951 2944202
36309B944202J178384q05151j779966j048531M22123J167240Q29406K20182o3528
$$ 2944202 4122586 3317435 1537469 488938 911061 2078301 2907707 3127889 3064361
36300C064361k51596o12191r76616j169146j094613m47649P89561J752240J587064
$$ 3064361 2812765 2200574 1223958 54812 -1039801 -1487450 -697889 1054351 2641415
36291B641415O71316q8072o66182j352975j447221k68011R94107M89601j313942
$$ 2641415 3312731 3224659 2558477 1205502 -241719 -509730 484377 973978 -339964
36282c39964j947089m63679J295721J422009K16929p81564o52190M51289J543103
$$ -339964 -2287053 -2750732 -1455011 -33002 183927 -597637 -1249827 -798538 744565
36273G44565J386562j02450j316867j029276k86558n64452r86501J83212J975367
$$ 744565 2131127 2028677 711810 -317466 -604024 -1168476 -2154977 -1971765 3602
36264C602J741126k94398q98694R77397K216161L52275k490310k746176m67481
$$ 3602 1744728 1450330 551636 1529033 3745194 4097469 1607159 -1139017 -1606498
36255a606498J237376O91885p06417r87200K1016J042476J074596L43741k56530
$$ -1606498 -369122 322763 -383654 -1370854 -1349838 -307362 767234 1110975 854445
36246H54445m25115o80158j164188j109780j71728P19151Q39746Q62950J267279
$$ 854445 429330 -250828 -1415016 -2524796 -2696524 -1977373 -1137627 -274677 992602
36237I92602R58701p01789j958649j146360K09881l11856j718547j033861J533722
$$ 992602 1951303 1249514 -709135 -1855495 -1645614 -1957470 -3676017 -4709878 -3176156
36228c176156K633268J072643o44019o28441R1122L84240P00094R23917j37924
$$ -3176156 -542888 529755 -114264 -742705 -651583 -267343 432751 1356668 1218744
36219A218744j971209k215478m62450R47952R60236J179399K043616J492474q12116
$$ 1218744 -752465 -2967943 -3430393 -2482441 -1522205 -342806 1700810 3193284 2381168
36210B381168j887551l40741R48169k28470j500849k26017J735987J335078m82454
$$ 2381168 493617 152876 1101045 872575 -628274 -854291 881696 2216774 1734320
36201A734320r42731l73089p48661j319125j30583J529791P77892j564208j806466
$$ 1734320 791589 418500 -330161 -1649286 -1779869 -250078 527814 -1036394 -2842860
36192b842860N89838K085384O74292j368656j384950J34414J172085R64535n731
$$ -2842860 -2253022 -167638 506654 -862002 -2246952 -2112538 -940453 24082 18351
36183A8351j022181j279456m03947P09343Q03522O9622k46884J13942K63284q8919
$$ 18351 -1003830 -2283286 -2687233 -1977890 -1174368 -1104746 -1351630 -1237688 -974404 -1063323
36173a063323k42985J37237N85341O74655K70327o17390j235168k85877J885711
$$ -1063323 -1306308 -1169071 -583730 90925 361252 -256138 -1491306 -1777183 108528
36164A08528K500627k24952l779427l935183k57025L381065L767734J554127p31970
$$ 108528 2609155 2384203 -1395224 -5330407 -5587432 -2206367 1561367 3115494 2383524
36155B383524j648553j205288j01587O08702L40626r6383M77065J547661J272127
$$ 2383524 734971 -470317 -571904 36798 377424 281041 758106 2305767 3577894
36146C577894p84949k651877k307752r1326J810834J702476j29123j894632k129719
$$ 3577894 2792945 141068 -2166684 -2258010 -447176 1255300 1126177 -768455 -2898174
36137b898174j072653L7714P55922J459799J689423L27330j911207k326216l5775
$$ -2898174 -3970827 -3933113 -3177191 -1717392 -27969 299361 -1611846 -3938062 -3973837
36128c973837K059138J130403j462778k317189q46560P15556J147532J115505
$$ -3973837 -1914699 -784296 -2247074 -4564263 -5410823 -4695267 -3547735 -2432230
36120b432230P67336m94718j824261j378258O25960J815421J167685K89876N15809
$$ -2432230 -1664894 -2159612 -3983873 -5362131 -4736171 -2920750 -1753065 -1463189 -947380
36111i47380R30698K97486q37920j136673l97581M23166M36508l54788r74092
$$ -947380 -16682 280804 -557116 -1693789 -2091370 -1668204 -1231696 -1586484 -2560576
36102b560576l74226J037405J502520M01085n18840K20544J319591Q16978n97011
$$ -2560576 -2934802 -1897397 -394877 6208 -512632 -292088 1027503 1844481 1247470
36093A247470r17177l84069p09304j493417q07941R17941J196743j32640n33217
$$ 1247470 330293 -53776 -763080 -2256497 -3064438 -2146497 -949754 -1082394 -1615611
36084a615611N89803P53575q67175j482507N13302K351417J189927j320294j816188
$$ -1615611 -1025808 -272233 -1139408 -2621915 -2108613 242804 1432731 112437 -1703751
36075a703751l21619O06148K44139R5026Q02729J399792J192146L32392r24611
$$ -1703751 -2025370 -1419222 -1175083 -1080057 -277328 1122464 2314610 2647002 1722391
36066A722391j853306j110359J232532K651382J270814j079269j288883M59367
$$ 1722391 -130915 -1241274 -8742 2642640 3913454 2834185 1545302 2004669
36058B004669J239996j569j273154j062137k92092j65162m25637o13279j029136
$$ 2004669 3244665 3243096 1969942 907805 615713 450551 24914 -588365 -1617501
36049a617501j534644j146454K33573J241611J081218O21981O16750M41934l22858
$$ -1617501 -3152145 -4298599 -4065026 -2823415 -1742197 -1120216 -503466 -61532 -384390
36040c84390p15215j71006Q3270q53940j464513k3369K090799J883479p43833
$$ -384390 -1099605 -1270611 -1187341 -2041281 -3505794 -3529163 -1438364 445115 -298718
36031b98718k569975j501798Q97451K069640J540686L20181q47315j344986n11184
$$ -298718 -2868693 -4370491 -3473040 -1403400 137286 457467 -389848 -1734834 -2246018
36022b246018R42720R25074j012099k231953n81359K084627K436704N99083l95307
$$ -2246018 -1303298 -378224 -1390323 -3622276 -4203635 -2119008 317696 916779 521472
36013E21472M83899J127810K59081o56597m06397r9949p86214j324848l87425
$$ 521472 1005371 2133181 2392262 1735665 1329268 1229319 443105 -881743 -1269168
36004a269168J119581J345451O1937j387434j781631q11827P76270J312055j62597
$$ -1269168 -149587 1195864 1257801 -129633 -1911264 -2723091 -1946821 -634766 -797363
35995g97363k029250j664399P26286K117149J170371K0807L64945P42973l32786
$$ -797363 -2826613 -4491012 -3764726 -1647577 -477206 -456399 -91454 651519 318733
35986C18733j367182n78196P82794O83521j09472K60444J133729O32177p46906
$$ 318733 -1048449 -1626645 -843851 -160330 -269802 -9358 1124371 1756548 1009642
35977A009642j064080m88431p20479j546137j088022Q22995K300815K194060Q87980
$$ 1009642 -54438 -542869 -1263348 -2809485 -3897507 -3074512 -773697 1420363 2308343
35968B308343j069135k790463k450536M28788K991529K256752m97868j574561
$$ 2308343 1239208 -1551255 -4001791 -3573003 -581474 1675278 1177410 -397151
35960c97151k33448J054331J011447O54042L89742m00878j071525m75299K43571
$$ -397151 -630599 423732 1435179 2089221 2478963 2078085 1006560 531261 774832
35951G74832p85941k212108j125944J554888J914315m72163j683940J3224J612008
$$ 774832 -11109 -2223217 -3349161 -1794273 120042 -352121 -2036061 -2022837 -410829
35942d10829Q28457n28259n98224m98346j059493o99311R55056J325027n00151
$$ -410829 417628 -110631 -708855 -1207201 -2266694 -2966005 -2010949 -685922 -1186073
35933a186073j324711Q36839K764359J065971k050902k222659L02346J627263
$$ -1186073 -2510784 -1673945 1090414 2156385 105483 -2117176 -1814830 -187567
35925a87567L72636j131165j016569J12974R54390P81684n10887j776113j081491
$$ -187567 185069 -946096 -1962665 -1849691 -895301 -113617 -624504 -2400617 -3482108
35916c482108J473177K927152J347710j184710j629532k50377N93684K88773k9684
$$ -3482108 -2008931 918221 2265931 1081221 -548311 -798688 -205004 83769 54085
35907E4085k8064j80706k22678J74193J78372p78797j530428r92176j00489q5611
$$ 54085 26021 -154685 -377363 -203170 -24798 -803595 -2334023 -3326199 -3426688 -3512299
35897c512299l41706P0881M75360J34857j6783P30178J145796L90194n5962Q68958
$$ -3512299 -3854005 -3783124 -3307764 -3172907 -3189690 -2459512 -1313716 -923522 -979484 -110526
35887a10526J451414K26898j077896n99418K19629l80361p37924R44826K206212
$$ -110526 1340888 1567786 489890 -109528 110101 -270260 -1008184 -63358 2142854
35878B142854P7295k918678k085748J506908K434323k06203j618895L51784J914002
$$ 2142854 2220149 -698529 -2784277 -1277369 1156954 950751 -668144 -316360 1597642
35869A597642K08030k074471j710925p967L31593k19147J45799Q77918L85598
$$ 1597642 1805672 -268799 -1979724 -1987691 -1656098 -1875245 -1729446 -851528 -465930
35860d65930q48067j152984l69566L98644O27832M72379J20643O8663P77366J445074
$$ -465930 -1313997 -2466981 -2836547 -2437903 -1810071 -1337692 -1217049 -1148386 -371020 1074054
35850A074054P67795o20671n82050J040325J805049M87387j035813j004099l55106
$$ 1074054 1841849 1221178 639128 1679453 3484502 3971889 2936076 1931977 1576871
35841A576871m69956p12900j36617M36652O1556m26161j50199q5298j094972j752612
$$ 1576871 1106915 394015 257398 694050 755606 329445 179246 93948 -1001024 -2753636
35831b753636n09548J332283J380965p9222p00267Q8580M63768n44056j532374
$$ -2753636 -3263184 -1930901 -549936 -629158 -1329425 -1240845 -777077 -1321133 -2853507
35822b853507j019066M83534J408518J035557q3667q57559n23550O68192J576241
$$ -2853507 -3872573 -3389039 -1980521 -944964 -1028631 -1886190 -2409740 -1741548 -165307
35813a65307J401925O11646J66649K12020J64325k46453p30973r97390r39296
$$ -165307 1236618 1848264 2014913 2226933 2391258 2144805 1413832 416442 -522854
35804e22854n11785M9653K14343j19592l03884R6043N31694L66186q584J43620
$$ -522854 -1034639 -984986 -770643 -890235 -1194119 -1098076 -566382 -200196 -208780 -65160
35794f5160N53209L69606l29195o66231n50256p79208j295621q05903J049247
$$ -65160 488049 857655 528460 -137771 -688027 -1467235 -2762856 -3568759 -2519512
35785b519512K427620J512892p85360j880435q84284O69979J411466J616847J667389
$$ -2519512 -91892 1421000 635640 -1244795 -2129079 -1459100 -47634 1569213 3236602
35776C236602R18683p58660j869322j234409J15103N44758K36796K62494L35203
$$ 3236602 4155285 3396625 1527303 292894 407997 952755 1189551 1452045 1787248
35767A787248l26452p87933L17011J788513J095097j395809k514070j067066O24498
$$ 1787248 1460796 672863 989874 2778387 3873484 2477675 -36395 -1103461 -478963
35758d78963P92907N47551Q33137M18428j151538j757848k69938R84859L7840
$$ -478963 313944 861495 1694632 2113060 961522 -796326 -1066264 -81405 -43565
35749d3565j186445l11852J078755K46369j542608r37331J641086K476779N32819
$$ -43565 -1230010 -1541862 -463107 -216738 -1759346 -2696677 -1055591 1421188 1954007
35740A954007j220647p69480L73602L55312l76508o20547k00484N80919J320839
$$ 1954007 733360 -36120 337482 692794 316286 -304261 -504745 76174 1397013
35731A397013J060851o26243k157684j647160J54344R52977N71577P35614J378307
$$ 1397013 2457864 1831621 -326063 -1973223 -1818879 -865902 -294325 441289 1819596
35722A819596M10690k273152l715654k061268P09813J648547N80815l50165L41599
$$ 1819596 2230286 -42866 -3758520 -5819788 -5109975 -3461428 -2880613 -3230778 -2889179
35713b889179J930267K295898K40128k517588k686182J65983K287073Q73577j561229
$$ -2889179 -958912 1336986 1577114 -940474 -3626656 -3460673 -1173600 -300023 -1861252
35704a861252j095377J272693J507755m65168p81052J416965K407188L47932j720946
$$ -1861252 -2956629 -1683936 -176181 -641349 -1422401 -5436 2401752 2749684 1028738
35695A028738j206445K08537L67879K22229R81053J274584J673j062589l27423
$$ 1028738 -177707 30830 398709 620938 1601991 2876575 2878248 1815659 1488236
35686A488236O68067J13536p87137j63842J120603J160140J96672l86753n47460
$$ 1488236 2156303 2269839 1482702 1318860 2439463 3599603 3796275 3409522 2862062
35677B862062q50822r59924p42006r78012j349973j65161K150239K309146o70157
$$ 2862062 2011240 1051316 309310 -668702 -2018675 -2183836 -33597 2275549 1605392
35668A605392k759761o29451K847128K733906n88222k530996j323788M93731R60432
$$ 1605392 -1154369 -1783820 1063308 3797214 3208992 677996 -645792 -152061 808371
35659H08371Q85189J025966O48410n11758j504640j774984j493919m99130J085306
$$ 808371 1693560 2719526 3367936 2856178 1351538 -423446 -1917365 -2416495 -1331189
35650a331189J780733N63398r76221p51458L38135j08874j650584j423549J086168
$$ -1331189 449544 1012942 36721 -714737 -376602 -485476 -2136060 -3559609 -2473441
35641b473441K963886K184861J42009j050677j253581j163894o35638M68805J220075
$$ -2473441 490445 2675306 2817315 1766638 513057 -650837 -1286475 -817670 402405
35632D02405O69936q59101k176569k246464p39149J503357K667528J761468N2363
$$ 402405 1072341 213240 -1963329 -4209793 -4948942 -3445585 -778057 983411 1035774
35623A035774m74131K27786N78118J8053m23465k15253j53854p07465j087027
$$ 1035774 561643 789429 1367547 1385600 962135 746882 593028 -114437 -1201464
35614a201464n72384L71546P98829L16271p10477j277532l73920J575443K471632
$$ -1201464 -1773848 -1402302 -603473 -287202 -997679 -2275211 -2649131 -1073688 1397944
35605A397944J060414r54609j067418L08414N45339q96836j573906j30460J418974
$$ 1397944 2458358 1503749 436331 744745 1290084 393248 -1180658 -1311118 107856
35596A07856R89432k47224K5995J400961J501990r6312j225101m96429Q51857
$$ 107856 1097288 850064 876059 2277020 3779010 3682698 2457597 1961168 2813025
35587B813025J116697L80747l05208n40793k65511Q80436K438424K457995j47279
$$ 2813025 3929722 4310469 4005261 3464468 3198957 4079393 6517817 8975812 8828533
35578H828533l191737l384093q04581J166314P28314k14871J77030O78153k30294
$$ 8828533 5636796 2252703 1448122 2614436 3342750 3127879 3304909 3983062 3752768
35569C752768j165482k76985J047426K29354j989561k579193j052828K98894O55316
$$ 3752768 2587286 2310301 3357727 3587081 1597520 -981673 -2034501 -1735607 -1080291
35560a080291J368448K277390J286655j492340k917041j519435L15146M15994
$$ -1080291 288157 2565547 3852202 2359862 -557179 -2076614 -1761468 -1345474
35552a345474j53149P7597K73453m25264p30655L02158J057713N5220j292578
$$ -1345474 -1498623 -1421026 -1147573 -1572837 -2303492 -2001334 -943621 -888401 -2180979
35543b180979r85636M41169J332914J543440J499865O38528r81144j517558j60471
$$ -2180979 -3166615 -2725446 -1392532 150908 1650773 2289301 1308157 -209401 -369872
35534c69872R13585j26826j571726j068726L37931K51214p42765k88861J395437
$$ -369872 543713 416887 -1154839 -2223565 -1885634 -1634420 -2377185 -2666046 -1270609
35525a270609J909507P00166n34784r73276j188299j013620J30518J139856M15593
$$ -1270609 638898 1339064 804280 -168996 -1357295 -2370915 -2240397 -1100541 -684948
35516f84948j069186q42832R85155J720302M26817o67932J59004J637316J734288
$$ -684948 -1754134 -2596966 -1611811 108491 535308 -132624 26380 1663696 3397984
35507C397984L57470j225391k117697k037357j047592J91399P70762N96022M05148
$$ 3397984 3755454 2530063 412366 -1624991 -2672583 -2481184 -1710422 -1114400 -709252
35498g09252N69478O24572J39160n69547p79884k09080M73843K00797r55165j336806
$$ -709252 -139774 484798 623958 54411 -725473 -934553 -460710 -259913 -1215078 -2551884
35488b551884O7104J603786J072761o32942o72448J015478J468314j77803j087472
$$ -2551884 -2484780 -880994 191767 -441175 -1113623 -98145 1370169 1192366 104894
35479A04894K63178J357459K33793r57866m9117R97884k38730j884494r58067
$$ 104894 368072 1725531 1959324 1001458 952341 1950225 1711495 -172999 -1131066
35470a131066J170093J132579n19560o08362P71489O69401j015659j265494M95490
$$ -1131066 39027 1171606 652046 43684 815173 1484574 468915 -796579 -301089
35461c01089J336546O3541q66638O3135Q62717j93582j520569j025547N17567
$$ -301089 1035457 1098998 232360 295495 1158212 964630 -555939 -1581486 -1063919
35452a063919R96175J67066n55396m92515k88850m59524m57889M81088J809536
$$ -1063919 -67744 99322 -456074 -948589 -1237439 -1696963 -2154852 -1673764 135772
35443A35772J677557o35483k801556j825835J518539L068383R44063j805285j769226
$$ 135772 1813329 1177846 -1623710 -3449545 -1931006 1137377 2081440 276155 -1493071
35434a493071K27050J216276M72853o08206j110114p74264O54727K233698J941533
$$ -1493071 -1266021 -49745 423108 -185098 -1295212 -2069476 -1414749 818949 2760482
35425B760482j24843j083128K33722J070983n10571k038241r71719O74176l8237
$$ 2760482 2635639 1552511 1786233 2857216 2346645 308404 -663315 10861 -27376
35416b7376j687037j222583N26257P01314k65322J41721J587622J689590M83864
$$ -27376 -1714413 -2936996 -2410739 -1709425 -1974747 -1833026 -245404 1444186 1928050
35407A928050r4527L6713k65196m48416L23320O32285o35611j429142j07710Q70992
$$ 1928050 1833523 1870236 1605040 1156624 1479944 2112229 1476618 47476 -60234 810758
35397H10758p34010k051773J87620L089169J936775j444155j533657J455598K221873
$$ 810758 76748 -1975025 -1787405 1301764 3238539 1794384 260727 1716325 3938198
35388C938198m28584k198077j087438J33986k37390n53282j0714J67695Q3199
$$ 3938198 3509614 1311537 224099 358085 120695 -432587 -443301 -275606 -192407
35379a92407Q66493J349423j43992j616877k32783J980366J067106j614571j540036
$$ -192407 674086 2023509 1879517 262640 29857 2010223 3077329 1462758 -77278
35370g7278P83737P90196j642789j965302P47388K365339J029026o84443j294471
$$ -77278 706459 1496655 -146134 -2111436 -1364048 1001291 2030317 1345874 51403
35361E1403j845527j761675M77707K780975J869792m21232J55042K424281J887623
$$ 51403 -1794124 -3555799 -3078092 -297117 1572675 1151443 1306485 3730766 5618389
35352E618389p06606q94229O65053l84381k824096j482133K342401K077736k268012
$$ 5618389 4911783 4017554 4682607 4298226 1474130 -8003 2334398 4412134 2144122
35343B144122l690343m66612J482696j12774n87908J699224K275598k24057j425351
$$ 2144122 -1546221 -2012833 -530137 -642911 -1230819 468405 2744003 2519946 1094595
35334A094595m6677Q4772j343228k11590K780572K156125j590437k005692J180706
$$ 1094595 1047918 1132690 -210538 -422128 2358444 4514569 2924132 918440 2099146
35325B099146J391715j823053j531218K837595L596890o13504j944832J560946
$$ 2099146 3490861 1667808 136590 2974185 6571075 5957571 4012739 5573685
35317E573685K062090k682952m387603J73168K977754p2277j999940J067693K724940
$$ 5573685 7635775 4952823 565220 738388 3716142 3643865 1643925 2711618 5436558
35308E436558k64734j477889J707717K435751j474280k462586J436627J822459
$$ 5436558 5171824 3693935 5401652 7837403 6363123 3900537 5337164 7159623
35300G159623l174741l917750K099522M383027o36446k683637J792551K475789
$$ 7159623 3984882 67132 2166654 6549681 5913235 3229598 5022149 7497938
35292G497938l188794l287148M479712N897614k291868m060996N063326P442325
$$ 7497938 4309144 1021996 5501708 11399322 9107454 5046458 10109784 17552109
35284A7552109k666759n972171M674306Q513595k207941l880811J2116687J7473036
$$ 17552109 14885350 8913179 13587485 22101080 19893139 16012328 28129015 45602051
35276D5602051J086746k768214K1611580L3863188J5642950K4911138R6085885
$$ 45602051 46688797 43920583 65532163 99395351 115038301 139949439 236035324
35269B36035324J43738403P2729083n1417364p1226816K6206083P8907087q854458
$$ 236035324 379773727 452502810 401085446 329858630 356064713 434971800 426117342
35262D26117342j27043479j32872152n1851717o493355k4855136l5521727r659331
$$ 426117342 299073863 166201711 114349994 107856639 83001503 47479776 37820445
35255C7820445O593406q487484j8394991l460175P728057k045841r895979j171742
$$ 37820445 44413851 35926367 17531376 14071201 21799258 19753417 9857438 8685696
35247H685696N275907k425397p367209Q01387O600493J80575n188070q98659J758120
$$ 8685696 13961603 11536206 4168997 4970384 11570877 11751452 6563382 5664723 7422843
35238G422843l416255n093234J557934M402987j462799l759150K689071N586553
$$ 7422843 4006588 -1086646 471288 4874275 3411476 -347674 2341397 7927950
35230G927950r08680m914931K95607M102700l92515l968453l91067J958693j997989
$$ 7927950 7019270 2104339 2399946 6502646 6110131 2141678 1750611 3709304 1711315
35221A711315l551636J860738M557801q81703m594559K35894M869089J867253
$$ 1711315 -1840321 20417 4578218 3696515 -898044 -662150 4206939 6074192
35213F074192j705073P34836K592422j832659n119090p36798M026712J330406
$$ 6074192 4369119 5103955 7696377 5863718 744628 7830 4034542 5364948
35205E364948l194418j626109K224406J572923q67278k32542M20980k091877k758230
$$ 5364948 2170530 544421 2768827 4341750 3474472 3241930 3662910 1571033 -1187197
35196a187197J899521N112799J130263l856505k304341J877976J476998j312142
$$ -1187197 712324 5825123 6955386 3098881 794540 2672516 4149514 2837372
35188B837372q01080J070043j60784k023569n63214J160122p02404k396091N45851
$$ 2837372 2036292 3106335 2945551 921982 358768 1518890 816486 -1579605 -1033754
35179a033754M205462K962951o57036j365008m40394j378002k097891K84496K586511
$$ -1033754 3171708 6134659 5477623 4112615 3672221 2294219 196328 480824 3067335
35170C067335J241261q52235l06162K56485j410013j445955K275231M337603J313991
$$ 3067335 4308596 3456361 3150199 3406684 1996671 550716 2825947 7163550 8477541
35161H477541j227936R45512K599899l14876k003438J725217M316535J333449
$$ 8477541 7249605 8195117 10795016 10480140 8476702 10201919 14518454 15851903
35153A5851903L41967N903384Q485620K904596K059862J3823564K2590396J9500278
$$ 15851903 16193870 22097254 30582874 33487470 35547332 49370896 71961292 91461570
35145I1461570L0576757P4760697J07499689O2422886m2109230r6681970l5103009
$$ 91461570 122038327 196799024 304298713 366721599 324612369 227930399 192827390
35138A92827390O9258716Q9998365M676571q8890744j04630585n9747252k2100245
$$ 192827390 262086106 352084471 356761042 267870298 163239713 103492461 81392216
35131H1392216j6735201j8773212r923470p35637k133514o889400n790413k202583
$$ 81392216 64657015 45883803 35960333 35224696 33091182 26201782 20411369 18208786
35123A8208786k289859l673791j830846R12395K15761k219695k057116J04752
$$ 18208786 15918927 12245136 10414290 11326685 11542446 9322751 7265635 7370387
35115G370387N13903r74259j369845k13148J99332n85370q84285p55538j773131
$$ 7370387 7884290 6910031 5540186 5327038 5526370 4941000 4056715 3301177 1528046
35106A528046k963656j465698K121825L496761J111429j316692o96438R76291
$$ 1528046 -1435610 -2901308 -779483 2717278 3828707 2512015 1815577 2791868
35098B791868O49163q21324r81690k49735m89146j154999m72489R41498J105621
$$ 2791868 3441031 2619707 1638017 1388282 899136 -255863 -728352 213146 1318767
35089A318767L28429M63229J174897L66884j802047k631176j060167P69905R65174
$$ 1318767 1647196 2110425 3285322 3652206 1850159 -781017 -1841184 -1071279 -106105
35080a06105L71004M71645R15240O59468J11255M00456J214747J004400n73380
$$ -106105 264899 736544 1651784 2311252 2422507 2822963 4037710 5042110 4468730
35071D468730j730970q55460R77231J090140j080844k820937j668102J116611
$$ 4468730 2737760 1882300 2859531 3949671 2868827 47890 -1620212 -503601
35063e03601K262010R04068p47639r17833k54113K927j56042j76750J02087O79111
$$ -503601 1758409 2662477 1914838 997005 742892 745819 589777 413027 515114 1194225
35053A194225J308580J106016l41996j716415j570701p26543q35083j176121J04223
$$ 1194225 2502805 3608821 3266825 1550410 -20291 -746834 -1581917 -2758038 -2653815
35044b653815J954602J410284j076673j554048J011301K620371O37350j914066
$$ -2653815 -699213 711071 -365602 -1919650 -908349 1712022 2349372 435306
35036D35306j403793P80390J289339M45535P10018J688257R52719j303587k370929
$$ 435306 -968487 -188097 1101242 1546777 2256795 3945052 4897771 3594184 1223255
35027A223255j342651k4792L07742K38564K98594J18735l80726p65725r90971
$$ 1223255 -119396 -144188 163554 402118 700712 819447 438721 -327004 -1317975
35018a317975j138772p14122M82261J459139J315426O31541L91875M98562N05796
$$ -1317975 -2456747 -3170869 -2688608 -1229469 85957 717498 1109373 1607935 2113731
35009B113731O27881Q10285J79530j277540j998054j205767l47994o39223r60859
$$ 2113731 2741612 3551897 3731427 2453887 455833 -749934 -1097928 -1737151 -2698010
35000b698010k7699J138285J028354L59536O63135J445777J086858l74984j470109
$$ -2698010 -2725709 -1587424 -559070 -199534 463601 1909378 2996236 2621252 1151143
34991A151143j559829j093147l95696K83237M21672J60708L95525R07578J54515
$$ 1151143 -408686 -1501833 -1897529 -1614292 -1192620 -1031912 -636387 271191 425706
34982D25706j851000k621390q42253J291407J427343N21736N68337J003687K08994
$$ 425706 -1425294 -4046684 -4888937 -3597530 -2170187 -1648451 -1080114 -76427 132567
34973A32567j109737j035441K27217Q71679M78221J05153J64517K27787J89260
$$ 132567 -977170 -2012611 -1785394 -913715 -435494 -330341 -165824 61963 251223
34964B51223P2866l26978n53638J91139J061538K92436j254266n55809K262997
$$ 251223 324089 -2889 -556527 -365388 696150 988586 -265680 -821489 1441508
34955A441508L148324O92409j146502J01856R02122j676922l874826j431559K564603
$$ 1441508 4589832 5282241 4135739 4237595 5139717 3462795 -412031 -1843590 721013
34946G21013K751557P58519J749762M403428K883556k353395m486813j397331
$$ 721013 3472570 4231089 5980851 10384279 13267835 10914440 6427627 5030296
34938E030296J557718J160422O68924K198330K387813q21346l651603k783621
$$ 5030296 6588014 7748436 8417360 10615690 13003503 12182157 8530554 5746933
34930E746933o76284n25334q47859O01360J846010K41329k374748k558350o96985
$$ 5746933 5070649 4545315 3697456 4298816 6144826 6386155 4011407 1453057 756072
34921G56072M66603N28084Q36562J075667Q1455j250457j110190J18986N45858
$$ 756072 1222675 1750759 2587321 3662988 3744443 2493986 1383796 1502782 2048640
34912B048640k98356j340198j784850j304690L44293K283331K534219O60863j151728
$$ 2048640 1750284 410086 -1374764 -2679454 -2335161 -51830 2482389 3143252 1991524
34903A991524j150201m10797o40978j473358j691378j320986p17256N80706K226626
$$ 1991524 841323 430526 -210452 -1683810 -3375188 -4696174 -5413430 -4832724 -2606098
34894b606098K226801j65506k461985k055568K12138J735238J838714J514650
$$ -2606098 -379297 -544803 -3006788 -5062356 -4850218 -3114980 -1276266 238384
34886B38384R36147k26870j045150l41988J173561J823644J331302M99658n08842
$$ 238384 1174531 947661 -97489 -439477 734084 2557728 3889030 4388688 3879846
34877C879846j650962j816348l73033R69714K33315j508402j438703N81765J586961
$$ 3879846 2228884 412536 39503 1009217 1242532 -265870 -1704573 -1122808 464153
34868D64153k9149k061034j692872O12994K047618J403653L48315N75532J156598
$$ 464153 435004 -1626030 -3318902 -2705908 -658290 745363 1093678 1669210 2825808
34859B825808M4773k296085k779243q1356K758948K176239p88119k001643l10680
$$ 2825808 2870581 574496 -2204747 -2286103 472845 2649084 1860965 -140678 -451358
34850d51358J273834P81050K2751P25266J347937J43414j354424q16694Q61064
$$ -451358 822476 1603526 1626277 2351543 3699480 3842894 2488470 1671776 2532840
34841B532840J065602k93008r98544k40122O02982N27770p4614p23663j161388
$$ 2532840 3598442 3305434 2306890 2066768 2669750 3197520 3122906 2399243 1237855
34832A237855p14603P48564J737976J031075K7626Q66162K663340K429737j80351
$$ 1237855 523252 1271816 3009792 4040867 4068493 4934655 7597995 10027732 9847381
34823I847381k027979j242316L7595o28201j814681k82745L817760O320331L961887
$$ 9847381 7819402 6577086 6614681 5986480 4171799 3889054 7706814 14027145 17989032
34814A7989032j604553n485598m646196p42770K039222J513841n93973j271474
$$ 17989032 16384479 10898881 6252685 5509915 7549137 9062978 8469005 7197531
34806G197531K5009J098904K17235j652256k341303j331766j24423m2550o89211
$$ 7197531 7222540 8321444 8538679 6886423 4545120 3213354 3088931 3046381 2357170
34797B357170q77100l31270K00539J99626l3264r5859j10441k97633m03795j8668
$$ 2357170 1480070 1148800 1349339 1548965 1515701 1419842 1309401 1011768 607973 589305
34787E89305P36967J192803P73590l77125j295913r59970M32176J317641O85760
$$ 589305 1326272 2519075 3292665 2915540 1619627 659657 1091833 2409474 3095234
34778C095234l26507l5074J015709Q37077m76723o03533R08147J360068o23814
$$ 3095234 2768727 2733653 3749362 4586439 4109716 3506183 4414330 5774398 5150584
34769E150584k322614j196764P56006L24970j445389j211480P77689J334067J18677
$$ 5150584 2827970 1631206 2387212 2712182 1266793 55313 833002 2167069 2285746
34760B285746p8700J149435J030577q86685j404211N86570J795853K03743j421499
$$ 2285746 2207046 3356481 4387058 3500373 2096162 2682732 4478585 4682328 3260829
34751C260829n13657Q70049M3259j438270p85299R80052J050279k50981n70995
$$ 3260829 2747172 3617221 3660480 2222210 1436911 2416963 3467242 3216261 2645266
34742B645266J05454L1744o56861n30367J3619k66208m39536J002409K535670
$$ 2645266 2750720 2782464 2125603 1595236 1608855 1342647 903111 1905520 4441190
34733D441190J481308j165201j857015k12512N80062o65222j423067k70297O78902
$$ 4441190 5922498 4757297 2900282 2687770 3267832 2602610 1179543 909246 1588148
34724A588148j84907j083977j95494J074680O39602p02009q11664K53619P21145
$$ 1588148 1403241 319264 123770 1198450 1838052 1136043 324379 577998 1299143
34715A299143J50916k31080J79677O04669M04344J07K0323L20607J85410o92958
$$ 1299143 1450059 1218979 1398656 2003325 2407669 2407776 2428099 2748706 2934116 2241158
34705B241158j596688j425200j22106J124675J583081J956921K688358K437611
$$ 2241158 644470 -780730 -902836 221839 1804920 3761841 6450199 8887810
34697H887810O9634k669139k868161o46464R32783L91595m20285J43039J042443
$$ 8887810 8957444 6288305 3420144 2773680 3706463 4098058 3677773 3820812 4863255
34688D863255J007404Q74618J495129J525382k61368k187813j923023l19678j11310
$$ 4863255 5870659 6745277 8240406 9765788 9504420 7316607 5393584 5073906 4962596
34679D962596j476332j966315p93048n7408r53169j589193j05767K219139K868029
$$ 4962596 3486264 1519949 726901 669493 -283676 -1872869 -1978636 240503 3108532
34670C108532J621538K71255k47682m98798p85752o14695L3385M00628J74901
$$ 3108532 4730070 5001325 4753643 4254845 3469093 2854398 2887783 3288411 3463312
34661C463312j76773m73672r98057j345179m68365J468312K521723J278675j125830
$$ 3463312 3286539 2812867 1814810 469631 1266 1469578 3991301 5269976 4144146
34652D144146k388066j823942o72448o2170R6809K83528N39485O72796N59260
$$ 4144146 1756080 -67862 -740310 -802480 -705671 -422143 117342 790138 1349398
34643A349398J38924l58099l56883K49962N59615j79048j145758q36465O85797
$$ 1349398 1488322 1130223 773340 1023302 1582917 1403869 258111 -578354 107443
34634A07443J672091J033403l74588j194255j182386q40110m20660j0362J44301
$$ 107443 1779534 2812937 2438349 1244094 61708 -778402 -1199062 -1209424 -1065123
34625a065123Q2217L58751J242983K091974J993290P70565q45384j755657j277068
$$ -1065123 -982906 -624155 618828 2710802 4704092 5474657 4629273 2873616 1596548
34616A596548J19281J032039P17936J02971L35266Q64109L42072r43547j350663
$$ 1596548 1715829 2747868 3465804 3568775 3904041 4768150 5110222 4166675 2816012
34607B816012n75602o6374m30348n58296J9803J55353m90317l32736J267665K204239
$$ 2816012 2240410 2174036 1743688 1185392 1205195 1360548 870231 537495 1805160 4009399
34597D009399P82593j151682p72957J323782K025181L25966j666801k230211j966072
$$ 4009399 4791992 3640310 2867353 4191135 6216316 6542282 4875481 2645270 679198
34588F79198j827047j384348M0299J926478L047245K648280R08734j046717j744851
$$ 679198 -1147849 -2532197 -2491898 -565420 2481825 5130105 6038839 4992122 3247271
34579C247271q82479M0104l53269j220071p34062R65392J841581J018353r9285
$$ 3247271 2364792 2404896 2051627 831556 97494 1062886 2904467 3922820 3823535
34570C823535k54145j24807p33277j478716j075022L30288J246952Q19566k29067
$$ 3823535 3569390 3444583 2711306 1232590 157568 487856 1734808 2554374 2325307
34561B325307o71450j75363N38361O26252K1152n54604l94008M34142J130734
$$ 2325307 1653857 1478494 2016855 2643107 2664259 2109655 1715647 2149789 3280523
34552C280523R45484k3802q05272n81119K08454L62530k25741k24253Q02655J028237
$$ 3280523 4226007 4202205 3396933 2815814 3024268 3386798 3161057 2936804 3739459 4767696
34542D767696q75554k720854j362336K051720K896109n7790k344475m84053K536090
$$ 4767696 3892142 1171288 -191048 1860672 4756781 4698991 2354516 1870463 4406553
34533D406553J881655j578096k665463K55148L211107K661339j56144j970593
$$ 4406553 6288208 4710112 2044649 2299797 5510904 8172243 8016099 6045506
34525F045506j646490k44391R44252J118768K22015o40195k99124N48409N9013
$$ 6045506 4399016 4154625 5098877 6217645 6439660 5799465 5500341 6048750 6107763
34516F107763j738573k511619r85333J046514J232197k22552j267852q77273J10574
$$ 6107763 4369190 1857571 872238 1918752 3150949 2928397 1660545 783272 893846
34507H93846N55825L45856J65391M92842R93351R61680L57774q4593m1235q7968
$$ 893846 1449671 1795527 1960918 2453760 3447111 4408791 4766565 4681972 4640737 4552769
34497D552769m15771j18820J130015J769800L62045j852769k329915p64719P03407
$$ 4552769 4136998 4018178 5148193 6917993 7280038 5427269 3097354 2332635 3036042
34488C036042P21325J95152L29960R64879J303704R96071K30653k92438K44472
$$ 3036042 3757367 3952519 4282479 5247358 6551062 7547133 7777786 7485348 7729820
34479G729820J412536J411986k76956j371884j6627J830562J154536j078138j321204
$$ 7729820 9142356 10554342 10277386 8905502 8888875 10719437 11873973 10795835 9474631
34470I474631O30416J369371j73357j018972M00724J515226M02515p96824M7366
$$ 9474631 10105047 11474418 11301061 10282089 10682813 12198039 12600554 11803730 11851096
34461A1851096J216953N40458n60763O4442J109561K99356j146351n74930J211433
$$ 11851096 13068049 13608507 13047744 13112186 14221747 14521103 13374752 12799822 14011255
34452A4011255J237709n59389j546286j002527n81551n73034K93988J345899L79915
$$ 14011255 15248964 14689575 13143289 12140762 11559211 10986177 11280165 12626064 13005979
34443A3005979j882741j859713J167396L272325J720272q92721q96583R08125
$$ 13005979 11123238 9263525 10430921 13703246 15423518 14530797 13634214 14542339
34435A4542339J143607n75969j454720k56890R89077M83292o81417n42005O91419
$$ 14542339 15685946 15109977 13655257 13398367 14387444 14870736 14189319 13647314 14338733
34426A4338733J195564M39466j19527N33768J266810N58360r48832j264152j56849
$$ 14338733 15534297 15973763 15854236 16388004 17654814 18213174 17264342 16000190 15843341
34417A5843341M86138j92215o47289J40900N21163j006412k593814j505508J222443
$$ 15843341 16329479 16137264 15489975 15630875 16152038 15145626 12551812 11046304 12268747
34408A2268747J843107m52011k229673r77937J400923J808070K63102j016082
$$ 12268747 14111854 13659843 11430170 10452233 11853156 13661226 13924328 12908246
34400A2908246j171358j131374j351825j159359k08909Q08271J017436K08014
$$ 12908246 11736888 10605514 9253689 8094330 7885421 8693692 9711128 9919142
34392I919142j008639j501309o12017P93707J083587R4459n01004K40459R38982
$$ 9919142 8910503 7409194 6797177 7590884 8674471 8768930 8267926 8508385 9447367
34383I447367Q4240j406128j557819m56125O7411l96911k03036J344381K392493
$$ 9447367 9531607 8125479 6567660 6111535 6178946 5782035 5578999 6923380 9315873
34374I315873J175686j149242j899181m73549J008355P18932n79072q80773K69278
$$ 9315873 10491559 9342317 7443136 6969587 7977942 8696874 8117802 7237029 7506307
34365G506307J335718R75899l00020j063840q97271n99417o94230o55003R9819
$$ 7506307 8842025 9817924 9517904 8454064 7556793 6957376 6263146 5608143 5707962
34356E707962J145029J519708Q72170l33006j416255j805031j108354M39713J740023
$$ 5707962 6852991 8372699 9244869 8911863 7495608 5690577 4582223 5021936 6761959
34347F761959J751550P41870q041J10296L36226j14421p40160n94054j1259l27807
$$ 6761959 8513509 9255379 9247338 9357634 9693860 9579439 8839279 8245225 8233966 7906159
34337G906159j651231k093856k13540K487402K986684P10289j509258j219911
$$ 7906159 6254928 4161072 3947532 6434934 9421618 10131907 8622649 7402738
34329G402738L71431M54124j097168j781934o65612J44054q06869j617917q5090
$$ 7402738 7774169 8228293 7131125 5349191 4683579 4827633 4020764 2402847 2317757
34320B317757K330751K379478N7749j312047k12268R21125j77722k036179j988601
$$ 2317757 4648508 7027986 7085735 5773688 5561420 6482545 6304823 4268644 2280043
34311B280043k97877P33413N64185O85203J529167J658365K93410j443665k308506
$$ 2280043 1982166 2715579 3279764 3964967 5494134 7152499 7445909 6002244 3693738
34302C693738k216913j339267K59139J493905P57526j432983k173592k4097K538342
$$ 3693738 1476825 137558 396697 1890602 2648128 1215145 -958447 -982544 1555798
34293A555798K377074P3910j187863k70056R06949Q07607J77173m0342l77715
$$ 1555798 3932872 4006782 2818919 2548863 3455812 4263419 4440592 4400250 4022535
34284D022535j280480j646718m54959J276955J698289O66442k95072k44149K42622
$$ 4022535 2742055 1095337 640378 1917333 3615622 4282064 3986992 3742843 3985465
34275C985465L11270j17711p03780j171061j152937l25078Q97472J413442P08982
$$ 3985465 4296735 4179024 3475244 2304183 1151246 826168 1723640 3137082 3846064
34266C846064l48408n69143j4559J75707n25335j277820j088785j12925P88484
$$ 3846064 3497656 2928513 2913954 3089661 2564326 1286506 197721 84796 873280
34257H73280J262253J496094J391130O60277k87098n49601l3872L66180J72807
$$ 873280 2135533 3631627 5022757 5683034 5395936 4846335 4812463 5178643 5351450
34248E351450q5315q5522l37362q86964o81331N99138J280369m2997j876525j591629
$$ 5351450 5266135 5180613 4843251 3956287 3274956 3874094 5154463 5111466 3234941 1643312
34238A643312N45622J528346J01829j369726o23842J098596J187604l29653j139425
$$ 1643312 2188934 3717280 3819109 2449383 1825541 2924137 4111741 3782088 2642663
34229B642663l07098O15926K20368q75768j325963q74054j14125O24929J309753
$$ 2642663 2335565 2951491 3171859 2296091 970128 96074 -18051 606878 1916631
34220A916631J648641J291146M19624l78907p75805q93585q84369o23302O6777
$$ 1916631 3565272 4856418 5276042 4897135 4121330 3227745 2343376 1720074 1786851
34211A786851R63156J339252N69365r29407j639998m96361J437333J713369m78116
$$ 1786851 2750007 4089259 4658624 3729217 2089219 1592858 3030191 4743560 4265444
34202D265444k821912k525308l928J607381P05517q32289p62615K94946M26049
$$ 4265444 1443532 -1081776 -1085704 521677 1227194 394905 -367710 -72764 353285
34193C53285j96063J15767J264639J336624j6108q29675j73949L28434m82485
$$ 353285 157222 272989 1537628 2874252 2858144 2028469 1854520 2182954 1700469
34184A700469j254926p75204l10677j080884j514442J46050K172440J609470q09305
$$ 1700469 445543 -329661 -640338 -1721222 -3235664 -3089614 -917174 692296 -117009
34175a17009j581836P3602J320724N90040l11206M9444L63567m12960q21534K22866
$$ -117009 -1698845 -1625243 -304519 285521 -25685 23759 387326 -25634 -847168 -624302
34165f24302J028179P8187r12035K49833K198864J901396m95388j929266j139791
$$ -624302 403877 482064 -429971 -180138 2018726 3920122 3424734 1495468 355677
34156C55677j1214r049j98141L64674P82026J78949n20908k21168L65195J0353
$$ 355677 344463 335414 137273 501947 1283973 1462922 942014 720846 1086041 1096394
34146A096394p40401l87019Q48749J038628m88800j847736j165393P22447J473692
$$ 1096394 355993 -31026 817723 1856351 1367551 -480185 -1645578 -923131 550561
34137E50561N13208m78802l16871J55497q0145m03079J44918R19155O69385k30894
$$ 550561 1063769 584967 268096 423593 343448 -59631 85287 1004442 1673827 1442933
34127A442933l26383M71440P80950Q7149n87538n89973n07020o68805l70902P49498
$$ 1442933 1116550 1587990 2368940 2456089 1868551 1278578 771558 102753 -268149 481349
34117D81349J860050K025188J070908p79253k755665l134822r80738J579318J323885
$$ 481349 2341399 4366587 5437495 4658242 1902577 -1232245 -2212983 -633665 690220
34108F90220j236809j917558R65916L597397K140758j545041k834565r86688P64008
$$ 690220 -546589 -2464147 -1498231 2099166 4239924 2694883 -139682 -1126370 -362362
34099c62362O71053K56319P23532J024399K24420q24201j077933o67014n1656
$$ -362362 308691 565010 1288542 2312941 2537361 1713160 635227 -31787 -83443
34090h3443N62533O56537j11604o94427K68549J972568K010760j50663k197936
$$ -83443 479090 1135627 1024023 329596 598145 2570713 4581473 4430810 2232874
34081B232874k132942o23971N82906R19434P14907J26727n92453q61590o49090
$$ 2232874 99932 -524039 58867 978301 1693208 1819935 1227482 365892 -283198
34072b83198n93698o70658M8564J624440K532501J639237j89254j360435j441136
$$ -283198 -876896 -1547554 -1498990 125450 2657951 4297188 4107934 2747499 1306363
34063A306363r02321l7546P89111P15860n38685j692669j169480Q22619K333313
$$ 1306363 404042 366496 1155607 1871467 1332782 -359887 -1529367 -706748 1626565
34054A626565J765949n17709k530772k423116l27072J495508J061246p32106j042665
$$ 1626565 3392514 2874805 344033 -2079083 -2406155 -910647 150599 -581507 -1624172
34045a624172J013877K831675J722221j330551k879831j434096R42954J512721
$$ -1624172 -610295 2221380 3943601 2613050 -266781 -1700877 -757923 754798
34037G54798K0847j503828j298341L58334J634680J109028p12296j881402j116350
$$ 754798 775645 -728183 -2026524 -1668190 -33510 1075518 363222 -1518180 -2634530
34028b634530P88498J881009J139894o46113j838676j413687L36369K094526K521925
$$ -2634530 -1846032 34977 1174871 528758 -1309918 -2723605 -2387236 -292710 2229215
34019B229215J343998m43917j578878j675081j223393o67107N6881R54410J421700
$$ 2229215 3573213 3129296 1550418 -124663 -1348056 -2015163 -1958282 -1003872 417828
34010D17828P79244o62861j588507j062241L42161J200180Q37790j80866r66587
$$ 417828 1197072 534211 -1054296 -2116537 -1774376 -574196 263594 82728 -883859
34001h83859j056736l66832P50871J310055N24233q65467j132569R3914J162941
$$ -883859 -1940595 -2307427 -1556556 -246501 277732 -587735 -1720304 -1626390 -463449
33992d63449P67015k69135n88669m05589n38434m89276N82586J747633J380366
$$ -463449 303566 34431 -554238 -959827 -1498261 -1987537 -1404951 342682 1723048
33983A723048j3816m01663L44839J67275j502727k418563j081373P67729R82678
$$ 1723048 1709232 1307569 1652408 1819683 316956 -2101607 -3182980 -2415251 -1432573
33974a432573K88431M67722R15164j51118j893836j488413J211079K703325Q03695
$$ -1432573 -1144142 -676420 238744 87626 -1806210 -3294623 -2083544 619781 1423476
33965A423476j938872j837557O75418J996355P30861p83814n82783J65211j73261
$$ 1423476 -515396 -2352953 -1677535 318820 1049681 265867 -316916 -151705 -324966
33956c24966p09457L4406R31241r2071k026458j701388J104009K792268J255691
$$ -324966 -1034423 -1000017 -68776 -160847 -2187305 -3888693 -2784684 7584 1263275
33947A263275j059914j204485n641K15475j86389N11675J601132J024452o21052
$$ 1263275 203361 -1001124 -1006765 -791290 -977679 -466004 1135128 2159580 1538528
33938A538528p80038O15402R63939m95583j517751r38752m70311j095633r64630
$$ 1538528 758490 1373892 2337831 1842248 324497 -614255 -1084566 -2180199 -3144829
33929c144829J124626K929477J934495o68873j690758l37388J317453J372183
$$ -3144829 -2020203 909274 2843769 2174896 484138 146750 1464203 2836386
33921B836386j86893k058613k547693q37090J540905J795732m09941k038905r55137
$$ 2836386 2649493 590880 -1956813 -2793903 -1252998 542734 132793 -1906112 -2861249
33912b861249Q87819O78730p93513q14186N97477J133811N52626R01594K326310
$$ -2861249 -1973430 -1294700 -2088213 -2902399 -2304922 -1171111 -618485 283109 2609419
33903B609419K315511L4736j878153j346695J20313K94953l02428o8234M77528
$$ 2609419 4924930 4959666 3081513 1734818 1855131 2150084 1847656 1779422 2256950
33894B256950j95664j502745j479151j51880M58585k37295n07977N08813J078703
$$ 2256950 2061286 558541 -920610 -1072490 -613905 -851200 -1359177 -850364 228339
33885B28339k79856k028680j620425P26797K310676J696965K49877l18624j35530
$$ 228339 -51517 -2080197 -3700622 -2973825 -663149 1033816 1283693 965069 829539
33876H29539j42790l32948j42555L08815M85867L53744J25056k91624p25897l99047
$$ 829539 686749 353801 211246 520061 1005928 1359672 1484728 1193104 467207 68160
33866F8160P81215J389252L38631j104008q51783Q47087J658552N42973r88043
$$ 68160 849375 2238627 2577258 1473250 621467 1468554 3127106 3670079 2682036
33857B682036j296165n66771J60652L92986J05825l90299k00786J108013K116686
$$ 2682036 1385871 819100 979752 1372738 1478563 1088264 887478 1995491 4112177
33848D112177J014860j373970k242281r30005J45887m08980p87509M64072J523771
$$ 4112177 5127037 3753067 1510786 580781 726668 317688 -469821 -5749 1518022
33839A518022L81025j455627j290725L65598Q62702j93248p37624P2958R19830
$$ 1518022 1899047 443420 -847305 -481707 380995 187747 -549877 -476919 442911
33830D42911R38924O47839K21255p68471j793344j743955q91893m10544j55832
$$ 442911 1381835 2029674 2250929 1482458 -310886 -2054841 -2946734 -3357278 -3513110
33821c513110P76068J593085O79514j105837j113721O73871J205672o51319k058493
$$ -3513110 -2737042 -1143957 -464443 -1570280 -2684001 -2010130 -804458 -1455777 -3514270
33812c514270q49087R76311Q40433r6874O43614K150011J473591j229022k528390
$$ -3514270 -4363357 -3387046 -2546613 -2643487 -1999873 150138 1623729 394707 -2133683
33803b133683q26697J486727J787475N94327q0874J07875n1184j028329j830295
$$ -2133683 -2960380 -1473653 313822 908149 827275 935150 883966 -144363 -1974658
33794a974658j382653K12343J778127K064847Q45252p36071j173577j88899R69073
$$ -1974658 -3357311 -3144968 -1366841 698006 1543258 807187 -366390 -555289 413784
33785D13784J011942N2940p43528o21493J30305Q25576J069022P21878j94524
$$ 413784 1425726 1478666 735138 113645 243950 1069526 2138548 2860426 2665902
33776B665902j164164j234509o3035J316779J493961L97907p26187j077668j111082
$$ 2665902 1501738 267229 204194 1520973 3014934 3412841 2686654 1608986 497904
33767D97904j343863j410842r26433l53340j73311J3139O04025R56931L93332
$$ 497904 -845959 -2256801 -3183234 -3536574 -3709885 -3696746 -3092721 -2135790 -1742458
33758a742458l44573K3909J292209J943676J223077j87668j417158k035647j556232
$$ -1742458 -2087031 -2063122 -770913 1172763 2395840 2208172 791014 -1244633 -2800865
33749b800865K01424K081124K375142J004269l76564p41055p13942q25685m58140
$$ -2800865 -2599441 -518317 1856825 2861094 2484530 1743475 1029533 203848 -254292
33740b54292N34817P48758p53143k410102j839987Q63727K997692K461441K0969
$$ -254292 280525 1029283 276140 -2133962 -3973949 -3110222 -112530 2348911 2369880
33731B369880j854011j659803n7493J180717J070870J95697l33533k68902j19664
$$ 2369880 515869 -1143934 -1201427 -20710 1050160 1245857 912324 643422 523758
33722E23758l7058K78168O11864K67655o64755j127455o56002j21810k82894n55498
$$ 523758 486700 764868 1376732 1644387 979632 -147823 -803825 -925635 -1208529 -1764027
33712a764027q2519P59655R22687K66098l57526l30685J51434N26201L51048l77770
$$ -1764027 -1846546 -1086891 -164204 101894 -255632 -586317 -434883 91318 442366 64596
33702F4596r94826o95909L15791Q29763K57148m82083l55663K86201M70374J07814
$$ 64596 -930230 -1626139 -1310348 -480585 -223437 -705520 -1061183 -774982 -304608 -196794
33692a96794k82547o57562j048725p26717P19810J902166J058475j018364j457454
$$ -196794 -479341 -1136903 -2185628 -2912345 -2192535 -290369 768106 -250258 -1707712
33683a707712O85461K783710K177928k13203j499169r51200m35257j054080j590084
$$ -1707712 -1022251 1761459 3939387 3726184 2227015 1275815 840558 -213522 -1803606
33674a803606q64479K26394K42996m94019n92082J58540P35855P44818P81678
$$ -1803606 -2668085 -2441691 -2198695 -2692714 -3284796 -3126256 -2390401 -1645583 -863905
33665h63905R45894N37374m17080q07877k35519K15401j71297m64037K20066J010249
$$ -863905 81989 619363 202283 -605594 -841113 -625712 -797009 -1261046 -1040980 -30731
33655c0731P43352N9192K53246Q17574J97926j320979j662468q6229J704754K074118
$$ -30731 712621 771813 1025059 1842633 2040559 719580 -942888 -1029117 675637 2749755
33645B749755J329997M95031j70891o53143o14539j61122J3255j50216J8606L25808
$$ 2749755 4079752 4574783 4403892 3750749 3136210 2975088 2988343 2838127 2856733 3182541
33635C182541l38645j745743j894367m5149J607045R56177q38539j191115N1956
$$ 3182541 2843896 1098153 -796214 -841363 765682 1721859 883320 -307795 -255839
33626b55839Q43651L72720r6405K04491L22236m94325j328380r72042K46645R19799
$$ -255839 587812 960532 864127 1068618 1390854 896529 -431851 -1403893 -1157248 -237449
33616b37449M09236m41748m78465K11357L56518o17693j385627m26636J441463
$$ -237449 171787 -269961 -748426 -537069 -180551 -798244 -2183871 -2610507 -1169044
33607a169044J880728N04398n03296O3993N69019l25709r64564M74120K285712
$$ -1169044 711684 1216082 712786 776779 1345798 1020089 55525 529645 2815357
33598B815357J451778j411188k588016o61265J667260J668929j23216j566558
$$ 2815357 4267135 2855947 267931 -393334 1273926 2942855 2819639 1253081
33590A253081j644025n55289J093013K165232J554548k16753j182717m15032Q30187
$$ 1253081 -390944 -946233 146780 2312012 3866560 3649807 2467090 2052058 2882245
33581B882245R55138j50501j499944k057375j201366N85930J502549M18479j093897
$$ 2882245 3837383 3686882 2186938 129563 -1071803 -485873 1016676 1435155 341258
33572C41258o77001J047452J204952o50103j676013m65546O77754r6530r38985
$$ 341258 -335743 711709 1916661 1266558 -409455 -875001 -197247 -293777 -1232762
33563a232762K45688J836091J159251q90776j324583J60776J257804J083619Q19314
$$ -1232762 -987074 849017 2008268 1117492 -207091 -46315 1211489 2295108 3114422
33554C114422P37147j53910j487032j614329n89636k49780r21854q32414N92135
$$ 3114422 3851569 3697659 2210627 596298 6662 -243118 -1164972 -1997386 -1405251
33545a405251J568005R81687L8256j35824j22594l27780J31998J328618J635159
$$ -1405251 162754 1144441 1182697 1046873 924279 596499 728497 2057115 3692274
33536C692274M59984l98035J67566M69233q61969j946244o12027J553238J381207
$$ 3692274 4152258 3754223 3921789 4391022 3529053 1582809 970782 2524020 3905227
33527C905227p86605j662467k44475J006676N20294j78251L72546J092292O03375
$$ 3905227 3118622 1456155 1211680 2218356 2738650 2560399 2932945 4025237 4628612
33518D628612k88718j39982P36472J149488J086982J279048J677518J922970K512685
$$ 4628612 4339894 4199912 4936384 6085872 7172854 8451902 10129420 12052390 14565075
33509A4565075L864082M727220L224993n05608m006329n022122l496988j123782
$$ 14565075 18429157 23156377 26381370 25875762 21869433 16847311 13350323 12226541
33501A2226541K28888k67075j825574k617679j652972m7252L41480o11141j201208
$$ 12226541 12455429 12188354 10362780 7745101 6092129 6044877 6386357 5775216 4574008
33492D574008l54061R46267J155490J84175q03033j037972q29138p83016r59224
$$ 4574008 4219947 5166214 6321704 6505879 5702846 4664874 3835736 3052720 2093496
33483B093496r06313k99865N49737Q96610M05663l33648m69263L0069M14409K62166
$$ 2093496 1187183 887318 1437055 2333665 2739328 2405680 1936417 1966486 2380895 2643061
33473B643061l3540n0434N268j74017k90549J62198R91625J361948Q45611K7201
$$ 2643061 2609521 2559087 2564355 2390338 2099789 2261987 3253612 4615560 5461171 5488372
33463E488372k10332J51874K06453n97955j492055j308299k40662K61164l21263
$$ 5488372 5278040 5429914 5636367 5038412 3546357 2238058 1997396 2258560 1937297
33454A937297n95385O29322K210024K096122L64914q49017l78371P45488J323577
$$ 1937297 1341912 1971234 4181258 6277380 6642294 5793277 5414906 6160394 7483971
33445G483971J482193J536735J081398J76668m3461R21996J910262J875300J386245
$$ 7483971 8966164 10502899 11584297 11760965 11717504 12639500 14549762 16425062 17811307
33436A7811307J174181O77103m46365q88448K21422J131013k23404k686704l332144
$$ 17811307 18985488 19662591 19216226 18327778 18549200 19680213 19456809 16770105 13437961
33427A3437961j838405n71792n66301n25050m9383n72406k170864k599774r59241
$$ 13437961 11599556 11027764 10461463 9936413 9887030 9314624 7143760 4543986 3584745
33418C584745N41000K36759l31045M11716R12300o19852k350266j322919J514035
$$ 3584745 4125745 4362504 4031459 4443175 5355475 4735623 2385357 1062438 2576473
33409B576473K432368N42852j237505r42444N1211Q4396l15938k11905m1408k61540
$$ 2576473 5008841 5551693 4314188 3371744 3422955 3507351 3191413 2979508 2938100 2676560
33399B676560k11535L16195J67724j085119j803197o56241J045107J208058J23697
$$ 2676560 2465025 2781220 2948944 1863825 60628 -595613 449494 1657552 1781249
33390A781249j65747Q87445J637819P88159r49301k062710j984916j221138m82357
$$ 1781249 1615502 2502947 4140766 4928925 3979624 1916914 -68002 -1289140 -1771497
33381a771497p6252J89998O32648J100005J041517L93017j43334j33987n0390
$$ -1771497 -1847749 -1657751 -1025103 74902 1116419 1509436 1366102 1232115 1181725
33372A181725j93164K19608J752544L180732K822613J296340J088278K838122
$$ 1181725 988561 1208169 2960713 6141445 8964058 10260398 11348676 14186798
33364A4186798L869111J738982k062726l833581k535498q98904j342749k736640
$$ 14186798 18055909 19794891 17732165 13898584 11363086 10464182 9121433 6384793
33356F384793k477373m80472P95200M1177j085930n58168J001871J252111m65080
$$ 6384793 3907420 3426948 4222148 4263325 3177395 2619227 3621098 4873209 4408129
33347D408129k131375j740227J52668J355640R16750K9052K6156M99726J72981
$$ 4408129 2276754 536527 689195 2044835 2961585 2990637 3016793 3516519 3689500
33338C689500r01935j236385j95611Q22376L78345p78892q68122P6565L27868
$$ 3689500 2787565 1551180 1355569 2177945 2556290 1777398 909276 985841 1313709
33329A313709n29795p94415L75482J208004P1672j658703j534230K70035J456123
$$ 1313709 783914 -10501 364981 1572985 1644657 -14046 -1548276 -1278241 177882
33320A77882J146431N19798J78195n46115j424037j069993M17907J011587L2698
$$ 177882 1324313 1844111 2022306 1476191 52154 -1017839 -599932 411655 444353
33311D44353m88442P89655K033143J142175p94319j373635p12477o71227j231072
$$ 444353 -44089 745566 2778709 3920884 3126565 1752930 1040453 369226 -861846
33302h61846o38344J108020J855316P63519m30123l38331K25440K84005L57306
$$ -861846 -1500190 -392170 1463146 2226665 1796542 1458211 1683651 1967656 2324962
33293B324962P57751K77859j600866k834287j389736J333456K088073L93106r30160
$$ 2324962 3082713 3360572 1759706 -1074581 -2464317 -1130861 957212 1350318 420158
33284D20158j06957J184916Q54241l11964l06975O03054N06772o20906p57086
$$ 420158 313201 1498117 2352358 2040394 1733419 2336473 2843245 2222339 1465253
33275A465253M47507N84894j474347k973429j124304K229794K969989Q29565m56678
$$ 1465253 1912760 2497654 1023307 -1950122 -3074426 -844632 2125357 2954922 2498244
33266B498244P38753J544925k94504k483253j913189L48118R87616l73825j266621
$$ 2498244 3236997 4781922 4487418 2004165 90976 439094 1426710 1052885 -213736
33257b13736o71426O3458K71498P95521J571762J249634k00788j005803m27506
$$ -213736 -885162 -821704 -550206 245315 1817077 3066711 2865923 1860120 1432614
33248A432614J69754j53047m98264j62468j1769p02586j320963r61875j36045
$$ 1432614 1602368 1449321 951057 788589 776820 74234 -1246729 -2208604 -2344649
33239b344649M05351P55751Q80322J81001j018592j233241q4710R10809Q66872
$$ -2344649 -1939298 -1183547 -303225 -122224 -1140816 -2374057 -2458767 -1547958 -681086
33230f81086Q97574J685387J812564K83198j315280j308674p42542j240482j774393
$$ -681086 216488 1901875 3714439 3997637 2682357 1373683 631141 -609341 -2383734
33221b383734n25314J338920J137644o96328j001051J006231K454624J435001
$$ -2383734 -2909048 -1570128 -432484 -1128812 -2129863 -1123632 1330992 2765993
33213B765993k82434n31859j8422m06410j258931j104239j94773K4557m97081
$$ 2765993 2483559 1951700 1933278 1526868 267937 -836302 -1031075 -1006518 -1503599
33204a503599m18574N58924J071744K80290p20069m53587Q01342J399508O08595
$$ -1503599 -1922173 -1363249 -291505 -11215 -731284 -1184871 -383529 1015979 1624574
33195A624574m62128n26475Q2804R4087o77239j129582p02171j51426j14713j18677
$$ 1624574 1162446 635971 718775 812862 135623 -993959 -1696130 -1847556 -1962269 -2080946
33185b080946L10864O91379N85137M88302P74311Q29213K88055l7403K96358J75201
$$ -2080946 -1770082 -1078703 -493566 -5264 769047 1598260 1886315 1848912 2145270 2320471
33175B320471j132650k093223r46533J333895K269116J339182N0324p72380j399863
$$ 2320471 1187821 -905402 -1851935 -518040 1751076 3090258 3140582 2368202 968339
33166I68339j476642m39713P01280N82302P8715Q61597J863322O49613j847709
$$ 968339 -508303 -948016 -246736 335566 414281 1275878 3139200 3788813 1941104
33157A941104k065607J92284R78425j169691k483273l19561K190844J402755p77454
$$ 1941104 -124503 67781 1046206 -123485 -2606758 -2926319 -735475 667280 -110174
33148a10174m88237J392641J159284r90901j378118O96030J886109M83757j216375
$$ -110174 -598411 794230 1953514 962613 -415505 280525 2166634 2650391 1434016
33139A434016j076729P1338Q22404J197020J173922J02032j354990j339022J28431
$$ 1434016 357287 428625 1251029 2448049 3621971 3724003 2369013 1029991 1158422
33130A158422P63639l02294j113534l25660O20576K55653m86050l34771N4321
$$ 1158422 1922061 1619767 506233 180573 801149 1056802 570752 235981 290302
33121B90302k11977l41947L90114Q11269r7582r26481R1790J979861K286586N99430
$$ 290302 78325 -263622 126492 937761 840179 -86302 5488 1985349 4271935 4871365
33111D871365j290632k020924j568138k62937J227600J589299L50376r44637p57280
$$ 4871365 3580733 1559809 -8329 -271266 956334 2545633 2896009 1951372 1194092
33102A194092P3507j40683j004393r39352k30523m81056j404609j055217O39238
$$ 1194092 1267599 1126916 122523 -816829 -1047352 -1528408 -2933017 -3988234 -3348996
33093c348996J486893P08978J69629J011882J786362J226131L41152J49890k59740
$$ -3348996 -1862103 -1153125 -983496 28386 1814748 3040879 3382031 3531921 3272181
33084C272181j431948j565697O37216K899997K068898j125265k931451j803668
$$ 3272181 1840233 274536 911752 3811749 5880647 4755382 1823931 20263
33076B0263L3731L54907l43190n43673O848O74953J041761P77591l24860j500313
$$ 20263 53994 408901 65711 -477962 -471114 203839 1245600 2023191 1698331 198018
33066A98018j374150J53688J466398J305291K68473l67476l03518l3737N4896
$$ 198018 -1176132 -1022444 443954 1749245 2017718 1650242 1346724 1312987 1367883
33057A367883k65012j051526j676305j245661m8826N30877J46709J53556J215389
$$ 1367883 1102871 51345 -1624960 -2870621 -2919447 -2388570 -2241861 -2088305 -872916
33048h72916J780675M66866j333514j256203M03613J120989O103j050393n15347
$$ -872916 907759 1374625 41111 -1215092 -811479 309510 315613 -734780 -1250127
33039a250127N87928N98685k60577n48724K36127J391464K252829K561062J957891
$$ -1250127 -662199 -63514 -324091 -872815 -636688 754776 3007605 5568667 7526558
33030G526558K17368j960321l153600k516829o36794R78881J211733K75218n68408
$$ 7526558 7743926 5783605 2630005 113176 -523618 455263 1666996 1942214 1373806
33021A373806l86915L77586N61186j25760p47970n06255K29738O30864N52034
$$ 1373806 986891 1364477 1925663 1799903 1051933 545678 775416 1406280 1958314
33012A958314L61582L6422p73377j800232k045631j013194L76247P04184j48187
$$ 1958314 2319896 2356318 1582941 -217291 -2262922 -3276116 -2899869 -2195685 -2343872
33003b343872p47566J6756J370018J689535P52452j42098l06485n38144j298024
$$ -2343872 -3091438 -3074682 -1704664 -15129 737323 595225 288740 -249404 -1547428
32994a547428j481000k41189J142939R54466j67357j36158J191656J780823Q09626
$$ -1547428 -3028428 -3269617 -2126678 -1172212 -1339569 -1475727 -284071 1496752 2306378
32985B306378j7387N74216J281014M74097j081298j526562p50837p9891P1737
$$ 2306378 2288991 2863207 4144221 4618318 3537020 2010458 1259621 1179730 1251467
32976A251467L29801N92036Q5647q25169p52113M07976R39755j65752j523729
$$ 1251467 1581268 2173304 2258951 1433782 681669 1089645 2029400 1863648 339919
32967C39919j259426L37999J303923P11891l25612m45328K06054N17048Q5725
$$ 339919 -919507 -581508 722415 1434306 1108694 663366 869420 1386468 1472193
32958A472193m07189l43101M4965K14670N7722k59251o99032j108016j000028
$$ 1472193 1065004 721903 766868 981538 1039260 780009 80977 -1027039 -2027067
32949b027067j97201O68679R41924Q17404O69421R1951j207206k051451j000548
$$ -2027067 -2224268 -1555589 -613665 203739 873160 965111 -242095 -2293546 -3294094
32940c294094J165644K049112J073753L48788J298441K422812J761335j43043
$$ -3294094 -2128450 -79338 994415 1343203 2641644 5064456 6825791 6682748
32932F682748j428455j646072j457848q36507L30331Q08514m64015k027901j532720
$$ 6682748 5254293 3608221 2150373 1313866 1644197 2452711 1988696 -39205 -1571925
32923a571925N61873J505605N45944r6451Q21606J499641L91436r88349o64960
$$ -1571925 -1010052 495553 1041497 945046 1766652 3266293 3657729 2669380 2004420
32914B004420L57827j47803j675178j657421K50586J406372K18505j515085j474932
$$ 2004420 2362247 2214444 539266 -1118155 -867569 538803 757308 -757777 -2232709
32905b232709o2839Q28910Q21431Q29686P27514m56543k122939k206441l12784
$$ -2232709 -2295548 -1466638 -645207 184479 911993 455450 -1667489 -3873930 -4186714
32896d186714J327468J117160L74111P90819J410902L98875j465779j784510l62106
$$ -4186714 -2859246 -1742086 -1367975 -577156 833746 1232621 -233158 -2017668 -2379774
32887b379774Q31475J225478J998715K702932J172886k116121l291286p01472
$$ -2379774 -1548299 -322821 1675894 4378826 5551712 3435591 144305 -557167
32879e57167K053383J383127j017164j441698r2119K57242m51268q0038J020266
$$ -557167 1496216 2879343 1862179 420481 328362 585604 134336 54298 1074564
32870A074564N19963j040648o05584J829728K621366M62134j487746j035269k07018
$$ 1074564 1594527 553879 -51705 1778023 4399389 4861523 3373777 2338508 2131490
32861B131490q59700j158731N57889J983472N59834j805242j700865J52684L60816
$$ 2131490 1271790 113059 670948 2654420 3214254 1409012 -291853 -139169 221647
32852B21647j355314k000027m45829J197427J507132J473890J709347J176166
$$ 221647 -1133667 -3133694 -3579523 -2382096 -874964 598926 2308273 3484439
32844C484439k67167q91395q473N46730n98771j911775j297249O22013J500855
$$ 3484439 3217272 2325877 2317404 2864134 2265363 353588 -943661 -321648 1179207
32835A179207O27264n54171q32281m66029n3157L64946O70393K92340p85203j353626
$$ 1179207 1806471 1252300 420019 -46010 -99167 265779 936172 1228512 443309 -910317
32825i10317l10639J512987J895557l0820k434152k935686j453607J71054Q95129
$$ -910317 -1220956 292031 2187588 2156768 -277384 -3213070 -4666677 -4495623 -3600494
32816c600494J287862J670727J326453K74078M2008J301517K141463N43728k257991
$$ -3600494 -2312632 -641905 684548 958626 1000634 2302151 4443614 4987342 2729351
32807B729351k945104n06696K368277K649948L25465k119469k567057j084898
$$ 2729351 -215753 -722449 1645828 4295776 4621241 2501772 -65285 -1150183
32799a150183M94369M76919q75817j595000n49220Q36308M82081j197634j697958
$$ -1150183 -655814 -178895 -1054712 -2649712 -3198932 -2362624 -1880543 -3078177 -4776135
32790d776135q4510J569281J227358k08155m61748O91662J362508O17432k11594
$$ -4776135 -4860645 -3291364 -2064006 -2272161 -2733909 -2042247 -679739 -62307 -273901
32781b73901J94972J010999N41917j135907k149240j341921L73570J465602J526864
$$ -273901 -78929 932070 1473987 338080 -1811160 -3153081 -2779511 -1313909 212955
32772B12955R77594L568j189010j701645q06461O94933J180452L50533m31718
$$ 212955 1190549 1194117 5107 -1696538 -2502999 -1808066 -627614 -277081 -708799
32763g08799j21771P57645J161796Q05700p111q97748j298827p21755L59308P14489
$$ -708799 -830570 -72925 1088871 1894571 1887460 989712 -309115 -1030870 -671562 42927
32753D2927n0279q86049p50043J13589P86898Q06290K79361l72928n10941Q7747
$$ 42927 -7352 -893401 -1643444 -1529855 -742957 63333 342694 -30234 -541175 -453428
32743d53428O09317K35006l19105K32350J290554Q95876r37712j735538l14276
$$ -453428 155889 390895 71790 304140 1594694 2490570 1552858 -182680 -496956
32734d96956J320307J154263l0797o75559j006368j565522j350889J58359J071490
$$ -496956 823351 1977614 1946817 1271258 264890 -1300632 -2651521 -2493162 -1421672
32725a421672j03718j467910n46756J439059J485022j79906o48527P12039J583667
$$ -1421672 -1525390 -2993300 -3540056 -2100997 -615975 -795881 -1444408 -732369 851298
32716H51298Q76160J6353j83040n57440j047663l88138J045914J234529P6602
$$ 851298 1727458 1743811 1560771 1003331 -44332 -432470 613444 1847973 1924575
32707A924575j76789J092312J628224J78744j456325j590712r64609n09163K98491
$$ 1924575 1747786 2840098 4468322 4647066 3190741 1600029 635420 126257 424748
32698D24748J323723R50617q58687j533045J07629J608613Q18795o91103o70095
$$ 424748 1748471 2699088 1840401 307356 414985 2023598 2842393 2151290 1481195
32689A481195l761n23685j273601k94546J503678J603044m8874j280061j230258
$$ 1481195 1477434 953749 -319852 -614398 889280 2492324 2443450 1163389 -66869
32680f6869q51005n30341J14634N58077l3978q75796m76495Q68551J550619J183119
$$ -66869 -917874 -1448215 -1333581 -775504 -809482 -1685278 -2161773 -1293222 257397 1440516
32670A440516P01318M02150k06238j027682j528649j690766j418852r8380J736907
$$ 1440516 2141834 2543984 2337746 1310064 -218585 -1909351 -3328203 -3426583 -1689676
32661a689676J912640j93477j786232n21417J638987J542350k4159j11402J019182
$$ -1689676 222964 29487 -1756745 -2278162 -639175 903175 879016 767614 1786796
32652A786796P57160n95110l75247R30093R8939k389947k047919J861197L958268
$$ 1786796 2543956 1948846 1573599 2503692 2602631 212684 -1835235 25962 3984230
32643C984230J041347k509842j677923J276673R47205k288897l184736o6248L082630
$$ 3984230 5025577 2515735 837812 2114485 3061690 772793 -2411943 -2478191 604439
32634F04439K975779Q51152q19389j610272j870114j210423K02000J015928O81421
$$ 604439 3580218 4431370 3611981 2001709 131595 -1078828 -876828 139100 820521
32625H20521L47066P17561O91830o54238k161699k064926m24918J188901J775606
$$ 820521 1167587 1885148 2576978 1922740 -238959 -2303885 -2728803 -1539902 235704
32616B35704J495986P21895k62580q14182l86655M36469M04251n93565j187046
$$ 235704 1731690 2453585 2191005 1376823 990168 1426637 1830888 1237323 50277
32607E0277n72675J24257l96221j311775p66842J011210J658287K02107j314828
$$ 50277 -522398 -398141 -794362 -2106137 -2872979 -1861769 -203482 -1375 -1316203
32598a316203q68023N90675Q12777m09989j424969j309543m45496P37839J775665
$$ -1316203 -2184226 -1593551 -780774 -1190763 -2615732 -3925275 -4370771 -3632932 -1857267
32589a857267J695161M28408k00119R59051J923960M20268j898747j626887N82246
$$ -1857267 -162106 266302 66183 1025234 2949194 3369462 1470715 -156172 426074
32580D26074O65207k047342l318184p64747K327111K351032N60391j14560O7234
$$ 426074 1091281 -956061 -4274245 -5038992 -2711881 -360849 199542 84982 152216
32571A52216n06976j023164j31587P04759l37165j577893m43084J705663J587251
$$ 152216 -354760 -1377924 -1509511 -804752 -1141917 -2719810 -3162894 -1457231 130020
32562A30020l92228r81692K54143P02520j60947j22750R77539N65727j559834
$$ 130020 -262208 -1243900 -989757 -287237 -448184 -570934 406605 972332 -587502
$$ [...]
##END NTUPLES=NMR SPECTRUM
##END=
