##TITLE=31Pdec_IPACAT-29-1
 CDCl3, 124 sc
 6.12.2021
##JCAMPDX= 6.0         $$ Bruker NMR JCAMP-DX V2.0
##DATA TYPE= NMR SPECTRUM
##DATA CLASS= NTUPLES
##ORIGIN= UXNMR, Bruker Analytische Messtechnik GmbH
##OWNER= root
$$ XWIN-NMR		Version 3.5
$$ Mon Dec  6 12:51:22 2021 Russian Standard Time (UT+4h)  she@DPX200
##.OBSERVE FREQUENCY= 81.013821
##.OBSERVE NUCLEUS= ^31P
##.ACQUISITION MODE= SIMULTANEOUS
##.ACQUISITION SCHEME= undefined
##.AVERAGES= 124
##.DIGITISER RES= 16
##SPECTROMETER/DATA SYSTEM= spect
##.PULSE SEQUENCE= zgpg30
##.SOLVENT NAME= CDCl3
##.SHIFT REFERENCE= (INTERNAL, CDCl3, 0, 248.564)
##AUDIT TRAIL= $$ (NUMBER, WHEN, WHO, WHERE, WHAT)
$$ ##TITLE= Audit trail, XWIN-NMR		Version 3.5
$$ ##JCAMPDX= 5.01
$$ ##ORIGIN= Bruker BioSpin GmbH
$$ ##OWNER= she
$$ F:/spectra/data/she/nmr/P31/1/pdata/1/auditp.txt
$$ ##AUDIT TRAIL=  $$ (NUMBER, WHEN, WHO, WHERE, WHAT)
(   1,<2021-12-06 12:50:20.03 +0400>,<she>,<DPX200>,
      <continue with go, POWCHK disabled, PULCHK disabled
       configuration hash MD5:
       00 E9 B6 7A A2 85 ED C7 34 08 36 98 17 FE 4E 26
       data hash MD5: 32K
       EB 91 4F 22 1D D3 B3 30 F5 C7 91 1E 27 3C 12 87>)
(   2,<2021-12-06 12:50:23.23 +0400>,<she>,<DPX200>,
      <Start of raw data processing
       efp BC_mod = 2 LB = 1 FT_mod = 6 PKNL = 1 PHC0 = -9138.712 PHC1 = -6.930573 SI = 64K 
       data hash MD5: 64K
       BB BD FB C9 DE 9A 13 6B E3 66 07 22 8B 9E 25 43>)
(   3,<2021-12-06 12:50:52.98 +0400>,<she>,<DPX200>,
      <pk PHC0 = 2.842486 PHC1 = -5.600001 
       data hash MD5: 64K
       38 9D 7F 28 94 7C 4E 59 D9 DA C5 B0 28 7B 7A 51>)
(   4,<2021-12-06 12:50:56.17 +0400>,<she>,<DPX200>,
      <abs ABSG = 5 
       data hash MD5: 64K
       A0 11 84 8B 38 D6 56 6C F7 95 96 12 C5 4B 07 7C>)
$$ ##END=
$$ 
$$ hash MD5
$$ C2 BD 44 FB 3C 2B FA 12 36 93 DD BD 67 90 B6 72
##$RELAX= 
##$RELAX= 
##$RELAX= 
##$RELAX= 
##$RELAX= 
##$RELAX= 
##$RELAX= 
##$RELAX= 
$$ Bruker specific parameters
$$ --------------------------
##$DU= <F:/spectra>
##$EXPNO= 1
##$NAME= <P31>
##$PROCNO= 1
##$TYPE= <nmr>
##$USER= <she>
##$AMP= (0..31)
100 100 100 100 100 100 100 100 100 100 100 100 100 100 100 100 100 100 
100 100 100 100 100 100 100 100 100 100 100 100 100 100 
##$AQSEQ= 0
##$AQ_mod= 1
##$AUNM= <au_zg>
##$AUTOPOS= <>
##$BF1= 81.014009
##$BF2= 200.13
##$BF3= 200.13
##$BF4= 200.13
##$BF5= 200.13
##$BF6= 200.13
##$BF7= 200.13
##$BF8= 200.13
##$BYTORDA= 1
##$CFDGTYP= 0
##$CFRGTYP= 5
##$CHEMSTR= <none>
##$CNST= (0..31)
1 1 145 1 1 1 1 1 1 1 1 1 1 1 1 1 1 1 1 1 1 1 1 1 1 1 1 1 1 1 1 1 
##$CPDPRG= <waltz16>
##$CPDPRG1= <>
##$CPDPRG2= <waltz16>
##$CPDPRG3= <>
##$CPDPRG4= <mlev>
##$CPDPRG5= <mlev>
##$CPDPRG6= <mlev>
##$CPDPRG7= <mlev>
##$CPDPRG8= <mlev>
##$CPDPRGB= <>
##$CPDPRGT= <>
##$D= (0..31)
0 1 0 0 0 0 0 0 0 0 0 0.03 2e-05 3e-06 0 0 0 0 0 0 0 0 0 0 0 0 0 0 0 0 
0 0 
##$DATE= 1638780384
##$DBL= (0..7)
120 120 120 11 120 120 24 19 
##$DBP= (0..7)
150 150 150 150 150 150 150 150 
##$DBP07= 0
##$DBPNAM0= <>
##$DBPNAM1= <>
$$ [...]
##$SUBNAM3= <"">
##$SUBNAM4= <"">
##$SUBNAM5= <"">
##$SUBNAM6= <"">
##$SUBNAM7= <"">
##$SUBNAM8= <"">
##$SUBNAM9= <"">
##$SW= 501.771253377433
##$SWIBOX= (0..15)
0 1 3 0 0 0 0 0 0 0 0 0 0 0 0 0 
##$SW_h= 40650.406504065
##$TD= 32768
##$TD0= 1
##$TE= 0
##$TE2= 300
##$TE3= 300
##$TEG= 300
##$TL= (0..7)
0 120 53 12 22 120 120 120 
##$TP= (0..7)
150 150 150 150 150 150 150 150 
##$TP07= 0
##$TPNAME0= <>
##$TPNAME1= <>
##$TPNAME2= <>
##$TPNAME3= <>
##$TPNAME4= <>
##$TPNAME5= <>
##$TPNAME6= <>
##$TPNAME7= <>
##$TPOAL= (0..7)
0.5 0.5 0.5 0.5 0.5 0.5 0.5 0.5 
##$TPOFFS= (0..7)
0 0 0 0 0 0 0 0 
##$TUNHIN= 0
##$TUNHOUT= 0
##$TUNXOUT= 0
##$USERA1= <user>
##$USERA2= <user>
##$USERA3= <user>
##$USERA4= <user>
##$USERA5= <user>
##$V9= 5
##$VALIST= <valist>
##$VCLIST= <CCCCCCCCCCCCCCC>
##$VD= 0
##$VDLIST= <DDDDDDDDDDDDDDD>
##$VPLIST= <PPPPPPPPPPPPPPP>
##$VTLIST= <TTTTTTTTTTTTTTT>
##$WBST= 1024
##$WBSW= 4
##$XGAIN= (0..3)
0 0 0 0 
##$XL= 0
##$YL= 0
##$YMAX_a= 22309
##$YMIN_a= -24182
##$ZGOPTNS= <>
##$ZL1= 120
##$ZL2= 120
##$ZL3= 120
##$ZL4= 120
##$ABSF1= 248.5645
##$ABSF2= -253.2056
##$ABSG= 5
##$ABSL= 3
##$ALPHA= 0
##$AQORDER= 0
##$ASSFAC= 0
##$ASSFACI= 0
##$ASSFACX= 0
##$ASSWID= 0
##$AUNMP= <proc_1d>
##$AZFE= 0.1
##$AZFW= 0.5
##$BCFW= 0
##$BC_mod= 2
##$BYTORDP= 0
##$COROFFS= 0
##$CY= -3
##$DATMOD= 1
##$DC= 0
##$DFILT= <>
##$DTYPP= 0
##$F1P= 0
##$F2P= 0
##$FCOR= 1
##$FTSIZE= 65536
##$FT_mod= 6
##$GAMMA= 0
##$GB= 0
##$INTBC= 1
##$INTSCL= 5.30512e-09
##$ISEN= 30
##$LB= 1
##$LEV0= 0
##$LPBIN= 0
##$MAXI= 10000
##$MC2= 0
##$MEAN= 0
##$ME_mod= 0
##$MI= 50
##$NCOEF= 0
##$NC_proc= -4
##$NLEV= 6
##$NOISF1= 182.463
##$NOISF2= 159.3651
##$NSP= 0
##$NTH_PI= 0
##$NZP= 0
##$OFFSET= 248.5645
##$PC= 4
##$PHC0= -9135.869
##$PHC1= -12.53057
##$PH_mod= 1
##$PKNL= yes
##$PPARMOD= 0
##$PSCAL= 0
##$PSIGN= 0
##$REVERSE= no
##$SF= 81.014009
##$SI= 65536
##$SIGF1= 159.3651
##$SIGF2= -187.1042
##$SINO= 113.3802
##$SIOLD= 16384
##$SREGLST= <1H.CDCl3>
##$SSB= 0
##$STSI= 65536
##$STSR= 0
##$SW_p= 40650.406504065
##$SYMM= 0
##$S_DEV= 0
##$TDeff= 32768
##$TDoff= 0
##$TI= <>
##$TILT= no
##$TM1= 0
##$TM2= 0
##$TOPLEV= 0
##$USERP1= <user>
##$USERP2= <user>
##$USERP3= <user>
##$USERP4= <user>
##$USERP5= <user>
##$WDW= 1
##$XDIM= 65536
##$YMAX_p= 350169972
##$YMIN_p= -2809877
$$ End of Bruker specific parameters
$$ ---------------------------------
##NTUPLES= NMR SPECTRUM
##VAR_NAME=  FREQUENCY,     SPECTRUM/REAL,   SPECTRUM/IMAG
##SYMBOL=    X,             R,               I
##VAR_TYPE=  INDEPENDENT,   DEPENDENT,       DEPENDENT
##VAR_FORM=  AFFN,          ASDF,            ASDF
##VAR_DIM=   65536,         65536,           65536
##UNITS=     HZ,            ARBITRARY UNITS, ARBITRARY UNITS
##FACTOR=    0.620285442955139, 1,           1
##FIRST=     20137.2065510759, 0,            0
##LAST=      -20513.1999529892, 0,           0
##MIN=       -20513.1999529892, -2809877,    0
##MAX=       20137.2065510759, 350169972,    0
$$ Real data points
##PAGE= N=1
##DATA TABLE= (X++(R..R)), XYDATA
$$ [...]
$$ plain form
38470 764386 800647 838676 777168 511810 201694 65893 126613 289658 493240 643372
38460 643372 589919 352554 231651 473447 880178 962790 511151 -127871 -405240 -145228
38450 -145228 279174 342346 -81303 -603394 -782799 -613688 -451862 -544668 -821247 -1103274
38440 -1103274 -1276403 -1233752 -927354 -564645 -475400 -649537 -701742 -481442 -372397 -653397
38430 -653397 -876276 -403870 549787 1001246 449579 -428425 -613999 38507 761354 886945
38420 886945 542095 304866 451616 728960 770926 524919 193452 -90467 -342812 -524251
38410 -524251 -471712 -111498 391235 759639 787502 419946 -152717 -493734 -306058 110219
38400 110219 119750 -387213 -766830 -490570 148257 554529 687073 890120 1135869 1049862
$$ packed form
38470G64386L6261L8029o1508k65358l10116j35801O0720J63045K03582J50132
38460F43372n3453k37365j20903K41796M06731Q2612m51639o39022k77369K60012
38450a45228M24402O3172m23649n22091j79405J69111J61826r2806k76579k82027
38440a103274j73129M2651L06398L62709Q9245j74137n2205K20300J09045k81000
38430f53397k22879M72406R53657M51459n51667q78004j85574O52506P22847J25591
38420H86945l44850k37229J46750K77344M1966k46007l31467k83919k52345j81439
38410e24251N2539L60214N02733L68404K7863l67556n72663l41017J87676M16277
38400A10219R531n06963l79617K76260O38827M06272J32544K03047K45749q6007
$$ plain form
38390 1049862 611965 234003 78474 -168845 -687881 -1121124 -1011449 -379104 300121
38381 300121 532013 196965 -313857 -419821 -20499 317987 145331 -162212 26810 532742
38371 532742 558586 -95964 -764122 -959754 -931183 -932966 -721186 -187256 203991 151965
38361 151965 115072 561706 1115114 1124161 716141 543311 695094 615295 80425 -412927
38351 -412927 -380124 26981 318095 263748 39580 -29023 222294 627287 835081 703717
38341 703717 449348 318022 279817 166848 -90124 -490697 -983474 -1330463 -1280923 -1046512
38331 -1046512 -1182610 -1726923 -1940277 -1342961 -552265 -475361 -989652 -1144536 -560369 73669
38321 73669 -21041 -771189 -1425564 -1313751 -382725 725263 1157421 693110 12109 -136044
$$ packed form
38390A049862m37897l77962j55529k47319n19036m33243J09675O32345O79225
38381C00121K31892l35048n10822j05964L99322L38486j72656l07543J89022N05932
38371E32742K5844o54550o68158j95632K8571j783K11780N33930L91247n2026
38361A51965l6893M46634N53408R047m08020j72830J51783p9799n34870m93352
38351d12927L2803M07105K91114n4347k24168o8603K51317M04993K07794j31364
38341G03717k54369j31326l8205j12969k56972m00573m92777l46989M9540K34411
38331a046512j36098n44313k13354N97316P90696P6904n14291j54884N84167O34038
38321G3669r4710p50148o54375J11813R31026J107988M32158m64311o81001j48153
$$ plain form
38311 -136044 189126 415546 334847 178489 74424 31168 272561 916884 1446259 1228382
38301 1228382 533393 271180 672429 1022502 841616 504133 413667 370455 177807 158612
38291 158612 542938 923706 865609 572867 427779 323438 26609 -189162 99428 729044
38281 729044 1139037 1103385 768428 186329 -609544 -1204865 -1100696 -434357 109158 175088
38271 175088 80443 189327 389336 390430 209306 97981 185276 422392 768198 1189674
38261 1189674 1489848 1372976 831623 331446 344427 698387 733212 259948 -46063 394044
38251 394044 1075477 1035469 285698 -195565 35624 289485 -15813 -387216 -171058 273982
38241 273982 173472 -350083 -504586 -154685 37057 -188157 -256427 222979 787761 858487
$$ packed form
38311a36044L25170K26420q0699j56358j04065m3256K41393O44323N29375k17877
38301A228382o94989k62213M01249L50073j80886l37483r0466m3212j92648j9195
38291A58612L84326L80768n8097k92742j45088j04341k96829k15771K88590O29616
38281G29044M09993l5652l34957n82099p95873n95321J04169O66339N43515O5930
38271A75088r4645J08884K00009J094j81124j11325Q7295K37116L45806M21476
38261A189674L00174j16872n41353n00177J2981L53960L4825m73264l06011M40107
38251C94044O81433m0008p49771m81263K31189K53861l05298l71403K16158M45040
38241B73982j00510n23555j54503L49901J91742k25214o8270M79406N64782P0726
$$ plain form
38231 858487 541212 251014 18292 -321383 -590648 -473175 -81832 170613 186487 205600
38221 205600 243344 17414 -443881 -617882 -212898 317264 409623 255666 472936 1044340
38211 1044340 1259759 832521 397636 548805 973941 1062595 860078 748403 598323 81476
38201 81476 -437585 -309523 157875 -44960 -938521 -1253711 -320314 807642 890558 262626
38191 262626 57497 380768 457155 204314 355285 1021645 1340774 850123 228504 217422
38181 217422 571549 615416 297077 141211 457914 1003974 1246194 759377 -372489 -1407279
38171 -1407279 -1554317 -918384 -444403 -693150 -1119368 -935645 -281575 10973 -399170
38162 -399170 -998685 -1232953 -1163349 -1143459 -1230386 -1218880 -1065999 -951598 -928642 -803891
$$ packed form
38231H58487l17275k90198k32722l39675k69265J17473L91343K52445J5874J9113
38221B05600L7744k25930m61295j74001M04984N30162R2359j53957K17270N71404
38211A044340K15419m27238m34885J51169M25136Q8654k02517j11675j50080n16847
38201H1476n19061J28062M67398k02835q93561l15190R33397J127956Q2916o27932
38191B62626k05129L23271P6387k52841J50971O66360L19129m90651o21619j1082
38181B17422L54127M3867l18339j55866L16703N46060K42220m86817j131866j034790
38171a407279j47038O35933M73981k48747m26218J83723O54070K92548m10143
38162c99170n99515k34268O9604J9890q6927J1506J52881J14401K2956J24751
$$ plain form
38152 -803891 -493456 -262695 -356971 -549190 -440582 -181160 -374382 -1067926 -1391261 -685419
38142 -685419 409746 671847 -70252 -736633 -463125 421678 1078888 1186127 940729
38133 940729 557770 219919 187646 505776 789691 665903 276097 39456 66035 110186
38123 110186 -6972 -210137 -332103 -252319 28043 270606 109523 -512569 -1162419 -1378551
38113 -1378551 -1160778 -803589 -473560 -236765 -258053 -555482 -713876 -329318 300532 430684
38103 430684 -110432 -628531 -473362 168598 638881 613153 231945 -290036 -794159 -1058975
38093 -1058975 -932952 -579764 -324260 -269761 -294208 -349988 -450277 -390187 95406 768558
38083 768558 914855 244950 -572806 -728472 -391472 -428845 -1036482 -1341803 -657949 466900
$$ packed form
38152h03891L10435K30761r4276j92219J08608K59422j93222o93544l23335P05842
38142f85419J095165K62101p42099o66381K73508Q84803O57210J07239k45398
38133I40729l82959l37851l2273L18130K83915j23788l89806k36641K6579M4151
38123A10186j17158k03165j21966P9784K80362K42563j61083o22092o49850k16132
38113a378551K17773L57189L30029K36795k1288k97429j58394L84558O29850J30152
38103D30684n41116n18099J55169O41960M70283k5728l81208n21981n04123k64816
38093a058975J26023L53188K55504N4499k4447n5780j00289O0090M85593O73152
38083G68558J46297o69905q17756j55666L37000l7373o07637l05321O83854J124849
$$ plain form
38073 466900 1002627 845448 761969 1068182 1177803 678212 132327 285730 924870 1160761
38063 1160761 666445 11099 -247385 -222530 -267638 -377400 -368805 -335272 -499136 -751743
38053 -751743 -739323 -395870 -46551 83229 152833 358278 560854 498248 211210 -14316
38043 -14316 -94956 -278241 -745848 -1283949 -1511053 -1355573 -1136978 -1146071 -1270043 -1132049
38033 -1132049 -555859 218422 785093 922573 647923 66026 -676144 -1330755 -1613229
38024 -1613229 -1385434 -752070 -30776 350337 129196 -424770 -613945 -89525 628450
38015 628450 799318 469856 268822 286775 -33104 -724233 -951271 -342127 223272 -44454
38005 -44454 -489206 -70337 815108 908493 199119 -43482 570741 902503 266838 -382432
$$ packed form
38073D66900N35727j57179q3479L06213J09621m99591n45885J53403O39140K35891
38063A160761m94316o55346k58484K4855m5108j09762Q595L3533j63864k52607
38053g51743J2420L43453L49319J29780O9604K05445K02576o2606k87038k25526
38043a4316q0640j83285m67607n38101k27104J55480K18595r093j23972J37994
38033a132049N76190P74281N66671J37480k74650n81897p42170o54611k82474
38024a613229K27795O33364P21294L81113k21141n53966j89175N24420P17975
38015F28450J70868l29462k01034J7953l19879o91129k27038O09144N65399k67726
38005d4454m44752M18869Q85445R3385p09374k42601O14223L31762o35665o49270
$$ plain form
37995 -382432 -86504 525856 375487 -269048 -372635 106017 316572 53557 -46417 226064
37985 226064 312557 -41092 -310258 -49590 502266 936853 1204991 1384883 1395803 1166412
37975 1166412 751221 180702 -490712 -989864 -1043054 -783794 -594322 -580110 -537935 -345386
37965 -345386 -21801 442434 910603 960161 411104 -210764 -297065 -42145 -73678 -395012
37955 -395012 -454036 -169748 -56652 -276585 -380292 -143454 105325 193755 405578 801589
37945 801589 916516 458739 -237207 -714300 -847583 -650531 -204131 92914 -155478 -633078
37935 -633078 -614309 -120612 12502 -554422 -1123335 -1041339 -493226 135345 794562 1231666
37925 1231666 864013 -196173 -865205 -527507 71882 102748 -49303 340394 949029
$$ packed form
37995c82432K95928O12360j50369o44535j03587M78652K10555k63015r9974K72481
37985B26064Q6493l53649k69166K60668N51856M34587K68138J79892J0920k29391
37975A166412m15191n70519o71414m99152n3190K59260J89472J4212M2175J92549
37965c45386L23585M64235M68169M9558n49057o21868q6301K54920l1533l21334
37955c95012n9024K84288J13096k19933j03707K36838K48779Q8430K11823L96011
37945H01589J14927m57777o95946m77093j33283J97052M46400K97045k48392m77600
37935f33078J8769M93697J33114n66924n68913Q1996N48113O28571O59217M37104
37925A231666l67653j060186o69032L37698N99389L0866j52051L89697O08635
$$ plain form
37916 949029 964746 441119 24835 -188679 -466763 -541889 -29054 572953 438322 -216456
37906 -216456 -417944 35195 408840 323467 117318 -74359 -501190 -969618 -912211 -446993
37896 -446993 -314006 -558990 -397333 279442 424784 -545190 -1667834 -1730306 -871363 -98948
37886 -98948 171569 262121 334887 190262 -173036 -431767 -368988 -55457 331809 614604
37876 614604 663440 530902 382216 220698 -42680 -220103 7967 467982 547174 99097
37866 99097 -260515 -92473 194787 71707 -233704 -184893 116986 114211 -273395 -541289
37856 -541289 -382984 -29711 221920 351931 402302 311812 106960 -12117 82331 265796
37846 265796 310641 132226 -133805 -263803 -202759 -183362 -433383 -752231 -648243 -17001
$$ packed form
37916I49029J5717n23627m16284k13514k78084p5126N12835O02007j34631o54778
37906b16456k01488M53139L73645q5373k06149j91677m26831m68428N7407M65218
37896d46993J32987k44984J61657O76775J45342r69974j122644o2472Q58943P72415
37886i8948K70517R0552P2766j44625l63298k58731O2779L13531L87266K82795
37876F14604M8836j32538j48686j61518k63378j77423K28070M60015P9192m48077
37866I9097l59612J68042K87260j23080l05411M8811L01879k775l87606k67894
37856e41289J58305L53273K51631J30011N0371r0490k04852j19077R4448J83465
37846B65796M4845j78415k66031j29998O1044J9397k50021l18848J03988O31242
$$ plain form
37836 -17001 609223 702968 369391 71594 -11805 -6482 67230 274799 412094 136051 -464890
37825 -464890 -819864 -581814 -108705 -5750 -351919 -635373 -416535 174348 671665 836301
37815 836301 813843 796612 758461 608087 409700 276068 176360 58437 53084 298565 626491
37804 626491 718920 577448 539286 784792 1116804 1291678 1272677 1063574 606555 4947
37794 4947 -431177 -556674 -588484 -757689 -975542 -1018045 -838051 -516320 -97445 339133
37784 339133 611515 605138 369201 -38105 -561486 -905092 -626287 263984 1070571 1112023
37774 1112023 486842 -120668 -216568 197794 887076 1559370 1858702 1555784 821719 124414
37764 124414 -162614 40144 572016 1106941 1306421 1116634 843296 792757 967818 1222892
$$ packed form
37836a7001O26224R3745l33577k97797q3399N323P3712K07569J37295k76043o00941
37825d64890l54974K38050M73109J02955l46169k83454K18838N90883M97317J64636
37815H36301k2458j7231l8151j50374j98387j33632r9708j17923n353K45481L27926
37804F26491R2429j41472l8162K45506L32012J74874j9001k09103m57019o01608
37794D947m36124j25497l1810j69205k17853m2503J79994L21731M18875M36578
37784C39133K72382o377k35937m07306n23381l43606K78805Q90271Q06587M1452
37774A112023o25181o07510r5900M14362O89282O72294K99332l02918p34065o97305
37764A24414k87028K02758N31872N34925J99480j89787k73338n0539J75061K55074
$$ plain form
37754 1222892 1464728 1508909 1060767 176452 -531355 -563380 -197271 -40910 -132272 -23377
37744 -23377 377546 672572 673329 608714 561570 340438 73997 255100 884286 1226153 878519
37733 878519 490567 803609 1455393 1496736 815401 223282 193138 319647 177451 -19443
37723 -19443 59831 252279 228192 46116 -11074 105235 227972 223879 -10697 -506663 -924251
37712 -924251 -683697 225885 945837 762783 103171 -94661 269155 493864 320908 223307
37702 223307 354035 176907 -456004 -740207 -71638 924261 1266134 984219 783547 758171
37692 758171 420924 -154108 -247661 309066 737559 421149 -285554 -704629 -695659 -479859
37682 -479859 -128304 304530 523620 357023 121704 174148 274266 -142618 -1102132 -1903637
$$ packed form
37754A222892K41836M4181m48142q84315p07807l2025L66109J56361r1362J08895
37744b3377M00923K95026P57o4615m7144k21132k66441J81103O29186L41867l47634
37733H78519l87952L13042O51784M1343o81335n92119l0144J26509j42196j96894
37723a9443P9274J92448k4087j82076n7190J16309J22737m093k34576m95966m17588
37712i24251K40554R09582P19952j83054o59612j97832L63816K24709j72956r7601
37702B23307J30728j77128o32911k84203O68569R95899L41873k81915k00672k5376
37692G58171l37247n75032r3553N56727M28493l16410p06703m19075Q970K15800
37682d79859L51555M32834K19090j66597k35319N2444J00118m16884r59514q01505
$$ plain form
37672 -1903637 -1896199 -1193662 -479627 -225413 -274489 -240826 -142224 -337092 -797676 -885464
37662 -885464 -214034 600545 637398 -9859 -287308 345680 1144048 1079114 113966 -901093
37652 -901093 -1261502 -969506 -494223 -290232 -434867 -571095 -333410 148334 424226 384755
37642 384755 345450 432249 381337 98190 -108270 -87751 -134263 -414882 -614367 -507188
37632 -507188 -412385 -668629 -1064683 -1192909 -991676 -581612 8043 576530 684996 266236
37622 266236 -171091 -331081 -527967 -841055 -625902 419993 1420490 1455591 914027
37613 914027 685910 585493 -163499 -1264851 -1606837 -1084395 -726211 -876476 -685905
37604 -685905 209941 872715 555275 -132869 -282739 48130 350050 560009 679293 308169
$$ packed form
37672a903637P438P02537P14035K54214m9076L3663R8602j94868m60584q7788
37662h85464O71430Q14579L6853o47257k77449O32988P98368o4934r65148j015059
37652i01093l60409K91996M75283K03991j44635j36228K37685M81744K75892l9471
37642C84755l9305Q6799n0912k83147k06460K0519m6512k80619j99485J07179
37632e07188R4803k56244l96054j28226K01233M10064N89655N68487J08466m18760
37622B66236m37327j59990j96886l13088K15153J045895J000497L5101n41564
37613I14027k28117j00417p48992j101352l41986N22442L58184j50265J90571
37604f85905Q95846O62774l17440o88144j49870L30869L01920K09959J19284l71124
$$ plain form
37594 308169 -587977 -1147048 -741550 -65268 -181555 -965263 -1418929 -1162126 -665840 -275631
37584 -275631 53046 189366 -97344 -523369 -549424 -238136 -101849 -146603 86599 485436
37574 485436 309801 -545177 -1088217 -534380 572310 1107914 793496 297965 210614 495547
37564 495547 875403 1231280 1496046 1476963 1014275 254761 -374583 -545755 -371735 -274780
37554 -274780 -484388 -810744 -992651 -1049259 -1093037 -1028614 -760373 -517872 -559469 -660848
37544 -660848 -395013 78194 58597 -686036 -1466710 -1534932 -997240 -508196 -379319 -428425
37534 -428425 -500570 -649124 -830322 -831711 -587266 -285114 -89831 19994 84518 55846
37524 55846 -53535 -104501 -26467 67673 81259 123547 343088 631185 655789 222219 -487626
$$ packed form
37594C08169q96146n59071M05498O76282j16287p83708m53666K56803M96286L90209
37584b75631L28677J36320k86710m26025k6055L11288J36287m4754K33202L98837
37574D85436j75635q54978n43040N53837J106690N35604l14418m95531q7351K84933
37564D95547L79856L55877K64766j9083m62688p59514o29344j71172J74020R6955
37554b74780k09608l26356j81907n6608m3778O4423K68241K42501m1597j01379
37544f60848K65835M73207j9597p44633p80674o8222N37692M89044J28877m9106
37534d28425p2145j48554j81198j389K44445L02152J95283J09825O4524k8672
37524E5846j09381n0966P8034R4140J3586M2288K19541K88097K4604m33570p09845
$$ plain form
37513 -487626 -1063188 -1196399 -873078 -349940 -7339 -113440 -570616 -912671 -733503 -176417
37503 -176417 174491 -3495 -370096 -422594 -210658 -199239 -492618 -662901 -483115 -362157
37493 -362157 -705426 -1201680 -1237966 -823353 -525957 -520789 -320254 358227 1016055 1041496
37483 1041496 553435 136178 15937 -15052 -44593 40859 119688 -149861 -767060 -1270104
37473 -1270104 -1326213 -1069512 -705795 -178838 525194 1080192 1151937 837510 526390 478253
37463 478253 694102 971915 929571 296677 -566207 -799749 -67955 884089 1164881 923777
37453 923777 981408 1463483 1585276 892926 -18796 -360014 -157789 8831 -108473 -264526
37443 -264526 -206498 95375 588497 1167399 1602701 1681382 1394788 865537 219155 -330893
$$ packed form
37513d87626n75562j33211L23321N23138L42601j06101m57176l42055J79168N57086
37503a76417L50908j77986l66601n2498K11936J1419k93379j70283J79786J20958
37493c62157l43269m96254l6286M14613K97396N168K00535O78481O57828K5441
37483A041496m88061m17257j20241l0989k9541Q5452P8829k69549o17199n03044
37473a270104n6109K56701L63717N26957P04032N54998P1745l14427l11120m8137
37463D78253K15849K77813m2344o32894q62884k33542P31794R52044K80792k41104
37453I23777N7631M82075J21793o92350r11722l41218K02225J66620j17304j56053
37443b64526N8028L01873M93122N78902M35302P8681k86594n29251o46382n50048
$$ plain form
37433 -330893 -485956 -225136 -25529 -382067 -1118303 -1484200 -1037346 -204143 196142 -126509
37423 -126509 -667471 -791702 -488068 -277609 -416774 -506637 -107709 511463 666958 247230
37413 247230 -84102 170398 649620 717611 410658 334273 719177 1027637 611080 -500728
37403 -500728 -1611306 -2048646 -1749552 -1179099 -732557 -335655 246704 841330 949570
37394 949570 461191 -85627 -182678 18102 61319 -83838 -61914 234459 497906 475222
37384 475222 249114 6673 -181907 -304707 -380551 -525372 -817667 -1100132 -1165028 -1103700
37374 -1103700 -1152146 -1210236 -936537 -398049 -136394 -343653 -439326 113626 923188 1142188
37364 1142188 653158 191098 272127 572486 570331 312063 176500 208125 136202 -82889
$$ packed form
37433c30893j55063K60820J99607l56538p36236l65897M46854Q33203M00285l22651
37423a26509n40962j24231L03634K10459j39165q9863L98928O19172J55495m19728
37413B47230l31332K54500M79222O7991l06953p6385L84904L08460m16557j111808
37403e00728j110578m37340K99094N70453M46542L96902N82359N94626J08240
37394I49570m88379n46818r7051K00780M3217j45157K1924K96373K63447k2684
37384D75222k26108k42441j88580j22800p5844j44821k92295k82465o4896O1328
37374a103700m8446n8090K73699N38488K61655k07259r5673N52952Q09562K19000
37364A142188m89030m62060Q1029L00359k155k58268j35563L1625p1923k19091
$$ plain form
37354 -82889 -187178 -87902 -34622 -159739 -166374 276826 984531 1363033 1055977 292374
37344 292374 -440791 -904734 -1169530 -1270571 -1041525 -425136 195473 281302 -169747 -505314
37334 -505314 -217483 392809 702207 704569 920134 1394060 1441832 645454 -466895 -1146028
37324 -1146028 -1362086 -1521867 -1641079 -1425331 -948307 -603467 -469037 -304408 -114823
37315 -114823 -134167 -284991 -267013 -168186 -320115 -519962 -172903 619615 930773 313779
37305 313779 -530919 -858911 -911567 -1217177 -1527572 -1280755 -693278 -495704 -749975 -754660
37295 -754660 -152516 550727 721597 369180 19807 107514 546098 746685 187995 -852295
37285 -852295 -1403603 -912010 84110 731037 895394 917279 754277 105417 -827715 -1443208
$$ packed form
37354h2889j04289R9276N3280j25117o635M43200P07705L78502l07056p63603
37344B92374p33165m63943k64796j01041K29046O16389O20609Q5829m51049l35567
37334e05314K87831O10292L09398K362K15565M73926M7772p96378j112349o79133
37324a146028k16058j59781j19212K15748M77024L44840J34430J64629J89585
37315a14823j9344j50824J7978R8827j51929j99847L47059P92518L11158o16994
37305C13779q44698l27992n2656l05610l10395K46817N87477J97574k54271m685
37295g54660O02144P03243J70870l52417l49373Q7707M38584K00587n58690j040290
37285h52295n51308M91593R96120O46927J64357K1885j63002o48860r33132o15493
$$ plain form
37275 -1443208 -1523602 -1284891 -779322 43141 775306 833274 319134 -106020 -201041 -248680
37265 -248680 -226792 212820 850555 966550 544047 423414 898826 1161724 646029 -58771
37255 -58771 -289020 -347606 -653150 -748516 -179864 369174 -4849 -879793 -1091828 -535784
37245 -535784 -142120 -221653 -126891 360264 561352 138109 -313818 -358411 -425201 -872398
37235 -872398 -1215767 -949845 -412117 -117750 141213 727849 1178928 715679 -464651
37226 -464651 -1266802 -1086669 -429789 -52956 -99312 -272730 -362756 -305700 -43796 388464
37216 388464 762789 790457 318254 -548914 -1369970 -1550562 -924474 -100877 133878 -237217
37206 -237217 -515567 -316872 -28457 -50337 -143142 53219 317444 236628 -20767 15117
$$ packed form
37275a443208q0394K38711N05569Q22463P32165N7968n14140m25154r5021m7639
37265b48680K1888M39612O37735J15995m22503j20633M75412K62898n15695p04800
37255e8771k30249n8586l05544r5366N68652N49038l74023q74944k12035N56044
37245e35784L93664p9533R4762M87155K01088m23243m51927m4593o6790m47197
37235h72398l43369K65922N37728K94367K58963N86636M51079m63249j180330
37226d64651q02151J80133O56880L76833m6356j73418r0026N7056K61904M32260
37216C88464L74325K7668m72203q67168q21056j80592O26088Q23597K34755l71095
37206b37217k78350J98695K88415k1880r2805J96361K64225q0816k57395L5884
$$ plain form
37196 15117 242990 144073 -207976 -116372 529263 820451 109479 -924961 -1164525 -557392
37186 -557392 6302 33519 -180454 -398798 -805263 -1353454 -1533053 -1149449 -740539 -802201
37176 -802201 -1092389 -1164957 -1153056 -1428106 -1754563 -1460789 -447088 544357 827182 539148
37166 539148 301906 396326 552475 450148 158353 -12856 30144 39431 -195931 -517240
37156 -517240 -616204 -472464 -321188 -254157 -181533 -180741 -458839 -841318 -751079 13568 855352
37145 855352 1098368 818869 531578 327409 -110175 -738334 -1021224 -699545 -221969 -152969
37135 -152969 -435462 -509242 -51227 595963 761446 184641 -631196 -926538 -544270 -44955
37125 -44955 93372 11343 -17229 -142511 -522375 -721605 -228184 583967 770543 134564
$$ packed form
37196A5117K27873r8917l52049R1604O45635K91188p10972j034440k39564O07133
37186e57392N63694K7217k13973k18344m06465n48191j79599L83604M08910o1662
37176h02201k90188p2568J1901k75050l26457K93774J013701R91445K82825k88034
37166E39148k37242R4420J56149j02327k91795j71209M3000R287k35362l21309
37156e17240r8964J43740J51276O7031P2624P92k78098l82479R0239P64647Q41784
37145H55352K43016k79499k87291k04169m37584o28159k82890L21679M77576O9000
37135a52969k82493p3780M58015O47190J65483n76805q15837k95342L82268M99315
37125d4955J38327q2029k8572j25282l79864j99230M93421Q12151J86576o35979
$$ plain form
37115 134564 -520718 -633898 -620536 -990449 -1414187 -1255107 -579270 -19944 95583 -65055
37105 -65055 -314296 -556487 -543922 -73908 550851 712982 214487 -507357 -931492 -917251
37095 -917251 -616122 -261412 -109557 -290815 -623100 -790773 -729279 -596103 -398732 -6231
37085 -6231 430143 475635 -1759 -591094 -882373 -905769 -782037 -332680 517085 1229952
37075 1229952 1151349 477324 153782 668124 1441653 1680709 1376511 1050172 863415 569464
37065 569464 217541 248525 728892 1043384 715032 155793 132019 669449 1000310 625732
37055 625732 -16260 -141181 411898 1054732 1160606 670917 14055 -403404 -538413 -589278
37045 -589278 -645661 -596873 -408188 -289032 -400711 -537666 -383305 -30360 89704 -162338
$$ packed form
37115A34564o55282j13180J3362l69913m23738J59080O75837N59326J15527j60638
37105f5055k49241k42191J2565M70014O24759J62131m98495p21844m24135J4241
37095i17251L01129L54710J51855j81258l32285j67673O1494J33176J97371L92501
37085f231M36374M5492m77394n89335k91279k3396J23732M49357Q49765P12867
37075A229952p8603o74025l23542N14342P73529K39056l04198l26339j86757k93951
37065E69464l51923L0984M80367L14492l28352n59239k3774N37430L30861l74578
37055F25732o41992j24921N53079O42834J05874m89689o56862m17459j35009n0865
37045e89278n6383M8788J88685J19156j11679j36955J54361L52945J20064k52042
$$ plain form
37035 -162338 -434559 -462331 -487556 -825878 -1297088 -1445354 -1162629 -738721 -403393 -186995
37025 -186995 -160118 -381801 -579697 -329435 284131 583491 150472 -542416 -698406 -204366
37015 -204366 307331 340468 96886 60410 301379 413505 69554 -531491 -856398 -663284
37005 -663284 -315465 -315386 -588954 -553984 -23446 340624 -138885 -1109536 -1522038 -983097
36995 -983097 -217000 -30955 -360492 -658624 -761005 -881674 -1054291 -1119674 -1130701 -1264933
36985 -1264933 -1394372 -1227655 -868797 -730103 -823823 -661925 -45123 526366 514713 33054
36975 33054 -442801 -725673 -927358 -1076191 -1111120 -1102683 -1126000 -1010803 -538024 169447
36965 169447 733626 976847 1059559 1167914 1244602 1060766 505201 -162759 -429402 -134498
$$ packed form
37035a62338k72221k7772k5225l38322m71210j48266K82725M23908L35328K16398
37025a86995K6877k21683j97896K50262O13566K99360m33019o92888j55990M94040
37015b04366N11697L3137k43582l6476K40969J12126l43951o01045l24907J93114
37005f63284L47819P9k73568L4970N30538L64070m79509r70651m12502N38941
36995i83097P66097J86045l29537k98132j02381j20669j72617o5383j1027j34232
36985a264933j29439J66717L58858J38694r3720J61898O16802N71489j1653m81659
36975C3054m75855k82872k01685j48833l4929Q437k3317J15197M72779P07471
36965A69447N64179K43221Q2712J08355P6688j83836n55565o67960k66643K94904
$$ plain form
36955 -134498 110226 -426350 -1442593 -1712613 -674207 702534 1179661 839699 668037
36946 668037 964877 1100763 696599 106273 -326348 -637121 -742737 -400741 126285 173631
36936 173631 -281190 -470243 -70980 231926 -107615 -592058 -547798 -188882 -77606 -122012
36926 -122012 67366 292170 105520 -307716 -458321 -489421 -874884 -1362439 -1208189 -467413
36916 -467413 -58935 -347158 -585544 -140541 538269 678577 280764 -121313 -335833 -559002
36906 -559002 -830212 -984905 -1009742 -1007510 -909550 -616185 -359050 -526907 -1083417 -1482532
36896 -1482532 -1288292 -652488 -28415 401893 768789 1056642 950560 326304 -357268
36887 -357268 -511907 -189118 -3070 -260657 -609984 -691248 -648014 -697596 -662416 -367519
$$ packed form
36955a34498K44724n36576j016243k70020J038406J376741M77127l39962j71662
36946F68037K96840J35886m04164n90326m32621l10773j05616L41996N27026M7346
36936A73631m54821j89053L99263L02906l39541m84443M4260L58916J11276m4406
36926a22012J89378K24804j86650m13236j50605l1100l85463m87555J54250P40776
36916d67413M08478k88223k38386M45003O78810J40308l97813m02077k14520k23169
36906e59002k71210j54693k4837K232R7960K93365K57135j67857n56510l99115
36896a482532J94240O35804O24073M30308L66896K87853j06082o24256o83572
36887c57268j54639L22789J86048k57587l49327q1264M3234m9582L5180K94897
$$ plain form
36877 -367519 -110676 -203669 -359626 -140647 218334 99548 -513652 -1026600 -1154691 -1144435
36867 -1144435 -1043853 -519229 377491 931946 613094 -262807 -977877 -1126025 -724888
36858 -724888 -76053 318838 162417 -183817 -136231 170789 55328 -479341 -550945 177407
36848 177407 757882 297806 -691881 -1099612 -807665 -573828 -678564 -654834 -274840 54796
36838 54796 -20368 -370185 -732791 -968507 -901164 -419316 156532 246362 -308882 -1043928
36828 -1043928 -1409249 -1259567 -821398 -449907 -401171 -611241 -746188 -630882 -455323 -381408
36818 -381408 -259559 -30173 -25919 -421175 -732503 -447730 118006 246286 -97039 -308995
36808 -308995 -189887 -180644 -507330 -805316 -773604 -598375 -513651 -450187 -323066 -236877 -250888
$$ packed form
36877c67519K56843r2993j55957K18979L58981j18786o13200n12948j28091J0256
36867a144435J00582N24624Q96720N54455l18852q75901p15070j48148M01137
36858g24888O48835L94891j56421l46234M7586L07020j15461n34669p1604P28352
36848A77407N80475m60076r89687m07731K91947K33837j04736K3730L79994L29636
36838E4796p5164l49817l62606k35716O7343M81848N75848Q9830n55244p35046
36828a043928l65321J49682M38169L71491M8736k10070j34947J15306J75559P3915
36818c81408J21849K29386M254l95256l11328K84773N65736J28280l43325k11956
36808c08995J19108R243l26686k97986L1712J75229Q4724O3464J27121Q6189j4011
$$ plain form
36797 -250888 -316400 -497227 -838033 -1040759 -792128 -386854 -401078 -718304 -592047 189564
36787 189564 947198 1153190 1082863 1086856 958013 508887 133555 215299 468136 424259
36777 424259 167758 68532 160611 271525 407715 542143 392932 -98762 -442581 -263192
36767 -263192 74416 48117 -182431 -150928 14711 -202829 -754285 -996086 -643922 -159547
36757 -159547 -79762 -397431 -709185 -673739 -281456 143333 280517 252675 447223 775489
36747 775489 624874 -114493 -594319 -187535 433748 222835 -647979 -1075825 -677577 -128255
36737 -128255 91418 219960 336157 -6639 -875078 -1539249 -1459967 -1047253 -967033 -1225924
36727 -1225924 -1379219 -1200161 -764132 -262050 -23323 -309199 -834320 -951672 -546442
$$ packed form
36797b50888o5512j80827l40806k02726K48631M05274j4224l17226J26257P81611
36787A89564P57634K05992p0327L993j28843m49126l75332Q1744K52837m3877
36777D24259k56501r9226R2079J10914J36190J34428j49211m91694l43819J79389
36767b63192L37608k6299k30548L1503J65639k17540n51456k41801L52164M84375
36757a59547P9785l17669l11754L5446L92283M24789J37184k7842J94548L28266
36747G75489j50615p39367m79826M06784O21283k10913q70814m27846L98248N49322
36737a28255K19673J28542J16197l42796q68439o64171P9282M12714Q0220k58891
36727a225924j53295J79058M36029N02082K38727k85876n25121j17352M05230
$$ plain form
36718 -546442 -225482 -363302 -560844 -410579 -183061 -267066 -465019 -386060 -94153 147677
36708 147677 342961 472065 224403 -404895 -745174 -350762 191299 121041 -257527 -113291
36698 -113291 453852 548138 -18183 -438880 -276471 -103636 -451577 -982107 -1141924 -934739
36688 -934739 -609021 -218557 60544 -196479 -938999 -1343696 -846618 -30431 143338 -379420
36678 -379420 -882257 -999779 -970854 -921241 -641018 -123436 294146 435425 429246 295966
36668 295966 -76298 -464859 -416151 -4872 101850 -363046 -780661 -568236 -50566 154646
36658 154646 163512 492674 974546 883241 150819 -403200 -296673 -51694 -209214 -386693
36648 -386693 20678 709514 854419 388543 80171 355525 812178 1018469 1055111 1008895
$$ packed form
36718e46442L20960j37820j97542J50265K27518q4005j97953P8959K91907K41830
36708A47677J95284J29104k47662o29298l40279L94412N42061p0258l78568J44236
36698a13291N67143R4286n66321m20697J62409J72835l47941n30530j59817K07185
36688i34739L25718L90464K79101k57023p42520m04697M97078Q16187J73769n22758
36678c79420n02837j17522K8925M9613K80223N17582M17582J41279o179j33280
36668B95966l72264l88561M8708M11279J06722m64896m17615K12425N17670K05212
36658A54646Q866L29162M81872r1305p32422n54019J06527K44979j57520j77479
36648c86693M07371O88836J44905m65876l08372K75354M56653K06291L6642m6216
$$ plain form
36638 1008895 654215 75661 -41014 638676 1347801 1165834 397953 167342 749261
36629 749261 1227242 961172 494956 539722 794611 498063 -292323 -780265 -637251 -345507
36619 -345507 -252412 -12080 681880 1354747 1283135 523097 -126066 -163355 59287 -43012
36609 -43012 -460677 -658376 -323839 241654 524271 397039 163043 48986 -134694 -659353
36599 -659353 -1297489 -1396519 -700138 154051 298751 -293067 -798925 -643017 -156815 64480
36589 64480 34512 183643 559179 733521 461573 -9525 -315380 -293115 80046 661966
36579 661966 1015330 753608 151631 -36918 423105 880660 715466 182578 -64909 72333
36569 72333 164853 -16281 -313424 -579345 -764931 -703798 -299645 110991 60967 -368986
$$ packed form
36638A008895l54680n78554j16675O79690P09125j81967p67881k30611N81919
36629G49261M77981k66070m66216M4766K54889k96548p90386m87942J43014K91744
36619c45507R3095K40332O93960O72867p1612p60038o49163l7289K22642j02299
36609d3012m17665j97699L34537N65493K82617j27232k33996j14057j83680n24659
36599f59353o38136r9030O96381Q54189J44700n91818n05858J55908M86202K21295
36589F4480k9968J49131L75536J74342k71948m71098l05855K2265L73161N81920
36579F61966L53364k61722o01977j88549M60023M57555j65194n32888k47487J37242
36569G2333R2520j81134k97143k65921j85586O1133M04153M10636n0024m29953
$$ plain form
36559 -368986 -607027 -339740 206596 704301 963812 749878 -61223 -1033139 -1452956 -1248124
36549 -1248124 -1067385 -1240057 -1278837 -765962 -119227 36815 -220403 -379502 -269486 -13376
36539 -13376 403721 899247 970362 314395 -470509 -541024 5205 356140 252392 158895
36529 158895 209603 -20983 -491798 -440669 395022 1172333 1142083 699484 554094 537190
36519 537190 97556 -519233 -576829 -101199 131397 -163253 -413699 -181192 260529 529693
36509 529693 628306 574747 190608 -400365 -625094 -229240 265763 303088 77539 98378
36499 98378 316191 270462 -86012 -323678 -282176 -318103 -665813 -1002905 -911094 -480155
36489 -480155 -162162 -161012 -233947 -96790 172463 241553 -29121 -370593 -390384 -8601
$$ packed form
36559c68986k38041K67287N46336M97705K59511k13934q11101r71916m19817K04832
36549a248124J80739j72672l8780N12875O46735J56042k57218j59099J10016K56110
36539a3376M17097M95526P1115o55967p84904p0515N46229L50935j03748r3497
36529A58895N0708k30586m70815N1129Q35691P77311l0250m42599j45390j6904
36519E37190m39634o16789n7596M75630K32596k94650k50446K32507M41721K69164
36509E29693R8613n3559l84139n90973k24729L95854M95003L7325k25549K0839
36499I8378K17813m5729l56474k37666M1502l5927l47710l37092R1811M30939
36489d80155L17993J150p2935J37157K69253O9090k70674l41472j9791L81783
$$ plain form
36479 -8601 476189 711345 565548 124564 -405402 -770285 -834135 -737117 -728581 -815691 -795479
36468 -795479 -660818 -642693 -726676 -541825 -31525 173226 -431380 -1288230 -1315099 -364478
36458 -364478 489332 310928 -589825 -1229724 -1195324 -873332 -694126 -641110 -512218 -306313
36448 -306313 -206218 -313227 -491034 -477874 -202317 13351 -284127 -1115337 -1894644 -1971707
36438 -1971707 -1308379 -529065 -333253 -887615 -1708113 -2093514 -1762492 -1097642 -683270
36429 -683270 -646478 -626227 -341235 96306 446325 573512 336569 -339020 -1088587 -1261954
36419 -1261954 -779303 -397796 -669508 -1055138 -719629 95723 314583 -422942 -1281171
36410 -1281171 -1436845 -988975 -414703 93831 320993 -184883 -1339319 -2092843 -1568594
$$ packed form
36479h601M84790K35156j45797m40984n29966l64883o3850R7018Q536q7110K0212
36468g95479J34661J8125q3983J84851N10300K04751o04606q56850k6869R50621
36458c64478Q53810j78404r00753o39899L4400L21992J79206N3016J28892K05905
36448c06313J00095j07009j77807J3160K75557K15668k97478q31210p79307p7063
36438a971707O63328P79314J95812n54362q20498l85401L31022O64850M14372
36429f83270L6792K0251K84992M37541L50019J27187k36943o75589p49567j73367
36419a261954M82651L81507k71712l85630L35509Q15352K18860p37525q58229
36410a281171j55674M47870N74272N08534K27162n05876j154436p53524N24249
$$ plain form
36401 -1568594 -303012 428130 306062 156279 501202 839195 625190 203768 271418
36392 271418 868789 1398248 1410523 996040 524920 276834 271382 321110 294798 288867 355167
36381 355167 194557 -446740 -1108257 -956399 3991 693520 351698 -397978 -469807 143219
36371 143219 499804 144100 -393020 -516478 -258362 92742 432204 695017 776220 801066
36361 801066 1026766 1313142 1181300 591340 123662 111206 153266 -117185 -345333 -88929
36351 -88929 334263 336649 84839 239481 784567 939222 358786 -318897 -427648 -164877
36341 -164877 -113723 -340954 -480835 -431972 -429922 -520672 -458305 -188681 -27161 -180816 -396744
36330 -396744 -340302 -135452 -214704 -676496 -1112570 -1161568 -937265 -701621 -388187 167062
$$ packed form
36401a568594J265582P31142j22068j49783L44923L37993k14005m21422O7650
36392B71418N97371N29459J2275m14483m71120k48086n452M9728k6312n931O6300
36381C55167j60610o41297o61517J51858R60390O89529l41822p49676p1829O13026
36371A43219L56585l55704n37120j23458K58116L51104L39462K62813Q1203K4846
36361H01066K25700K86376j31842n89960m67678j2456M2060k70451k28148K56404
36351h8929M23192K386k51810J54642N45086J54655n80436o77683j08751K62771
36341a64877N1154k27231j39881M8863K050r0750O2367K69624J61520j53655k15928
36330c96744N6442K04850p9252m61792m36074m8998K24303K35644L13434N55249
$$ plain form
36320 167062 665491 539260 -185751 -697239 -356880 494230 1033624 968421 624528 256949
36310 256949 -163233 -496664 -356521 284338 806731 590332 -244008 -991461 -1153723 -872171
36300 -872171 -642360 -775796 -1136402 -1292867 -925208 -157768 498858 594193 160389 -333102
36290 -333102 -477893 -342458 -297281 -453833 -511041 -284554 -94344 -285006 -598502 -550583
36280 -550583 -299343 -421808 -756799 -339912 1103325 2420300 2459271 1565496 841791
36271 841791 516498 85996 -341355 -112195 618471 851113 295036 -153105 129436 558985
36261 558985 391015 -181855 -574921 -704255 -717712 -503735 -111376 -66776 -617366 -1181839
36251 -1181839 -1167115 -797883 -514613 -159608 471240 853272 456041 -175570 -69745 689006
$$ packed form
36320A67062M98429j26231p25011n11488L40359Q51110N39394o5203l43893l67579
36310B56949m20182l33431J40143O40859N22393k16399q34340p47453j62262K81552
36300h72171K29811j33436l60606j56465L67659P67440O56626R5335m33804m93491
36290c33102j44791J35435M5177j56552n7208K26487J90210j90662l13496M7919
36280e50583K51240j22465l34991M16887J443237J316975L8971q93775p23705
36271H41791l25293m30502m27351K29160P30666K32642n56077m48141K82541M29549
36261E58985j67970n72870l93066j29334j3457K13977L92359M4600n50590n64473
36251a181839J4724L69232K83270L55005O30848L82032l97231o31611J05825P58751
$$ plain form
36241 689006 1113723 819349 398093 317731 406159 534167 902556 1423995 1604982 1309955
36231 1309955 977989 864641 722952 443813 327574 445612 396636 37537 -159823 129601
36221 129601 522577 550728 346232 248961 170378 -136542 -497710 -535540 -289277 -164986
36211 -164986 -344230 -596186 -661924 -577686 -576704 -748778 -814391 -360544 537757 1135548 838164
36200 838164 62537 -236389 167347 611589 682424 733686 1026101 1153703 820341 486981
36190 486981 586965 660483 63685 -833619 -1032209 -369294 211326 -51413 -835457 -1327793
36180 -1327793 -1216084 -829000 -610849 -694434 -837643 -673157 -133896 379488 425875 91101
36170 91101 -83983 241445 816704 1113412 899354 445658 214948 359154 556890 438864
$$ packed form
36241F89006M24717k94374m21256q0362Q8428J28008L68389N21439J80987k95027
36231A309955l31966j13348j41689k79139j16239J18038m8976l59099j97360K89424
36221A29601L92976K8151k04496r7271p8583l06920l61168l7830K46263J24291
36211a64986j79244k51956o5738Q4238R82j72074o5613M53847Q98301N97791k97384
36200H38164p75627k98926M03736M44242P0835N1262K92415J27602l33362l33360
36190D86981R9984P3518n96798q97304j98590O62915N80620k62739p84044m92336
36180a327793J11709L87084K18151q3585j43209J64486N39261N13384M6387l34774
36170I1101j75084L25428N75259K96708k14058m53696k30710J44206J97736j18026
$$ plain form
36160 438864 120359 80463 474664 846883 669395 -52128 -843577 -1202109 -863784 51008
36150 51008 961772 1209136 770378 321693 339466 469393 129402 -586622 -1070528 -1049834
36140 -1049834 -782940 -513665 -207046 189036 635212 1171146 1818487 2267093 2020243
36131 2020243 1002187 -198712 -837909 -697548 -239967 -119253 -505788 -928848 -924091
36122 -924091 -706761 -818067 -1168874 -1074201 -413920 83 -312309 -608342 -54327 852052
36112 852052 984809 353497 45065 488730 912193 701714 240911 5217 -240907 -777636
36102 -777636 -1208800 -1065311 -607198 -395719 -442749 -370175 -149779 -141220 -518744 -1053807
36092 -1053807 -1373936 -1203485 -544535 174251 399521 123197 -70705 135467 302843
$$ packed form
36160D38864l18505l9896L94201L72219j77488p21523p91449l58532L38325R14792
36150E1008R10764K47364m38758m48685J7773J29927l39991p16024m83906K0694
36140a049834K66894K69275L06619L96082M46176N35934O47341M48606k46850
36131B020243j018056j200899o39197J40361M57581J20714l86535m23060M757
36122i24091K17330j11306l50807R4673O60281M14003l12392k96033N54015R06379
36112H52052J32757o31312l08432M43665M23463k10479m60803k35694k46124n36729
36102g77636m31164J43489M58113K11479m7030P2574K20396Q559l77524n35063
36092a053807l20129J70451O58950P18786K25270k76324j93902K06172J67376
$$ plain form
36083 302843 -28470 -524864 -512909 6582 364304 149744 -358102 -668465 -571766 -148105
36073 -148105 339790 506248 111857 -614160 -1103758 -977538 -372337 215108 354096 79703
36063 79703 -62268 428156 1313522 1778221 1440407 833316 593673 584295 297207 -211341
36053 -211341 -431284 -296578 -296192 -645495 -953854 -870870 -540628 -209360 145987 539971
36043 539971 751811 696284 683949 963396 1262124 1143193 638290 176195 5684 30420
36033 30420 132852 293942 383806 193524 -205306 -423913 -274906 -123540 -464304 -1226637
36023 -1226637 -1768056 -1615920 -1019727 -623493 -687988 -819164 -495832 262971 868410 794049
36013 794049 160093 -393451 -427705 -183014 -198663 -543335 -729222 -476407 -185113 -316499
$$ packed form
36083C02843l31313m96394J1955N19491L57722k14560n07846l10363R6699M23661
36073a48105M87895J66458l94391p26017m89598J26220O05201N87445J38988k74393
36063G9703j41971M90424Q85366M64699l37814o07091k39643r378k87088n08548
36053b11341k19943J34706L86l49303l08359Q2984L30242L31268L55347L93984
36043E39971K11840n5527j2335K79447K98728j18931n04903m62095j70511K4736
36033C0420J02432J61090Q9864j90282l98830k18607J49007J51366l40764p62333
36023a226637n41419J52136N96193L96234o4495j31176L23332P58803O05439p4361
36013G94049o33956n53544l4254K44691j5649l44672j85887K52815K91294j31386
$$ plain form
36003 -316499 -600185 -393203 281953 702157 559553 446641 876114 1415576 1373613 917253
35993 917253 788133 1122445 1327029 1128730 980591 1207607 1428164 1228065 893248 959238
35983 959238 1350568 1496036 1156080 661554 356831 213227 57745 -137769 -311632 -426996
35973 -426996 -411164 -147950 339682 796203 940109 744656 461530 366376 485741 588439
35963 588439 496779 383341 595767 1109755 1377336 976210 280880 119433 730933 1437657
35953 1437657 1517187 1054958 642208 513424 410087 168440 -26771 4424 247674 719756
35943 719756 1442239 2062337 2008108 1313343 798812 992188 1321483 998328 323474 256769
35933 256769 825176 966675 184668 -603848 -421775 335166 580476 136511 -215201 -41007
$$ packed form
36003c16499k83686K06982O75156M20204j42604j12912M29473N39462m1963m56360
35993I17253j29120L34312K04584j98299j48139K27016K20557k00099l34817O5990
35983I59238L91330J45468l39956m94526l04723j43604j55482j95514j73863j15364
35973d26996J5832K63214M87632M56521J43906j95453k83126r5154J19365J02698
35963E88439r1660j13438K12426N13988K67581m01126o95330j61447O11500P06724
35953A437657P9530m62229m12750j28784j03337k41647j95211L1195K43250M72082
35943G19756P22483O20098n4229o94765n14531J93376L29295l23155o74854o6705
35933B56769N68407J41499p82007p88516J82073P56941K45310m43965l51712J74194
$$ plain form
35923 -41007 254020 259095 128235 117587 120872 -64980 -388991 -670849 -794321 -664275 -270248
35912 -270248 123082 181403 748 56834 511883 908865 755175 140811 -413933 -503657
35902 -503657 -94749 512930 842739 615541 112559 -77075 224329 605072 694382 582376
35892 582376 446673 215961 -88265 -105869 335270 783211 733933 382582 295977 536376
35882 536376 669696 539066 446370 553587 657695 663947 782993 1090563 1329694 1356292
35872 1356292 1397598 1631715 1833617 1687397 1192752 554382 -59840 -431215 -271011 378332
35862 378332 944108 905357 465185 280067 563666 842415 686173 344423 426885 1120570
35852 1120570 1963121 2350874 2072619 1329605 462532 -172728 -230647 385682 1258789 1725690
$$ packed form
35923d1007K95027N075j30860j0648L285j85852l24011k81858j23472J30046L94027
35912b70248L93330N8321j80655N6086M55049L96982j53690o14364n54744q9724
35902e03657M08908O07679L29809k27198n02982j89634L01404L80743Q9310j12006
35892E82376j35703k30712l04226j7604M41139M47941m9278l51351q6605K40399
35882E36376J33320j30630r2696J07217J04108O252J19046L07570K39131K6598
35872A356292M1306K34117K01902j46220m94645o38370o14222l71375J60204O49343
35862C78332N65776l8751m40172j85118K83599K78749j56242l41750Q2462O93685
35852A120570Q42551L87753k78255p43014q67073o35260n7919O16329Q73107M66901
$$ plain form
35842 1725690 1583018 1294476 1300828 1393856 1107469 501784 83762 46450 127037 243792
35832 243792 662526 1311501 1530617 952312 204435 186466 889643 1489689 1497064 1258819
35822 1258819 1282589 1561534 1745656 1631552 1282761 899228 731993 944216 1407100 1758988
35812 1758988 1773691 1576573 1454335 1581540 1968261 2504881 2972344 3161616 3115594 3175792
35802 3175792 3681398 4641962 5740477 6622287 7187498 7674381 8448274 9608391 10790133
35793 10790133 11454293 11402454 10941659 10542396 10410550 10380672 10129833 9480528 8550129 7591708
35783 7591708 6683447 5713278 4749780 4189910 4254597 4487458 4165432 3233226 2432580 2362149
35773 2362149 2768834 3007951 2891343 2720428 2663361 2533215 2207609 1902162 1847699 1913258
$$ packed form
35842A725690j42672k88542O352R3028k86387o05685m18022l7312Q0587J16755
35832B43792M18734O48975K19116n78305p47877j7969P03177O00046P375k38245
35822A258819K3770K78945J84122j14104l48791l83533j67235K12223M62884L51888
35812A758988J4703j97118j22238J27205L86721N36620M67463J89272m6022O0198
35802C175792N05606R60564J098515Q81810N65211M86883P73893J160117J181742
35793A0790133O64160n1839m60795l99263j31846k9878k50839o49305r30399r58421
35783G591708r08261r70169r63498n59870O4687K32861l22026r32206q00646p0431
35773B362149M06685K39117j16608j70915n7067j30146l25606l05447n4463O5559
$$ plain form
35763 1913258 1787858 1464790 1298704 1508298 1828763 1872158 1726907 1872984 2440051 2904078
35753 2904078 2760241 2205010 1794414 1650692 1478108 1243754 1266795 1573793 1746545 1627432
35743 1627432 1642861 2083749 2531792 2463800 2074864 1960506 2192415 2278852 1977655 1601121
35733 1601121 1444032 1389210 1258029 1172520 1315175 1570440 1672777 1612354 1679366 2090958
35723 2090958 2676360 2988079 2745895 2156969 1721943 1706115 1916540 2048484 2085257 2228438
35713 2228438 2584736 3103818 3722327 4373577 4899311 5112016 4955383 4582540 4365416
35704 4365416 4775620 5966007 7404934 8288764 8491852 8720501 9490888 10439080 11045646
35695 11045646 11513348 12264841 12979698 12982843 12388385 11933367 11698438 10976212 9605036
$$ packed form
35763A913258j25400l23068j66086K09594L20465M3395j45251J46077N67067M64027
35753B904078j43837n55231m10596j43722j72584k34354K3041L06998J72752j19113
35743A627432J5429M40888M48043o7992l88936j14358K31909Q6437l01197l76534
35733A601121j57089n4822j31181q5509J42655K55265J02337o0423O7012M11592
35723B090958N85402L11719k42184n88926m35026j5828K10425J31944L6773J43181
35713B228438L56298N19082O18509O51250N25734K12705j56633l72843k17124
35704D365416M10204J190387J438927Q83830K03088K28649P70387R48192O06566
35695A1045646M67702P51493P14857L145n94458m55018k34929p22226j371176
$$ plain form
35686 9605036 8456590 8157646 8167152 7704916 6902713 6365662 6141511 5842519 5398656 5008850
35676 5008850 4651586 4278121 4188548 4547840 4804261 4333569 3480386 3171527 3561727 3871109
35666 3871109 3631583 3295251 3380073 3717194 3885976 3840114 3748798 3657217 3613052 3735773
35656 3735773 3900220 3761207 3345794 3170597 3469862 3783629 3696242 3503886 3643657 3885595
35646 3885595 3727546 3305669 3214811 3549113 3804163 3730099 3635795 3758942 3951716 4161441
35636 4161441 4621197 5278813 5586485 5264499 4839380 4952945 5459975 5721951 5581476
35627 5581476 5497258 5777944 6203906 6487945 6690224 7015437 7478845 7912298 8120588 7997047
35617 7997047 7690391 7627553 8065060 8618132 8632429 8116744 7850498 8323324 9017022 9156388
$$ packed form
35686I605036j148446k98944R506m62236q02203n37051k24151k98992m43863l89806
35676E008850l57264l73465q9573L59292K56421m70692q53183l08859L90200L09382
35666C871109k39526l36332Q4822L37121J68782m5862r1316r1581m4165J22721
35656C735773J64447j39013m15413j75197K99265L13767q7387j92356J39771K41938
35646C885595j58049m21877r0858L34302K55050p4064r4304J23147J92774K09725
35636D161441M59756O57616L07672l21986m25119J13565N07030K61976j40475
35627E581476q4218K80686M25962K84039K02279L25213M63408M33453K08290j23541
35617G997047l06656o2838M37507N53072J4297n15685k66246M72826O93698J39366
$$ plain form
35607 9156388 8823849 8769565 9284453 9885862 10172633 10407172 10992046 11808277 12448300 12851300
35597 12851300 13310996 13947119 14540532 14948032 15387539 16126305 17026790 17636980 17773407
35588 17773407 17843801 18428342 19597502 20852351 21787050 22586160 23699281 25202670 26752722
35579 26752722 28108464 29413297 30911055 32622557 34432194 36359743 38611370 41379223
35571 41379223 44632322 48129979 51720772 55636692 60302817 65752359 71504794 77310831
35563 77310831 83778105 91799209 101455596 112018406 123085186 135164909 148943617
35556 148943617 164512986 181690977 200647498 221656493 244387219 267847858 290872384
35549 290872384 312231589 330357859 343468602 350169972 349836593 342546791 329025913
$$ packed form
35607I156388l32539n4284N14888O01409K86771K34539N84874Q16231O40023M03000
35597A2851300M59696O36123N93413M07500M39507P38766R00485O10190J36427
35588A7773407P0394N84541J169160J254849R34699P99110J113121J503389J550052
35579B6752722J355742J304833J497758J711502J809637J927549K251627K767853
35571D1379223L253099L497657L590793L915920M666125N449542N752435N806037
35563G7310831O467274Q021104R656387J0562810J1066780J2079723J3778708
35556A48943617J5569369J7177991J8956521K1008995K2730726K3460639K3024526
35549B90872384K1359205J8126270J3110743O701370l33379p289802j3520878
$$ plain form
35542 329025913 310692059 289389901 266821559 244226779 222475973 202147883 183432303
35535 183432303 166222125 150480382 136393712 124068776 113250787 103528467 94739246
35528 94739246 86984591 80251435 74208455 68485421 63053964 58188392 54078825 50631932
35520 50631932 47651466 45002629 42496482 39833650 36899118 34006231 31615856 29861352
35512 29861352 28517125 27307739 26017531 24458421 22679667 21119406 20168720 19631724
35504 19631724 18992963 18138278 17351335 16676458 15880645 15064934 14631735 14500217 14073380
35495 14073380 13249667 12719196 12841517 12960719 12401892 11493830 10929822 10677355 10266583
35486 10266583 9683648 9187228 8648240 7909819 7447233 7743063 8239190 7879957 6624342
$$ packed form
35542C29025913j8333854k1302158k2568342k2594780k1750806k0328090j8715580
35535A83432303j7210178j5741743j4086670j2324936j0817989r722320q789221
35528I4739246p754655o733156o042980n723034n431457m865572m109567l446893
35520E0631932k980466k648837k506147k662832k934532k892887k390375j754504
35512B9861352j344227j209386j290208j559110j778754j560261r50686n36996
35504A9631724o38761q54685p86943o74877p95813q15711m33199j31518m26837
35495A4073380q23713n30471J22321J19202n58827r08062n64008k52467m10772
35486A0266583n82935m96420n38988p38421m62586K95830M96127l59233j255615
$$ plain form
35477 6624342 5506978 5193360 5340978 5444383 5460659 5457245 5398205 5423400 5675650 5821081
35467 5821081 5457794 4963104 5080630 5657264 5752899 5112015 4497888 4349468 4194470 3773226
35457 3773226 3662201 4222812 4884698 5081496 5046423 5112528 5101513 4993449 5267177 5912346
35447 5912346 6097962 5616480 5619201 6919444 8564540 9298890 9534227 10424679 11703939
35438 11703939 12102421 11545464 11250879 11682524 11974797 11552809 10877113 10268255 9332275
35429 9332275 8016006 7050898 6789657 6590188 5894747 5039744 4480622 4048285 3513059
35420 3513059 3127525 3069423 3025681 2820005 2778826 3001509 2978761 2468860 2051776 2211080
35410 2211080 2524371 2419736 2113346 2070116 2101881 1820946 1530106 1764670 2238507 2147093
$$ packed form
35477F624342j117364l13618J47618J03405J6276l414n9040K5195K52250J45431
35467E821081l63287m94690J17526N76634R5635o40884o14127j48420j54998m21244
35457C773226j11025N60611O61886J96798l5073O6105j1015j08064K73728O45169
35447E912346J85616m81482K721J300243J645096P34350K35337Q90452J279260
35438A1703939L98482n56957k94585M31645K92273m21988o75696o08858r35980
35429I332275j316269r65108k61241j99469o95441q55003n59122m32337n35226
35420C513059l85534n8102m3742k05676m1179K22683k2748n09901m17084J59304
35410B211080L13291j04635l06390m3230L1765k80935k90840K34564M73837r1414
$$ plain form
35400 2147093 1411604 803621 822415 1166002 1394402 1472927 1496979 1413554 1236191 1156969
35390 1156969 1258867 1389176 1431468 1461632 1548962 1610001 1531077 1290477 949490 652359
35380 652359 590893 818103 1146904 1374596 1532617 1755888 1976298 1927207 1453751 719078
35370 719078 93243 -161269 -132081 -113307 -134912 158589 899378 1521851 1395970 781654
35360 781654 500582 698311 737098 450164 554765 1382778 2112982 1962160 1372910 1175779
35350 1175779 1224551 865631 280398 229747 693844 886281 579023 340688 368172 138079
35340 138079 -517242 -966384 -824444 -587652 -699286 -701415 34680 1210766 1877432 1586724
35330 1586724 807729 318497 478747 1000278 1285721 1100422 855776 960490 1069319
$$ packed form
35400B147093p35489o07983J8794L43587K28400P8525K4052q3425j77363p9222
35390A156969J01898J30309M2292L0164Q7330O1039p8924k40600l40987k97131
35380F52359o1466K27210L28801K27692J58021K23271K20410m9091m73456p34673
35370G19078o25835k54512K9188J8774k1605K93501P40789O22473j25881o14316
35360G81654k81072J97729L8787k86934J04601Q28013P30204j50822n89250j97131
35350A175779M8772l58920n85233n0651M64097J92437l07258k38335K7484k30093
35340A38079o55321m49142J41940K36792j11634k129P36095J176086O66666k90708
35330A586724p78995m89232J60250N21531K85443j85299k44646J04714J08829
$$ plain form
35321 1069319 546697 -367975 -621931 192993 1168546 1285503 680954 195788 167763 295831
35311 295831 371340 492682 654604 636980 333707 -91026 -362783 -298022 -1526 72133
35301 72133 -446084 -1243142 -1553835 -1134862 -542126 -235644 14245 482904 884070 951537
35291 951537 1062520 1573939 1983930 1592313 726062 397398 792686 997409 401849 -403274
35281 -403274 -503619 130364 753845 841294 559211 362061 422056 526140 437377 220133
35271 220133 78546 -29024 -293853 -563439 -402708 179432 579391 481196 330401 485354
35261 485354 527782 103924 -154085 470168 1349768 1163786 -100806 -980308 -563448 401998
35251 401998 809855 601828 308476 26944 -414453 -821298 -851514 -552085 -194237 114832
$$ packed form
35321A069319n22622r14672k53956Q14924R75553J16957o04549m85166k8025J28068
35311B95831P5509J21342J61922j7624l03273m24733k71757O4761K96496P3659
35301G2133n18217p97058l10693M18973N92736L06482K49889M68659M01166O7467
35291I51537J10983N11419M09991l91617q66251l28664L95288K04723n95560q05123
35281d03274j00345O33983O23481Q7449k82083j97150N9995J04084q8763k17244
35271B20133j41587j07570k64829k69586J60731N82140L99959r8195j50795J54953
35261D85354M2428m23858k58009O24253Q79600j85982j264592q79502M16860R65446
35251D01998M07857k08027k93352k81532m41397m06845l0216K99429L57848L09069
$$ plain form
35241 114832 282162 79838 -445911 -774050 -519080 67035 519988 710497 645032 183801
35231 183801 -588339 -1094814 -864586 -133206 526857 854791 833803 403557 -291458 -744104
35221 -744104 -675381 -455296 -479523 -532622 -305855 -107304 -371277 -807523 -789871 -347707
35211 -347707 -18566 75498 197465 202862 -306345 -1020875 -1048244 -224400 509426 387797
35201 387797 -181804 -296905 276697 1004599 1278338 912108 233982 -142309 77949 442196
35191 442196 302417 -223986 -393905 6675 330049 127957 -148381 50120 448608 407049
35181 407049 -80052 -433384 -341275 -57570 65350 -47203 -236567 -255685 65639 597046
35171 597046 944754 870149 555632 360701 493380 970146 1599966 1910495 1472215 499865
$$ packed form
35241A14832J67330k02324n25749l28139K54970N86115M52953J90509o5465m61231
35231A83801p72140n06475K30228P31380O60063L27934k0988m30246o95015m52646
35221g44104O8723K20085k4227n3099K26767J98551k63973m36246J7652M42164
35211c47707L29141R4064J21967N397n09207p14530k7369Q23844P33826j21629
35201C87797n69601j15101N73602P27902K73739l66230o78126l76291K20258L64247
35191D42196j39779n26403j69919M00580L23374k02092k76338J98501L98488m1559
35181D07049m87101l53332R2109K83705J22920j12553j89364j9118L21324N31407
35171E97046L47708p4605l14517j94931J32679M76766O29820L10529m38280r72350
$$ plain form
35161 499865 -232686 -317991 -184933 -369397 -733549 -815424 -589421 -367967 -194944 109994
35151 109994 419181 353598 -94035 -429606 -268681 207658 507452 358720 -67426 -360162
35141 -360162 -290638 -47908 35971 -60258 -121035 -166435 -407408 -679904 -516626 -2322
35131 -2322 131455 -300767 -379194 578601 1755448 1876749 1078914 618181 918603 1135627
35121 1135627 743899 317653 342752 377324 19313 -226982 188334 871713 1157102 1149608
35111 1149608 1246045 1146222 345940 -691922 -917977 -209810 456734 457814 238163 319862
35101 319862 453265 247105 -9358 229005 898655 1441993 1545814 1289761 770827 103371
35091 103371 -293809 52231 1014283 1830959 1881729 1256439 459591 -183778 -652050 -962213
$$ packed form
35161D99865p32551q5305J33058j84464l64152q1875K26003K21454J73023L04938
35151A09994L09187o5583m47633l35571J60925M76339K99794j48732m26146k92736
35141c60162O9524K42730Q3879r6229o0777m5400k40973k72496J63278N14304
35131b322J33777m32222p8427R57795J176847J21301p97835m60733L00422K17024
35121A135627l91728m26246K5099L4572l58011k46295M15316O83379K85389p494
35111A149608R6437r9823q00282j037862k26055P08167O66544J080k19651Q1699
35101C19862J33403k06160k56463K38363O69650N43338J03821k56053n18934o67456
35091A03371l97180L46040R62052Q16676N0770o25290p96848o43369m68272l10163
$$ plain form
35081 -962213 -1035190 -804780 -324383 241025 680511 840784 730105 501564 312722 237313
35071 237313 291125 424995 467955 232491 -225684 -580904 -598194 -409058 -271866 -168269
35061 -168269 124684 581328 804811 473434 -218986 -673915 -414223 479818 1381547 1626384
35051 1626384 1159854 633278 670188 1093056 1148777 500865 -341985 -690357 -425140 102148
35041 102148 579432 845515 771686 421622 167010 257554 386829 90660 -489825 -701487
35031 -701487 -278902 295428 470678 263307 1919 -198364 -404403 -570838 -606812 -577311
35021 -577311 -553739 -408256 -43351 316910 404067 369869 566064 870040 696388 -151742
35011 -151742 -1047522 -1253907 -796946 -311990 -252477 -626575 -1315106 -2121210 -2537559 -2072808
$$ packed form
35081i62213p2977K30410M80397N65408M39486J60273j10679k28541j88842p5409
35071B37313N3812J33870M2960k35464m58175l55220j7290J89136J37192J03597
35061a68269K92953M56644K23483l31377o92420m54929K59692Q94041R01729K44837
35051A626384m66530n26576L6910M22868N5721o47912q42850l48372K65217N27288
35041A02148M77284K66083p3829l50064k54612R0544J29275k96169n80485k11662
35031g01487M22585N74330J75250k07371k61388k00283k06039j66435l5974K9501
35021e77311K3572J45483L64905L60261Q7157l4198J96195L03976j73652q48130
35011a51742q95780k06385M56961M84956N9513l74098o88531q06104m16349M64751
$$ plain form
35001 -2072808 -1020773 -366126 -551416 -799745 -196453 912966 1329878 694707 -22199
34992 -22199 102478 788867 1155940 906373 398204 -41747 -277932 -107514 511726 1060047
34982 1060047 897061 167508 -262473 90557 753453 1009792 743947 290226 -187361
34973 -187361 -761084 -1365527 -1736810 -1709993 -1345626 -787661 -195515 196116 155324 -319078
34963 -319078 -919862 -1243884 -1098138 -624486 -136215 184821 408305 647990 823189 756635
34953 756635 464947 185275 109405 243239 522405 879539 1181289 1306090 1321775 1367398
34943 1367398 1334842 977373 434597 264527 683484 1115550 910691 276051 -22819 198127
34933 198127 278893 -279201 -1059982 -1288637 -791508 -53980 443592 582324 439283 151301
$$ packed form
35001b072808J052035O54647j85290k48329O03292J109419M16912o35171p16906
34992b2199J24677O86389L67073k49567n08169m39951k36185J70418O19240N48321
34982A060047j62986p29553m29981L53030O62896K56339k65845m53721m77587
34973a87361n73723o04443l71283K6817L64367N57965N92146L91631m0792m74402
34963c19078o00784l24022J45746M73652M88271L21036K23484K39685J75199o6554
34953G56635k91688k79672p5870J33834K79166L57134L01750J24801J5685M5623
34943A367398l2556l57469n42776j70070M18957M32066k04859o34640k98870K20946
34933A98127Q0766n58094p80781k28655M97129P37528M97572J38732j43041k87982
$$ plain form
34923 151301 -56357 -4559 220731 375109 382224 372443 434088 539832 670560 756108 551862
34912 551862 -82219 -781016 -949632 -514121 7788 271616 436156 559079 307298 -310054
34902 -310054 -543270 109682 1005015 1220112 915849 895506 1091435 663773 -367217 -832295
34892 -832295 -131069 876102 1250455 1217128 1305088 1231827 629575 92783 334963 832528
34882 832528 540467 -352229 -653461 -64492 426646 193178 -208768 -236071 -249319 -597005
34872 -597005 -743419 -127221 716241 737289 -197361 -1141110 -1241659 -586205 98950 247722
34862 247722 -71848 -325133 -156279 176190 187278 -120265 -307219 -225160 -194910 -366794
34852 -366794 -413888 -59001 535263 1081379 1425196 1349582 673164 -233080 -627201 -409060
$$ packed form
34923A51301k07658N1798K25290J54378P115r781O1645J05744J30728Q5548k04246
34912E51862o34081o98797j68616M35511N21909K63828J64540J22923k51781o17352
34902c10054k33216O52952Q95333K15097l04263k0343J95929m27662j030990m65078
34892h32295P01226J007171L74353l3327Q7960p3261o02252n36792K42180M97565
34882H32528k92061q92696l01232N88969M91138k33468m01946k7303j3248l47686
34872e97005j46414O16198Q43462K1048r34650r43749j00549O55454O85155J48772
34862B47722l19570k53285J68854L32469J1088l07543j86954Q2059L0250j71884
34852c66794m7094L54887N94264N46116L43817p5614o76418r06244l94121K18141
$$ plain form
34842 -409060 -335345 -825215 -1225618 -860668 -187999 -93225 -454875 -354195 418341 976003
34832 976003 598478 -326867 -897956 -743986 -192861 287444 524353 616645 649708 529310
34822 529310 203156 -30980 215971 766741 911502 353258 -315228 -442290 -177260 1313
34812 1313 183733 741247 1383050 1318008 409998 -503996 -636113 -98511 436879 528722
34802 528722 245604 -46538 -32299 249089 434389 290680 -17684 -287126 -588346 -899932
34792 -899932 -814456 -142164 514077 457470 -49227 -174143 184495 337010 26139 -214235
34782 -214235 -105464 -110979 -496181 -721930 -312024 321472 493881 179474 -222352 -599439
34772 -599439 -1021277 -1272920 -1087222 -634204 -296380 -140718 -10922 95896 156019 360229
$$ packed form
34842d09060P3715m89870m00403L64950O72669R4774l61650J00680P72536N57662
34832I76003l77525r25345n71089J53970N51125M80305K36909R2292L3063j20398
34822E29310l26154k34136K46951N50770J44761n58244o68486j27062K65030J78573
34812A313J82420N57514O41803o5042r08010r13994j32117N37602N35390R1843
34802E28722k83118k92142J4239K81388J85300j43709l08364k69442l01220l11586
34792h99932Q5476O72292O56241n6607n06697j24916L58638J52515l10871k40374
34782b14235J08771n515l85202k25749M09906O33496J72409l14407m01826l77087
34772e99439m21838k51643J85698M53018L37824J55662J29796J06818O0123K04210
$$ plain form
34762 360229 773289 1002140 714939 284844 341669 802251 976888 661600 475234 869111
34752 869111 1329094 994597 -181138 -1319687 -1643477 -1278929 -901872 -819264 -719483 -314538
34742 -314538 170126 395603 462115 611785 606545 32982 -809902 -1057401 -500002 61475
34732 61475 27110 -157672 90530 418572 149228 -513725 -788514 -550734 -348702 -308772
34722 -308772 8699 575587 663506 -28057 -773604 -772102 -119028 547809 841778 680750
34712 680750 63773 -733080 -1137410 -925619 -579027 -597909 -801106 -741095 -464823 -329269
34702 -329269 -326498 -176666 57801 25697 -301799 -596277 -729195 -862233 -968820 -776353
34692 -776353 -278515 159334 345859 505731 819749 1090321 1042525 665662 130375 -359816
$$ packed form
34762C60229M13060K28851k87201m30095N6825M60582J74637l15288j86366L93877
34752H69111M59983l34497j175735j138549l23790L64548L77057Q2608R9781M04945
34742c14538M84664K25477O6512J49670n240n73563q42884k47499N57399N61477
34732F1475l4365j84782K48202L28042k69344o62953k74789K37780K02032L9930
34722c08772L17471N66888Q7919o91563p45547J502O53074O66837K93969j61028
34712F80750o16977p96853m04330K11791L46592j8882k03197O0011K76272J35554
34702c29269K771J49832K34467l2104l27496k94478j32918j33038j06587J92467
34692g76353M97838M37849J86525J59872L14018K70572m7796l76863n35287m90191
$$ plain form
34682 -359816 -583855 -501704 -453705 -746999 -1041273 -707310 122031 561774 288516 63406
34672 63406 458643 844124 413436 -407705 -553834 66617 594427 663532 722997 897362
34662 897362 650341 -117999 -633457 -378082 147437 294255 191917 271717 494472 618288
34652 618288 688805 717841 416719 -178583 -374994 222688 938019 934840 434391 220086
34642 220086 362090 364694 256522 484828 861739 693472 12019 -346520 -62686 252174
34632 252174 227396 329366 845077 1180830 800115 148275 -30226 250366 492292 593812
34622 593812 795349 1072300 1180454 1059695 701774 -64319 -1113953 -1691261 -1206879
34613 -1206879 -176723 320356 33974 -285802 -101919 236844 212040 -113526 -390666
$$ packed form
34682c59816k24039Q2151M7999k93294k94274L33963Q29341M39743k73258k25110
34672F3406L95237L85481m30688q21141j46129O20451N27810O9105N9465J74365
34662H97362k47021p68340n15458K55375N25519J46818j02338P9800K22755J23816
34652F18288P0517K9036l01122n95302j96411N97682P15331l179n00449k14305
34642B20086J42004K604j08172K28306L76911j68267o81453l58539K83834L14860
34632B52174k4778J01970N15711L35753l80715o51840j78501K80592K41926J01520
34622E93812K01537K76951J08154j20759l57921p66093j049634n77308M84382
34613a206879J030156M97079k86382l19776J83883L38763k4804l25566k77140
$$ plain form
34604 -390666 -542968 -634691 -532046 -140812 217853 115824 -350006 -631968 -481569 -250440
34594 -250440 -284976 -374095 -138685 249337 212159 -368831 -909614 -924902 -651853 -571255
34584 -571255 -676087 -646696 -478187 -403409 -331580 69245 725898 1114055 937658 413591
34574 413591 -171739 -716010 -1041757 -917937 -513670 -327185 -439536 -324920 322998 1042443
34564 1042443 1217208 843119 345189 -3160 -127026 50284 482395 915623 1199225
34555 1199225 1408388 1472393 1106469 393778 -47152 123128 440245 400508 303187 726033
34545 726033 1497333 1865749 1529532 890847 382545 93389 8475 111004 231060 187685
34535 187685 75492 120294 347967 641184 902147 889906 257743 -833430 -1522428 -1218193
$$ packed form
34604c90666j52302r1723J02645L91234L58665j02029m65830k81962J50399K31129
34594b50440l4536q9119K35410L88022l7178n80990n40783j5288K73049Q0598
34584e71255j04832K9391J68509P4778P1829M00825O56653L88157j76397n24067
34574D13591n85330n44271l25747J23820M04267J86485j12351J14616O47918P19445
34564A042443J74765l74089m97930l48349j23866J77310M32111M33228K83602
34555A199225K09163O4005l65924p12691m40930J70280L17117l9737r7321M22846
34545G26033P71300L68416l36217o38685n08302k89156q4914J02529J20056m3375
34535A87685j12193M4802K27673K93217K60963j2241o32163j091173o88998L04235
$$ plain form
34525 -1218193 -444053 -113762 -268842 -229204 237613 671453 734615 533492 184221 -236565
34515 -236565 -373036 41455 545799 449617 -74073 -245149 -13951 -139869 -762001 -963988
34505 -963988 -213705 711512 854198 358102 -59792 -279076 -652483 -1129107 -1235531 -755592
34495 -755592 72804 861818 1225241 918932 208077 -185650 139362 803232 1231330 1333481
34485 1333481 1281246 1045415 609782 295526 377313 606492 532561 94674 -432705 -813628
34475 -813628 -866280 -463694 115251 223552 -327573 -853978 -687767 -100581 208940 181940
34465 181940 306822 742443 1217803 1601430 1876686 1720071 865153 -178178 -544650
34456 -544650 -195732 66189 -140869 -289588 58046 544089 710498 725399 882546 920206
$$ packed form
34525a218193P74140L30291j55080L9638M66817M33840O3162k01123l49271m20786
34515b36565j36471M14491N04344r6182n23690j71076K31198j25918o22132k01987
34505i63988P50283R25217J42686m96096m17894k19284l73407m76624j06424M79939
34495g55592Q28396P89014L63423l06309p10855l93727L25012O63870M28098J02151
34485A333481n2235k35831m35633l14256Q1787K29179p3931m37887n27379l80923
34475h13628n2652M02586N78945J08301n51125n26405J66211N87186L09521k7000
34465A81940J24882M35621M75360L83627K75256j56615q54918j043331l66472
34456e44650L48918K61921k07058j48719L47634M86043J66409J4901J57147L7660
$$ plain form
34446 920206 482110 -102918 -202943 96432 35403 -670940 -1307719 -1075951 -159897 506742
34436 506742 390638 -106143 -285996 10985 395903 495291 231834 -290760 -792054 -768384
34426 -768384 63511 1155253 1451965 614077 -497873 -906953 -681416 -545873 -710515
34417 -710515 -761208 -557919 -511640 -857644 -1232139 -1178715 -664922 53904 700050 975127
34407 975127 705355 172036 -55468 204266 565918 714333 806469 1001001 1012964 528137
34397 528137 -224415 -724834 -814424 -731840 -648006 -551159 -509877 -645293 -817953 -699918
34387 -699918 -257351 130014 171644 50357 116276 370169 495991 349551 162109 185721
34377 185721 331893 337119 194734 195993 501625 857533 852550 356386 -384526 -974447 -1109094
$$ packed form
34446I20206m38096n85028j00025K99375o1029p06343o36779K31768R16054O66639
34436E06742j16104m96781j79853K96981L84918R9388k63457n22594n01294K3670
34426g68384Q31895J091742K96712q37888j111950m09080K25537J35543j64642
34417g10515n0693K03289M6279l46004l74495N3424N13793P18826O46146K75077
34407I75127k69772n33319k27504K59734L61652J48415R2136J94532J1963m84827
34397E28137p52552n00419q9590Q2584Q3834R6847M1282j35416j72660J18035
34387f99918M42567L87365M1630j21287O5919K53893J25822j46440j87442K3612
34377A85721J46172N226j42385J259L05632L55908m983m96164p40912n89921j34647
$$ plain form
34366 -1109094 -753510 -234525 -9893 -155425 -225342 144941 652456 669896 79385 -619657
34356 -619657 -999399 -1060049 -866726 -370350 190819 243410 -349615 -880968 -688387 -145650
34346 -145650 -126434 -660965 -926406 -657448 -679793 -1548323 -2385869 -1938742 -452299 493757
34336 493757 98100 -648851 -496755 294497 481884 -299252 -1120764 -1177213 -769360 -606771
34326 -606771 -794127 -950619 -882460 -643544 -217502 357998 701888 414210 -309259 -776076
34316 -776076 -590389 -83286 123009 -205746 -733595 -943827 -684500 -329341 -295803 -448440
34306 -448440 -288032 211124 424171 6762 -500626 -484734 -211686 -274385 -457449 -82363
34296 -82363 642437 684067 -198976 -930648 -684152 -72957 -92757 -620601 -838957 -643224
$$ packed form
34366a109094L55584N18985K24632j45532o9917L70283N07515J7440n90511o99042
34356f19657l79742o0650J93323M96376N61169N2591n93025n31353J92581N42737
34346a45650J9216n34531k65441K68958k2345q68530q37546M47127J486443R46056
34336D93757l95657p46951J52096P91252J87387p81136q21512n6449M07853J62589
34326f06771j87356j56492O8159K38916M26042N75500L43890k87678p23469m66817
34316g76076J85687N07103K06295l28755n27849k10232K59327L55159L3538j52637
34306d48440J60408M99156K13047m17409n07388J5892K73048o2699j83064L75086
34296h2363P24800M1630q83043p31672K46496O11195j9800n27844k18356J95733
$$ plain form
34286 -643224 -654328 -1058959 -1366131 -1295788 -1085578 -834580 -313392 389953 763095 711249
34276 711249 847896 1516817 2083265 1765029 794192 129388 188991 475511 453990 242199
34266 242199 239336 479408 656084 585326 361591 125950 -89464 -270432 -352858 -334827
34256 -334827 -357516 -550047 -807015 -842371 -529309 -104533 78737 -27840 -134183 -37695
34246 -37695 66602 -151828 -646200 -930912 -608699 150395 772085 877881 605102 333718
34236 333718 243465 234507 184704 120546 119397 161584 139410 -30930 -317395 -542187 -470245
34225 -470245 -34436 528275 895592 1027463 1137946 1245336 1002604 191906 -793346 -1276800
34215 -1276800 -1065852 -596568 -310738 -209140 -106398 10395 86389 189391 323186 264228
$$ packed form
34286f43224j1104m04631l07172P0343K10210K50998N21188P03345L73142n1846
34276G11249J36647O68921N66448l18236r70837o64804N9603K86520k1521k11791
34266B42199k863K40072J76676p0758k23735k35641k15414j80968q2426J8031
34256c34827k2689j92531k56968l5356L13062M24776J83270j06577j06343R6488
34246c7695J04297k18430m94372k84712L22213P59094O21690J05796k72779k71384
34236C33718r0253q958m9803o4158j149M2187k2174j70340k86465k24792P1942
34225d70245M35809N62711L67317J31871J10483J07390k42732q10698r85252m83454
34215a276800K10948M69284K85830J01598J02742J16793P5994J03002J33795n8958
$$ plain form
34205 264228 -87261 -346394 -32451 712818 1191997 1006828 496938 219596 345830 747430
34195 747430 1326066 1959870 2390154 2515684 2651523 3179160 4048028 4904359 5577878 6111345
34185 6111345 6420763 6313172 5819099 5163167 4426779 3580804 2799550 2321374 2000313
34176 2000313 1459297 736034 272632 167473 17521 -288735 -262131 312821 802477 607475
34166 607475 149788 264303 889267 1129886 565517 -198283 -371232 170155 972778 1486113
34156 1486113 1361582 703615 120899 145238 543427 610497 176157 -188769 -107543 733
34146 733 -416880 -1166227 -1480527 -909760 225197 1160183 1335719 863421 430457 578118
34136 578118 1065023 1187033 707920 103671 -179332 -279672 -542501 -957906 -1234371 -1162244
$$ packed form
34205B64228l51489k59133L13943P45269M79179j85169n09890k77342J26234M01600
34195G47430N78636O33804M30284J25530J35839N27637Q68868Q56331O73519N33467
34185F111345L09418j07591m94073o55932p36388q45975p81254m78176l21061
34176B000313n41016p23263m63402j05159j49952l06256K6604N74952M89656j95002
34166F07475m57687J14515O24964K40619n64369p63800j72949N41387Q02623N13335
34156A486113j24531o57967n82716K4339L98189O7070m34340l64926Q1226J08276
34146G33m17613p49347l14300N70767J134957R34986J75536m72298m32964J47661
34136E78118M86905J22010m79113o04249k83003j00340k62829m15405k76465P2127
$$ plain form
34126 -1162244 -695244 63362 762516 972687 667030 286508 164247 185244 177338 250654
34116 250654 484068 645863 553217 385218 317408 198594 -42516 -66716 302245 527403
34106 527403 14965 -891408 -1253476 -799312 -149879 260912 765746 1685378 2585307 2804813
34096 2804813 2412359 2158760 2578045 3505699 4511634 5515315 6774323 8326265 9664830
34087 9664830 10175445 9864308 9384270 9204189 9010495 8189572 6694325 5066145 3708055
34078 3708055 2577393 1633605 1120129 1143482 1296835 1085369 617569 489341 903180
34069 903180 1254860 905097 166428 13323 708485 1287359 868491 24338 63559 1103616
34059 1103616 1811977 1281593 223141 -250054 -197249 -380641 -813386 -817120 -314014 -50239
$$ packed form
34126a162244M67000P58606O99154K10171l05657l80522j22261K0997p906P3316
34116B50654K33414J61795r2646j67999o7810j18814k41110k4200L68961K25158
34106E27403n12438r06373l62068M54164O49433M10791N04834R19632Q99929K19506
34096B804813l92454k53599M19285R27654J005935J003681J259008J551942J338565
34087I664830N10615l11137m80038j80081j93694q20923j495247j628180j358090
34078C708055j130662r43788n13476K3353J53353k11466m67800j28228M13839
34069I03180L51680l49763p38669j53105O95162N78874m18868q44153L9221J040057
34059A103616P08361n30384j058452m73195N2805j83392m32745l734N03106K63775
$$ plain form
34049 -50239 -435197 -967804 -1034068 -662032 -281568 -229527 -622063 -1238493 -1454877 -824689
34039 -824689 174860 537299 3812 -638887 -715948 -477091 -444377 -578078 -570114 -486348
34029 -486348 -574477 -739050 -698515 -464781 -265220 -155750 -44256 70618 169778 336383
34019 336383 560441 650421 580733 636779 926252 1078340 804319 422174 336417 291674
34009 291674 -213145 -898988 -842170 194423 1202099 1111411 164064 -385150 173766 1205460
33999 1205460 1628022 1278079 1001982 1444441 2211274 2514447 2307752 2284378 2874503 3805800
33989 3805800 4688751 5444477 5972543 5991942 5547994 5142469 4940116 4367159 3049436
33980 3049436 1669294 1150847 1299928 1093123 224321 -494823 -400647 147935 473927
$$ packed form
34049e0239l84958n32607o6264L72036L80464N2041l92536o16430k16384O30188
34039h24689R99549L62439n33487o42699p7061K38857L2714j33701P964Q3766
34029d86348q8129j64573M0535K33734J99561J09470J11494J14874R9160J66605
34019C36383K24058Q9980o9688N6046K89473J52088k74021l82145q5757m4743
34009B91674n04819o85843N6818J036593J007676r0688r47347n49214N58916J031694
33999A205460M22562l49943k76097M42459P66833L03173k06695k3374N90125R31297
33989C805800Q82951P55726N28066J9399m43948m05525k02353n72957j317723
33980C049436j380142n18447J49081k06805q68802p19144R4176N48582L25992
$$ plain form
33971 473927 508475 563829 648083 522456 202568 -44301 -104765 -88639 -51082 66870 212470
33960 212470 165783 -197948 -687623 -929222 -735978 -309966 -6899 83995 171137 323980
33950 323980 255592 -234629 -801875 -886927 -437458 44779 170748 37138 -104009 -188037
33940 -188037 -222910 -152596 -36619 -134420 -590922 -1171164 -1478575 -1356167 -976816 -634274
33930 -634274 -511411 -546673 -481782 -149265 285216 518632 533387 607112 872842 1111830
33920 1111830 1065126 728213 241349 -285478 -707225 -812097 -531355 -65598 301779 408405
33910 408405 217154 -161236 -391828 -149298 403142 614872 60284 -909078 -1534755 -1445643
33900 -1445643 -891108 -312583 75984 312446 494386 640582 718410 782259 976493 1283018
$$ packed form
33971D73927L4548N5354Q4254j25627l19888k46869o0464J6126L7557J17952J45600
33960B12470m6687l63731m89675k41599J93244M26012L03067R0894Q7142J52843
33950C23980o8388m90221n67246q5052M49469M82237J25969j33610j41147q4028
33940a88037l4873P0314J15977r7801m56502n80242l07411J22408L79351L42542
33930f34274J22863l5262O4891L32517M34481K33416J4755P3725K65730K38988
33920A111830m6704l36913m86864n26827m21747j04872K80742M65757L67377J06626
33910D08405j91251l78390k30592K42530N52440K11730n54588r69362o25677Q9112
33900a445643N54535N78525L88567K36462J81940J46196P7828O3849J94234L06525
$$ plain form
33890 1283018 1401438 1132078 766535 728177 886992 726966 233361 -1147 222729 262858
33880 262858 -358402 -1075748 -1044388 -375795 96749 35156 -137160 -48162 245301 637055
33870 637055 1047576 1128402 578352 -195951 -424400 -63874 172085 -11862 -115343 99232
33860 99232 67129 -549827 -1103811 -928780 -418866 -348949 -632673 -627075 -303389 -185531
33850 -185531 -332355 -325842 -207318 -470286 -1023631 -1095390 -442198 192073 220919 52555
33840 52555 261421 585206 419726 -139500 -462315 -346974 -170376 -187989 -257981 -242839
33830 -242839 -192096 -97458 100947 211130 -93332 -724458 -1096050 -780700 -22843 574561
33820 574561 710473 573585 477373 477147 387928 151027 92859 624340 1589525 2154131 1652331
$$ packed form
33890A283018J18420k69360l65543l8358J58815j60026m93605k34508K23876M0129
33880B62858o21260p17346L1360O68593M72544o1593j72316Q8998K93463L91754
33870F37055M10521Q0826n50050p74303k28449L60526K35959j83947j03481K14575
33860I9232l2103o16956n53984J75031N09914O9917k83724N598L23686J17858
33850a85531j46824O513J18524k62968n53345p1759O53192O34271K8846j68364
33840E2555K08866L23785j65480n59226l22815J15341J76598j7613o9992J5142
33830b42839N0743R4638J98405J10183l04462o31126l71592L15350P57857N97404
33820E74561J35912j36888r6212k26q9219k36901n8168N31481R65185N64606n01800
$$ plain form
33809 1652331 453731 -372920 -290275 180894 303736 111565 205250 787404 1362783 1436532
33799 1436532 1118234 836201 735570 662365 584892 644659 771821 628550 105982 -426289
33789 -426289 -613427 -598291 -688732 -769061 -487618 85154 502088 652864 885580 1279879
33779 1279879 1366501 880653 304152 232283 578291 866128 986996 1131587 1212745 968142
33769 968142 560896 499964 917694 1405467 1624030 1621989 1466340 1027529 331702 -234593
33759 -234593 -312180 35895 439967 565101 317038 -75320 -195250 105015 446272 411354
33749 411354 172155 218726 565839 759600 647519 521671 419098 -14902 -713773 -946167
33739 -946167 -331762 485754 720125 517607 549215 906988 1082776 843645 480680 245815
$$ packed form
33809A652331j198600q26651Q2645M71169J22842j92171R3685N82154N75379P3749
33799A436532l18298k82033j00631p3205p7473N9767J27162j43271n22568n32271
33789d26289j87138J5136r0441q0329K81443N72772M16934J50776K32716L94299
33779A279879Q6622m85848n76501p1869L46008K87837J20868J44591Q1158k44603
33769I68142m07246o0932M17730M87773K18563k041j55649m38811o95827n66295
33759b34593p7587L48075M04072J25134k48063l92358j19930L00265L41257l4918
33749D11354k39199M6571L47113J93761j12081j25848j02573m34000o98871k32394
33739i46167O14405Q17516K34371k02518L1608L57773J75788k39131l62965k34865
$$ plain form
33729 245815 91283 -23681 -20768 70594 120084 119034 125724 107292 126277 461416 1129842
33718 1129842 1528146 1119491 340980 167133 770411 1310832 1196023 829567 765988 781171
33708 781171 354005 -361701 -711247 -510747 -234603 -232133 -296402 -160332 28932 24398
33698 24398 -26902 213567 668832 803581 271006 -643607 -1343042 -1480270 -1074507 -317522
33688 -317522 473447 902718 862970 775840 1086019 1555738 1519349 893968 409860 605637
33678 605637 1076674 1089967 576736 93101 54294 417498 925586 1270380 1167872 641794
33668 641794 116781 -65806 -44836 -56533 73311 620983 1348161 1673922 1374464 726678
33658 726678 97959 -223260 -14068 567278 847818 391175 -263072 -225091 485642 979076
$$ packed form
33729B45815j54532j14964K913R1362M9490j050O690j8432J8985L35139O68426
33718A129842L98304m08655p78511j73847O03278N40421j14809l66456o3579J5183
33708G81171m27166p15706l49546K00500K76144K470o4269J36070J89264m534
33698B4398n1300K40469M55265J34749n32575r14613o99435j37228M05763P56985
33688c17522P90969M29271l9748q7130L10179M69719l6389o25381m84108J95777
33678F05637M71037J3293n13231m83635l8807L63204N08088L44794j02508n26078
33668F41794n25013j82587K0970j1697J29844N47672P27178L25761k99458o47786
33658G26678o28719l21219K09192N81346K80540m56643o54247L7981P10733M93434
$$ plain form
33648 979076 757662 231774 -66636 -51939 245693 811882 1226739 871411 -108394 -747872
33638 -747872 -562492 -212443 -396411 -778270 -672095 -228965 -150847 -562738 -941903 -989713
33628 -989713 -860274 -606320 -96190 455059 495697 -100691 -707000 -615459 207090 1179471
33618 1179471 1709952 1618710 1140711 667662 433925 377100 309390 211964 301820 760310
33608 760310 1379644 1558454 845871 -438000 -1360744 -1345581 -747414 -229763 76503 341832
33598 341832 336206 -286907 -1139993 -1386235 -954892 -640233 -807616 -882110 -452339 27666
33588 27666 143709 242632 574529 549563 -272038 -1131311 -1022971 -216619 202976 -32914
33578 -32914 -260375 -172093 -129360 -226300 -82833 318161 496411 311612 107054 -73349
$$ packed form
33648I79076k21414n25888k98410J4697K97632N66189M14857l55328r79805o39478
33638g47872J85380L50049j83968l81859J06175M43130P8118m11891l79165m7810
33628i89713J29439K53954N10130N51249M0638n96388o06309R1541Q22549R72381
33618A179471N30481r1242m77999m73049k33737n6825o7710r7426Q9856M58490
33608G60310O19334J78810p12583j283871r22744J5163N98167N17651L06266K65329
33598C41832n626o23113q53086k46242M31343L14659j67383p4494M29771M80005
33588B7666J16043R8923L31897k4966q21601q59273J08340Q06352M19595k35890
33578c2914k27461Q8282M2733r6940J43467M00994J78250j84799k04558j80403
$$ plain form
33568 -73349 -535941 -1080939 -1040994 -425784 -90023 -408590 -719033 -543031 -399289 -726612
33558 -726612 -885893 -153886 934931 1265132 769360 346118 328814 102749 -621001 -1115401
33548 -1115401 -677393 279715 733400 337012 -297626 -487091 -212876 99489 210760
33539 210760 231543 278327 270133 159630 132341 364707 713252 862224 680158 221549
33529 221549 -455718 -1144335 -1316640 -592273 606324 1342849 1217344 700970 342824
33520 342824 171049 74652 198052 562307 759717 500647 124099 99491 320387 387861
33510 387861 340801 553849 1055461 1475386 1591559 1458166 1096829 573258 278411 522488
33500 522488 862502 520711 -399021 -841487 -267586 509305 494265 -71256 -222773 162840
$$ packed form
33568g3349m62592n44998L9945O15210L35761l18567l10443J76002J43742l27323
33558g26612j59281P32007J088817L30201m95772m23242j7304k26065p23750m94400
33548a115401M38008R57108M53685l96388o34638j89465K74215L12365J11271
33539B10760K0783M6784q194j10503k7289K32366L48545J48972j82066m58609
33529B21549o77267o88617j72305P24367J198597P36525j25505n16374l58146
33520C42824j71775r6397J23400L64255J97410k59070l76548k4608K20896O7474
33510C87861m7060K13048N01612M19925J16173j33393l61337n23571k94847K44077
33500E22488L40014l41791r19732m42466N73901P76891j5040n65521j51517L85613
$$ plain form
33490 162840 250984 -302813 -705018 -196021 812935 1336644 1120989 722588 509758 269654
33480 269654 -153957 -453367 -344123 -27346 144616 159098 188537 192715 23746 -230552
33470 -230552 -352305 -356145 -442781 -655689 -855467 -949161 -863118 -415193 411562 1150566
33460 1150566 1249596 797948 422529 420159 470358 306859 126060 82519 -91743 -569259
33450 -569259 -948462 -756395 -136235 406901 691200 848761 887304 767479 711426 872115
33440 872115 845458 151697 -846331 -1218218 -779192 -418165 -813391 -1461639 -1455599 -732517
33430 -732517 16745 354562 421004 428393 402758 394964 470261 473175 211437 -125111 -140770
33419 -140770 165372 418058 508774 692449 919650 677350 -172728 -936773 -960911 -554956
$$ packed form
33490A62840Q8144n53797m02205N08997J008956N23709k15655l98401k12830k40104
33480B69654m23611k99410J09244L16777J71962J4482K9439M178j68969k54298
33470b30552j21753l840q6636k12908j99778r3694Q6043M47925Q26755P39004
33460A150566R9030m51648l75419k370N0199j63499j80799m3541j74262m77516
33450e69259l79203J92067O20160N43136K84299J57561L8543j19825n6053J60689
33440H72115k6657o93761r98028l71887M39026L61027l95226o48248O040P23082
33430g32517P49262L37817O6442P389k5635p794P5297K914k61738l36548j5659
33419a40770L06142K52686R0716J83675K27201k42300q50078p64045k4138M05955
$$ plain form
33409 -554956 -479187 -805210 -925957 -544285 5560 390703 595606 563252 173551 -273983
33399 -273983 -203169 360524 664603 301838 -206760 -321503 -342437 -741219 -1172972 -960959
33389 -960959 -257750 122253 -80825 -320561 -208711 45044 263247 598008 944194 771846
33379 771846 -42332 -781375 -755953 -179400 277044 415987 483681 510448 294507 -44136
33369 -44136 -62585 351112 733051 623333 135143 -210834 -56759 513463 1138775 1468516
33359 1468516 1318767 705911 -144023 -831695 -985990 -568394 56148 451114 482504 299263
33349 299263 56503 -178091 -318436 -262743 3423 433928 983399 1506025 1726888 1517953
33339 1517953 1066971 556486 -105305 -905033 -1339235 -943428 -83793 374149 174741
$$ packed form
33409e54956P5769l26023j20747L81672N49845L85143K04903l2354l89701m47534
33399b73983P0814N63693L04079l62765n08598j14743k0934l98782m31753K12013
33389i60959P03209L80003k03078k39736J11850K53755K18203L34761L46186j72348
33379G71846q14178p39043K5422N76553M56444J38943O7694K6767k15941l38643
33369d4136j8449M13697L81939j09718m88190l45977J54075N70222O25312L29741
33359A468516j49749o12856q49934o87672j54295M17596O24542L94966L1390j83241
33349B99263k42760k34594j40345N5693K66166M30505N49471N22626K20863k08935
33339A517953m50982n10485o61791p99728m34202L95807Q59635M57942j99408
$$ plain form
33330 174741 -154779 -260248 -377815 -630375 -666756 -371384 -251391 -615111 -936168 -606897
33320 -606897 139431 647176 771731 772144 625974 144690 -454999 -772024 -862389 -1019406
33310 -1019406 -1064057 -574232 217558 512391 71370 -408185 -284723 209716 440885 224809
33300 224809 -121484 -290346 -252573 -175102 -241370 -450550 -580222 -506021 -457523 -657048
33290 -657048 -816247 -447688 322721 771377 537938 79732 -50175 92113 171814 192821
33280 192821 362129 617084 730419 735743 842951 995538 878314 390969 -158350 -386631
33270 -386631 -191185 233589 574712 595255 297683 -84285 -332695 -438846 -467401 -343420
33260 -343420 34711 524114 803490 735192 472733 179842 -129114 -376179 -311529 138079
$$ packed form
33330A74741l29520j05469j17567k52560l6381K95372J19993l63720l21057L29271
33320f06897P46328N07745J24555M13j46170m81284n99689l17025r0365j57017
33310a019406m4651M89825P91790K94833m41021m79555J23462M94439K31169k16076
33300B24809l46293j68862L7773P7471o6268k09180j29672P4201M8498j99525
33290f57048j59199L68559P70409M48656k33439m58206j29907J42288P9701K1007
33280A92821J69308K54955J13335N324J07208J52587j17224m87345n49319k28281
33270c86631J95446M24774L41123K0543k97572l81968k48410j06151k8555J23981
33260c43420L78131M89403K79376o8298k62459k92891l08956k47065O4650M49608
$$ plain form
33250 138079 583494 561717 161430 -78645 75820 278752 210590 44603 20186 -51459
33240 -51459 -391693 -668618 -422282 72371 81843 -407255 -552120 36146 581442 255721
33230 255721 -562814 -809687 -186136 581023 806121 574209 379203 487134 760254 859902
33220 859902 593113 170485 -13671 67804 72892 -18695 262912 998475 1425686 975155
33210 975155 235770 96065 361756 196672 -369205 -522329 -171420 -126268 -591927 -720553
33200 -720553 -66063 707994 1141119 1790268 2931900 3680209 3622804 4298592 7330592
33191 7330592 11503153 13490436 11708911 7987963 5007591 3457070 2472674 1645480
33183 1645480 1306815 1383162 1260193 811191 624337 998013 1420962 1364823 1031888 878454
$$ packed form
33250A38079M45415k1777m00287k40075J54465K02932o8162j65987k4417p1645
33240e1459l40234k76925K46336M94653R472m89098j44865N88266N45296l25721
33230B55721q18535k46873O23551P67159K25098k31912j95006J07931K73120R9648
33220H59902k66789m22628j84156Q1475N088r1587K81607P35563M27211m50531
33210I75155p39385j39705K65691j65084n65877j53124L50909M5152m65659j28626
33200g20553O54490P74057M33125O49149J141632P48309n7405O75788L032000
33191G330592M172561J987283j781525l720948k980372j550521r84396q27194
33183A645480l38665P6347j22969m49002j86854L73676M22949n6139l32935j53434
$$ plain form
33173 878454 790332 304723 -477073 -798691 -243703 626835 972235 718904 464640 473647
33163 473647 331320 -253401 -811462 -682434 54862 681185 785843 677290 770635 949118
33153 949118 779180 158932 -522550 -837953 -723054 -375306 79993 649445 1224496 1486779
33143 1486779 1225475 671676 322137 415732 742852 982124 1019478 875797 569889 227433
33133 227433 129263 414341 841271 1054020 987880 803874 546844 166469 -182843 -213454
33123 -213454 75263 364150 490372 633159 877605 945557 643854 287499 282137 474310
33113 474310 389029 49196 23153 539171 1073124 1122910 970476 1214137 1790642 1990292
33103 1990292 1415741 483699 -105002 -66194 372311 792638 928695 917225 1210473 1966953
$$ packed form
33173H78454q8122m85609p81796l21618N54988Q70538L45400k53331k54264R007
33163D73647j42327n84721n58061J29028P37296O26323J04658j08553R3345J78483
33153I49118j69938o20248o81482l15403J14899L47748M55299N69452N75051K62283
33143A486779k61304n53799l49539R3595L27120K39272L7354j43681l05908l42456
33133B27433r8170K85078M26930K12749o6140j84006k57030l80375l49312l0611
33123b13454K88717K88887J26222J42787K44446O7952l01703l56355n362J92173
33113D74310q5281l39833k6043N16018N33953M9786j52434K43661N76505J99650
33103A990292n74551r32042n88701L8808M38505M20327J36057j1470K93248P56480
$$ plain form
33093 1966953 2596434 2361313 1480778 1093515 1886048 3279708 4378116 5281616 6909848
33084 6909848 9744929 13241218 16308353 17903034 17333524 14642263 10832750 7297265
33076 7297265 4838966 3407132 2633877 2216506 1850474 1324470 817238 700365 928116
33067 928116 1001466 652443 164932 -134386 -276621 -308743 15450 801049 1544827 1566373
33057 1566373 845414 69605 -179207 -12828 66356 -159402 -426547 -402332 -96882 235652
33047 235652 466910 628954 618106 220549 -415634 -695323 -290301 326625 460990 110222
33037 110222 -160952 -109850 -26820 -76138 -13274 288317 524199 404399 42253 -293983
33027 -293983 -477723 -410694 9586 583672 809810 459732 -90138 -319580 -122549 276951
$$ packed form
33093A966953O29481k35121q80535l87263P92533J393660J098408R03500J628232
33084F909848K835081L496289L067135J594681n69510k691261l809513l535485
33076G297265k458299j431834p73255m17371l66032n26004n07232j16873K27751
33067I28116P3350l49023m87511k99318j42235l2122L24193P85599P43778K1546
33057A566373p20959p75809k48812J66379P9184k25758k67145K4215L05450L32534
33047B35652K31258J62044j0848l97557o36183k79689M05022O16926J34365l50768
33037A10222k71174N1102Q3030m9318O2864L01591K35882j19800l62146l36236
33027b93983j83740O7029M20280N74086K26138l50078n49870k29442J97031L99500
$$ plain form
33017 276951 691105 1004223 1059743 786144 350422 28494 -20100 161408 308122 47890
33007 47890 -678255 -1316302 -1188853 -363474 345930 378131 41238 -63287 147449 310076
32997 310076 245935 188109 442246 987136 1394604 1186038 414406 -222944 -131039 434378
32987 434378 729754 517035 212597 113533 69843 -3001 125994 565675 1097681 1549624
32977 1549624 1966149 2436935 3257386 5044444 7816844 10037990 9751208 6990281 3970408
32968 3970408 2436764 1951596 1402191 904627 1112137 1650377 1611012 1034825 644289
32959 644289 494660 92331 -425553 -425060 31172 230487 25486 -18352 279971 443547
32949 443547 271805 161515 321280 432711 274938 32340 -157707 -386003 -617288 -662672
$$ packed form
33017B76951M14154L13118N5520k73599m35722l21928m8594J81508J46714k60232
33007D7890p26145o38047J27449Q25379P09404L2201l36893j04525K10736J62627
32997C10076o4141n7826K54137N44890M07468k08566p71632o37350R1905N65417
32987D34378K95376k12719l04438r9064m3690p2844J28995M39681N32006M51943
32977A549624M16525M70786Q20451J787058K772400K221146k86782k760927l019873
32968C970408j533644m85168n49405m97564K07510N38240l9365n76187l90536
32959F44289j49629m02329n17884M93M56232J99315k05001m3838K98323J63576
32949D43547j71742j10290J59765J11431j57773k42598j90047k28296k31285m5384
$$ plain form
32939 -662672 -508846 -239492 200468 679774 657930 -61142 -731434 -614168 -130879 -132136
32929 -132136 -431178 -240852 234726 42220 -745871 -967733 -274969 328825 203615 -63513
32919 -63513 4023 -60549 -517952 -740668 -451577 -416620 -1024335 -1363118 -747467 -48361
32909 -48361 -277872 -812134 -435105 559029 824898 136416 -385206 -122936 288878 192070
32899 192070 -235327 -566888 -675780 -489402 31815 491196 326462 -344220 -760111 -532550
32889 -532550 -40484 284398 456434 566972 503144 270000 122096 149423 120338 -89452
32879 -89452 -288474 -365673 -537780 -976565 -1443091 -1505202 -995152 -167865 483703 586843
32869 586843 222366 -136422 -164283 -49107 -122777 -308827 -265159 35926 252525 181420
$$ packed form
32939f62672J53826K69354M39960M79306k1844p19072o70292J17266M83289j257
32929a32136k99042J90326M75578j92506p88091k21862O92764O03794j25210k67128
32919f3513O7536o4572m57403k22716K89091L4957o07715l38783O15651O99106
32909d8361k29511n34262L77029R94134K65869o88482n21622K62270M11814r6808
32899A92070m27397l31561j08892J86378N21217M59381j64734o70682m15891K27561
32889e32550M92066L24882J72036J10538o3828k33144j47904K7327k9085k09790
32879h9452j99022p7199j72107m38785m66526o2111N10050Q27287O51568J03140
32869E86843l64477l58788k7861J15176p3670j86050M3668L01085K16599p1105
$$ plain form
32859 181420 -38118 -267708 -570114 -936311 -1087518 -777327 -204991 69087 -277095 -852171
32849 -852171 -872009 -105840 706738 724153 126561 -154979 214633 599111 523540 379921
32839 379921 550351 582947 -28659 -794840 -817527 -114304 480587 556922 454619 430910
32829 430910 319732 98344 71835 314582 486608 354685 42221 -291411 -571032 -629512
32819 -629512 -407765 -267781 -544325 -871977 -630836 -1409 237802 17156 140529 863843
32809 863843 1267005 618934 -411065 -662475 -90532 324282 14013 -550227 -639107 -138406
32799 -138406 458161 652738 457627 337140 556641 716303 291556 -451462 -671511 -160586
32789 -160586 364402 424814 457951 868849 1187227 891410 419148 448762 645282 164742
$$ packed form
32859A81420k19538k29590l02406l66197j51207L10191N72336K74078l46182n75076
32849h52171j9838P66169Q12578J7415n97592k81540L69612L84478p5571j43619
32839C79921J70430L2596o11606p66181k2687P03223N94891P6335j02303k3709
32829D30910j11178k21388k6509K42747J72026j31923l12464l33632k79621n8480
32819f29512K21747J39984k76544l27652K41141O29427K39211k20646J23373P23314
32809H63843M03162o48071j029999k51410N71943M14814l10269n64240q8880N00701
32799a38406N96567J94577j95111j20487K19501J59662m24747p43018k20049N10925
32789a60586N24988O0412L3137M10898L18378k95817m72262K9614J96520m80540
$$ plain form
32779 164742 -830207 -1251418 -705153 -15077 83430 -137416 -132806 43551 67066 -49574
32769 -49574 -132014 -186702 -211380 -80835 98082 -163 -268222 -103660 616467 1120950
32759 1120950 839151 297293 217352 294892 -176488 -856950 -712055 224922 660308 -36413
32749 -36413 -790681 -373758 811595 1365064 845453 182053 250828 843655 1205988 1015543
32739 1015543 544296 195375 172699 453793 840824 1031440 780931 110606 -623511 -973078
32729 -973078 -816917 -457788 -173318 157724 691127 1052684 655029 -393349 -1246383
32720 -1246383 -1345441 -944147 -421000 250892 958222 1106315 502055 -16614 323896 962504
32710 962504 805780 -3445 -257375 407420 954289 586804 -123318 -282848 1555 22896
$$ packed form
32779A64742r94949m21211N46265O90076R8507k20846M610J76357K3515j16640
32769d9574q2440n4688k4678J30545J78917r8245k68059J64562P20127N04483
32759A120950k81799n41858p9941P7540m71380o80462J44895R36977M35386o96721
32749c6413p54268M16923J185353N53469n19611o63400O8775N92827L62333j90445
32739A015543m71247l48921k2676K81094L87031J90616k50509o70325p34117l49567
32729i73078J56161L59129K84470L31042N33403L61557l97655j048378q53034
32720a246383r9058M01294N23147O71892P07330J48093o04260n18669L40510O38608
32710I62504j56724q09225k53930O64795N46869l67485p10122j59530K84403K1341
$$ plain form
32700 22896 -382804 -744635 -657250 -82461 750990 1376024 1338776 756522 307837 398779
32690 398779 700358 736811 474907 78621 -383509 -668593 -390965 263697 463898 -125756
32680 -125756 -740594 -648151 -254279 -326848 -695895 -661715 -280236 -204717 -468304 -483237
32670 -483237 -207131 -254179 -696006 -748436 -7766 828178 943981 489242 190251 328427
32660 328427 574763 567175 268760 -111802 -320137 -255931 -58418 83198 131359 64893
32650 64893 -256686 -793795 -1109141 -873148 -410728 -259907 -353555 -212728 182715 400189
32640 400189 394721 600594 1087847 1356835 1160815 830501 544325 12449 -748824 -1044117
32630 -1044117 -435231 500212 911845 746744 515925 363041 7131 -560592 -913437
$$ packed form
32700B2896m05700l61831Q7385N74789Q33451O25034l7248n82254m48685R0942
32690C98779L01579L6453k61904l96286m62130k85084K77628O54662K00201n89654
32680a25756o14838R2443L93872p2569l69047L4180L81479P5519k63587j4933
32670d83237K76106m7048m41827n2430P40670Q35944J15803m54739k98991J38176
32660C28427K46336p588k98415l80562k08335O4206J97513J41616M8161o6466
32650F4893l21579n37109l15346K35993M62420J50821r3648J40827L95443K17474
32640D00189n468K05873M87253K68988j96020l30314k86176n31876p61273k95293
32630a044117O08886R35443M11633j65101k30819j52884l55910n67723l52845
$$ plain form
32621 -913437 -745381 -223142 233639 306242 -23949 -455422 -635181 -542521 -438420 -396351
32611 -396351 -208536 115240 157200 -317569 -899232 -995577 -538167 59533 444116 545546
$$ packed form
32621i13437J68056N22239M56781P2603l30191m31473j79759R2660J04101M2069
32611c96351J87815L23776M1960m74769n81663r6345M57410N97700L84583J01430
$$ [...]
##END NTUPLES=NMR SPECTRUM
##END=
