##TITLE=31Pdec_IPACAT-25a
 DMSO-d6, 24 sc
 22.2.2023
##JCAMPDX= 6.0         $$ Bruker NMR JCAMP-DX V2.0
##DATA TYPE= NMR SPECTRUM
##DATA CLASS= NTUPLES
##ORIGIN= UXNMR, Bruker Analytische Messtechnik GmbH
##OWNER= root
$$ XWIN-NMR		Version 3.5
$$ Wed Feb 22 14:00:53 2023 Russian Standard Time (UT+4h)  she@DPX200
##.OBSERVE FREQUENCY= 81.013821
##.OBSERVE NUCLEUS= ^31P
##.ACQUISITION MODE= SIMULTANEOUS
##.ACQUISITION SCHEME= undefined
##.AVERAGES= 24
##.DIGITISER RES= 16
##SPECTROMETER/DATA SYSTEM= spect
##.PULSE SEQUENCE= zgpg30
##.SOLVENT NAME= CDCl3
##.SHIFT REFERENCE= (INTERNAL, CDCl3, 0, 248.564)
##AUDIT TRAIL= $$ (NUMBER, WHEN, WHO, WHERE, WHAT)
$$ ##TITLE= Audit trail, XWIN-NMR		Version 3.5
$$ ##JCAMPDX= 5.01
$$ ##ORIGIN= Bruker BioSpin GmbH
$$ ##OWNER= she
$$ F:/spectra/data/she/nmr/P31/1/pdata/1/auditp.txt
$$ ##AUDIT TRAIL=  $$ (NUMBER, WHEN, WHO, WHERE, WHAT)
(   1,<2023-02-22 13:58:41.75 +0400>,<she>,<DPX200>,
      <created by zg, POWCHK disabled, PULCHK disabled
       configuration hash MD5:
       00 E9 B6 7A A2 85 ED C7 34 08 36 98 17 FE 4E 26
       data hash MD5: 32K
       2C 93 49 2F 95 C3 AA 06 1F 29 4C 07 E9 7C 35 C9>)
(   2,<2023-02-22 13:59:00.37 +0400>,<she>,<DPX200>,
      <Start of raw data processing
       efp BC_mod = 2 LB = 1 FT_mod = 6 PKNL = 1 PHC0 = -11026.94 PHC1 = 177.0102 SI = 64K 
       data hash MD5: 64K
       CE 51 4C 59 DC B2 92 AB 6B 3F 33 E2 5B 22 58 14>)
(   3,<2023-02-22 13:59:19.01 +0400>,<she>,<DPX200>,
      <pk PHC0 = 26.44917 PHC1 = 0 
       data hash MD5: 64K
       0E B7 17 08 11 80 12 CC 84 8C 03 CF E9 21 6F AF>)
(   4,<2023-02-22 13:59:22.45 +0400>,<she>,<DPX200>,
      <abs ABSG = 5 
       data hash MD5: 64K
       8A 80 31 D3 8C 8A 05 25 F7 5D DA 0B 2B D2 D3 31>)
$$ ##END=
$$ 
$$ hash MD5
$$ E7 D1 A9 26 0D 36 FD 26 2A 28 5E 00 6F D9 6C 6B
##$RELAX= 
##$RELAX= 
##$RELAX= 
##$RELAX= 
##$RELAX= 
##$RELAX= 
##$RELAX= 
##$RELAX= 
##$RELAX= 
$$ Bruker specific parameters
$$ --------------------------
##$DU= <F:/spectra>
##$EXPNO= 1
##$NAME= <P31>
##$PROCNO= 1
##$TYPE= <nmr>
##$USER= <she>
##$AMP= (0..31)
100 100 100 100 100 100 100 100 100 100 100 100 100 100 100 100 100 100 
100 100 100 100 100 100 100 100 100 100 100 100 100 100 
##$AQSEQ= 0
##$AQ_mod= 1
##$AUNM= <au_zg>
##$AUTOPOS= <>
##$BF1= 81.014009
##$BF2= 200.13
##$BF3= 200.13
##$BF4= 200.13
##$BF5= 200.13
##$BF6= 200.13
##$BF7= 200.13
##$BF8= 200.13
##$BYTORDA= 1
##$CFDGTYP= 0
##$CFRGTYP= 5
##$CHEMSTR= <none>
##$CNST= (0..31)
1 1 145 1 1 1 1 1 1 1 1 1 1 1 1 1 1 1 1 1 1 1 1 1 1 1 1 1 1 1 1 1 
##$CPDPRG= <waltz16>
##$CPDPRG1= <>
##$CPDPRG2= <waltz16>
##$CPDPRG3= <>
##$CPDPRG4= <mlev>
##$CPDPRG5= <mlev>
##$CPDPRG6= <mlev>
##$CPDPRG7= <mlev>
##$CPDPRG8= <mlev>
##$CPDPRGB= <>
##$CPDPRGT= <>
##$D= (0..31)
0 1 0 0 0 0 0 0 0 0 0 0.03 2e-05 3e-06 0 0 0 0 0 0 0 0 0 0 0 0 0 0 0 0 
0 0 
##$DATE= 1677059921
##$DBL= (0..7)
120 120 120 11 120 120 24 19 
##$DBP= (0..7)
150 150 150 150 150 150 150 150 
##$DBP07= 0
##$DBPNAM0= <>
##$DBPNAM1= <>
$$ [...]
##$SUBNAM3= <"">
##$SUBNAM4= <"">
##$SUBNAM5= <"">
##$SUBNAM6= <"">
##$SUBNAM7= <"">
##$SUBNAM8= <"">
##$SUBNAM9= <"">
##$SW= 501.771253377433
##$SWIBOX= (0..15)
0 1 3 0 0 0 0 0 0 0 0 0 0 0 0 0 
##$SW_h= 40650.406504065
##$TD= 32768
##$TD0= 1
##$TE= 0
##$TE2= 300
##$TE3= 300
##$TEG= 300
##$TL= (0..7)
0 120 53 12 22 120 120 120 
##$TP= (0..7)
150 150 150 150 150 150 150 150 
##$TP07= 0
##$TPNAME0= <>
##$TPNAME1= <>
##$TPNAME2= <>
##$TPNAME3= <>
##$TPNAME4= <>
##$TPNAME5= <>
##$TPNAME6= <>
##$TPNAME7= <>
##$TPOAL= (0..7)
0.5 0.5 0.5 0.5 0.5 0.5 0.5 0.5 
##$TPOFFS= (0..7)
0 0 0 0 0 0 0 0 
##$TUNHIN= 0
##$TUNHOUT= 0
##$TUNXOUT= 0
##$USERA1= <user>
##$USERA2= <user>
##$USERA3= <user>
##$USERA4= <user>
##$USERA5= <user>
##$V9= 5
##$VALIST= <valist>
##$VCLIST= <CCCCCCCCCCCCCCC>
##$VD= 0
##$VDLIST= <DDDDDDDDDDDDDDD>
##$VPLIST= <PPPPPPPPPPPPPPP>
##$VTLIST= <TTTTTTTTTTTTTTT>
##$WBST= 1024
##$WBSW= 4
##$XGAIN= (0..3)
0 0 0 0 
##$XL= 0
##$YL= 0
##$YMAX_a= 2974
##$YMIN_a= -2845
##$ZGOPTNS= <>
##$ZL1= 120
##$ZL2= 120
##$ZL3= 120
##$ZL4= 120
##$ABSF1= 248.5645
##$ABSF2= -253.2056
##$ABSG= 5
##$ABSL= 3
##$ALPHA= 0
##$AQORDER= 0
##$ASSFAC= 0
##$ASSFACI= 0
##$ASSFACX= 0
##$ASSWID= 0
##$AUNMP= <proc_1d>
##$AZFE= 0.1
##$AZFW= 0.5
##$BCFW= 0
##$BC_mod= 2
##$BYTORDP= 0
##$COROFFS= 0
##$CY= -3
##$DATMOD= 1
##$DC= 0
##$DFILT= <>
##$DTYPP= 0
##$F1P= 0
##$F2P= 0
##$FCOR= 1
##$FTSIZE= 65536
##$FT_mod= 6
##$GAMMA= 0
##$GB= 0
##$INTBC= 1
##$INTSCL= 6.047779e-11
##$ISEN= 30
##$LB= 1
##$LEV0= 0
##$LPBIN= 0
##$MAXI= 10000
##$MC2= 0
##$MEAN= 0
##$ME_mod= 0
##$MI= 50
##$NCOEF= 0
##$NC_proc= -7
##$NLEV= 6
##$NOISF1= 182.463
##$NOISF2= 159.3651
##$NSP= 0
##$NTH_PI= 0
##$NZP= 0
##$OFFSET= 248.5645
##$PC= 4
##$PHC0= -11000.49
##$PHC1= 177.0102
##$PH_mod= 1
##$PKNL= yes
##$PPARMOD= 0
##$PSCAL= 0
##$PSIGN= 0
##$REVERSE= no
##$SF= 81.0140089999694
##$SI= 65536
##$SIGF1= 159.3651
##$SIGF2= -187.1042
##$SINO= 113.3802
##$SIOLD= 16384
##$SREGLST= <1H.CDCl3>
##$SSB= 0
##$STSI= 65536
##$STSR= 0
##$SW_p= 40650.406504065
##$SYMM= 0
##$S_DEV= 0
##$TDeff= 32768
##$TDoff= 0
##$TI= <>
##$TILT= no
##$TM1= 0
##$TM2= 0
##$TOPLEV= 0
##$USERP1= <user>
##$USERP2= <user>
##$USERP3= <user>
##$USERP4= <user>
##$USERP5= <user>
##$WDW= 1
##$XDIM= 65536
##$YMAX_p= 426183756
##$YMIN_p= -71768105
$$ End of Bruker specific parameters
$$ ---------------------------------
##NTUPLES= NMR SPECTRUM
##VAR_NAME=  FREQUENCY,     SPECTRUM/REAL,   SPECTRUM/IMAG
##SYMBOL=    X,             R,               I
##VAR_TYPE=  INDEPENDENT,   DEPENDENT,       DEPENDENT
##VAR_FORM=  AFFN,          ASDF,            ASDF
##VAR_DIM=   65536,         65536,           65536
##UNITS=     HZ,            ARBITRARY UNITS, ARBITRARY UNITS
##FACTOR=    0.620285442955139, 1,           1
##FIRST=     20137.2065510682, 0,            0
##LAST=      -20513.1999529968, 0,           0
##MIN=       -20513.1999529968, -71768105,   0
##MAX=       20137.2065510682, 426183756,    0
$$ Real data points
##PAGE= N=1
##DATA TABLE= (X++(R..R)), XYDATA
$$ [...]
38333I07309Q06714J392231O66592j224903j836269k03085R38628q59961l377173
38324b789917k582174J080682K974183J020194j437197q11654J697437K392740
38316A544294L77423j860285k152889p24328J117305K432103K561301J099650
38308D394574j328860l069302k947097j530987l84453j49613L2319R01605J555540
38299b526274O04888j296802j671173K98660K108401J335027o23815n68687J446319
38290h93456K053426j13086k131671j247619J032342J550130L22388J5332J480223
38281B068009K563512J502004o52767j691696j010688j3364l19430j854896k639292
38272b048608r64850K003302K950066N52789k391274k392640K80478K379512K059201
$$ plain form
38333 907309 1714023 3106254 3772846 2547943 711674 508589 1447217 587256 -2789917
38324 -2789917 -5372091 -4291409 -1317226 -297032 -1734229 -2545883 -848446 1544294
38316 1544294 1921717 61432 -2091457 -2815785 -1698480 733623 3294924 4394574
38308 4394574 3065714 -3588 -2950685 -4481672 -4866125 -5015738 -4983419 -4081814 -2526274
38299 -2526274 -1921386 -3218188 -4889361 -4590701 -2482300 -1147273 -1771088 -2339775 -893456
38290 -893456 1159970 1046884 -1084787 -2332406 -1300064 250066 572454 587786 2068009
38281 2068009 4631521 6133525 5480758 3789062 2778374 2765010 2445580 590684 -2048608
38272 -2048608 -3013458 -1010156 1939910 2492699 101425 -2291215 -2010737 368775 2427976
38263B427976L87296j039309j699773j387187n5674J212096J012192k06249n78354
38254G3014K49689O21788j94038p21704J03167R81139K74632j442700k214901
38245b269914j175100P49540J884431J156594p27800j532095k03349J162985J71232
38236g83476j647170o85934K593039L468473J48234l178182k822105q86387o91969
38227d485477r29785J020486L172087J900695j207886j429897J114432J640738
38219G95393j024477k445595j70202K339253J726386j55376k06105P40106J21535
38210A720918j701099k251998p15082J520510K785978K103435k05776j975274
38202A281612j319494J95011n89964k909355k471071J334526L428184Q58861k244474
$$ plain form
38263 2427976 2815272 1775963 76190 -1310997 -1366671 -154575 857617 651368 73014
38254 73014 322703 944491 750453 28749 131916 1113055 1387687 -55013 -2269914
38245 -2269914 -3445014 -2695474 -811043 345551 -382249 -1914344 -2117693 -954708 -783476
38236 -783476 -2430646 -3116580 -523541 2944932 3093166 -85016 -2907121 -3793508 -4485477
38227 -4485477 -5415262 -4394776 -1222689 678006 -529880 -1959777 -845345 795393
38219 795393 -229084 -2674679 -2844881 -505628 1220758 1065382 859277 1599383 1720918
38210 1720918 19819 -2232179 -2947261 -1426751 1359227 3462662 3256886 1281612
38202 1281612 -37882 157129 -432835 -3342190 -5813261 -4478735 -1050551 -191690 -2436164
38193b436164j417741R90094N30708j304827o1889L134312K963741r30477k948917
38184a481160l82783K804550K648730L91910j150646j922294k682469k362105
38176d136267k26653J903099K083731R45115N8686m76516j116536j360530p68487
38167c094358O6353P87069J845955K808705K099387l17617k007303j267834N09570
38158A429927J074312K26712q04111j217671o79125P48901J640539K33934k412645
38149B40773k752363J72463K686492J751005m40061k17304J527893J037265j848189
38140B157974l236862j249019J378023J736211N98579K42140P99232P26351m29734
38131B722895j517716j557656q13166j20288J99943N35826J125464J269945R7347
$$ plain form
38193 -2436164 -3853905 -2863811 -2333103 -3637930 -3699819 -565507 2398234 1467757 -1481160
38184 -1481160 -1863943 940607 3589337 3981247 2830601 908307 -1774162 -4136267
38176 -4136267 -4362920 -2459821 -376090 569025 627711 151195 -965341 -2325871 -3094358
38167 -3094358 -3028005 -2240936 -394981 2413724 4513111 4195494 2188191 920357 1429927
38158 1429927 2504239 2730951 1926840 709169 30044 778945 2419484 2653418 240773
38149 240773 -2511590 -2339127 347365 2098370 1658309 1441005 2968898 4006163 2157974
38140 2157974 -1078888 -2327907 -949884 786327 1384906 1627046 2426278 3152629 2722895
38131 2722895 1205179 -352477 -1165643 -1285931 -1085988 -550162 575302 1845247 1942594
38122A942594j733715k192323m96502J504672J743000P23624L27521O48006J20186
38113B587063j406971k008534o88732Q37588M68628j406399k509458j498896P24257
38104d901454K218345J926930N83043q5107P04962J738426J272471n60836j783678
38095A113102j223551n0710K3123q06514q93867L25159J478246J187396o9150
38086A083234o65033O8537J148940J238365L2500j651217k583460j876567K16483
38077b988218K009884J759862j64645j403941o22574O84522N67103l64048j86529
38068g08584Q61517O70359r97357j741318k97482J384280J206277j8627l10360
38059D8705L39906N21584q0843o02330n83189l1057J207535K581734K420004J86765
$$ plain form
38122 1942594 208879 -1983444 -2479946 -975274 767726 1491350 1818871 2466877 2587063
38113 2587063 1180092 -828442 -1517174 -679586 -210958 -1617357 -4126815 -5625711 -4901454
38104 -4901454 -2683109 -756179 -173136 -258243 446719 2185145 3457616 2896780 1113102
38095 1113102 -110449 -161159 -138036 -944550 -1838417 -1513258 -35012 1152384 1083234
38086 1083234 418201 486738 1635678 2874043 2906543 1255326 -1328134 -3204701 -2988218
38077 -2988218 -978334 781528 616883 -787058 -1409632 -725110 -158007 -522055 -708584
38068 -708584 152933 823292 -174065 -1915383 -2212865 -828585 377692 359065 48705
38059 48705 388611 910195 829352 227022 -356167 -387224 820311 3402045 5822049 6008814
38049F008814j934751j843258q74585j744761l844688l750341n40938K633807
38041e890701L209870K401244K155702J689960m62382k876785k711530j6616K166961
38032c34277J974884N60716n91420j758246l198459l331192p68869K792672L923537
38023g30654J696355j226357k080317r13018O24759J669771K057424J279848o42558
38014A735253k054752j345527O01363J391830L44238j019555j489888j215231
38006c052269l47945J075385J741152J39405k354501k276642Q63057L153757J739691
37997F81090j004257j269364N16198R81838p14038k118238j636048l54099L61341
37988d555577N55242O71978Q07598J125256J450949P68840j174030k353919p41498
$$ plain form
38049 6008814 4074063 2230805 1356220 -388541 -4233229 -7983570 -8524508 -5890701
38041 -5890701 -2680831 -279587 1876115 3566075 3103693 226908 -2484622 -2501238 -334277
38032 -334277 1640607 2201323 1609903 -148343 -3346802 -6677994 -7446863 -4654191 -730654
38023 -730654 965701 -260656 -2340973 -3253991 -2629232 -959461 1097963 2377811 1735253
38014 1735253 -319499 -1665026 -1063663 328167 672405 -347150 -1837038 -3052269
38006 -3052269 -3400214 -2324829 -583677 -444272 -2798773 -5075415 -4212358 -1058601 681090
37997 681090 -323167 -1592531 -1076333 -94495 -808533 -2926771 -4562819 -4916918 -4555577
37988 -4555577 -4000335 -3328357 -2520759 -1395503 55446 824286 -349744 -2703663 -3445161
37979c445161K269838L131171Q98834j630760j911714n24545O31958J007900J162137
37970A589658J224964P53742l69692j427994j272304K92022J457111J78899k410388
37961A6018k574980N23999K628888M91244k545497j358840K541417K978039j061656
37952A638632l707452j460101J801203J682172j32325O9455J583557J408866r1948
37943B792059k84336P30277N51047r74411j554865n28816K52343k77634j059932
37934c54268j162398j010250r92728p42107j38105M22858Q39145J187478J085729
37925h64646M12986J53980J086746K125621J560992l73850j755018j632971r65271
37916b51431q68900j225529j219258m02209Q66182J601315J109315k1823n65148
$$ plain form
37979 -3445161 -1175323 1955848 2854682 1223922 -687792 -1212337 -580379 427521 1589658
37970 1589658 2814622 3568364 3198672 1770678 498374 790396 2247507 2426406 16018
37961 16018 -2558962 -2034963 593925 1085169 -1460328 -2819168 -277751 2700288 1638632
37952 1638632 -2068820 -3528921 -1727718 -45546 -177871 -108416 1475141 2884007 2792059
37943 2792059 2507723 3238000 3789047 2814636 1259771 730955 983298 705664 -354268
37934 -354268 -1516666 -2526916 -3519644 -4261751 -4399856 -3976998 -3137853 -1950375 -864646
37925 -864646 -451660 -297680 789066 2914687 4475679 4101829 2346811 713840 -251431
37916 -251431 -1120331 -2345860 -3565118 -3967327 -3101145 -1499830 -390515 -412338 -977486
37907i77486m75201q13480j503943r85913R83038K229368J388488K25863P09779
37898G80513J641591P98692j058120j368138q9601L57984p43161j367476k38863
37889a286579J301803J638626R42535J41010m39218p60697p98627r24941j350844
37880a536932j280164m2880J266820J074316r0082m04569Q6164l45694j652855
37871b925876j618434K69012J408004J26050j325136m3042K921088L773776J175682
37862C761124k058592k715618r80755L88678j09539r56347q7319J813851K058014
37853A113497J8664j631639r10903L55597l75976j928954j250217J282682K212303
37844a114946O93009j85440J198857K225264P30972j043225k32834J634804J085242
$$ plain form
37907 -977486 -1452687 -2266167 -3770110 -4756023 -3772985 -1543617 -155129 70734 780513
37898 780513 2422104 3220796 2162676 794538 704937 1062921 319760 -1047716 -1286579
37889 -1286579 15224 1653850 2596385 2737395 2298177 1537480 738853 -186088 -1536932
37880 -1536932 -2817096 -2859976 -1593156 -518840 -608922 -1013491 -927327 -1273021 -2925876
37871 -2925876 -4544310 -4275298 -2867294 -2741244 -4066380 -4109422 -1188334 2585442 3761124
37862 3761124 1702532 -1013086 -1993841 -1605163 -1714702 -2671049 -2758368 -944517 1113497
37853 1113497 1132161 -499478 -1410381 -1054784 -1430760 -3359714 -4609931 -3327249 -1114946
37844 -1114946 -421937 -607377 591480 2816744 3547716 2504491 2271657 3906461 4991703
37835D991703j478973k339235l82946J298871L60275j466258j488137j17249L13751
37826c08198n19534n94153R43106K077271Q27389j542300k039775k58120J001839
37817d12475J0626j231799l17809J437175R02111j707867k729376l89612K594629
37808a844397K775972J51172k554099l038629r19446K277887L787785J933941
37800B570186j451825k681035q68658J163910J259750N07676L28604L1867q13324
37791D7151n69996J296617J992694m50192l175111k420216M35536J023190r90877
37782b811204j698465M23494K343423J745682K66928k2269K56976P5805L12977
37773H93347J572334K154729N54228j829684k634649j779954q40879m20498l6362
$$ plain form
37835 4991703 3512730 1173495 790549 2089420 2449695 983437 -504700 -621949 -308198
37826 -308198 -827732 -1421885 -478779 1598492 2425881 883581 -1156194 -1414314 -412475
37817 -412475 -401849 -1633648 -1951457 -514282 387829 -1320038 -4049414 -4439026 -1844397
37808 -1844397 931575 1082747 -1471352 -4509981 -5429427 -3151540 636245 2570186
37800 2570186 1118361 -1562674 -2431332 -1267422 -7672 500004 828608 860475 47151
37791 47151 -522845 773772 2766466 2316274 -858837 -3279053 -2843517 -1820327 -2811204
37782 -2811204 -4509669 -4086175 -1742752 2930 269858 247589 504565 580370 893347
37773 893347 2465681 4620410 5174638 3344954 710305 -1069649 -1910528 -2331026 -2367388
37764b367388L36282L99076N19653J027287J123124k1420j522250j582757O7796
37755b020597J676953J526168j98485j679006j321911N79228K060755J667138
37747B290243R7982r49379j008490p46702k40062Q59834J693093Q97158q74805
37738B018872j408067l04349N32799L46609N73773J384879M65108k752655m785548
37729c928579k878094N22614J373309J9288p9854J894474L430678K890186R13826
37720D157848j634929l817130l672429p28097J618658L26903j824152k2466M125986
37711a469808M192269n81003l362103m48071L071132K101835n52578l36382P55397
37702C370688j287521m016474k240759K434266L659001P11938r61379N32384J084941
$$ plain form
37764 -2367388 -2031106 -1632030 -1112377 -85090 1038034 1016614 -505636 -2088393 -2020597
37755 -2020597 -343644 1182524 984039 -694967 -2016878 -1437650 623105 2290243
37747 2290243 2388225 1438846 430356 -316346 -556408 303426 1996519 2893677 2018872
37738 2018872 610805 306456 839255 1185864 1759637 3144516 3609624 856969 -3928579
37729 -3928579 -6806673 -6284059 -4910750 -4891462 -4971316 -3076842 353836 3244022 4157848
37720 4157848 2522919 -1294211 -4966640 -5694737 -4076079 -3749176 -5573328 -5595794 -1469808
37711 -1469808 2722461 2141458 -1220645 -1668716 1402416 3504251 2951673 2615291 3370688
37702 3370688 2083167 -1933307 -4174066 -1739800 1919201 2631139 1669760 2202144 3287085
37693C287085r98650j786676N26204J696628r73254l282921j125607K236141J381458
37684I60408k504162l843426j276198J482587K031098J384392L47993j399198
37676b816506k572833r93133K368551L747149J794193p31723j252933l70512L43574
37667d84173P24241R25838L79759p06425p44279Q69116K276062J453256j063628
37658C629767k906087k596189p25959R92621J288370L66219m09887k01105K79019
37649b83231M9831m96960l55694L24139O15258M37024L11073L6826p42881j231125
37639a335740n68098L79483L54079P2975P94855J357464j42128k182750j264013
37630b533873K146500L378122N54735k397443j876741K55405O18216j62490L79567
$$ plain form
37693 3287085 2288435 501759 1027963 2724591 1751337 -1531584 -2657191 -421050 960408
37684 960408 -1543754 -5387180 -6663378 -5180791 -3149693 -1765301 -1417308 -2816506
37676 -2816506 -5389339 -6382472 -4013921 -266772 1527421 795698 -457235 -827747 -484173
37667 -484173 240068 1165906 1545665 839240 94961 964077 3240139 4693395 3629767
37658 3629767 723680 -1872509 -2598468 -1605847 -317477 48742 -361145 -562250 -283231
37649 -283231 -233400 -730360 -1086054 -761915 -146657 290367 601440 638266 -104615 -1335740
37639 -1335740 -1903838 -1524355 -1170276 -1097301 -302446 1055018 912890 -1269860 -2533873
37630 -2533873 -387373 2990749 3545484 1148041 -728700 -473295 144921 -17569 361998
37621C61998J592445J090526o54933j179486l75052j53133n61097l2791R39123
37612A027600K25608j812475k338475o45880P40884L28738l14558J52023P18837
37603a917698N93133R02071K065652K169081P5819k092982j868009K9237J322649
37594A278953J638016J799635J166952j281991l933808l764170p32169J799807
37586b028775J624650K09372k58276N233k65508q05450o20194j50783m59186r22827
37576c671744l6690J640901J781101J2017j084738J03751J599649J075090k63145
37567A156192K04173J792716J362890j324709k727050r19306J413559J157726
37559B116191p82685j523994n87109L40695N37634N15361J65477q27946j428110
$$ plain form
37621 361998 1954443 3044969 2390036 1210550 835498 682365 121268 88477 1027600
37612 1027600 1253208 -559267 -2897742 -3543622 -2802738 -2474000 -2788558 -2636535 -1917698
37603 -1917698 -1324565 -422494 1643158 3812239 3888058 1795076 -72933 -43696 1278953
37594 1278953 2916969 4716604 5883556 4601565 667757 -3096413 -3828582 -2028775
37586 -2028775 -404125 -194753 -453029 -447796 -713304 -1518754 -2138948 -2289731 -2748917 -3671744
37576 -3671744 -3708434 -2067533 -286432 -274415 -1359153 -1255402 344247 1419337 1156192
37567 1156192 1360365 3153081 4515971 3191262 464212 -455094 958465 2116191
37559 2116191 1333506 -190488 -777597 -436902 100732 616093 781570 -46376 -1474486
37550a474486n33953P07909L08586j238742j559619j73867R18871O09490P8001
37541b357810K93139N28573K33069K34939R87573J390892N24076q31516j407352
37532d04417j031320k20168O84702J273321R96300k6985r37168j163535p43639
37523a572909K13954J270156J251901l55855j995457j827144n06295j0051j96117
37514c727817O66705K153134J865383k20158j219830j57854M29612p46597j254250
37505b211672M59512J757725K39487j792400j003180J429169J908927J00913j451626
37496e63145j837180j944423j380674P18736K663425K008101j80503p56764L17368
37487i55059L05320j102916j324965J82317R84678L22293K52178J091121K93814
$$ plain form
37550 -1474486 -2008439 -1300530 -991944 -2230686 -3790305 -3964172 -3045301 -2435811 -2357810
37541 -2357810 -2064671 -1536098 -1303029 -1068090 -80517 1310375 1834451 1002935 -404417
37532 -404417 -1435737 -1655905 -971203 302118 1298418 1271433 334265 -829270 -1572909
37523 -1572909 -1358955 -88799 1163102 807247 -1188210 -3015354 -3521649 -3531700 -3727817
37514 -3727817 -3061112 -907978 957405 737247 -482583 -640437 -210825 -957422 -2211672
37505 -2211672 -1752160 5565 245052 -1547348 -2550528 -1121359 787568 888481 -563145
37496 -563145 -2400325 -4344748 -5725422 -5006686 -2343261 -335160 -515663 -1272427 -955059
37487 -955059 -649739 -1752655 -3077620 -2895303 -1910625 -1588332 -1336154 -245033 48781
37478D8781k395491l167557p1484L248317K823794P0854j118446k64674K85077
37469e40829j97987n24476m04343l58594K09140J951031L384110K492967l9505
37460E971514j647304j414984n75734r7477k9051o82393k138654k955994j624011
37451e194088R24817K321655J968856J203402P11988R5781k93633L75711J282611
37442C397100O34756j236670k000454j023618l10545r09429j107608L23535J586003
37433f46930O77747j121699j073854Q18038J965921J184187J27862L57522R32126
37424C220920M0176k019820k827118q71498K194943L066603O53214k296810k291362
37415a130752N78882K788576K032666Q080n31699J15092m39144k347151k871514
$$ plain form
37478 48781 -2346710 -5514267 -5585751 -2337434 486360 557214 -561232 -825906 -540829
37469 -540829 -738816 -1263292 -1667635 -2026229 -1817089 133942 3518052 6011019 5971514
37460 5971514 4324210 2909226 2333492 2236015 2206964 1524571 -614083 -3570077 -5194088
37451 -5194088 -4269271 -1947616 21240 1224642 1936630 2032411 1738778 2114489 3397100
37442 3397100 4031856 2795186 794732 -228886 -539431 -1448860 -2556468 -2232933 -646930
37433 -646930 30817 -1090882 -2164736 -1346698 619223 1803410 1931272 2288794 3220920
37424 3220920 3261096 1241276 -1585842 -2457340 -262397 2804206 3457420 1160610 -1130752
37415 -1130752 -551870 2236706 4269372 4277452 3745753 3860845 3421701 1074550 -1796964
37406a796964o24451J972517K044955K92989n37246o6548l37798j616670j363085
37397b032301J361459L371303J726454j445594j821359M73547J038422j668985
37389A002946l500838r08082L350950M065991J022854j280818o05906M14306o30722
37380B930681j925306p89897J434695J065865k103476l839827j195280L136752
37372a285793M092485P00612k989116l295383q69583J500878K698734L010939
37364C563773J950736p93280l146593k588039j84849N76044p17352q13101J242171
37355i10490J817244j115322l537350j129468L532668M402283Q79176j863250
37347B075491r59054Q51169O08550q30120j593806j739992j631949o20916R03780
$$ plain form
37406 -1796964 -2421415 -448898 1596057 1889046 1351800 1285252 947454 -669216 -2032301
37397 -2032301 -670842 2700461 4426915 2981321 1159962 1633509 2671931 1002946
37389 1002946 -2497892 -3405974 -55024 4010967 5033821 3753003 3147097 3561403 2930681
37380 2930681 1005375 215478 1650173 2716038 612562 -3227265 -4422545 -1285793
37372 -1285793 2806692 3507304 518188 -2777195 -3646778 -2145900 552834 3563773
37364 3563773 5514509 4721229 1574636 -1013403 -1198252 -622208 -1339560 -2152661 -910490
37355 -910490 906754 -208568 -3745918 -4875386 -1342718 3059565 3938741 2075491
37347 2075491 1116437 1967606 2576156 1746036 152230 -1587762 -3219711 -3840627 -2936847
37338b936847J034605m44998j150859K8184J044899M02950l25422J93733L79504
37329a774251r39168j515041O48989L128621K410825m23196j370190L25372J730227
37320B222188J329514N44707K09095n64031j516318r23194R31016J323810n69597
37311B987190j962138o80658J603331K235633J305339L82069m63672j879014k819283
37302G08797j594624J111242K544785J344845r68914k212933j880109q84656j02782
37293a934349J94065J33830J18135N61408J217942J031476n98854k371350j950558
37284c598255R50039L296824K097743j393759k950559j110507Q99312K07044j391408
37275b993526o15779J885434K658390Q93739q70580j214238j300711j492197k96059
$$ plain form
37338 -2936847 -1902242 -2347240 -3498099 -3469915 -2425016 -2022066 -2347488 -2153755 -1774251
37329 -1774251 -2713419 -4228460 -3579471 -450850 1959975 1536779 166589 491961 2222188
37320 2222188 3551702 4096409 4305504 3741473 2225155 1301961 2232977 3556787 2987190
37311 2987190 1025052 344394 1947725 4183358 5488697 5870766 5407094 3528080 708797
37302 708797 -885827 225415 2770200 4115045 3146131 933198 -946911 -1831567 -1934349
37293 -1934349 -1740284 -1606454 -1488319 -926911 291031 1322507 723653 -1647697 -3598255
37284 -3598255 -2648216 648608 2746351 1352592 -1597967 -2708474 -1809162 -1602118 -2993526
37275 -2993526 -3609305 -1723871 934519 1828258 957678 -256560 -1557271 -3049468 -3345527
37266c345527K077201K690888M13611j630307o31644J518062J325743r15471k103866
37257f01310j283991k38128J37293P03426J410562Q62838r48246k067640j447068
37248c472264k43413L85570P21536J017508O52005k85614m78783L81839O40174
37239f81442o28457j629959m10460J873834K449609J008355p2546M21305Q85077
37230C215316p0277j071820k64956J202544M40259k548989m027866j512795K344233
37221b294351K985973K5006k526463k008857k19542K33766j04182N72213J539105
37212a797332P00231j383755j836780P7952J786991J415246L37971M94666J380098
37203A175288J335572J89771j010947j642220j464847k18353J360077J486434
$$ plain form
37266 -3345527 -1268326 1422562 1836173 205866 -425778 1092284 2418027 1502556 -601310
37257 -601310 -1885301 -2123429 -1986136 -1282710 127852 990690 42444 -2025196 -3472264
37248 -3472264 -3715677 -3330107 -2608571 -1591063 -939058 -1224672 -1703455 -1321616 -681442
37239 -681442 -1309899 -2939858 -3350318 -1476484 973125 1981480 1908934 2330239 3215316
37230 3215316 3145039 2073219 1808263 3010807 3451066 902077 -3125789 -4638584 -2294351
37221 -2294351 691622 716628 -1809835 -3818692 -4038234 -3804468 -3908650 -3336437 -1797332
37212 -1797332 -1097101 -2480856 -4317636 -4239684 -2452693 -1037447 -699476 -204810 1175288
37203 1175288 2510860 2700631 1689684 47464 -1417383 -1635736 -275659 1210775
37195A210775j32237j165802N6675J656050J031430p83456p67574Q35733P12978
37186B654572j746410k824048k44638K833301K230416j233039l171057j734579
37178c235482P39239J697942J236149O87477M92382K45616l29505r93119j026400
37169d85701J39069J708276J725624l36174k098915j181465J107006J347028q51496
37160A073252k100039m34297J530722N81725k061826k457680K04874K383784J238702
37151d0783j499918k153692j67897J418490L92470j666551j861781j36589R25478
37142d790773J84694m30025P40266K203208J642811l37744j226318n45551q8835
37133b648267m66654l34207N75479O65575k85232q9556J972201L038727Q29635
$$ plain form
37195 1210775 1078538 -87264 -30589 1625461 2656891 1873435 1105861 1941594 2654572
37186 2654572 908162 -1915886 -2160524 672777 2903193 1670154 -1500903 -3235482
37178 -3235482 -2496243 -798301 437848 1125325 1617707 1863323 1533818 540699 -485701
37169 -485701 -346632 1361644 3087268 2751094 652179 -529286 577720 1924748 1073252
37160 1073252 -1026787 -1461084 69638 651363 -1410463 -3868143 -3663269 -1279485 -40783
37151 -40783 -1540701 -3694393 -3862290 -2443800 -2051330 -3717881 -5579662 -5716251 -4790773
37142 -4790773 -4606079 -5036104 -4295838 -2092630 -449819 -787563 -2013881 -2559432 -2648267
37133 -2648267 -3114921 -3449128 -2873649 -2208074 -2493306 -2582862 -610661 2428066 3257701
37124C257701k324347k481290L80411K726112K399516M33065j406813k183167
37116H01188j316094Q04535J936810K90272k380770k590563m7410J988856J531873
37107A018697J14392m66412o16137q69271k00940J661590K543983P45319j909968
37098B021253k223911P9041K173082J762858o25505k689098k633004o95159J063250
37089a767193R92862p9827j41270Q19058R08264j63015l72222Q25968J022046
37080B044671r39681k271587n84665J719536J049467j386752j508928Q30588J702736
37071F55385k24846j576538J2863K221149K038391J45678r26950m80508O00130
37062B464754J643478J883290L92527j921563k375213l74903J066046k17726k018855
$$ plain form
37124 3257701 933354 -1547936 -1167525 1558587 3958103 4391168 2984355 801188
37116 801188 -514906 289629 2226439 2516711 135941 -2454622 -2502032 -513176 1018697
37107 1018697 1133089 666677 50540 -818731 -1019671 641919 3185902 3931221 2021253
37098 2021253 -202658 -123617 2049465 3812323 3186818 497720 -2135284 -2830443 -1767193
37089 -1767193 -774331 -854158 -995428 -176370 731894 568879 196657 1022625 2044671
37080 2044671 1104990 -1166597 -1751262 -31726 1017741 -369011 -1877939 -1047351 655385
37071 655385 430539 -1145999 -1133136 1088013 3126404 3272082 2345132 1864624 2464754
37062 2464754 4108232 5991522 6384049 4462486 2087273 1712370 2778416 2560690 541835
37053E41835j370224O45796J038951l4447j99261M85236l609j243900q91769M82062
37043e49330j78977k481807k110682J899508M360347J523260k782106k763484
37035c083271Q10402K533160P68270j005048n01605O73851R88977J210379J579900
37026C975015N97666j786577k965581j491589N23269O75374l44422n51252J33068
37017a235029N09488L71764K39612Q4942o9323L96066J174598N93667j566235
37008D99550k600070n15961K418244K538095R8058j375470n56231J78605q80451
36999a95631k006694r75202J471192K760582J803603k35674j697571j821297q05482
36990a702174O03852J546353J500116N96753l30839k61430P99470J288699q2046
$$ plain form
37053 541835 -828389 -182593 856358 821911 622650 1107886 1104277 -139623 -1031392 -549330
37043 -549330 -728307 -3210114 -5320796 -3421288 939059 2462319 -319787 -3083271
37035 -3083271 -2272869 260291 1028561 23513 -478092 195759 1184736 2395115 3975015
37026 3975015 4572681 2786104 -179477 -1671066 -1147797 -472423 -816845 -1368097 -1235029
37017 -1235029 -725541 -353777 -114165 -29223 -98546 297520 1472118 2065785 499550
37008 499550 -2100520 -2616481 -198237 2339858 2437916 1062446 506215 684820 -195631
36999 -195631 -2202325 -3177527 -1706335 1054247 2857850 2622176 924605 -896692 -1702174
36990 -1702174 -1098322 448031 1948147 2544900 2214061 1952631 2752101 4040800 3958754
36981C958754k008954j911856O5898Q27669p58947j622290N51777K992677J966998
36972D061726j064105j790035n9307M85798p99068o85455J401322J690396j151813
36963B089459k889015m74967K643372J918180j260833k347940p77569L33698p7858
36954h43473j98684M86628M37216m83582l96006J249182K570360K063988K96102
36945E181731j499844k560901k276785o25313J060617J416602Q63952N05127m5204
36936B019982j618284l019313k233595J38800J345448N04008m38025r6432O02509
36927b794902O99188P04647Q94213M50944n02444k20789J790304L131853J617581
36918E770595j362658k591292j298168L12571N11545M8767K52336P20162J53720
$$ plain form
36981 3958754 1949800 37944 103842 931511 172564 -1449726 -897949 2094728 4061726
36972 4061726 2997621 1207586 1148279 1634077 835009 149554 1550876 3241272 2089459
36963 2089459 -799556 -1274523 1368849 3287029 2026196 -321744 -1099313 -765615 -843473
36954 -843473 -1042157 -555529 -118313 -601895 -997901 251281 2821641 4885629 5181731
36945 5181731 3681887 1120986 -1155799 -1781112 -720495 696107 1560059 2065186 2019982
36936 2019982 401698 -2617615 -4851210 -4712410 -3366962 -2862954 -3300979 -3397411 -2794902
36927 -2794902 -2095714 -1391067 -496854 -45910 -548354 -769143 1021161 4153014 5770595
36918 5770595 4407937 1816645 518477 831048 1342593 1391360 1643696 2363858 2517578
36909B517578j184613j396185K81018J910524J281230q49932j659785k79849J063789
36900A683775M30740j301680k249142j950130p56873J183166K727986J709907
36892A477749j626114l244315l79741L713212L705999j82091k654007j241587
36884d30895O85043j51853k080048j750375O98185K349554J662887k84279j691691
36875i93472j580917j82932J152373J090720j03963r39041p39187p5728P77188
36866a594959K027462K845715J766994p86779k382472j749607k59541M24318K41245
36857E32376l58349j232702j486103N5142K281552K270400k86573j817890N855
36848c6292K505414J983623p28217j945469q78678j41464j010768j664402o84417
$$ plain form
36909 2517578 1332965 -63220 217798 2128322 3409552 2559620 899835 619986 1683775
36900 1683775 2114515 812835 -1436307 -3386437 -4143310 -2960144 -232158 1477749
36892 1477749 -148365 -3392680 -3772421 -59209 3646790 3464699 810692 -430895
36884 -430895 254148 102295 -1977753 -3728128 -3029943 -680389 982498 698219 -993472
36875 -993472 -2574389 -2757321 -1604948 -514228 -618191 -1557232 -2296419 -2372147 -1594959
36866 -1594959 432503 3278218 5045212 4258433 1875961 126354 -133187 291131 532376
36857 532376 174027 -1058675 -2544778 -2489636 -208084 2062316 1775743 -42147 -36292
36848 -36292 2469122 4452745 3724528 1779059 900381 758917 -251851 -1916253 -2600670
36839b600670N55481K69586q91363q76351Q05282K450490K355546Q33711l39519
36830B562193k45780J54833k38301p86041k34316Q46908O20991j002928j988232
36821c10673j302565l20668k21591j31042Q03738J484108P55042l92855m07855
36812d4361L28026M65145M7512J8785K69136M6040l78679k25714J51966k10859
36802D66997j157460j638942j263610l89452P51839J831330K036209J155424L09103
36793B101438L64537N11559k18843j008240n29057N78026L95765j354136k742098
36784a901049k092102Q2335J710641J228247p57005j809898m80121J493108J432905
36775a092939q1555O760J918073K132761o73416k745475j136918J227385L63957
$$ plain form
36839 -2600670 -2045189 -1775603 -2666966 -3543317 -2738035 -287545 2068001 2901712 2562193
36830 2562193 2316413 2471246 2232945 1446904 1212588 2059496 2680487 1677559 -310673
36821 -310673 -1613238 -1933906 -2155497 -2286539 -1482801 1307 756349 363494 -44361
36812 -44361 283665 748810 796322 815107 1084243 1130283 751604 525890 677856 466997
36802 466997 -690463 -2329405 -3593015 -3982467 -3230628 -1399298 636911 1792335 2101438
36793 2101438 2465975 2977534 2758691 1750451 1221394 1799420 2195185 841049 -1901049
36784 -1901049 -3993151 -3910816 -2200175 -971928 -1728933 -3538831 -4018952 -2525844 -1092939
36775 -1092939 -1174494 -1167734 750339 2883100 2209684 -535791 -1672709 -445324 -81367
36766h1367j985818j339877J835067K907695O70679j303778r46744j62657k96202
36757g03002J0189J117941R77924q54443j699273j64380J383692P15383r93818
36748b09787j647404j089357J76052K136357L497750J989413j621724l138749
36740I2551q56032J481967M15146j878953j501498P75144J258908m51015j398351
36731b062133m29192O91939R56289J149042J191843o2418j948449k057291J8021
36722b552349J689563J075410o00102j320386r49889l75956L48943J519877K397442
36713A232553J727795m93950k554366k556725m28734J738867J857746L59904l86170
36704D96920O00761J643640J250701M74872Q25789J376481K58609j887177k520203
$$ plain form
36766 -81367 -2067185 -3407062 -1571995 1335700 2006379 702601 -244143 -406800 -703002
36757 -703002 -692813 425128 1403052 548609 -1150664 -1315044 68648 784031 -209787
36748 -209787 -1857191 -2946548 -2770496 -634139 2863611 4853024 3231300 92551
36740 92551 -763481 718486 1133632 -745321 -2246819 -1471675 -212767 -663782 -2062133
36731 -2062133 -2491325 -1799386 -843097 305945 1497788 1435370 -513079 -2570370 -2552349
36722 -2552349 -862786 212624 -387478 -1707864 -2657753 -3033709 -2684766 -1164889 1232553
36713 1232553 2960348 2466398 -87968 -2644693 -3073427 -1334560 523186 883090 496920
36704 496920 1097681 2741321 3992022 4466894 5292683 6669164 6927773 5040596 2520393
36695B520393r89999O83700R11798K17560m36691q91532r09049k5326J127979
36686B208833J151697Q1358n36318k82951n30263j662525j880183j80098J486467
36677a43983R29125r47394j636988p61625m2895j70968q7980N74188N93781n82536
36667b277275j430320l76874J772807K671751J346204p06234j417469m85632N80757
36658c22285N01584k56736l07795O67511J441729Q59523o68732j658773j175393
36649i19367L58130J695913J857850R07574k04077p21232q17261q56594m33462
36640H67474Q08309J751801Q51918j231502j985073p14591K90385m38304r40081
36631g39664P23499K560934J485340j316952j812801M65558J691887N2264j523883
$$ plain form
36695 2520393 1530394 2214094 3125892 3343452 2906761 2015229 1106180 1080854 2208833
36686 2208833 3360530 3441888 2905570 2622619 2092356 429831 -1450352 -1630450 -143983
36677 -143983 785142 -162252 -1799240 -2560865 -2603760 -2774728 -2862708 -2288520 -1694739 -2277275
36667 -2277275 -3707595 -4084469 -2311662 360089 1706293 1000059 -417410 -903042 -322285
36658 -322285 179299 -77437 -385232 282279 1724008 2583531 1914799 256026 -919367
36649 -919367 -561237 1134676 2992526 3900100 3696023 2974791 2157530 1300936 867474
36640 867474 1675783 3427584 4279502 3048000 1062927 348336 638721 200417 -739664
36631 -739664 -16165 2544769 4030109 2713157 900356 1365914 3057801 3110065 1586182
36622A586182n92195Q96663N08731l68493N56057K079046J744976K87980j12819
36613F586128k15361k002740l902473k603682Q00699J644738q25518j975522O84687
36604a809044L427976K332155q81072k264194j446664m72801L50076J617129J943669
36595B797230j34283k690360k540332l8653J600404J118674J05965m20651j018390
36586a220396j509387q19136O66110J364991J250586J608297K069282R84500r68514
36577C426333r72544J202465K019797o25761l928607m009813r98214J909650K703956
36568G27262J701867j43106j804147j940776k10467J573347J286435p41109k166504
36559a717198j595577J31184J444268J681858J159254M91448R0737p6538l35209
$$ plain form
36622 1586182 993987 1890650 2399381 2030888 2586945 4665991 6410967 6698947 6586128
36613 6586128 6370767 4368027 465554 -2138128 -1337429 307309 -518209 -2493731 -1809044
36604 -1809044 1618932 3951087 3070015 805821 -640843 -1113644 -763568 853561 2797230
36595 2797230 2662947 -27413 -2567745 -2606398 -1005994 112680 218645 -202006 -1220396
36586 -1220396 -2729783 -3548919 -2882809 -1517818 -267232 1341065 3410347 4394847 3426333
36577 3426333 2453789 3656254 5676051 5050290 1121683 -2888130 -3886344 -1976694 727262
36568 727262 2429129 2286023 481876 -1458900 -1669367 -96020 1190415 449306 -1717198
36559 -1717198 -3312775 -3181591 -1737323 -55465 1103789 1595237 1685974 1609436 1274227
36550A274227q01141j187369j127467m70954N55946J159146M90469r31426j080064
36541b118633R84952L061824K243439q86782k761198j680208L36474J151730J225801
36532A557399J440039R34902p76828j796870n36806J256047R56699p30063j051790
36523A252729J28860K95011j189692j897081m58761J145965Q48701l99669n52361
36514h26298L58783Q94345P11674M57401Q1542q26020j582584j151296n9436K01121
36504a740768l74431k60704R78051J878379J485634P82259P36807O16874l62215
36495C739886j214294q20364j65675p48864j664334r09960Q16740P14914j375173
36486a627124k111848J51330K396113J369802j523843k527450q99665J021820
$$ plain form
36550 1274227 473086 -714283 -1841750 -2312704 -1756758 -597612 -107143 -1038569 -2118633
36541 -2118633 -1133681 1928143 4171582 3284800 523602 -1156606 -820132 331598 1557399
36532 1557399 2997438 3932340 3155512 1358642 821836 2077883 3034582 2304519 1252729
36523 1252729 1381589 1676600 486908 -1410173 -1868934 -722969 125732 -273937 -826298
36514 -826298 -467515 426830 1138504 1595905 1677447 851427 -731157 -1882453 -1941889 -1740768
36504 -1740768 -2115199 -2375903 -1397852 480527 1966161 2748420 3485227 4102101 3739886
36495 3739886 2525592 1705228 1539553 790689 -873645 -1783605 -966865 -251951 -1627124
36486 -1627124 -3738972 -3587642 -1191529 178273 -1345570 -3873020 -4772685 -3750865
36478c750865J862423K135922J823616L08463j288349p98429J430528K359666
36470D082975M69644k161409k917101j766462l41262L75454M14886K08700L84839
36461a249736J126290J496890O36762n30610m81967K67623r5469j422469j729420
36452a982106p71127m62966j120775o27166J427936K263026M87587j198198m25398
36443b409187R00432K51533q22024M13764K526617K002763o37713j598304k55714
36434C72167N9779j686843k065882R01203L845228K896459o24780k514144j583529
36425d00342p2877M48580L53261k10677j564427k513643j111941J891893L085320
36416i4853J093531j220383j009136L83349K5190j598572j488859P87998K549293
$$ plain form
36478 -3750865 -1888442 247480 2071096 2379559 1091210 292781 1723309 4082975
36470 4082975 4552619 2391210 -525891 -2292353 -2633615 -2258161 -1843275 -1634575 -1249736
36461 -1249736 -123446 1373444 2010206 1479596 997629 1265252 1169783 -252686 -1982106
36452 -1982106 -2753233 -3216199 -4336974 -4964140 -3536204 -1273178 -785591 -1983789 -2409187
36443 -2409187 -1508755 -1257222 -2079246 -1665482 861135 2863898 2226185 627881 372167
36434 372167 431946 -1254897 -3320779 -2419576 1425652 4322111 3697331 1183187 -400342
36425 -400342 -473219 -24639 328622 117945 -1446482 -3960125 -5072066 -3180173 -94853
36416 -94853 998678 -221705 -1230841 -847492 -822302 -2420874 -3909733 -3121735 -572442
36407e72442K565848K417287K498825P30115k854337m228345j248651J958167
36399A266467N60472l557130m618707j537973J427160J863953J720701K341439
36391e33618K180412P01287j08618K36057n16686k711388l158165m82562J929754
36382b463527J138773q51756q90680L74367P55312P41342J700602K269383M42274
36373C216090k412114l234108j719629M1087J077969J721155J590987M07278l38199
36364C50516O41769J856253J082770j130784k483609k198326r79243P35843K122698
36355b113J446395j221883k789776j365678O23394N12022j83730Q73217J982302
36346a25850N62886j359482k02497K530552K451639j42806r90972M97743O69172
$$ plain form
36407 -572442 1993406 4410693 6909518 7639633 4785296 556951 -691700 1266467
36399 1266467 1826939 -1730191 -6348898 -7886871 -6459711 -4595758 -2875057 -533618
36391 -533618 1646794 2348081 2239463 2475520 1958834 -752554 -3910719 -4393281 -2463527
36382 -2463527 -1324754 -2176510 -3067190 -2692823 -1937511 -1196169 504433 2773816 3216090
36373 3216090 803976 -2430132 -4149761 -4108674 -3030705 -1309550 281437 688715 350516
36364 350516 992285 2848538 3931308 2800524 316915 -1881411 -2860654 -2124811 -2113
36355 -2113 1444282 222399 -2567377 -3933055 -3309661 -2797639 -2981369 -2108152 -125850
36346 -125850 437036 -922446 -1124943 1405609 3857248 3714442 2723470 3221213 3890385
36337C890385j198677j561798N55080J512444m55232k267408j547559j04566K11726
36328i65605L85624R08483K25343j407696j181081R80644J223083j663676l445139
36319d940020j227073J831212K084315R86382J144870J291128k62401j253865
36311c45452L88338J693923n21226l131468j207962L210989L577295q84557m060723
36302a280843k473844L79073P65572J60519J197822K574855J566245j030195j941596
36293h2392k87980J351591O31114j593531k456951n79190K109349K370230m29534
36284A032706l164258k458269J249768M181581L461013q6897l245500l681040
36276b710896j845915o8159J44437l33903J75080J578374K305670J867710J283343
$$ plain form
36337 3890385 2691708 1129910 1684990 3197434 2742202 474794 -1072765 -1177331 -965605
36328 -965605 -579981 328502 553845 -853851 -2034932 -1054288 168795 -1494881 -4940020
36319 -4940020 -6167093 -4335881 -2251566 -1265184 -120314 1170814 908413 -345452
36311 -345452 42886 1736809 1215583 -1915885 -3123847 87142 3664437 2779880 -1280843
36302 -1280843 -3754687 -3375614 -2610042 -2449523 -1251701 1323154 2889399 1859204 -82392
36293 -82392 -370372 981219 1612333 18802 -2438149 -3017339 -907990 1462240 1032706
36284 1032706 -2131552 -4589821 -3340053 841528 4302541 4215644 970144 -2710896
36276 -2710896 -4556811 -4624970 -4480533 -4814436 -4639356 -3060982 -755312 1112398 2395741
36267B395741Q64397k38192j732716j815587j57991J058501M58589m72215k59901
36258A00626M9514o56416r66689M93329J893402P19986j907834k665539r24370
36249c863991Q70194J195929Q27661M75599k4556j45172R41477K216014J684467
36240D177622l36023j411587q10399l49828q02632m75285J299348K151651L23484
36231C766351j942987j402371J192980K069988J3033j925857r00397J900219L192791
36222E963750J758937q89296k921628l516515k401831o2243J616070Q98273j177515
36213g31998j677134O8370J382751M90184o51568J67927J465762O35538j296381
36204a46549j167544J006906K127149J173032L36186O92354O75863l24018o75577
$$ plain form
36267 2395741 3260138 3021946 1289230 -526357 -684348 374153 832742 360527 100626
36258 100626 150140 -506276 -1472965 -979636 913766 1633752 -274082 -2939621 -3863991
36249 -3863991 -2993797 -1797868 -970207 -494608 -519164 -664336 277141 2493155 4177622
36240 4177622 3841599 2430012 1619613 1269785 467153 -8132 1291216 3442867 3766351
36231 3766351 1823364 420993 1613973 3683961 3696994 1771137 870740 2770959 5963750
36222 5963750 7722687 6833391 3911763 395248 -2006583 -2068826 -452756 445517 -731998
36213 -731998 -2409132 -2340762 -958011 -467827 -1119395 -951468 514294 1149832 -146549
36204 -146549 -1314093 -307187 1819962 2992994 3329180 4021534 4697397 4373379 3697802
36195C697802M742k06761j643966j787362K95866J869601J018989l02341j22286
36186B824284J76085q36554j377222J34093J470857J78676j835295j293875R53319
36177C94368J526019N3338r10212m44090M2389k3278J01007L12209o1611m62244
36167E27895r4666K69416k04838n96049k56730n75105j991605j893596J032717
36158c782561L221986J410450j369575l59784K704084K340348j150648k088135
36150I26165P42309K044721p89603l421622k108661O15732J127271L53984N45958
36141C6254Q05323k86959j178031k48386Q09190P9008q43096K31305J860997J370138
36131B635743m68163q77071J37181Q5193j567834k551558j405427O05418J519686
$$ plain form
36195 3697802 3702544 3495783 1851817 64455 360321 2229922 3248911 2946570 2824284
36186 2824284 3000369 2163815 786593 920686 2391543 2570219 734924 -558951 394368
36177 394368 1920387 1973725 1063513 619423 661812 638534 739541 1051750 990139 527895
36167 527895 433229 702645 497807 -98242 -354972 -930077 -2921682 -4815278 -3782561
36158 -3782561 -560575 849875 -519700 -879484 1824600 4164948 3014300 926165
36150 926165 1668474 3713195 2923592 -498030 -2606691 -1990959 -863688 -509704 36254
36141 36254 841577 554618 -623413 -871799 -62609 16399 -826697 -595392 1265605 2635743
36131 2635743 2167580 1290509 1427690 1512883 -54951 -2606509 -4011936 -3406518 -1886832
36122a886832Q97193k36881n81593K87732J371307J272632O1543p87286n50092
36113a52277o4864o7170k47058m01395q36120j094451j35752J541803J899145
36104D41861L39408j183444r65384L28281J205823J223731N57953m62099q04410
36095F81720K68818J314354L13227j557798j010695J802804K757005L19006j640784
36086C247657k82332J187507j063126m517655l861904N17497L008977J229291
36078e34088j082168l56773J948287K524017J097124o9284J75168P18184J69861
36069D590328j206004j753303n04302J240717J201076q26608k427008j744511
36061a429615J67663J211252J058761P11579M85822R1047j79927O8080L32539
$$ plain form
36122 -1886832 -989639 -1226520 -1808113 -1520381 -149074 1123558 1185101 397815 -152277
36113 -152277 -217141 -284311 -531369 -932764 -1768884 -2863335 -2999087 -1457284 441861
36104 441861 781269 -402175 -1367559 -1039278 166545 1390276 1948229 1486130 681720
36095 681720 950538 2264892 2578119 1020321 9626 1812430 4569435 4888441 3247657
36086 3247657 2965325 4152832 3089706 -1427949 -5289853 -4772356 -1763379 -534088
36078 -534088 -1616256 -1973029 -24742 2499275 3596399 3527115 3702283 4420467 4590328
36069 4590328 3384324 1631021 1126719 2367436 3568512 2741904 314896 -1429615
36061 -1429615 -1261952 -50700 1008061 1719640 2205462 2296509 2116582 2184662 2517201
36052B517201K5664m28846m52818l47470l63844R1995J066353J184459l16249
36043B976445j916619j793853l24658R33479J492576J564518Q84235k91980n25160
36034B998983M90919O16857j433213l281269k231281K48655Q30949k18451P5880
36025a901971J765862J753981m76239j434581O64546K771832J746638j025652
36017C864416k291846j620970o80285J97220J685443K801407J572725j675927
36009C852183l991096l192993j83356K422709K869653J311785o74045j324978
36001A089862k20884J132677Q75208q40953j809548n94685J355906J467527m03217
35992B051893j624339m53923J455455J506351m0277o74941M27003J340621N00406
$$ plain form
36052 2517201 2542865 2114019 1661201 1313731 949887 1041882 2108235 3292694 2976445
36043 2976445 1059826 -734027 -1058685 -125206 1367370 2931888 3816123 3524143 2998983
36034 2998983 3489902 4106759 2673546 -607723 -2839004 -2590349 -1759400 -1977851 -1901971
36025 -1901971 -136109 1617872 1141633 -292948 371598 3143430 4890068 3864416
36017 3864416 1572570 -48400 -728685 -531465 1153978 3955385 5528110 3852183
36009 3852183 -138913 -3331906 -3515262 -1092553 1777100 3088885 2414840 1089862
36001 1089862 868978 2001655 2876863 2035910 226362 -368323 987583 2455110 2051893
35992 2051893 427554 -26369 1429086 2935437 2895160 2220219 2647222 3987843 4488249
35983D488249j254661k363842k301221r60435J546788L497059K365574j425883
35975C591628l898116k591995N1243P51571L84272J607268L507150K858927j28658
35966F133290j743850o13698N42994j43447r27192j96860M83918o86829k446776
35957D01550k526901j085146J77002Q18370J431069J785346J263998L76202P2319
35948B713809J60360q1600l51445J01534Q41783P02779l02868q17345K8077J442522
35938D437606J754731J06784k344148l007146o35422K420254K372007r88304l438329
35929F78033j868499J378497K018294K1880r20135N28141J509139p1017k129909
35920A144424j833873O2627P72694j62772p32617o8660L33533p17671k182257
$$ plain form
35983 4488249 3233588 869746 -1431475 -2391910 -845122 2651937 5017511 3591628
35975 3591628 -306488 -2898483 -2847240 -2095669 -1711397 -104129 3403021 6261948 6133290
35966 6133290 4389440 3775742 4318736 4175289 3248097 3051237 3535155 2848326 401550
35957 401550 -2125351 -3210497 -3033495 -2215125 -784056 1001290 2265288 2641490 2713809
35948 2713809 2874169 2792569 2441124 2542658 3384441 4087220 3784352 2967007 2995084 4437606
35938 4437606 6192337 6299121 3954973 947827 312405 2732659 5104666 4116362 678033
35929 678033 -1190466 188031 2206325 2228205 1308070 1836211 3345350 3274333 1144424
35920 1144424 -689449 -626822 145872 -16900 -749517 -818177 -484644 -1202315 -3384572
35911c384572k272446o44804J544537K953229K959088J915336Q48576M29602K11289
35902D559835n41209j491105j641069r56706l95226k91392m2288M44950M98827
35893A44617K10224N18513J202054P05808j042768j685778J69391K466136K500533
35884E188730N83286j139376j898175j983758q85516J327641K190289j24217k932059
35875C26845k096004J510423K882274M54225j765824p81041J145509R05526p16013
35866A865920j353176q78928k22558P66996J662133N89654k109568k422816J557186
35857e45157N217448L203594k415546m705242j605305J976294J945430k3178o81761
35848B366577j74651m05008j271503j236894k33724K90074j80992l53081R94221
$$ plain form
35911 -3384572 -5657018 -6301822 -4757285 -1804056 1155032 3070368 3918944 4348546 4559835
35902 4559835 4018626 2527521 886452 -70254 -465480 -756872 -799160 -354210 144617
35893 144617 354841 873354 2075408 2781216 1738448 52670 222061 2688197 5188730
35884 5188730 5772016 4632640 2734465 750707 -134809 1192832 3383121 3258904 326845
35875 326845 -1769159 -258736 2623538 3077763 1311939 530898 1676407 2581933 1865920
35866 1865920 512744 -366184 -588742 178254 1840387 2430041 320473 -2102343 -545157
35857 -545157 4672291 7875885 5460339 755097 -850208 1126086 3071516 3048338 2366577
35848 2366577 2191926 1786918 515415 -721479 -955203 -665129 -846121 -1199202 -204981
35839b04981K979415L209604P79952j939887j884396M61076J479198l11545j993171
35830B575265q45112J420815J620253J11651m53303J15873k45971j622248j837582
35821H39641m15335O55892M98616M66697J053888P94568p14537j531773n04073
35812A143584P07362L27686p16008m02664J240947K229719J276093p70270k012873
35803C023576j555001l60691J38245Q4433O91962J599531Q57533j422402k061946
35794I95240L68502K393999N72661k704718k622093M19124J597064m03218j654406
35785a037845J01882K003279J318902l62316n88262L4507q8141o28887q61284
35776a08165j289136j606529M4711L426132M763003J789551k302107k995109m16770
$$ plain form
35839 -204981 2774434 5984038 6763990 4824103 2939707 3400783 4879981 4568436 2575265
35830 2575265 1730153 3150968 4771221 4882872 4429569 4545442 4299471 2677223 839641
35821 839641 424306 1080198 1578814 2045511 3099399 3893967 3179430 1647657 1143584
35812 1143584 1850946 2178632 1462624 1059960 2300907 4530626 5806719 5036449 3023576
35803 3023576 1468575 1107884 1246129 1330562 2022524 3622055 4479588 3057186 995240
35794 995240 1363742 3757741 4330402 1625684 -996409 -577285 1019779 616561 -1037845
35785 -1037845 -935963 1067316 2386218 2023902 1435640 1470147 1382006 753119 -108165
35776 -108165 -1397301 -3003830 -2959119 467013 5230016 7019567 4717460 1722351 1305581
35767A305581J889836K283145J796629R70747o21332k227026k313842j049056
35759B034682m5671J88619M61082Q43182N62227r6738J83393J533632K387509
35750H051917J646353P5213r31659r77725n19916J91877J278450K399548K436933
35741A3650991P21680j537198k176022r09586R9346m90768r97316L73983K017380
35732A0752490J155588j386607j990168L38909K684808K661337R64085r32691
35724A4247751k351856k106173Q75802M633788N351229K647394K91206M79633
35716B4068774J189984P00689N67809J896675K708698J725071R80618J800350
35708C5638668K014032L79307j79255K454394N200924M738612L274232M456186
$$ plain form
35767 1305581 3195417 5478562 7275191 8245938 7624606 5397580 3083738 2034682
35759 2034682 1989011 2177630 2638712 3481894 4044121 3947383 4130776 5664408 8051917
35750 8051917 9698270 9773483 8841824 7864099 7344183 7536060 8814510 11214058 13650991
35741 13650991 14372671 12835473 10659451 9749865 9849211 9358443 8361127 8735110 10752490
35732 10752490 11908078 10521471 8531303 8870212 11555020 14216357 15180442 14247751
35724 14247751 11895895 9789722 10665524 15299312 20650541 23297935 23589141 24068774
35716 24068774 25258758 25959447 26527256 28423931 31132629 32857700 33838318 35638668
35708 35638668 37652700 38032007 37852752 40307146 45508070 50246682 53520914 57977100
35700E7977100O779611O633636N271907O648471J0109551J1533469J0774519J1717771
35692A27446035J5199537J8016213J9352734K2213624K7360675L1377517L2380790
35685B93347125L2602758L3277142L1413983K3951695J1591053l151700j8112848
35678D04919208l0236547l6113919l5904963l3578304l1639640k8886690k4666967
35671A83892178k1256326j9837256j8035372j4211610j0721398r869797r785158
35664H0175261p726203m883750m266781n704086o447429n481033m140390l371341
35656C8154248l018535l050582l311741k956989j938064j736575k810684l034787
35648A6296291q80965J618046J661263j65057j300124j279384j337075j279434
$$ plain form
35700 57977100 64756711 71390347 76662254 83310725 93420276 104953745 115728264 127446035
35692 127446035 142645572 160661785 180014519 202228143 229588818 260966335 293347125
35685 293347125 325949883 359227025 390641008 414592703 426183756 423032056 404919208
35678 404919208 374682661 338568742 302663779 269085475 237445835 208559145 183892178
35671 183892178 162635852 142798596 124763224 110551614 99830216 89960419 80175261
35664 80175261 72449058 67565308 63298527 57594441 51147012 45665979 41525589 38154248
35656 38154248 35135713 32085131 28773390 25816401 23878337 22141762 19331078 16296291
35648 16296291 15415326 17033372 18694635 18529578 17229454 15950070 14612995 13333561
35640A3333561k07496N72318r04492l204427k841039J56194J860080L66255j636881
35631G494073j509948l13888R3131L80218J586441K220249N43880j964015k472635
35622F057506j065707k42823p95447j082833l11189K74510o4808l08551K03117
35613B663775N31506O7339j90200M58786Q84773K092j194764j154517k87132j38056
35603A643602p35113o72338L91619J115256N34246o63328j183394m16035J343444
35594A357959K984139L065972J295238p54554j531560j592401k320181l212510
35586g07898k565052n80065O78418O27355Q51716J846272J849008J70237r61303
35577A208688K39398K045307J697367n86929k236967j905685n30008M25503K88279
$$ plain form
35640 13333561 13126065 13698383 12793891 9589464 6748425 6904619 8764699 9130954 7494073
35631 7494073 5984125 5670237 5763368 6143586 7730027 9950276 10494156 8530141 6057506
35622 6057506 4991799 4748976 3953529 2870696 2559507 2834017 2769209 2460658 2663775
35613 2663775 3195281 3262620 3072420 3531206 4415979 4418071 3223307 2068790 1781658 1643602
35603 1643602 908489 236151 627770 1743026 2277272 1613944 430550 14515 1357959
35594 1357959 4342098 7408070 8703308 7948754 6417194 4824793 2504612 -707898
35586 -707898 -3272950 -3853015 -3174597 -2547242 -1695526 150746 1999754 2169991 1208688
35577 1208688 1448086 3493393 5190760 4603831 2366864 461179 -68829 356674 644953
35568F44953n71342q21248M78301J955583J108321j714178k857293m59215K456582
35559B20464K222172l74139j904614j297952m6612J002178J899480J817558J70179
35550C708714j360036q79359M85073L25018j045906j444875p24081m33344l79629
35541a748425Q17585K251259J641568m60610j260484n36091q21583k392830k304750
35532d814361M76895K906722K399736K36646j126565j223283o19826N00352J491406
35523B27722J413328R01394J337359J796420M3659k954486l392087n88016J450845
35514B36138J23902k025459j813667J6978J189243J478576J347920J66371j599928
35505h79926j504377R00735K294755N95850j452654q15070R37846Q59123k71174
$$ plain form
35568 644953 73611 -747637 -269336 1686247 2794568 1080390 -1776903 -2236118 220464
35559 220464 2442636 2068497 163883 -1134069 -1180681 -178503 1720977 3538535 3708714
35550 3708714 2348678 1469319 1954392 2279410 1233504 -211371 -935452 -1368796 -1748425
35541 -1748425 -930840 1320419 2961987 2501377 1240893 704802 -116781 -2509611 -4814361
35532 -4814361 -4337466 -1430744 968992 1205638 79073 -1144210 -1764036 -1263684 227722
35523 227722 1641050 2542444 3879803 5676223 5719882 2765396 -626691 -1214707 236138
35514 236138 360040 -1665419 -3479086 -3462108 -2272865 -794289 553631 720002 -879926
35505 -879926 -2384303 -1483568 811187 1407037 -45617 -860687 77159 936282 665108
35496F65108j45157M06205o22530j920533r80715R27176O83878r29860l69063
35487b285491K266296K959840L34894k132743j630486J94696O07553j87168l31019
35478b03628N14039J101388N94278n11999r41861J04268J767308K106478N40929
35469E071200j262245j793557j510644j094940N6110J786355J909825m65522k493298
35460B03284j520635N90493O24588n21806J25865J734527R59452j596614j772280
35451a173126J000424K482216P59306q04588K10321J220142k61402j994257j188916
35442B50120L92046k73586j857802r31755J862678K502111l5536k240799j421660
35433a754183Q34628J678038Q69691R9672J40477L65572L20305K82653L25445
$$ plain form
35496 665108 519951 926156 303626 -1616907 -2597622 -1670446 -986568 -1916428 -2285491
35487 -2285491 -19195 2940645 3275539 1142796 -487690 -292994 314559 127391 -203628
35478 -203628 310411 1411799 2006077 1494078 552217 656485 2423793 4530271 5071200
35469 5071200 3808955 2015398 504754 -590186 -534076 1252279 3162104 2696582 203284
35460 203284 -1317351 -726858 -102270 -624076 -498211 1236316 2195768 599154 -1173126
35451 -1173126 -172702 2309514 3068820 2264232 2474553 3694695 3433293 1439036 250120
35442 250120 642166 368580 -1489222 -2420977 -558299 1943812 1908276 -332523 -1754183
35433 -1754183 -919555 758483 1628174 1727846 1868323 2233895 2554200 2836853 3162298
35424C162298m3272q72118j189474k82316Q75153O93461n63436r83674j45391
35415F51231k4763j486111k079994K55400L112833K584846o56390k112715k84299
35406c9962J307395o6311k343371k412135n96116J045858K196942L209648K698499
35397E000447m89948m069086m318426j063393J992547K038585Q8227j135193l71343
35388b327583J590495K997357K293733n64161l417931l591611r11574J777788
35380b153487J821351j67936j317973k09859J597947J998410J046921K03892k18082
35371B601184j073360k054769j530539O15738K100924J474521K55085J78860L95783
35362B963427k93071m82418J358304L090808J548211j903750k813706n30053R87688
$$ plain form
35424 3162298 3119026 2246908 1057434 775118 1650271 2343732 1780296 796622 651231
35415 651231 626468 -859643 -2939637 -2684237 428596 3013442 2357052 244337 -39962
35406 -39962 1267433 1201122 -1142249 -3554384 -4150500 -3104642 -907700 2301948 5000447
35397 5000447 4510499 441413 -3877013 -4940406 -2947859 -909274 -821047 -1956240 -2327583
35388 -2327583 -737088 2260269 4554002 3989841 571910 -3019701 -3931275 -2153487
35380 -2153487 -332136 -500072 -1818045 -2027904 -429957 1568453 2615374 2819266 2601184
35371 2601184 1527824 -526945 -2057484 -1441746 659178 2133699 2388784 2567644 2963427
35362 2963427 2670356 2187938 3546242 6637050 8185261 6281511 3467805 2937752 3925440
35353C925440j53159j178922k79771P7064j861690l266545j393001J526577J974254
35344f29753O71051K62496K18512j277161k508721n26054K960474L347472M65694
35335B984010j145740L17849J475070K7655j562707r32398O7328q65562k167992
35326a802487j304712P19645J317819P85034J134504J847007O37556k046790l067043
35317a779467j486689j1971m83802r63267Q31216L497651L844425J563026n68041
35308D443081q28823m58734r12145j419442o98446M33071J86475j082748j127449
35299a465160N76158J656628L83161j497882j293397N61741J313704K20740n58055
35290a02362K98542J239603O44669o04631j036342j181567k064173k546278r11062
$$ plain form
35353 3925440 3772281 2593359 2313588 2390652 528962 -2737583 -4130584 -2604007 -629753
35344 -629753 41298 303794 522306 -754855 -3263576 -3789630 -829156 2518316 2984010
35335 2984010 1838270 2156119 3631189 3658844 2096137 1163739 1231067 365505 -1802487
35326 -1802487 -3107199 -2387554 -1069735 -284701 849803 2696810 3334366 1287576 -1779467
35317 -1779467 -3266156 -3278127 -3761929 -4725196 -3893980 -396329 3448096 5011122 4443081
35308 4443081 3614258 3155524 2243379 823937 125491 558562 745037 -337711 -1465160
35299 -1465160 -889002 767626 1150787 -347095 -1640492 -1078751 234953 455693 -102362
35290 -102362 196180 1435783 2080452 1475821 439479 -742088 -2806261 -5352539 -6263601
35281f263601J630374K020224J5731j227751J0354J539922J096076r3423J51670
35272a120424J093149O34334p68050r46457O5021K66616m48147p6240J562580
35263B62382K087301O17413o79673l77974J5072p09502j152590l04291J91809
35254e0053o90647q05847J315023K856966Q27499k503828k679769K4523J449208
35245b56925L35188o60562l98723o35723j566191r60446J215688K023682P45431
35236a58581K40413J486180J534645q61340k368991p92569Q29112n44528k678395
35227c314054k120631J8869P98440Q28379K130803L287540J873093l81286k23379
35218B897774R94278m50393l399476l038883P00942K369452k08912k442915n92476
$$ plain form
35281 -6263601 -4633227 -2613003 -2597272 -3825023 -3814669 -2274747 -1178671 -1272094 -1120424
35272 -1120424 -27275 607059 -160991 -1107448 -1042427 -775811 -1223958 -1300198 262382
35263 262382 2349683 2967096 2287423 1909449 1924521 1215019 62429 -241862 -50053
35254 -50053 -740700 -1546547 -231524 2625442 3452941 949113 -1730656 -1706133 -256925
35245 -256925 78263 -582299 -981022 -1616745 -3182936 -4143382 -2927694 -904012 -158581
35236 -158581 81832 1568012 3102657 2241317 -127674 -920243 -91131 -635659 -3314054
35227 -3314054 -5434685 -5415816 -4617376 -3788997 -1658194 1629346 3502439 3121153 2897774
35218 2897774 3892052 3441659 42183 -2996700 -2295758 73694 -135218 -2578133 -3170609
35209c170609K506514K594100N04199l04150M38746M61361n71815r67541m06522
35200A084283k68594q38708o97382Q57121K459848K232415l6665k492709k959811
35191f60202j291910M09988N35992O3975O09731J434861O37781j304013j950825
35182a514622p80231K61575L31688P03752J610672J384681j62772q15314J56046
35173A175475N43584n62390o71416J477378K725511L29458l015274l001137k88646
35164a287457J086529L05781J38461J415641J764684J74672j260323j042949l05588
35155I89451j52802J6627N12464M66133Q94O03843K162310K317102K49107j495020
35145E670109q67586L51896m89871k485201k563552l63221J240623M86181r66850
$$ plain form
35209 -3170609 -664095 1930005 2434204 2130054 2568800 3030161 2458346 1490805 1084283
35200 1084283 815689 -23019 -720401 136720 2596568 4828983 4792318 2299609 -660202
35191 -660202 -1952112 -1542124 -1006132 -942157 -332426 1102435 1740216 436203 -1514622
35182 -1514622 -2294853 -2033278 -1701590 -997838 612834 1997515 1834743 1019429 1175475
35173 1175475 1719059 1156669 485253 1962631 4688142 5017600 2002326 -998811 -1287457
35164 -1287457 -200928 104853 243314 1658955 3423639 3598311 2337988 1295039 989451
35155 989451 836649 853276 1365740 1831873 1832767 2436610 4598920 6916022 7165129 5670109
35145 5670109 4802523 5154419 4664548 2179347 -384205 -747426 493197 979378 12528
35136A2528q57497M84652J077020K94333n71721m88554j4835R54m0316O65628
35126E62192J514782J040654o28205j484733n21526O82618M66673l04815P0180
35117A397820J005929N28023j226672j920572n89763R82212J042219N9013o06317
35108F71892n56141j35009K30519o7866j181453j815134o10122J301958J383818
35099g77538k14721m21770J802487L333257J715291p60255p02516J000737R90046
35090E965018r65484k079957j506956j170087j607143r63997J022528J786648
35082D80570K78414p80236P30283K434666Q95916k821252m281602j830432J329182
35073c564491J651642m01615j620622l61074J721891K046179K87056j370702j029713
$$ plain form
35136 12528 -844969 -360317 716703 1011036 439315 -49239 -64074 -63120 -103436 562192
35126 562192 2076974 3117628 2489423 1004690 483164 1165782 1632455 1327640 1397820
35117 1397820 2403749 2931772 1705100 -215472 -805235 176977 1219196 1278209 671892
35108 671892 115751 -19258 211261 143395 -1038058 -2853192 -3463314 -2161356 -777538
35099 -777538 -992259 -1414029 388458 3721715 5437006 4676751 3974235 4974972 5965018
35090 5965018 4999534 2919577 1412621 242534 -1364609 -2328606 -1306078 480570
35082 480570 758984 -21252 709031 3143697 4039613 1218361 -3063241 -4893673 -3564491
35073 -3564491 -1912849 -2314464 -3935086 -4296160 -2574269 -528090 -241034 -1611736 -2641449
35064b641449O48229J585932J096971L45495J68031n0959q92156j690957j658839
35055c089702j141128q18283n04903L09955J401014K139607K287374J767108M17659
35046B768701j228750j786830o73643P52317P63286n79211j811747k007580j284920
35037e088377M760J381652J958761J280087K10116n7065L67817L99220l20576
35028A36395r92774p60725M47726J830819K020008L00188j928467k186409k84701
35019a417940R97594k9161j237517k28618J406175O54955j472639j161151J882408
35010f05894L624973J920684n93605j251904j127949j890360k349587r82446P92416
35001b463672R23932K65977P60351J731541J150009n41606j017595P8419P63388
$$ plain form
35064 -2641449 -1993220 -407288 689683 1035178 1203209 1152250 260094 -1430863 -3089702
35055 -3089702 -4230830 -5049113 -5554016 -5244061 -3843047 -1703440 583934 2351042 2768701
35046 2768701 1539951 -246879 -920522 -168205 595081 15870 -1795877 -3803457 -5088377
35037 -5088377 -5083617 -3701965 -1743204 -463117 -253001 -310066 57751 456971 136395
35028 136395 -856379 -1617104 -1169378 661441 2681449 2981637 1053170 -1133239 -1417940
35019 -1417940 -420346 -449507 -1687024 -1915642 -509467 145488 -1327151 -2488302 -605894
35010 -605894 3019079 4939763 4346158 3094254 1966305 75945 -2273642 -3256088 -2463672
35001 -2463672 -1539740 -1273763 -513412 1218129 2368138 1826532 808937 887356 1650744
34992A650744M6610r03954j023588o32201k62043K9950M4287m11918p94753m72914
34982b729780J99126N90465R20323J425904J344355K47647o79145m82629l43571
34973D92695j419525k053441m6215L091855L532532P20840j774509j536174k21922
34964G86136j39685q18606o50442K73326P75308N93533L22359L63857Q14707J397937
34954C718430J114442p02061k743313k837213j036599L26677J46612q6002P51783
34945a347244J365030L51880j324584j808294r45147N7323N39129P46320J039736
34936a325851J502120J666764O02313j566309k646392r47703J438307Q15900k397233
34927b858084l546312m00365L581403M415801K617363P31846q23166k426588k678876
$$ plain form
34992 1650744 1697354 793400 -230188 -862389 -1124432 -1094482 -1050195 -1462113 -2256866 -2729780
34982 -2729780 -2530654 -1940189 -1019866 406038 1750393 1998040 1318895 836266 492695
34973 492695 -926830 -2980271 -3026486 65369 3597901 4318741 2544232 1008058 786136
34964 786136 646451 -172155 -822597 -549271 226037 819570 1141929 1505786 2320493 3718430
34954 3718430 4832872 4130811 1387498 -1449715 -2486314 -2159637 -2013025 -2099027 -1347244
34945 -1347244 17786 369666 -954918 -2763212 -3708359 -3651036 -3111907 -2365587 -1325851
34936 -1325851 176269 1843033 2445346 879037 -1767355 -2715058 -1276751 -460851 -2858084
34927 -2858084 -6404396 -6804761 -3223358 1192443 3809806 4541652 3718486 1291898 -1386978
34918a386978p13715J171386P78388j02103J177673K977786J684440k032012l825795
34909b70930k160708J17821P77526O75811P71371M99543n5590K10728Q34466Q7374
34899A487412j441954j036597J459612K736165J116731r85001j367944j226977
34891G41447j852338j646281N80823K254226N66451k595933k959438n4228K376670
34882b588601J858674j7956o67789P3937N24312k62678j356061j071681Q51926
34873b655917K390811J504651p59229j247040O59720J781835j3043k260554j714200
34864b312966M87999R03683m30613m10821J358689J664554n58931j853791K15696
34855i36501K694949J570801j967031l256651r60611J527356J377639k83855j058476
$$ plain form
34918 -1386978 -2100693 -929307 -150919 -253022 924651 3902437 5586877 3554865 -270930
34909 -270930 -2431638 -2313817 -1536291 -860480 -89109 410434 354844 565572 1400038 1487412
34899 1487412 45458 -991139 468473 3204638 4321369 3336368 1968424 741447
34891 741447 -1110891 -2757172 -2176349 77877 644328 -1951605 -4911043 -4965271 -2588601
34882 -2588601 -729927 -747883 -1415672 -1341735 -817423 -1080101 -2436162 -3507843 -2655917
34873 -2655917 -265106 1239545 480316 -766724 -107004 1674831 1661788 -598766 -2312966
34864 -2312966 -1824967 -921284 -1351897 -1762718 -404029 1260525 701594 -1152197 -936501
34855 -936501 1758448 3329249 1362218 -1894433 -2855044 -1327688 49951 -233904 -1292380
34846a292380o18586P022M93584R75394J061412N22786k2010k47275q18265j784287
34836a722605j719409j33954P89121p02790k334139n64548L503524M779994J404394
34827C299588k487482k811625p81715K89571J65629M17069O17672l57987j101865
34818b751145K21954J887853R91492j134406o31508K038897K189598j327403l720313
34809b234981j652388J765168K321242Q79001N11110Q53338l21899k130727j727361
34800a737497N68828J434786k67283j908647j111875J299546K894759K280413
34792C453030p2926k177550j932074M40143K020455Q22116j241314j101979P78498
34783I88399J236750n18087j714781l44596K021962K754128J462614l33697j369349
$$ plain form
34846 -1292380 -1910966 -1903944 -1410360 -434966 626446 1149232 1127222 879947 61682 -1722605
34836 -1722605 -3442014 -3575968 -2786847 -3489637 -5823776 -6388324 -2884800 1895194 3299588
34827 3299588 812106 -1999519 -2781234 -2491663 -2326034 -1908965 -1291293 -1649280 -2751145
34818 -2751145 -2529191 -641338 350154 -784252 -1415760 623137 2812735 1485332 -2234981
34809 -2234981 -3887369 -2122201 199041 1078042 1589152 2442490 2120591 -10136 -1737497
34800 -1737497 -1168669 266117 -1166 -1909813 -3021688 -1722142 1172617 3453030
34792 3453030 3380104 1202554 -729520 -289377 1731078 2553194 1311880 209901 988399
34783 988399 2225149 1707062 -7719 -352315 1669647 4423775 5886389 5552692 4183343
34774D183343j441293j021616p53213p56433l99938N38892R65844o2873j479739
34765b27026j436321q8067O67489J43430l82655l4434M93155N65117N72408O47298
34755I20394J01621j081304j669793r33826K41450P12864M52243l9907n90412
34746a886670r87173p38430J76021J056886J359848J132898N22437k97750p78013
34737d39946n81269l46200p15966r37748R2191J668991J931176O05621p23996
34728E52854j083872r07388l83272P54758J598054O87397j228946j594656N2508
34719a552563J185703K74723j062469j206561j026178j464279j374238K8103J058689
34710e139070M16650j80315R96349K251111J304625l42705L00207K379728K361764
$$ plain form
34774 4183343 2742050 1720434 967221 210788 -189150 349742 1315586 1252713 -227026
34765 -227026 -1663347 -1751414 -1083925 -940495 -1323150 -1357584 -864429 -299312 273096 920394
34755 920394 1022015 -59289 -1729082 -2662908 -2421458 -1708594 -1256351 -1296258 -1886670
34746 -1886670 -2873843 -3612273 -3436252 -2379366 -1019518 113380 635817 338067 -439946
34737 -439946 -1021215 -1367415 -2083381 -3021129 -2928938 -1259947 671229 1276850 552854
34728 552854 -531018 -1438406 -1821678 -1066920 531134 1218531 -10415 -1605071 -1552563
34719 -1552563 -366860 -92137 -1154606 -2361167 -3387345 -4851624 -6225862 -6197759 -5139070
34710 -5139070 -4722420 -4902735 -3906386 -1655275 -350650 -693355 -393148 1986580 4348344
34701D348344K1677j095757L73963J424640j69089k177599j584284P99358J886831
34692C828084P23731j018793j881917j841698j237700k60222N92181Q06952O13127
34683C23745N79398N76573l3133j161086j695085p64125J030837K021186J194109
34674B072419o53699j744322j255818l4685O51357M54345j84403p56684q02959
34665b254449l4145J041932J312329N34276j79375j06781j38180j129931k074048
34656c028372j502692K4866O91496K65673J80822Q53817J048994L10203m1894
34647a197087P64513J408042N37980r36638j119011P7862Q99675L14866o75785
34638G4417o18647L43099P22518j35853r16951o1178J734284K019548n200j992084
$$ plain form
34701 4348344 4370021 3274264 3648227 5072867 4903778 2726179 1141895 1941253 3828084
34692 3828084 4551815 3533022 1651105 -190593 -1428293 -1688515 -1096334 -289382 323745
34683 323745 903143 1479716 1446583 285497 -1409588 -2173713 -1142876 878310 2072419
34674 2072419 1418720 -325602 -1581420 -1616105 -964748 -510403 -694806 -1451490 -2254449
34665 -2254449 -2288594 -1246662 65667 599943 420568 313787 175607 -954324 -3028372
34656 -3028372 -4531064 -4506198 -3814702 -3549029 -3368207 -2514390 -1465396 -1155193 -1197087
34647 -1197087 -432574 975468 1513448 576810 -542201 -464339 435336 750202 74417
34638 74417 -544230 -201131 521387 385534 -531417 -592595 1141689 3161237 3156037 1163953
34628A163953j503221N72130J357640O8198j283728j162781l65143m6322J83633
34619a015641J030325J728949R77245q63886j791987n67616J575895K114212J64602
34610C352098k210353k325884l21244J013287K04108q81802j88226J194104J007613
34601H43701k44563k02077J165304J398899k96667j767904j457273m70421j33323
34592a164324o4204J40830k27088j038936o23308J318809K318886O20501j857488
34583e76322k125514j11727J946900K612592J790407k73875k381966k276139M54279
34574i41365K709924J719531p21807q45213J231000J761723o49512k962521k419816
34565a118056k06152J066765J011138P65121M97326l20525j169777r60986M3125
$$ plain form
34628 1163953 -339268 232862 1590502 1658700 374972 -787809 -1152952 -1199274 -1015641
34619 -1015641 14684 1743633 2720878 1856992 65005 -502611 1073284 3187496 3352098
34610 3352098 1141745 -1184139 -1505383 -492096 -287988 -1169790 -1358016 -163912 843701
34601 843701 599138 397061 1562365 2961264 2664597 896693 -560580 -1031001 -1164324
34592 -1164324 -1228528 -1087698 -1314786 -2353722 -2977030 -1658221 660665 1281166 -576322
34583 -576322 -2701836 -2813563 -866663 1745929 3536336 3262461 880495 -1395644 -941365
34574 -941365 1768559 3488090 2766283 1921070 3152070 4913793 4264281 1301760 -1118056
34565 -1118056 -1324208 -257443 753695 1518816 2016142 1695617 525840 -435146 -392021
34556c92021L53243n04985j085116n6875J541644J303380j082132k721438j158092
34547c802392J867770K473192J56290j538158m94117J009248N31150m78206K47218
34538b8005J281148p6687k548684k369634O17743K670241K057853J069334J353909
34529D027218J319544l22284j961679j955484j186698r07042o43412k7043r8428
34520a755308r04573m41187J832236L020065R53420j967211k099478M5983R43216
34511c72837n62838k156811j849087j60613J358232J696575O79506o50851m76601
34502b495325J510206L169282K717303J125733L3907r08918k296438k553236m41945
34493a39431J664951Q09985j402351r58247J815001K395968o43699l342037k736127
$$ plain form
34556 -392021 -38778 -543763 -1628879 -1685754 -144110 1159270 77138 -2644300 -3802392
34547 -3802392 -1934622 538570 694860 -843298 -1337415 -328167 202983 -275223 -28005
34538 -28005 1253143 1176456 -1372228 -3741862 -3124119 -453878 1603975 2673309 4027218
34529 4027218 5346762 5024478 3062799 1107315 -79383 -986425 -1629837 -1656880 -1755308
34520 -1755308 -2659881 -3101068 -1268832 1751233 2704653 737442 -1362036 -1316053 -372837
34511 -372837 -935675 -3092486 -4941573 -5102186 -3743954 -2047379 -1367873 -2018724 -2495325
34502 -2495325 -985119 2184163 4901466 6027199 6061106 5152188 2855750 302514 -139431
34493 -139431 1525520 2335505 933154 -25093 1789908 4185876 3542177 200140 -2535987
34484b535987r98224r33602j394831k02526J584194J728825Q44617R80247J770269
34475H42982J225398n84442j532456o99695O45139J045429J46231j495391k517578
34466b924383j546777Q13990K010214R29248l44614J14948R06921r6628j802704
34457a939785j634972P9408Q39149K75701K17997Q52469M66017q97940j174846
34448b916802j42830P8720q13660m22508J752354K672581P94658q97809K52463
34439C57167J904487N66070k291694k287832Q39816K663370P20768k127930k232546
34430a888324o8702J255112N33492n85279m92699L30442M90592j18497k19643
34421g63506P93782J726247J321236L30905L13778P75163l18799k877704m020677
$$ plain form
34484 -2535987 -3534211 -4467813 -5862644 -6065170 -4480976 -2752151 -1907534 -927287 842982
34475 842982 2068380 1483938 -48518 -748213 -103074 942355 1088586 -406805 -2924383
34466 -2924383 -4471160 -3657170 -1646956 -717708 -1062322 -947374 -40453 -137081 -1939785
34457 -1939785 -3574757 -3495349 -2656200 -2380499 -2162502 -1310033 -844016 -1741956 -2916802
34448 -2916802 -3059632 -2980912 -3794572 -4217080 -2464726 207855 1002513 104704 357167
34439 357167 2261654 2827724 536030 -1751802 -911986 1751384 2472152 344222 -1888324
34430 -1888324 -1957026 -701914 -168422 -753701 -1246400 -915958 -425366 -543863 -763506
34421 -763506 30276 1756523 3077759 3408664 3722442 4497605 4178806 1301102 -2719575
34412b719575k165469O03557J855836K115045K641432K285136k86864k910648
34404A418450k218144J078368K839225J346891r47245j733303j407419o86511
34396c09688Q23798K420827J901140q91359k851830j822876L84576J064233M07287
34387A126108J24841L59647K92890J61601M22252L50987m29346n32863R11557
34378B787674K112995J132264r21122j774001j630421k001943k203603n10045
34370c008202J891962J880554n77060j979846n48350J387464J382985L07176K27567
34361I64250J189572J720695R27570j008173k967791l035196l93163K588058K573356
34352B559178K7123j200445J57477Q67317j021432k409194k49731K963148K892527
$$ plain form
34412 -2719575 -4885044 -4281487 -2425651 -310606 2330826 4615962 4329098 1418450
34404 1418450 -799694 278674 3117899 4464790 3517545 1784242 376823 -309688
34396 -309688 514110 2934937 4836077 3944718 1092888 -729988 -345412 718821 1126108
34387 1126108 1250949 1610596 1903486 2065087 2487339 2838326 2408980 1876117 2787674
34378 2787674 4900669 6032933 5111811 3337810 1707389 -294554 -2498157 -3008202
34370 -3008202 -1116240 764314 187254 -1792592 -2340942 -953478 429507 736683 964250
34361 964250 2153822 3874517 4802087 3793914 826123 -2209073 -2602236 -14178 2559178
34352 2559178 2586301 1385856 1543333 2410650 1389218 -1019976 -1269707 1693441 4585968
34343D585968J00758j458566j094793j594921l371075l434495q04296J582190
34335e489230J619073P64559N82557K94401m45351L8658J988356K530286J51563
34326B034872k175609j421238P03234Q97679k06300J81896J522072R17579j230101
34317A224084j374565J129023K664509J065771j349449j922241j190711n16967
34309b70546M32936J664891J365205j004860k673987j340092J148565J651216
34301I73328L74028k88551L9544j64732j047823j314101q35502n64961l65097
34292c193867M99439J310289R41520K67760P61299J442501L63921j505594j454183
34283e66915K18367N44682q51868j054876Q26678J981192R48777K1099N53184
$$ plain form
34343 4585968 4686726 3228160 2133367 538446 -2832629 -6267124 -7071420 -5489230
34335 -5489230 -3870157 -3105598 -2523041 -2228640 -2673991 -2635333 -646977 1883309 2034872
34326 2034872 -140737 -1561975 -858741 38938 -167362 14534 1536606 2454185 1224084
34317 1224084 -150481 978542 3643051 4708822 3359373 1437132 246421 -270546
34309 -270546 162390 1827281 3192486 2187626 -486361 -1826453 -677888 973328
34301 973328 1347356 1058805 1098349 933617 -114206 -1428307 -2263809 -2828770 -3193867
34292 -3193867 -2694428 -1384139 -442619 -174859 586440 2028941 2392862 887268 -566915
34283 -566915 -348548 196134 -655734 -1710610 -883932 1097260 2046037 2067136 2620320
34274B620320K00083k301782l648609j047759K507718K388788n87483j728810
34266a597534L24537K322351J702997o33113k565088k604637n0211L667563M634764
34257E201629Q24752l969874m292004m93354K074037J058813m08689J52751Q80757
34248A028818j55618j313785o48952N77502M73559j31149L04997R70519M32508
34239A538399m78794k62757L92961O6580n00679J98294J248670N32512j451872
34230A283314k000672m36240Q95452M23507l61940L94758J816597J549267p61872
34221B802171k818261k513934l88498J273265J251283M37445O2244J3294k89255
34212a70246l78000M03133J120993K40893j658526k177414n23195J278501J317875
$$ plain form
34274 2620320 2820403 518621 -3129988 -4177747 -1670029 718759 131276 -1597534
34266 -1597534 -1272997 1049354 2752351 2119238 -445850 -3050487 -3100698 566865 5201629
34257 5201629 6026381 2056507 -2235497 -2728851 -654814 403999 -4690 148061 1028818
34248 1028818 873200 -440585 -1089537 -512035 -38476 -169625 135372 1105891 1538399
34239 1538399 1059605 796848 1189809 1256389 755710 954004 2202674 2735186 1283314
34230 1283314 -717358 -1153598 -258146 165361 -196579 198179 2014776 3564043 2802171
34221 2802171 -16090 -2530024 -2918522 -1645257 -393974 43471 105715 119009 -170246
34212 -170246 -548246 -145113 975880 1216773 -441753 -2619167 -3142362 -1863861 -545986
34203e45986J69431n27732j94308Q60113K074739K260085M20566k095391k342183
34194G9334R9271J975323Q95537j362318k086359j666532j699340j417371M82245
34185d700210K229191J272872q63498m39313K075112K187584j188966l301129
34177b728357p51238L017627K825685n82866k057522K01604K546242J661883j078742
34168C054316k356230j527646n38407n02524n35107J09085N94670K0249q32205
34159b513799n48553O61796J183079M15995m50756m02134R7484L78035P26696
34150d52157J325231J325025K22062r06543q78133k30942k33549q80146j232392
34141a941544j000520m63286L55067J094931O73912r78299j927071p58842J075577
$$ plain form
34203 -545986 -376555 -904287 -1098595 -238482 1836257 4096342 4516908 2421517 79334
34194 79334 178605 2153928 3049465 1687147 -399212 -2065744 -3765084 -5182455 -4700210
34185 -4700210 -2471019 -1198147 -2061645 -2500958 -425846 1761738 572772 -2728357
34177 -2728357 -3479595 -461968 2363717 1780851 -276671 -75067 2471175 4133058 3054316
34168 3054316 698086 -829560 -1367967 -1870491 -2405598 -2296513 -1701843 -1681594 -2513799
34159 -2513799 -3062352 -2400556 -1217477 -801482 -1252238 -1654372 -1556888 -1178853 -452157
34150 -452157 873074 2198099 2420161 1513618 635485 404543 170994 -709152 -1941544
34141 -1941544 -2942064 -3405350 -3050283 -1955352 -1281440 -2259739 -4186810 -4945652 -3870075
34132c870075J470985R16548J053152J300144Q5858j467935p74510J562496K165991
34123B442654K62984j227253p17075p6315m72956j79248J463704J829486m67437
34114B858544k310918p42322J952034J608000j428390l190448k033737P0649J377760
34105a838828J954299J819691P64077j31248K68655O52011r75795l270277k740593
34096c498008P02808K957072J577019q60922r70924O65360J225370J35286p21047
34087A212014k55210O25530P69865R0731q26081j300192q12819M85577J590597
34078A580012J526437K95709j320689k502970k640933j477788L78347J498216
34070b663659Q98586p75617j801027j199959K26311Q56934J85263n68287j38688
$$ plain form
34132 -3870075 -2399090 -1482542 -429390 870754 956612 -511323 -1285833 276663 2442654
34123 2442654 2705638 1478385 761310 684995 212039 32791 1496495 3325981 2858544
34114 2858544 547626 -194696 1757338 3365338 1936948 -1253500 -3287237 -3216588 -1838828
34105 -1838828 115471 1935162 2699239 2567991 2836646 3488657 2512862 -757415 -3498008
34096 -3498008 -2795200 161872 1738891 877969 -92955 572405 1797775 1933061 1212014
34087 1212014 956804 1582334 2352199 2442930 1616849 316657 -496162 -10585 1580012
34078 1580012 3106449 3402158 2081469 -421501 -3062434 -4540222 -4161875 -2663659
34070 -2663659 -1765073 -2540690 -4341717 -5541676 -5315365 -4458431 -4273168 -4841455 -4980143
34061d980143R13434J020225J96375K29213J688465K585083J431288j39875m0936
34052B903129M97911j021318l322977k343298K125521M792070J927085l159904
34044B398219m576210j476897J983709K807599J745128L11780j249598k479720
34036e35990k071911K9870J806269J615536J93286o49331k23882Q32444J549437
34027B545728J210715j49778j348997j035551N34770J609931J124390k49255j454663
34018B787290k148462k035349o46803J376334K201021J099331l96672p75821o91971
34009G68898j386921k194205j532158L12133J361788O99492o28726j335577j043089
34000d978365Q1297J355043J501911R7047j214305o27521J084394J712966J053714
$$ plain form
34061 -4980143 -4066709 -3046484 -2850109 -2620896 -932431 1652652 3083940 2944065 2903129
34052 2903129 3401040 2379722 -943255 -3286553 -1161032 3631038 5558123 2398219
34044 2398219 -2177991 -3654888 -1671179 1136420 2881548 3193328 1943730 -535990
34036 -535990 -2607901 -2578031 -771762 843774 1037060 387729 163847 996291 2545728
34027 2545728 3756443 3606665 2257668 1222117 1756887 3366818 4491208 4241953 2787290
34018 2787290 638828 -1396521 -2043324 -666990 1534031 2633362 2236690 1460869 768898
34009 768898 -618023 -2812228 -4344386 -4032253 -2670465 -1970973 -2599699 -3935276 -4978365
34000 -4978365 -4897068 -3542025 -2040114 -1943067 -3157372 -3784893 -2700499 -987533 66181
33991F6181P29332Q24509j97806j867674j550900Q37937J615833r65727l210878
33982c719193j318810K586274L622746J329861o00726n67005m57223j057235o60158
33973h41469R33670J209420o86173j906116k92653K079936K058989j09690j787913
33964F58001j772996r04453l0144O29366Q43406O56674O83319J043531Q88441
33955B695145r4562q47162n92719n6647k311K3909K94920j57100j642578k360251
33945b739356p71466J705307K392023R48843o57008j162874j049682q69282l41973
33936b545468P27149J797548J967401N78469j925795l467080k089465J063999
33928c893242K391338N64135j578722j460888m40979n41357l18348K129639M190548
$$ plain form
33991 66181 795513 1620022 1422216 -445458 -1996358 -1158421 457412 -508315 -3719193
33982 -3719193 -5038003 -2451729 1171017 2500878 1900152 1333147 875924 -181311 -841469
33973 -841469 92201 1301621 615448 -1290668 -1583321 496615 2555604 2445914 658001
33964 658001 -1114995 -2019448 -2049592 -1420226 -576820 79854 763173 1806704 2695145
33955 2695145 2600583 1753421 1160702 1104055 1101744 1125653 1420573 1263473 -379105 -2739356
33945 -2739356 -3510822 -1805515 586508 1535351 878343 -284531 -1334213 -2203495 -2545468
33936 -2545468 -1818319 -20771 1946630 2525099 599304 -2867776 -4957241 -3893242
33928 -3893242 -1501904 -937769 -2516491 -3977379 -4418358 -4959715 -5278063 -3148424 1042124
33919A042124J799823l310469m810823q65853L092422K430752n15817j135194
33911b273035M96684J079712l9179n01598O10680J488400P51953p15500j494574
33902e96457j380181r07963l22524M34103J192974J338183K82291j523608k400822
33893c884004j173642J056478J998290R92359m94877j103580q09043K4050J037458
33884b356511J242971l8925j407557p44840J335899J920933K58013j044516l08605
33875a143138P36775L49220l43257N6799N36783M6490j11321R60170J218559q04377
33865A502703k409562o17071K305698J762358j849726l566080j411207J232619
33857c050268J472479O57988Q40121J344210Q83035P9676j57361m25576j216852
$$ plain form
33919 1042124 2841947 -468522 -5279345 -6145198 -3052776 -622024 -1137841 -2273035
33911 -2273035 -1776351 -696639 -735818 -1237416 -626736 861664 1613617 898117 -596457
33902 -596457 -1976638 -2884601 -3207125 -2773022 -1580048 -241865 40426 -1483182 -3884004
33893 -3884004 -5057646 -4001168 -2002878 -1010519 -1505396 -2608976 -3418019 -3393969 -2356511
33884 -2356511 -1113540 -1152465 -2560022 -3304862 -1968963 -48030 209983 -834533 -1143138
33875 -1143138 -406363 -57143 -400400 -343601 193182 239672 128351 1088521 2307080 1502703
33865 1502703 -906859 -1523930 781768 2544126 694400 -2871680 -4282887 -3050268
33857 -3050268 -1577789 -919801 -79680 1264530 2147565 2227241 2069880 1644304 427452
33848D27452j563101q47076m8737J87954P45376J892562K038982L22862j431240
33839A725034j233893J27272N61142j74653o55732j76212P01829J234717Q39552
33830B949056p47964k484207k321657J39633K418188K058650k19746j770881j428558
33821a407486q4570J177123J748381J052117p24180j953019j364576o3291L30
33812a619171r06079p97853O29698J348852J97023j295343j239966k7904N87352
33803c123391Q8684l83388J26078J123054J401489N61256n19702p46598j33383
33794a605901K92457q9882p21153p47158q8289P73100J484359J777776J297159
33785B372468J22788r34628j148905o45678L9382O26735Q98203N56959j32887
$$ plain form
33848 427452 -1135649 -1982725 -2031462 -1843508 -1098132 794430 2833412 3156274 1725034
33839 1725034 491141 618413 1179555 1004902 349170 172958 874787 2109504 2949056
33830 2949056 2201092 -283115 -2604772 -2465139 -46951 2011699 1791953 21072 -1407486
33821 -1407486 -1492056 -314933 1433448 2485565 1761385 -191634 -1556210 -1619501 -1619171
33812 -1619171 -2525250 -3323103 -2693405 -1344553 -1147530 -2442873 -3682839 -3710743 -3123391
33803 -3123391 -3034707 -3418095 -3292017 -2168963 -767474 -206218 -725920 -1472518 -1605901
33794 -1605901 -1313444 -1403326 -2124479 -2871637 -2959926 -2186826 -702467 1075309 2372468
33785 2372468 2495256 1560628 411723 -233955 -194573 432162 1330365 1887324 1754437
33776A754437k98439K97729P32825L40899k19380j52360J52668J7035k04923J16935
33766B537426N93015M84057p9349o95155j564039k464180k027048K06181K109886
33757h99206J526740l79796q09230K86665M13331j004810j605782k22700J051145
33748a643643L59936r39231o79948O99687J215709N01601p5500K54985Q70603
33739E64199R67049M05149m57670j097293j234049j150178j111173o36853O58975
33730c091844J777283J402663J19178l62099j77248j050111k656503k218273J008016
33721e248938L768803L312158J225723L78974M69350l95624j666538j392635n3576
33712C97697J89698n78570k96043J128949J536866M02768k32455O50877J474020
$$ plain form
33776 1754437 1455998 1753727 2486552 2827451 2608071 2455711 2608379 2625414 2420491 2537426
33766 2537426 3130441 3614498 3535149 2839994 1275955 -1188225 -3215273 -3009092 -899206
33757 -899206 627534 247738 -561492 -274827 138504 -866306 -2472088 -2694788 -1643643
33748 -1643643 -1283707 -2222938 -2902886 -2203199 -987490 -485889 -561389 -306404 564199
33739 564199 1531248 1936397 1478727 381434 -852615 -2002793 -3113966 -3750819 -3091844
33730 -3091844 -1314561 88102 207280 -154819 -332067 -1382178 -4038681 -6256954 -5248938
33721 -5248938 -1480135 1832023 3057746 3436720 3906070 3510446 1843908 451273 397697
33712 397697 587395 8825 -287218 841731 2378597 2781365 2548910 3199787 4673807
33703D673807R54190q5960q31703j909226l443868l897437k318472k4600J288549
33694e594720J639018J836391J907708J538203Q37053j62584j474473k114581
33686a587985q31588J454438K029631K58011j115436n884J844052J699206j06108
33677C638337j307710j361277j330687j249544l69213N92900K00584r53869q89671
33668c030150M01792R27067K71827L03913J427261J122063j889350m471367k862814
33659g799758J659505L975751J907224j055408q43914J667477K323007k65680
33651A568204k918599k477800L3020J308576M32157m27967L63817J688439J626507
33642A196354Q3880j432449j682464o13660P90728J115904j04072j303765n18508
$$ plain form
33703 4673807 5627997 5542037 4710334 2801108 -642760 -4540197 -6858669 -6883269 -5594720
33694 -5594720 -3955702 -2119311 -211603 1326600 2163653 2001069 526596 -1587985
33686 -1587985 -2419573 -965135 1064496 1322507 207071 201187 2045239 3744445 3638337
33677 3638337 2330627 969350 -361337 -1610881 -1980094 -1387194 -1186610 -2140479 -3030150
33668 -3030150 -2628358 -1701291 -1429464 -1125551 301710 1423773 -465577 -4936944 -7799758
33659 -7799758 -6140253 -2164502 -257278 -1312686 -2156600 -489123 1833884 1568204
33651 1568204 -1350395 -3828195 -3795175 -2486599 -2054442 -2482409 -2118592 -430153 1196354
33642 1196354 1280234 -152215 -1834679 -2448339 -1657611 -541707 -645779 -1949544 -2468052
33633b468052J466426J486814j363086l527551j507317K958715M892995K509866
33625D448810j092389k517503j664177l46224J99314m10882j830914k422512m51393
33616f087870L078700M598010K332200j095076k015671l56289R42165K64719j014924
33607F45964j108974k24290J84250n03990j456634j522633n76002L89014N42320
33598c630975K83185M97653J048504J001044L00744q6465M1549k40190r26452
33589a711403m44190J646266K982078J363944j776414l107488j905797m40776
33581c393780j23902J00347J063930J585404N81647r04866j242661m81456K66070
33572b549267O73335J072776J256954P58387j08241n86795n19205j74019M67681
$$ plain form
33633 -2468052 -1001626 485188 -877898 -4405449 -5912766 -2954051 1938944 4448810
33625 4448810 3356421 838918 -825259 -1171483 -972169 -1383051 -3213965 -5636477 -6087870
33616 -6087870 -3009170 1588840 3921040 2825964 810293 454004 1396169 1660888 645964
33607 645964 -463010 -687300 -503050 -1007040 -2463674 -3986307 -4562309 -4173295 -3630975
33598 -3630975 -3347790 -2850137 -1801633 -800589 -499845 -586310 -544761 -784951 -1711403
33589 -1711403 -2155593 -509327 2472751 3836695 2060281 -1047207 -2953004 -3393780
33581 -3393780 -3517682 -3417335 -2353405 -768001 -186354 -1091220 -2333881 -2815337 -2549267
33572 -2549267 -1875932 -803156 453798 1212185 1103944 517149 -2056 -176075 291606
33563B91606J313185J549414N20935j070834j825111j279683r4373R74896J380610
33554A760645O31765r55380j801161p47751J063102J441855Q7816j278141j538124
33545a335374j105745k78943J113451K081530J031854j125525j127253J758001
33537A011996L673966J473083k282449k913323n31752O21218r42707k079065n90022
33528b559055J390996J257964j26444n28253J57695P87755J298074J838582J332243
33519D849557o62436k097547j026793J038292J036860j085271k442187j532164
33511a921689J69104J048747J267816J312552Q39260k11643j011458j042559n82515
33502a32385K68240J518166K111731P20377j863598l076102j990967m57562n9204
$$ plain form
33563 291606 1604791 3154205 3675140 2604306 779195 -500488 -594861 380035 1760645
33554 1760645 2392410 1437030 -364131 -1111882 -48780 1393075 1480891 202750 -1335374
33545 -1335374 -2441119 -2720062 -1606611 474919 1506773 381248 -746005 1011996
33537 1011996 4685962 6159045 3876596 963273 431521 1052739 110032 -1969033 -2559055
33528 -2559055 -1168059 89905 -36539 -564792 -407097 380658 1678732 3517314 4849557
33519 4849557 4187121 2089574 1062781 2101073 3137933 2052662 -389525 -1921689
33511 -1921689 -1752585 -703838 563978 1876530 2715790 2504147 1492689 450130 -132385
33502 -132385 135855 1654021 3765752 4486129 2622531 -453571 -2444538 -2902100 -2961304
33493b961304m5892N31074P81735j50279r53990l9002J658723J940408O07195
33484A368668o46201j024888j169227j178308l40377R32897R92393m89679j521764
33475c076486m19574J702460K253965M61807j699563j895586r2148J572806J442087
33466B49768K39910k51572J17722j24621j293441j643886k71231Q94516j24248
33457b207083j901016j400175J401262L331728K492077L59243r98576j308679
33449b31219r11616L06168J538906R65743j303003k314484l23028K196176K008062
33440A931705j19065j050931l92210m37851j540717j402026M72822J359243j62105
33431a341135j570670m83645J404072J230601l15137m47458Q57130R88469o57400
$$ plain form
33493 -2961304 -3007196 -2476122 -1694387 -1844666 -2798656 -2837658 -1178935 761473 1368668
33484 1368668 722467 -302421 -1471648 -2649956 -2990333 -2057436 -1065043 -1554722 -3076486
33475 -3076486 -3496060 -1793600 460365 922172 -777391 -2672977 -2765125 -1192319 249768
33466 249768 489678 238106 355828 231207 -1062234 -2706120 -2977351 -2082835 -2207083
33457 -2207083 -4108099 -5508274 -4107012 -775284 1716793 2076036 1077460 -231219
33449 -231219 -1142835 -836667 702239 1667982 364979 -1949505 -2272533 -76357 1931705
33440 1931705 1812640 761709 369499 -68352 -1609069 -3011095 -2538273 -1179030 -1341135
33431 -1341135 -2911805 -3395450 -1991378 -760777 -1075914 -1523372 -666242 322227 -335173
33422c35173j603623m02727J179817J237873M94053M62263Q12583L87252n26307
33413A706011q05030n30115o75580j212011j103527q9163Q47326Q96413L25769
33404f39907j71089k54029R9864Q17219J634258J977470J149231r89368l168723
33395D54926l210494n94751J898289J088911j912887k516214P88787L644315J974817
33386A615699j788749k339307M45394J749192k88365k002291o82532J181137O79244
33377a430578n21549M65023K339862J741594r41043k135872q19742L53630j64064
33368a112739o72550J58119Q35687n5118j036674j6776K170353K694020N63205
33359C527527k187897l014134j413498R92651K155256J376496j75368q18380l03040
$$ plain form
33422 -335173 -1938796 -2341523 -1161706 76167 570220 1032483 1845066 2232318 1706011
33413 1706011 900981 370866 -304714 -1516725 -2620252 -2709415 -1862089 -965676 -639907
33404 -639907 -810996 -1065025 -965161 -147942 1486316 3463786 4613017 3623649 454926
33395 454926 -2755568 -3350319 -1452030 -363119 -2276006 -4792220 -4003433 -359118 1615699
33386 1615699 -173050 -2512357 -2066963 -317771 -606136 -2608427 -3290959 -2109822 -1430578
33377 -1430578 -1952127 -1487104 852758 2594352 1653309 -482563 -1302305 -948675 -1112739
33368 -1112739 -1785289 -1627170 -791483 -846601 -1883275 -1900051 270302 2964322 3527527
33359 3527527 1339630 -1674504 -3088002 -2095351 59905 1436401 1261033 442653 139613
33350A39613J00469m06276r65672m88573N50038P92614Q8462k97729L25818R79968
33340H18732M46527j020181k210150k600725k422441j462403O37214K658746K311060
33331b843621l35189j707781P81774M384502M167608R1905k682260j231928J276496
33322A901506J100231m90496m25371M74784n20119k324649j437882J524959K010193
33313A813156j068954l190595j286620J670595J844058K93034J15858J054355
33305A244887R03631l5467m0103J68451j103520k303958m61505L050567L314262
33296D737245p53854m249899l236767N6206J433458P66829N78035J045299K99898
33287F76450j386265j514936M10841J779031Q64208o16449l02239J350886K124113
$$ plain form
33350 139613 240082 -166194 -1131866 -1620439 -1070401 -277787 -189325 -487054 -161236 818732
33340 818732 1265259 245078 -1965072 -4565797 -6988238 -8450641 -7813427 -5154681 -2843621
33331 -2843621 -3178810 -4886591 -4104817 279685 4447293 4539198 1856938 625010 1901506
33322 1901506 3001737 2511241 2085870 2560654 2040535 -284114 -1721996 -197037 1813156
33313 1813156 744202 -2446393 -3733013 -2062418 -218360 74674 190532 1244887
33305 1244887 2148518 2113051 2072948 2241399 1137879 -1166079 -1627584 1422983 4737245
33296 4737245 3983391 -266508 -3503275 -3447069 -2013611 -1246782 -668747 376552 676450
33287 676450 -709815 -2224751 -1813910 -34879 829329 212880 -89359 1261527 3385640
33278C385640J413683P15689J031796J379431L07047k024834l862138l640203
33270a293889j445035J114321K306801J688380K67398o88323q33070n87187j90150
33261C39246M16063Q28463K66601j102617j764553o87218R77702J157099l66556
33252F4230j672298j346941j60048M36981L38077L66599O14710L89059l69319
33243a338950o32486M16466K072776K517049P57002j867512k718910r28465J270709
33234d52321J355189o0470m26100N34756M74677j289222k256672j034030P868
33225c146325j031175j613464J149410M618086L716198r43885l321795q55382
33217a428332K125734J597183n24695q47485k43911j128238k248405q14502K109494
$$ plain form
33278 3385640 4799323 5515012 6546808 7926239 8233286 6208452 2346314 -1293889
33270 -1293889 -2738924 -1624603 682198 2370578 2637976 1949653 1116583 529396 339246
33261 339246 755309 1583772 1850373 747756 -1016797 -1704015 -726313 430786 64230
33252 64230 -1608068 -2955009 -3115057 -2678076 -2339999 -1973400 -1358690 -969631 -1338950
33243 -1338950 -1971436 -1554970 517806 3034855 3791857 1924345 -794565 -1723030 -452321
33234 -452321 902868 842398 416298 951054 1425731 136509 -2120163 -3154193 -3146325
33225 -3146325 -4177500 -5790964 -4641554 -23468 3692730 2748845 -572950 -1428332
33217 -1428332 697402 2294585 1769890 922405 678494 -449744 -2698149 -3512651 -1403157
33208a403157K888218J031882n18101l64483j8677l59568m25149k5489j57921
33199F47555m55099M44271J634875O96500j671187j808101Q21196J971710o99014
33190A582706l416412k072148J286083J927710j60047j067158K79303J040393
33182e99570r5370r87397k78302M22457j16449n78409J29575P97600L96424J46887
33172g62554J056021J462490n73658l758522m756444k305073J584081M064145
33164c989514L751468J214493j464354k081330m44064J322980J460361O72359
33156D42399M54480N30079k46555j295167r02071P49874J431984K31320r49256
33147D47087k04994J630436K293188J099152o15141j486644j418906j061806q91701
$$ plain form
33208 -1403157 1485061 2516943 1998842 1634359 1615682 1256114 830965 805476 647555
33199 647555 192456 636727 2271602 2968102 1296915 -511186 310010 2281720 1582706
33190 1582706 -1833706 -3905854 -2619771 -692061 -852108 -1919266 -1639963 -599570
33182 -599570 -694940 -1682337 -1960639 -1538182 -1654631 -2233040 -2103465 -1305865 -909441 -762554
33172 -762554 293467 1755957 1182299 -2576223 -7332667 -9637740 -8053659 -3989514
33164 -3989514 -238046 976447 -487907 -2569237 -3013301 -1690321 -229960 442399
33156 442399 896879 1426958 1180403 -114764 -1016835 -266961 1165023 1396343 447087
33147 447087 242093 1872529 4165717 5264869 4649728 3163084 1744178 682372 -209329
33138b09329r39693r75187q08210m96217k02723Q6606M68012Q13719Q81989O41043
33128g39990J60483n58102j161148p98389P09968J895383J104032j035556k035213
33119b458532q35760P89574Q88477m7872l32942K46738O22880N33363O23108P79529
33109H08563K05836p30069n07485J112973K207939J163462j122251k508820k183258
33100a553110r22868M06327J338504J292930J1878j490163j684924n04686N05797
33091b600315L46052k05155n4069N74136Q30489O72850M90783K5240r72862j544609
33081b437460o93142M67886j55339k010936j860844J349834L995495K523364j096264
33072H2594j913381Q26985K795485J259245j145197j030749O10328O93280p66335
$$ plain form
33138 -209329 -1149022 -2124209 -2932419 -3428636 -3631359 -3544753 -3076741 -2263022 -1381033 -739990
33128 -739990 -579507 -1137609 -2298757 -3097146 -2387178 -491795 612237 -423319 -2458532
33119 -2458532 -3294292 -2504718 -1616241 -1664113 -1997055 -1750317 -1127437 -594074 29034 808563
33109 808563 1014399 284330 -223155 889818 3097757 4261219 3138968 630148 -1553110
33100 -1553110 -2475978 -2069651 -731147 561783 573661 -916502 -2601426 -3106112 -2600315
33091 -2600315 -2254263 -2459418 -2513487 -1939351 -1108862 -436012 54771 80011 -892851 -2437460
33081 -2437460 -3130602 -2662716 -2818055 -4828991 -6689835 -5340001 -1344506 1178858 82594
33072 82594 -1830787 -1003802 1791683 3050928 1905731 874982 1485310 2178590 1412255
33063A412255j093321M06582J474851N54589j238010k202732j976228q72657Q00942
33054b733729K133379J933831L97350q00555o04983L23644Q73029O24028l76237
33045A769757j565209j550198M01432K415722J704199j299609k913810j311633
33037b349349R06315Q59115m06769k29372J217891J733868R91923M98405L81519
33028C603546n95825j969985j682618K63203J157873l63866k080359j400098J063404
33019b004725K652741K058524J60084j519757j937227q21781J024928K071660
33011A684447J416588l97715k078855k576217j480976N99020K024445J608442
33003G99179K44172j53547O00458Q07567k41049j071986m94659M95992M73840
$$ plain form
33063 1412255 318934 725516 2200367 2754956 1516946 -685786 -2662014 -3534671 -2733729
33054 -2733729 -600350 1333481 1730831 930276 325293 648937 1521966 2145994 1769757
33045 1769757 204548 -1345650 -944218 1471504 3175703 1876094 -1037716 -2349349
33037 -2349349 -1443034 -583919 -990688 -1220060 -2169 1731699 2723622 3222027 3603546
33028 3603546 3007721 1037736 -644882 -381679 776194 412328 -1668031 -3068129 -2004725
33019 -2004725 648016 2706540 2866624 1346867 -590360 -1412141 -387213 1684447
33011 1684447 3101035 2703320 624465 -1951752 -3432728 -2833708 -809263 799179
33003 799179 1043351 889804 1490262 2297829 2056780 984794 490135 986127 1459967
$$ [...]
##END NTUPLES=NMR SPECTRUM
##END=
