##TITLE=31Pdec_IPACAT-25
 CCl4, 24 sc
 2.04.2021
##JCAMPDX= 6.0         $$ Bruker NMR JCAMP-DX V2.0
##DATA TYPE= NMR SPECTRUM
##DATA CLASS= NTUPLES
##ORIGIN= UXNMR, Bruker Analytische Messtechnik GmbH
##OWNER= root
$$ XWIN-NMR		Version 3.5
$$ Fri Apr  2 12:32:32 2021 Russian Standard Time (UT+4h)  she@DPX200
##.OBSERVE FREQUENCY= 81.013821
##.OBSERVE NUCLEUS= ^31P
##.ACQUISITION MODE= SIMULTANEOUS
##.ACQUISITION SCHEME= undefined
##.AVERAGES= 24
##.DIGITISER RES= 16
##SPECTROMETER/DATA SYSTEM= spect
##.PULSE SEQUENCE= zgpg30
##.SOLVENT NAME= CDCl3
##.SHIFT REFERENCE= (INTERNAL, CDCl3, 0, 248.564)
##AUDIT TRAIL= $$ (NUMBER, WHEN, WHO, WHERE, WHAT)
$$ ##TITLE= Audit trail, XWIN-NMR		Version 3.5
$$ ##JCAMPDX= 5.01
$$ ##ORIGIN= Bruker BioSpin GmbH
$$ ##OWNER= she
$$ F:/spectra/data/she/nmr/P31/1/pdata/1/auditp.txt
$$ ##AUDIT TRAIL=  $$ (NUMBER, WHEN, WHO, WHERE, WHAT)
(   1,<2021-04-02 12:30:21.95 +0400>,<she>,<DPX200>,
      <created by zg, POWCHK disabled, PULCHK disabled
       configuration hash MD5:
       00 E9 B6 7A A2 85 ED C7 34 08 36 98 17 FE 4E 26
       data hash MD5: 32K
       50 79 8C F5 95 EC 73 2F C9 89 5A 46 34 89 1D 91>)
(   2,<2021-04-02 12:30:24.35 +0400>,<she>,<DPX200>,
      <Start of raw data processing
       efp BC_mod = 2 LB = 1 FT_mod = 6 PKNL = 1 PHC0 = -4362.74 PHC1 = -1.998908 SI = 64K 
       data hash MD5: 64K
       FE 28 3B 15 43 EA FB 0A CE 69 FD FF 60 C7 25 C4>)
(   3,<2021-04-02 12:31:01.60 +0400>,<she>,<DPX200>,
      <pk PHC0 = -98.53106 PHC1 = 219.4 
       data hash MD5: 64K
       94 5C AE AB D6 56 5B 5D F3 C6 A8 C4 86 56 60 95>)
$$ ##END=
$$ 
$$ hash MD5
$$ 7F A5 86 4B 55 C1 23 78 74 62 78 33 42 28 5D 18
##$RELAX= 
##$RELAX= 
##$RELAX= 
##$RELAX= 
##$RELAX= 
##$RELAX= 
##$RELAX= 
##$RELAX= 
$$ Bruker specific parameters
$$ --------------------------
##$DU= <F:/spectra>
##$EXPNO= 1
##$NAME= <P31>
##$PROCNO= 1
##$TYPE= <nmr>
##$USER= <she>
##$AMP= (0..31)
100 100 100 100 100 100 100 100 100 100 100 100 100 100 100 100 100 100 
100 100 100 100 100 100 100 100 100 100 100 100 100 100 
##$AQSEQ= 0
##$AQ_mod= 1
##$AUNM= <au_zg>
##$AUTOPOS= <>
##$BF1= 81.014009
##$BF2= 200.13
##$BF3= 200.13
##$BF4= 200.13
##$BF5= 200.13
##$BF6= 200.13
##$BF7= 200.13
##$BF8= 200.13
##$BYTORDA= 1
##$CFDGTYP= 0
##$CFRGTYP= 5
##$CHEMSTR= <none>
##$CNST= (0..31)
1 1 145 1 1 1 1 1 1 1 1 1 1 1 1 1 1 1 1 1 1 1 1 1 1 1 1 1 1 1 1 1 
##$CPDPRG= <waltz16>
##$CPDPRG1= <>
##$CPDPRG2= <waltz16>
##$CPDPRG3= <>
##$CPDPRG4= <mlev>
##$CPDPRG5= <mlev>
##$CPDPRG6= <mlev>
##$CPDPRG7= <mlev>
##$CPDPRG8= <mlev>
##$CPDPRGB= <>
##$CPDPRGT= <>
##$D= (0..31)
0 1 0 0 0 0 0 0 0 0 0 0.03 2e-05 3e-06 0 0 0 0 0 0 0 0 0 0 0 0 0 0 0 0 
0 0 
##$DATE= 1617352221
##$DBL= (0..7)
120 120 120 11 120 120 24 19 
##$DBP= (0..7)
150 150 150 150 150 150 150 150 
##$DBP07= 0
##$DBPNAM0= <>
##$DBPNAM1= <>
##$DBPNAM2= <>
##$DBPNAM3= <>
##$DBPNAM4= <>
##$DBPNAM5= <>
##$DBPNAM6= <>
##$DBPNAM7= <>
##$DBPOAL= (0..7)
0.5 0.5 0.5 0.5 0.5 0.5 0.5 0.5 
##$DBPOFFS= (0..7)
$$ [...]
##$SUBNAM2= <"">
##$SUBNAM3= <"">
##$SUBNAM4= <"">
##$SUBNAM5= <"">
##$SUBNAM6= <"">
##$SUBNAM7= <"">
##$SUBNAM8= <"">
##$SUBNAM9= <"">
##$SW= 501.771253377433
##$SWIBOX= (0..15)
0 1 3 0 0 0 0 0 0 0 0 0 0 0 0 0 
##$SW_h= 40650.406504065
##$TD= 32768
##$TD0= 1
##$TE= 0
##$TE2= 300
##$TE3= 300
##$TEG= 300
##$TL= (0..7)
0 120 53 12 22 120 120 120 
##$TP= (0..7)
150 150 150 150 150 150 150 150 
##$TP07= 0
##$TPNAME0= <>
##$TPNAME1= <>
##$TPNAME2= <>
##$TPNAME3= <>
##$TPNAME4= <>
##$TPNAME5= <>
##$TPNAME6= <>
##$TPNAME7= <>
##$TPOAL= (0..7)
0.5 0.5 0.5 0.5 0.5 0.5 0.5 0.5 
##$TPOFFS= (0..7)
0 0 0 0 0 0 0 0 
##$TUNHIN= 0
##$TUNHOUT= 0
##$TUNXOUT= 0
##$USERA1= <user>
##$USERA2= <user>
##$USERA3= <user>
##$USERA4= <user>
##$USERA5= <user>
##$V9= 5
##$VALIST= <valist>
##$VCLIST= <CCCCCCCCCCCCCCC>
##$VD= 0
##$VDLIST= <DDDDDDDDDDDDDDD>
##$VPLIST= <PPPPPPPPPPPPPPP>
##$VTLIST= <TTTTTTTTTTTTTTT>
##$WBST= 1024
##$WBSW= 4
##$XGAIN= (0..3)
0 0 0 0 
##$XL= 0
##$YL= 0
##$YMAX_a= 7652
##$YMIN_a= -7333
##$ZGOPTNS= <>
##$ZL1= 120
##$ZL2= 120
##$ZL3= 120
##$ZL4= 120
##$ABSF1= 0
##$ABSF2= 0
##$ABSG= 0
##$ABSL= 0
##$ALPHA= 0
##$AQORDER= 0
##$ASSFAC= 0
##$ASSFACI= 0
##$ASSFACX= 0
##$ASSWID= 0
##$AUNMP= <proc_1d>
##$AZFE= 0.1
##$AZFW= 0.5
##$BCFW= 0
##$BC_mod= 2
##$BYTORDP= 0
##$COROFFS= 0
##$CY= -3
##$DATMOD= 1
##$DC= 0
##$DFILT= <>
##$DTYPP= 0
##$F1P= 0
##$F2P= 0
##$FCOR= 1
##$FTSIZE= 65536
##$FT_mod= 6
##$GAMMA= 0
##$GB= 0
##$INTBC= 1
##$INTSCL= 5.30512e-09
##$ISEN= 30
##$LB= 1
##$LEV0= 0
##$LPBIN= 0
##$MAXI= 10000
##$MC2= 0
##$MEAN= 0
##$ME_mod= 0
##$MI= 50
##$NCOEF= 0
##$NC_proc= -5
##$NLEV= 6
##$NOISF1= 182.463
##$NOISF2= 159.3651
##$NSP= 0
##$NTH_PI= 0
##$NZP= 0
##$OFFSET= 248.5645
##$PC= 4
##$PHC0= -4461.271
##$PHC1= 217.4011
##$PH_mod= 1
##$PKNL= yes
##$PPARMOD= 0
##$PSCAL= 0
##$PSIGN= 0
##$REVERSE= no
##$SF= 81.014009
##$SI= 65536
##$SIGF1= 159.3651
##$SIGF2= -187.1042
##$SINO= 113.3802
##$SIOLD= 16384
##$SREGLST= <1H.CDCl3>
##$SSB= 0
##$STSI= 65536
##$STSR= 0
##$SW_p= 40650.406504065
##$SYMM= 0
##$S_DEV= 0
##$TDeff= 32768
##$TDoff= 0
##$TI= <>
##$TILT= no
##$TM1= 0
##$TM2= 0
##$TOPLEV= 0
##$USERP1= <user>
##$USERP2= <user>
##$USERP3= <user>
##$USERP4= <user>
##$USERP5= <user>
##$WDW= 1
##$XDIM= 65536
##$YMAX_p= 269997588
##$YMIN_p= -5520587
$$ End of Bruker specific parameters
$$ ---------------------------------
##NTUPLES= NMR SPECTRUM
##VAR_NAME=  FREQUENCY,     SPECTRUM/REAL,   SPECTRUM/IMAG
##SYMBOL=    X,             R,               I
##VAR_TYPE=  INDEPENDENT,   DEPENDENT,       DEPENDENT
##VAR_FORM=  AFFN,          ASDF,            ASDF
##VAR_DIM=   65536,         65536,           65536
##UNITS=     HZ,            ARBITRARY UNITS, ARBITRARY UNITS
##FACTOR=    0.620285442955139, 1,           1
##FIRST=     20137.2065510759, 0,            0
##LAST=      -20513.1999529892, 0,           0
##MIN=       -20513.1999529892, -5520587,    0
##MAX=       20137.2065510759, 269997588,    0
$$ Real data points
##PAGE= N=1
##DATA TABLE= (X++(R..R)), XYDATA
$$ [...]
38331h63220o51618J52367J215217J038521m76215j404181m20716J198766J388648
$$ -863220 -1514838 -1362471 -147254 891267 415052 -989129 -1409845 -211079 1177569
38322A177569J35485q52753o62154O0118M94461M67280M6914m92890m50088M45431
$$ 1177569 1313054 460301 -201853 -141735 352726 820006 866920 374030 -76058 369373
38312C69373J165643O01393n88469p99250m3355O7197q25888r52161O77485K246543
$$ 369373 1535016 2136409 1547940 748690 705335 772532 -53356 -1005517 -328032 1918511
38302A918511J556160p15607j957701j221702o4839J19018j41109J70055P61355
$$ 1918511 3474671 2759064 801363 -420339 -485178 -366160 -507269 -337214 424141
38293D24141O91234K3182l16097r4103j05318p18698j028357j56852J173166J390107
$$ 424141 1115375 1138557 822460 728357 623039 -95659 -1124016 -1280868 -107702 1282405
38283A282405K86727o40394l78502K30211P6673l44206L9508P42124L59481q76976
$$ 1282405 1569132 928738 550236 780447 857120 512914 552422 1294546 1654027 777051
38273G77051j119830J54121J123953M34808p07200o04796K35228K58561l47322
$$ 777051 -342779 -188658 935295 1370103 662903 58107 293335 551896 204574
38264B04574j32347Q58210J034979K8089o40415j46480L56968r2001o34537l29779
$$ 204574 72227 930437 1965416 1993505 1353090 1206610 1563578 1471577 837040 507261
38254E07261P6612l63175q72199k79784P40852P40652P2522K16408R41108N99709
$$ 507261 583873 220698 -651501 -931285 -190433 550219 622741 839149 1780257 2379966
38244B379966o77498p67472P47126J373081l21130k007093j099423J002969J015550
$$ 2379966 1702468 934996 1682122 3055203 2734073 726980 -372443 630526 1646076
38235A646076j079256k138038q22008O73749M05540n81915m86745M84581J057603
$$ 1646076 566820 -1571218 -2393226 -1719477 -1313937 -1895852 -2382597 -1898016 -840413
38226h40413R63055O13172p696p58385p76562J47224O75055j74565j188506o20534
$$ -840413 122642 735814 728118 -30267 -806829 -659605 15450 -159115 -1347621 -1968155
38216a968155J059242J812167R87009j23931n27870n94935p09149m78313J85897
$$ -1968155 -908913 903254 1890263 1766332 1238462 643527 -65622 -543935 -358038
38207c58038N00752J3560n72679m30854K36812O56721N38195J37639l01615o62641
$$ -358038 142714 156274 -416405 -847259 -610447 46274 584469 722108 420493 -242148
38197b42148p63620m83091N979L83552N34636O08653P09913O29618Q1222p08730
$$ -242148 -1005768 -1488859 -1482880 -1099328 -564692 43961 753874 1383492 1464714 755984
38187G55984r88432m68327L2925l18806q93956l41388J158936J777275O30269
$$ 755984 -232448 -700775 -667850 -986656 -1880612 -2222000 -1063064 714211 1344480
38178A344480r10697j286930p55455k92763J23827P52303Q40678j54591j056636
$$ 1344480 433783 -853147 -1608602 -1901365 -1777538 -1025235 -184557 -339148 -1395784
38169a395784n03205P30224Q34808j79050p40224m35534l27006o48123l60473
$$ -1395784 -1898989 -1168765 -333957 -513007 -1253231 -1688765 -2015771 -2663894 -3024367
38160c024367P15946J313423P54166q9912l37745j30510K07961O43326Q55703
$$ -3024367 -2308421 -994998 -240832 -330744 -668489 -798999 -591038 52288 907991
38151I07991N30844J93491L39039J21301j249107k317418j078994J364893J784546
$$ 907991 1438835 1632326 1971365 2092666 843559 -1473859 -2552853 -1187960 596586
38142E96586k86216j793636j017053J46327R488j74224P70133J344027K68538
$$ 596586 310370 -1483266 -2500319 -2353992 -2344504 -2518728 -1748595 -404568 -136030
38133a36030p52967P4987J326079Q43059n18434p10359k21946o80512j266360
$$ -136030 -888997 -814010 512069 1355128 836694 126335 -95611 -776123 -2042483
38124b042483j18415J740441J605841l00992j078540P8668Q77716N9705p71196
$$ -2042483 -2160898 -420457 1185384 884392 -194148 -115480 762236 821941 50745
38115E0745k24381Q38191J254304J106596N30076p23313j833643j331760L14146
$$ 50745 -173636 664555 1918859 3025455 3555531 2832218 998575 -333185 -19039
38106a9039Q48752k74441r76152q4635P54270P9223q81164n26900L09346j1749
$$ -19039 829713 555272 -420880 -505515 248755 327978 -553186 -1080086 -770740 -782489
38096g82489r95823q82799M63066J512452J418909P59972K23829q8012j92523
$$ -782489 -1778312 -2661111 -2198045 -685593 733316 1493288 1717117 1629105 1436582
38087A436582j05089j02459m01926p56312q24235o04684k00465L30953O58050
$$ 1436582 1331493 1229034 827108 70796 -753439 -1358123 -1558588 -1227635 -569585
38078e69585L86319k00489l94165j89349j89248l07358J61696R69622R48786O4419
$$ -569585 -183266 -383755 -777920 -967269 -1156517 -1463875 -1302179 -332557 616229 680648
38068F80648k71422L51648M56880o45157j265948j19493J087176J30907j940850
$$ 680648 409226 760874 1217754 572597 -693351 -812844 274332 405239 -1535611
38059a535611k184456l17135R45515K65887l81750Q26280K485776K127397M5277
$$ -1535611 -3720067 -4037202 -3091687 -2825800 -3207550 -2381270 104506 2231903 2277180
38050B277180j096890p6787J338041J055311n34130j411337q27270j710M7191
$$ 2277180 1180290 1103503 2441544 3496855 2962725 1551388 724118 722408 769599
38041G69599n8918M62877Q52206J7529j230962j018476N49121J164844k27894
$$ 769599 710681 1173558 2025764 2043293 812331 -206145 342976 1507820 1279926
38032A279926j650907r87327Q88922J550380N28193m93854m69455q4070q8766
$$ 1279926 -370981 -1358308 -469386 1080994 1609187 1115333 645878 561808 473042
38023D73042k40999k54793m25907p83822o91326J41195J043733J268999Q29449
$$ 473042 232043 -22750 -448657 -1232479 -1923805 -1782610 -738877 530122 1359571
38014A359571J20056n67255p99926j14372J050898J306004J4997j513370j513536
$$ 1359571 1479627 912372 112446 -1926 1048972 2354976 2369973 856603 -656933
38005f56933j20117Q56172M78890j92105N4471P47683O65363j70866o41955l53297
$$ -656933 -777050 79122 558012 365907 420378 1168061 1833424 1662558 1020603 667306
37995F67306l7619r8233k3221L72596L27123n50261j342475j094809k56375P0758
$$ 667306 629687 531454 508233 880829 1207952 657691 -684784 -1779593 -2035968 -1965210
37985a965210k87593o45973n68535o4409P54492J391122J054381m8372l92870
$$ -1965210 -2252803 -2898776 -3467311 -3531720 -2777228 -1386106 -331725 -380097 -772967
37976g72967P22711J699354Q21615j002122j568649p17797j60962m36260m38221
$$ -772967 -50256 1649098 2470713 1468591 -100058 -817855 -978817 -1415077 -1853298
37967a853298J41758L89369K96821P79919J317231L33853j542214j634986L96551
$$ -1853298 -1711540 -1322171 -1025350 -245431 1071800 1405653 -136561 -1771547 -1374996
37958a374996J497042M9852j415280m86657J184770R81831k65721k43043N65508
$$ -1374996 122046 171898 -1243382 -1730039 -545269 436562 170841 -72202 493306
37949D93306J53404r60502p20050L99506J29237j247551j128060P49941J638721
$$ 493306 646710 -313792 -1033842 -634336 -505099 -1752650 -2880710 -2130769 -492048
37940d92048M03457p02604K9512J243058J328406Q90695P50720N9338j632940
$$ -492048 -88591 -791195 -761683 481375 1809781 2700476 3451196 3510534 1877594
37931A877594k579754j275324R12202J602501O55818l23007o20684o42708l94066
$$ 1877594 -702160 -1977484 -1065282 537219 1193037 870030 249346 -393362 -787428
37922g87428L18304P29314Q923j011431p44897O40025J295613M31304o08917n03967
$$ -787428 -469124 260190 269113 -742318 -1487215 -847190 448423 879727 270810 -233157
37912b33157J68079R7163o22242o82302L30493J120229M59388q94636j037112
$$ -233157 -65078 32085 -590157 -1272459 -941966 178263 637651 -256985 -1294097
37903a294097L59559J325420L04331j416769j355703N81985J897077J040102n74217
$$ -1294097 -934538 390882 695213 -721556 -2077259 -1495274 401803 1441905 867688
37894H67688q63958P5677O36713K09930l62913l92638j34321k2945m1680L0245
$$ 867688 3730 79407 716120 926050 563137 170499 36178 13233 -28447 1798
37884A798K75930N67405N61306k530p72197r88439m93499M7622K57281N57764
$$ 1798 277728 845133 1406439 1403909 631712 -356727 -850226 -802604 -545323 12441
37874A2441J022580P22855p59598k032703j509201J91529J001839L41140l77377
$$ 12441 1035021 1757876 998278 -1034425 -2543626 -2352097 -1350258 -1009118 -1386495
37865a386495k62800j48401o73808r00270J8221J140481J137725M10189K55238
$$ -1386495 -1649295 -1797696 -2471504 -3371774 -3353553 -2213072 -1075347 -665158 -409920
37856d09920O19689M04556l51407m74279Q9099m9587j223667j737500m51279J229688
$$ -409920 209769 614325 262918 -211361 -122262 -171849 -1395516 -3133016 -3584295 -2354607
37846b354607J395421M44459J32706O37452N34305n77743j392140j069122l72267
$$ -2354607 -959186 -514727 -382021 255431 789736 211993 -1180147 -2249269 -2621536
37837b621536j07161P7632N92096Q85096M50818j04955L4035N98323P09880J80597
$$ -2621536 -2728697 -2651065 -2058969 -1173873 -723055 -828010 -793975 -195652 514228 694825
37827F94825m08393n85034l69096m5600P3690n9333m9175L95715P93173M96865
$$ 694825 286432 -298602 -667698 -713298 -639608 -698941 -748116 -352401 440772 937637
37817I37637j11817r2935L69374J08335r18919j223038j40159R48967P19339k11938
$$ 937637 825820 732885 1102259 1210594 291675 -931363 -1071522 -122555 596784 384846
37807C84846o32221n91108n97595k75126O38156J095972K44647q46299p12007
$$ 384846 -247375 -838483 -1436078 -1711204 -1073048 22924 267571 -578728 -1290735
37798a290735R7972R021q68163j009422n3364Q30947R56592P19152L31421l43831
$$ -1290735 -1192763 -1183742 -2051905 -3061327 -3114691 -2283744 -1327152 -608000 -276579 -620410
37788f20410q07426l95209L60961L64426k46432m33217p2492J42453J87673L94702
$$ -620410 -1427836 -1823045 -1462084 -1097658 -1344090 -1777307 -1849799 -1707346 -1519673 -1124971
37778a124971J95732q88926j617408o22644R31578Q86490j82491J75523J830228
$$ -1124971 -929239 -1818165 -3435573 -4058217 -3126639 -2240149 -2422640 -2247117 -416889
37769d16889J970941k4842j277810j87423R85318J43176j248690j092574j78634
$$ -416889 1554052 1529210 251400 63977 1049295 1192471 -56219 -1148793 -1327427
37760a327427j38081k66510P01665J557341M43539j612158k018954o34807L64935
$$ -1327427 -1465508 -1732018 -1030353 526988 970527 -641631 -2660585 -3295392 -2930457
37751b930457R8329k14943J52159M84299L78775L88273O82707P25442M15681J68930
$$ -2930457 -2832128 -3047071 -2894912 -2410613 -2031838 -1643565 -960858 -235416 180265 349195
37741C49195o7979n79075q98644m08244L81353N04250J58429K48953O72184N58572
$$ 349195 281216 -297859 -1196503 -1604747 -1223394 -719144 -560715 -311762 360422 918994
37731I18994l6358k06315J90300M24541K67842R7730j60678p75515j117008l70339
$$ 918994 882636 676321 866621 1291162 1559004 1656734 1496056 720541 -396467 -766806
37721g66806P86582Q25165l06183j105371q70548m65969m49348j37175Q30535
$$ -766806 19776 844941 538758 -566613 -1437161 -1903130 -2352478 -2489653 -1659118
37712a659118J490090J010180M2352k83497P7457L44026J85877P974K01511O03491
$$ -1659118 -169028 841152 883504 600007 677464 1021490 1207367 1215341 1416852 2020343
37702B020343O84827J56978o05718r38761p50663n59378m99063m4138Q48602J255606
$$ 2020343 2705170 2862148 2256430 1317669 567006 7628 -491435 -535573 313029 1568635
37692A568635O93840N6444J39259K09709o31418j541259j045231N06840J344674
$$ 1568635 2262475 2318919 2458178 2667887 2036469 495210 -550021 -43181 1301493
37683A301493Q53608N9475k83666l87880k80015L10170Q24719L28622p55968j037716
$$ 1301493 2155101 2214576 1930910 1543030 1263015 1573185 2397904 2726526 1970558 932842
37673I32842m42687l14666r35823r12714L10656J226640N44029r03929j596460
$$ 932842 490155 175489 -760334 -1673048 -1362392 -135752 408277 -495652 -2092112
37664b092112j278194m42010P64629J936879J971023N65246q25957q31937p6381
$$ -2092112 -3370306 -3812316 -3047687 -1110808 860215 1425461 599504 -232433 -308814
37655c08814N3566l26446j14708N83967N09681n78096j334522p70262M44965J116197
$$ -308814 -255248 -581694 -696402 -112435 397246 -180850 -1515372 -2285634 -1840669 -724472
37645g24472J033504P19028L32381l46051j050373r81884N4494R99365O64683
$$ -724472 309032 1028060 1360441 1014390 -35983 -1017867 -963373 35992 700675
37636G00675o28842j285519m95268P09677R45710K88313j96528j33792q533J0386
$$ 700675 71833 -1213686 -1708954 -999277 -53567 234746 38218 -95574 -104107 -93721
37626i3721K53631N82651L34304n44751j189827r31760o3075O89708Q92578N28496
$$ -93721 159910 742561 1076865 532114 -657713 -1589473 -1652548 -962840 -70262 458234
37616D58234o0724l28859o2350L47471M96132M15881P5734p66772j591250j100279
$$ 458234 397510 68651 6301 353772 849904 1265785 1341519 574747 -1016503 -2116782
37606b116782P55632J954494J098601l28076l53340J51607p82148k185318j321988
$$ -2116782 -1361150 593344 1691945 1363869 1010529 1162136 379988 -1805330 -3127318
37597c127318J386368K451023Q72532l31888N58090J113816n89139k199700j076984
$$ -3127318 -1740950 710073 1582605 1250717 1808807 2922623 2333484 133784 -943200
37588i43200J026121R41119n98155o35043O55602N85121r01299j060476O06396
$$ -943200 82921 1024040 425885 -209158 446444 1031565 130266 -930210 -323814
37579c23814J294714k82146j718213r79069N28757P61215K74530N43024J076749
$$ -323814 970900 688754 -1029459 -2008528 -1479771 -718556 -444026 98998 1175747
37570A175747N34302o12542p70052J15472N42071j50479r71064r19386k13482
$$ 1175747 1710049 1097507 327455 442927 984998 834519 -136545 -1055931 -1269413
37561a269413L63740N10042M75652N19322N58610L26495j40873l58559k8976L93940
$$ -1269413 -905673 -395631 80021 599343 1157953 1484448 1343575 985016 956040 1349980
37551A349980K99941j19618k28909r2019k97820o75342l85704M54314N81036l53445
$$ 1349980 1649921 1530303 1301394 1209375 911555 236213 -149491 304823 885859 532414
37541E32414q54753K14712J622148J386682k93063j359161q71198K5459K74833
$$ 532414 -322339 -107627 1514521 2901203 2608140 1248979 377781 403240 678073
37532F78073L55257Q25772R11027j81118j482665j355369K5926Q60658M52613
$$ 678073 1033330 1859102 2770129 2589011 1106346 -249023 -223097 637561 1090174
37523A090174J23884Q03027J272167J20432j668977j883873m18772N11820k21751
$$ 1090174 1214058 2017085 3289252 3409684 1740707 -143166 -561938 -50118 -271869
37514b71869r53215N0430J665998J420411p58431k158745q89670J605298K465037
$$ -271869 -1225084 -1174654 491344 1911755 1153324 -1005421 -1895091 -289793 2175244
37505B175244R66946r33734j392356q29677p50528j254009r67638N65924J838191
$$ 2175244 3142190 2208456 816100 -13577 -764105 -2018114 -2985752 -2419828 -581637
37496e81637J481107K94410j04855J70403j99155j079956q75917N48574J147829
$$ -581637 899470 1193880 1089025 1259428 1060273 -19683 -895600 -347026 800803
37487H00803j16998j358410n87677J131489J330229j11113j032826l75693O33736
$$ 800803 683805 -674605 -1262282 -130793 1199436 1088323 55497 -320196 313540
37478C13540P66191L81549K51698K72191K6062l92233p03022q54966p45121k18719
$$ 313540 1079731 1461280 1712978 1985169 2011231 1618998 915976 61010 -684111 -902830
37468i02830L83731L85672k38758o85887m03793K36104O10886O45446O28367O26237
$$ -902830 -519099 -133427 -372185 -1058072 -1461865 -1225761 -614875 30571 658938 1285175
37458A285175L99530k25432j001436j314508q33900q7691J53837R9803O01208
$$ 1285175 1684705 1459273 457837 -856671 -1690571 -1778262 -1624425 -1524622 -923414
37449i23414J348641Q40458r86907j734483J66603K518808K084431o00935j973235
$$ -923414 425227 1265685 278778 -1455705 -1289102 1229706 3314137 2713202 739967
37440G39967q01026L54700l03480j008136J23419J568015Q54943j259163j891236
$$ 739967 -61059 293641 -9839 -1017975 -894556 673459 1528402 269239 -1621997
37431a621997m13026R69774Q03457R7001J11428N22802N50170L40779L06060J88410
$$ -1621997 -2035023 -1065249 -261792 -164791 -53363 469439 1019609 1360388 1666448 1854858
37421A854858l00520o88577m32844J19429K00653k75577o97303o13987j02123
$$ 1854858 1554338 865761 432917 552346 752999 477422 -219881 -833868 -935991
37412i35991N38802R70035Q38961J29469n64117o19524k60056k90006q36489j029557
$$ -935991 -397189 572846 1411807 1541276 977159 357635 97579 -192427 -1028916 -2058473
37402b058473l25911N32693N99235J97173K88009P15344M45869l90317l07331
$$ -2058473 -2384384 -1851691 -1252456 -1055283 -767274 -51930 393939 3622 -303709
37393c03709J049195J788511L98163j727700k031367l57916J003055O18493m79638
$$ -303709 745486 2533997 2932160 1204460 -826907 -1184823 -181768 436725 -42913
37384d2913p01266P7681R05346J073486N26070k98029p08967m35272p7607k74052
$$ -42913 -744179 -666498 238848 1312334 1838404 1540375 831408 396136 318529 44477
37374D4477o48346m30826K04436M80381L41303K07879j64092j057417j451429
$$ 44477 -603869 -1034695 -830259 -349878 -8575 199304 35212 -1022205 -2473634
37365b473634k32789J468226J412303j91128q04371K93578Q15112n07745j608870
$$ -2473634 -2706423 -1238197 174106 -17022 -821393 -527815 287297 -220448 -1829318
37356a829318n94628J069656J205203M97557P12800J185922J80493j503662j520890
$$ -1829318 -2423946 -1354290 -149087 348470 1061270 2247192 2427685 924023 -596867
37347e96867N0301Q23943l153p73552m75243j0560k6047K8711K14022k00938q48754
$$ -596867 -546566 277377 274224 -499328 -974571 -985131 -1011178 -982467 -768445 -969383 -1818137
37336a818137l44077J148563J662462M83473o95831n13952K60739N76807O37046
$$ -1818137 -2162214 -1013651 648811 1132284 436453 -77499 183240 760047 1397093
37327A397093N57665l40613j630853j365874P95865K117060M68786k247779k673046
$$ 1397093 1954758 1614145 -16708 -1382582 -586717 1530343 1999129 -248650 -2921696
37318b921696o55007J106382J177577O19051M67119M05227J22003J6331J41395
$$ -2921696 -3576703 -2470321 -1292744 -673693 -206574 198653 320656 336987 478382
37309D78382m3779n25226n95278j20494J70827j09797n00394n41152k88819Q0018
$$ 478382 434603 -90623 -685901 -806395 -635568 -745365 -1245759 -1786911 -2075730 -1995712
37299a995712M20902M55120J67408J16656N98129R45146N71266J05227L20183
$$ -1995712 -1574810 -1119690 -952282 -835626 -237497 707649 1278915 1384142 1704325
37290A704325N93767n7128r80356p76815J62853J52027p77460p54616N60356J011938
$$ 1704325 2298092 2240964 1260608 483793 646646 798673 21213 -733403 -173047 838891
37280H38891n21378j996070j316887L92220P79724L5982J67957J339938J587785
$$ 838891 317513 -1678557 -2995444 -2603224 -1823500 -1787518 -1619561 -279623 1308162
37271A308162J57308j248964j119277j29894L44019K33537K58445M43477K72601
$$ 1308162 1465470 216506 -902771 -1032665 -688646 -455109 -196664 246813 519414
37262E19414k07497l98636q6717L14753M11363K27185p2252m64797q92880j020713
$$ 519414 311917 -86719 -173436 141317 552680 779865 707613 242816 -650064 -1670777
37252a670777n19615L29592P05918K94611r1083L63694R87005M02736j090301
$$ -1670777 -2190392 -1860800 -1154882 -860271 -951354 -587660 399345 802081 -288220
37243b88220j429296J52340J515510N69823j371388j309232R32930K363655J223933
$$ -288220 -1717516 -1565176 -49666 520157 -851231 -2160463 -1227533 1136122 2360055
37234B360055o56440q83620J56968N37904r2979n06171k29961l9991k73108k48615
$$ 2360055 1703615 819995 976963 1514867 1421888 915717 685756 645765 372657 124042
37224A24042L59578P85957L19190n80950q58771j95265O58462Q29229L62961Q2268
$$ 124042 483620 1269577 1588767 1007817 149046 -46219 612243 1441472 1804433 1886701
37214A886701L30558L29103n86674j485335q12877J068242J835984M27182j180621
$$ 1886701 2217259 2546362 1959688 474353 -338524 729718 2565702 2992884 1812263
37205A812263p08730J087497J565448r915j725532j909717r59009o8936K90251
$$ 1812263 1103533 2191030 3756478 3746563 2021031 111314 -847695 -916631 -626380
37196f26380K19708j8447Q4521O79362Q12995l59980j648317r61237J283428K079892
$$ -626380 -406672 -425119 -340598 338764 1151759 791779 -856538 -1817775 -534347 1545545
37186A545545J58462j807261j019600J293178J863424K48111j000289n51830P7718
$$ 1545545 1704007 -103254 -1122854 170324 2033748 2281859 1281570 729740 807458
37177H07458m94711j317323r16288L86611J173781Q90390R8884m81098m13908
$$ 807458 312747 -1004576 -1920864 -1534253 -360472 529918 628802 147704 -266204
37168b66204L30087J063085Q02974m38903j411188j188994l34820Q3793k5428
$$ -266204 63883 1126968 1929942 1491039 79851 -1109143 -1443963 -1360170 -1385598
37159a385598l670L68516O84113O37799L32211O0813J57247O77104R26031p719
$$ -1385598 -1389268 -1020752 -336639 301160 633371 694184 851431 1528535 2454566 2446847
37149B446847j712071k284343o59577J575272J947588K98388j179038j013297
$$ 2446847 734776 -1549567 -2209144 -633872 1313716 1612104 433066 -580231
37141e80231n4620L25474J48087J15915J38545k91706q80285p93172Q3498R89299
$$ -580231 -634851 -309377 -161290 -45375 93170 -198536 -1078821 -1871993 -1788495 -799196
37131g99196J289791R88453L76024k27778m83721l25722j52765k80844m23040
$$ -799196 490595 1479048 1855072 1627294 1143573 817851 665086 384242 -38798
37122c8798k31669k7224k37026l83417L39835J481026J502250l3567j516286j314136
$$ -38798 -270467 -297691 -534717 -918134 -578299 902727 2404977 2371410 855124 -459012
37112d59012M2602O87599m0084r61328q67444M6652P90669Q23171K78911m67504
$$ -459012 -416410 271189 231105 -730223 -1597667 -1551015 -760346 62825 341736 -125768
37102a25768r50734o91317K97250J184644J042529p522p98744n20329K46959L32797
$$ -125768 -1076502 -1767819 -1470569 -285925 756604 749082 -49662 -569991 -323032 9765
37092I765m07449r26541n02975L00700N97332M22976L27209K49826k14075p11550
$$ 9765 -397684 -1324225 -1827200 -1526500 -929168 -506192 -178983 70843 -143232 -854782
37082h54782m66983K51039K50581o55866j111056k64672Q35253Q91103L49008
$$ -854782 -1321765 -1070726 -820145 -1476011 -2587067 -2851739 -2016486 -1125383 -776375
37073g76375M33649R47358O04557p05078j528609r00490M40605J194077R15711
$$ -776375 -342726 604632 1209189 504111 -1024498 -1924988 -1484383 -290306 625405
37064F25405M6277o63601n86581J79437O08215o4412j054960r48212J97102R25365
$$ 625405 671682 8081 -578500 -399063 209152 144740 -910220 -1858432 -1661330 -735965
37054g35965O36176K85395M89666N33647m493k10854M74983R28565J10357r89073
$$ -735965 -99789 185606 675272 1208919 1204426 993572 1468555 2397120 2507477 1518404
37044A518404q35706P5354K0543j027488j289246q0100J073394P90922k60269
$$ 1518404 682698 758052 778595 -248893 -1538139 -1618239 -544845 246077 -14192
37035a4192o87906l76114j04055l585M29436J151880J450843R88925J87985n19341
$$ -14192 -702098 -1078212 -1182267 -1185852 -756416 395464 1846307 2835232 3023217 2503876
37025B503876j140824j610652j475856o04532K28469J89232l27914j23351R36969
$$ 2503876 1363052 -247600 -1723456 -2327988 -2099519 -1910287 -2238201 -2361552 -1424583
37016a424583J476681O50184l66305q1713Q54984N56183r92241j660641m20452
$$ -1424583 52098 702282 335977 254264 1109248 1665431 673190 -987451 -1407903
37007a407903J061422J047502K33143J88695O98237M75826l73864n93655o6797
$$ -1407903 -346481 701021 934164 1122859 1821096 2296922 1923058 1329403 1262606
36998A262606M6804n38882p03823J40712J048984R62338J7816r75614j444369
$$ 1262606 1309410 770528 66705 207417 1256401 2218739 2236555 1260941 -183428
36989a83428j160763l23078K84882N0978m92960l44192M21102Q70189Q57024J040444
$$ -183428 -1344191 -1667269 -1382387 -1331409 -1824369 -2168561 -1747459 -877270 -20246 1020198
36979A020198J228248L92820j236239j851036o84763O54633O10183k4370K93772
$$ 1020198 2248446 2641266 1405027 -446009 -1130772 -476139 134044 109674 403446
36970D03446J143149Q62404o14589j505799p65481N96731J098545N56440j61183
$$ 403446 1546595 2408999 1794410 288611 -476870 119861 1218406 1774846 1613663
36961A613663l74846j44506J774l65072j062829j375165q86429o1591L52237K80640
$$ 1613663 1238817 1094311 1096085 731013 -331816 -1706981 -2593410 -2655001 -2302764 -2022124
36951b022124K33843M45177O13616M68145J42529p7929j04649q7728k20435m49020
$$ -2022124 -1788281 -1343104 -729488 -261343 -118814 -196743 -301392 -389120 -609555 -1058575
36941a058575m00724J40061P19543O55931P1792j42064L45809P14580K17088o41524
$$ -1058575 -1459299 -1319238 -599695 56236 128028 -14036 331773 1046353 1263441 621917
36931F21917q41745k97857J99653J93506n3629k26384k94637k36646m7790K0521
$$ 621917 -219828 -517685 -318032 -124526 -178155 -404539 -699176 -935822 -983612 -963091
36921i63091j73159j41589O48302J619300J382922l61729j940913j517096N03510
$$ -963091 -1136250 -1277839 -629537 989763 2372685 2010956 70043 -1447053 -943543
36912i43543J776242Q76873r95160j727840r89706j74576j3810K85162J187695
$$ -943543 832699 1709572 714412 -1013428 -2003134 -2177710 -2191520 -1906358 -718663
36903g18663J644661P77514m47683o24694j07299j97546p95664p37531j20010
$$ -718663 925998 1703512 1255829 631135 523836 326290 -469374 -1206905 -1326915
36894a326915j89035q83505o95683O20783J424188R66042N44508Q52036M98827
$$ -1326915 -1515950 -2399455 -3095138 -2474355 -1050167 -84125 460383 1312419 1811246
36885A811246j270126k549338j504538O00142J320318N73526j8010q8465l45721
$$ 1811246 541120 -2008218 -3512756 -2912614 -1592296 -1018770 -1036780 -1125245 -1470966
36876a470966l90478O18975J699215J112884n48377r63364K63326J120134N51344
$$ -1470966 -1861444 -1242469 456746 1569630 1021253 57889 321215 1441349 1992693
36867A992693k46605l18433k61695m00165k5938P04447M05854r96947j557113
$$ 1992693 1746088 1427655 1165960 765795 739857 1444304 1850158 853211 -703902
36858g03902l13773J061810R60932J94976J35162L65721l0905m79060j53483J34751
$$ -703902 -1017675 44135 1005067 1200043 1335205 1700926 1670021 1190961 1037478 1172229
36848A172229o53250j577327j058136L63040P85342R222l41586L34964P62943
$$ 1172229 518979 -1058348 -2116484 -1753444 -968102 -958880 -1300466 -965502 -202559
36839b02559J30329n56967k07179O48466Q02908J63720l16893j12992K45600Q0476
$$ -202559 -72230 -629197 -836376 -187910 614998 778718 461825 348833 594433 674909
36829F74909l61039j88017P21740J196403L29992q80888o57135Q56815J520004
$$ 674909 313870 125853 847593 2043996 2373988 1493100 835965 1692780 3212784
36820C212784K96009j158652j000057J38794M23046l18779o94037j12846N95743
$$ 3212784 3508793 2350141 1350084 1488878 1911924 1593145 899108 786262 1382005
36811A382005P11150L46347k61500r48054j176916n39119L39622M36647j73229
$$ 1382005 2093155 2439502 2178002 1229948 53032 -486087 -146465 290182 116953
36802A16953m60662k7289M30682K56165m14880r98025q72365K70736J739044K004175
$$ 116953 -343709 -370998 59684 315849 -99031 -1097056 -1969421 -1698685 40359 2044534
36792B044534N65649q98754n41544R60483J306730n4371j269705j008634k23110
$$ 2044534 2610183 1711429 1169885 2130368 3437098 3382727 2113022 1104388 881278
36783H81278k81490q64995p52448K90644J368727J613555Q51128l78802j084904
$$ 881278 599788 -265207 -1017655 -727011 641716 2255271 3106399 2727597 1642693
36774A642693o82509J61756K27494n48850r40931k81177N62493N73521L3081j24784
$$ 1642693 960184 1121940 1349434 800584 -140347 -421524 140969 714490 747571 622787
36764F22787K71453N88667L62776k38151o81845n31848Q4841M41233P3183m57573
$$ 622787 894240 1482907 1845683 1607532 925687 393839 478680 919913 993096 535523
36754E35523l34321J86620J99461k17582p2865O84563Q20779j72498j123722j003830
$$ 535523 201202 387822 587283 369701 296836 981399 1802178 1629680 505958 -497872
36744d97872m09747k76422l17782P0091L98720l1760o21621l31082M49387M16957
$$ -497872 -907619 -1184041 -1501823 -1431732 -1033012 -1064772 -1686393 -2017475 -1568088 -1151131
36734a151131m58192p78441R6181J053292Q93663l1483n08924j52436L11030K32419
$$ -1151131 -1609323 -2387764 -2291583 -1238291 -344628 -376111 -885035 -1037471 -726441 -494022
36724d94022r9874k0406L91084L01550n44124j099609l83772Q42943R41820j34914
$$ -494022 -593896 -614302 -223218 78332 -465792 -1565401 -1949173 -1106230 -164410 -299324
36714b99324o86438O6439P41310R3674r49567q77950L0298N24886N69454Q80719
$$ -299324 -985762 -919323 -178013 -84339 -1033906 -1911856 -1881558 -1356672 -787218 93501
36704I3501J035945J18266j134452j038113J88203N48100m17341q08178L07830
$$ 93501 1129446 1247712 113260 -924853 -736650 -188550 -605891 -1414069 -1106239
36695a106239J114246P4221j333005r74738L73542L25453j088227j398058K76612
$$ -1106239 8007 82228 -1250777 -2225515 -1851973 -1526520 -2614747 -4012805 -3736193
36686c736193J744987J104003n05415q43552J92032Q78087L97394l51373m52568
$$ -3736193 -1991206 -887203 -1392618 -2236170 -2044138 -1166051 -768657 -1120030 -1572598
36677a572598j07979J04177Q4128j2962j54613k54487r9086L08892O89806Q55131
$$ -1572598 -1680577 -1576400 -1492272 -1505234 -1659847 -1914334 -2013420 -1704528 -1014722 -159591
36667a59591P71987L36129l76141p37519k38791M58695J41810j033716j393454
$$ -159591 612396 948525 572384 -165135 -403926 54769 196579 -837137 -2230591
36658b230591j03440J478813J724575R18157L12912J5650n76827r85814k85835
$$ -2230591 -2334031 -855218 869357 1787514 2100426 2116076 1539249 553435 267600
36649B67600P54292L26938j389102k020326n39134J027138O55001o35809m73250
$$ 267600 1021892 1348830 -40272 -2060598 -2599732 -1572594 -917593 -1553402 -2026652
36640b026652J285402K477445J666288k71412j515733j210310n931O76505Q4448
$$ -2026652 -741250 1736195 3402483 3131071 1615338 405028 399097 1075602 1160050
36631A160050q94978p78365L17680O48948m66867j377487n91071Q51796J050210
$$ 1160050 265072 -513293 -195613 453335 -13532 -1391019 -1982090 -1130294 -80084
36622h0084J51351k64955J00575K08242r8009J03469Q24844R36431J36711n81667
$$ -80084 71267 -193688 -93113 115129 17120 120589 945433 1881864 2018575 1436908
36612A436908p19462q78629j225694r61832J39184J099736J221262R35513O93227
$$ 1436908 717446 -161183 -1386877 -2348709 -2209525 -1109789 111473 1046986 1740213
36603A740213K75020k92263m00031O783J45083k41960m13910k373L67848K89031
$$ 1740213 2015233 1722970 1322939 1329722 1474805 1232845 818935 816562 1184410 1473441
36593A473441J24443p2982p43230j424950q59569P52190J382163J50119j092048
$$ 1473441 1597884 1524902 781672 -643278 -1502847 -750657 631506 781625 -310423
36584c10423n63460P06980P00417m15152r35174m43383Q8048L53654Q13028J121782
$$ -310423 -873883 -166903 533514 118362 -816812 -1260195 -1172147 -818493 -5465 1116317
36574A116317M73646n90042n85513N75644J329768P80195k49471q05880j026304
$$ 1116317 1589963 999921 414408 990052 2319820 3100015 2850544 2044664 1018360
36565A018360j263271j185579m22652O39775J218198R02035k4413o94603l73544
$$ 1018360 -244911 -1430490 -1853142 -1213367 4831 906866 882453 187850 -185694
36556a85694M97979N67834m59557j020771L5724J376195J042823m13679q03537
$$ -185694 312285 880119 420562 -600209 -564485 811710 1854533 1440854 637317
36547F37317R6402K95921q43335j388491j06424J345248R63382o01855j236265
$$ 637317 733719 1029640 186305 -1202186 -1308610 36638 1000020 398165 -838100
36538h38100l60501P95820J114278N02159m92738j004331m31940N76507O08933
$$ -838100 -1198601 -402781 711497 1213656 720918 -283413 -715353 -138846 470087
36529D70087l91299p37724L61348J258450L58195j232878j387125k23770M06730
$$ 470087 78788 -658936 -297588 960862 1319057 86179 -1300946 -1524716 -1117986
36520a117986K1685j59728K87544M38693J08751L25475J201346J326375J05631
$$ -1117986 -1096301 -1256029 -968485 -529792 -421041 -95566 1105780 2432155 2537786
36511B537786j044129q76771k07236l83803j044740q01547N35388J708239J685271
$$ 2537786 1493657 616886 409650 25847 -1018893 -1820440 -1285052 423187 2108458
36502B108458O30805n74382j066120n11408M93788Q00349j3183j037360j135130
$$ 2108458 2739263 2164881 1098761 587353 1081141 1881490 1868307 830947 -304183
36493c04183k53983P81872J295160J071180J80302q82435j300193q01991q3068
$$ -304183 -558166 223706 1518866 2590046 2770348 1887913 587720 -214271 -297339
36484b97339J47820O3623J08698J11959k10916m35329o1143M56559L27349k49344
$$ -297339 -149519 -85896 22802 134761 -76155 -511484 -572627 -116068 211281 -38063
36474c8063m45413k30034k70733n55749l76711K72201N43047J72302j48912q5946
$$ -38063 -483476 -713510 -984243 -1539992 -1916703 -1644502 -1101455 -929153 -1078065 -1164011
36464a164011q5998j92801J73047P73266M14312r57990j550875k54969J485928
$$ -1164011 -1250009 -1442810 -1269763 -496497 -82185 -1040175 -2591050 -2846019 -1360091
36455a360091J717348O69192j76015n75847j144211j345296j92415J380516J273629
$$ -1360091 357257 1026449 850434 274587 -869624 -2214920 -2407335 -1026819 246810
36446B46810m40759j258601L4569J547279J237639k04654q18387k33639M51121
$$ 246810 -193949 -1452550 -1417981 129298 1366937 1162283 343896 110257 561378
36437E61378N88220L05186l16179j062028j215571n13331J79237J96759K32699
$$ 561378 1149598 1454784 1138605 76577 -1138994 -1652325 -1473088 -1276329 -1043630
36428a043630R51985J401547M05482j199613j546318m91029M76108P30734Q85289
$$ -1043630 -91645 1309902 1715384 515771 -1030547 -1521576 -1045468 -314734 570555
36419E70555Q35773k20817j558486j201961P74262J684280K75290j028930J31640
$$ 570555 1406328 1185511 -372975 -1574936 -800674 883606 1158896 129966 261606
36410B61606K099188J590211j225374k928847j762159L72365J094413L87503m32085
$$ 261606 2360794 3951005 2725631 -203216 -1965375 -1593010 -498597 -111094 -543179
36401e43179o75473l07562N07079J019653L09238j144010j534014k21760J087407
$$ -543179 -1218652 -1526214 -1019135 518 309756 -834254 -2368268 -2590028 -1502621
36392a502621P10999o06381r63808r4488O10444L69670j92254l87738k82742o5251
$$ -1502621 -791622 -1398003 -2361811 -2456299 -1845855 -1476185 -1668439 -2056177 -2338919 -2404170
36382b404170L12343O61917O08536K80694J99746L97928M05613J68957J53157
$$ -2404170 -2091827 -1429910 -821374 -540680 -340934 56994 462607 631564 784721
36373G84721M14676M23203J6708k90474k12331r6452j35262q761L18715L07181
$$ 784721 1199397 1622600 1639308 1348834 1136503 1040051 904789 896028 1214743 1521924
36363A521924j71550m07092j3000L10456q3630o59036o09211k40236l77880q53210
$$ 1521924 1350374 943282 930282 1240738 1157108 498072 -111139 -351375 -729255 -1582465
36353a582465p43662O8091P04953O82777M59716M43893L91231Q8313j65865j43720
$$ -1582465 -2326127 -2258036 -1553083 -870306 -410590 33303 424534 512847 346982 203262
36343B03262j12287k73353l05142J13691P02616Q99415N42623o5457n85454q66037
$$ 203262 90975 -182378 -487520 -373829 328787 1228202 1770825 1705368 1119914 253877
36333B53877q64572n98007k23222n1472k97805o93769n68651K95633J051262O84295
$$ 253877 -610695 -1208702 -1431924 -1483396 -1781201 -2474970 -3043621 -2747988 -1696726 -1012431
36323a012431m62510r34769j66184P90992R99728Q93798R76162N92714o48327
$$ -1012431 -1474941 -2409710 -2575894 -1784902 -785174 108624 1084786 1677500 1029173
36314A029173j434882n39359Q53935P20277n32866p72496J93045M13570n32914
$$ 1029173 -405709 -945068 -91133 629144 96278 -676218 -483173 -69603 -602517
36305f02517o62895P38896J542600M15665p12312N7091J263089O83846p23418
$$ -602517 -1265412 -526516 1016084 1431749 719437 776528 2039617 2723463 2000045
36296B000045n66704O84381N50259r65077j235996M83259J730899Q54224n59805
$$ 2000045 1433341 2117722 2667981 1702904 466908 950167 2681066 3535290 2975485
36287B975485o31707j19203n91306j490565j114037M62051J415904Q57684j01235
$$ 2975485 2343778 2224575 1633269 142704 -971333 -509282 906622 1764306 1663071
36278A663071j36463N24046O13226l77333j455087j338521j44165P18427M62991
$$ 1663071 1526608 2050654 2663880 2286547 831460 -507061 -651226 67201 530192
36269E30192q5861J5502K79031k00977r69635r22812k97587k43077o21330j33126
$$ 530192 444331 459833 738864 537887 -431748 -1354560 -1652147 -1895224 -2516554 -2649680
36259b649680J238004J888070J169996L55319K83660L7181r34191j321698j97734
$$ -2649680 -1411676 476394 1646390 2001709 2285369 2322550 1388359 66661 -131073
36250a31073R17070K33863j267679j234537L15394J022865q9825j197342n84752
$$ -131073 785997 1019860 -247819 -1482356 -1166962 -144097 -233922 -1431264 -2016016
36241b016016Q60961J162344O8075q74877n57950M36198Q44054L25335k75398
$$ -2016016 -1155055 7289 75364 -799513 -1357463 -921265 -77211 248124 -27274
36232b7274j24092M88550N45589k57931j015268q26031j9392L66929J2825m18701
$$ -27274 -151366 337184 882773 624842 -390426 -1216457 -1235849 -868920 -856095 -1274796
36222a274796l49279J7353K23458L02432O30171J185834J346618O33136n19852
$$ -1274796 -1624075 -1606722 -1383264 -1080832 -450661 735173 2081791 2714927 2195075
36213B195075j164144j068189r67886j255285j142547P0784J505018J666085O05302
$$ 2195075 1030931 -37258 -1005144 -2260429 -3402976 -3332192 -1827174 -161089 444213
36204D44213k55056l83670o34631j215246r49659N87396J824659J347955K8409
$$ 444213 189157 -194513 -829144 -2044390 -2994049 -2406653 -581994 765961 794370
36195G94370m19208L6534K21545n5780k3989L15708K14119k29610j52248L54533
$$ 794370 375162 411696 633241 577461 553472 869180 1083299 853689 701441 1055974
36185A055974K28246n90199p47336L46488J306610O66621r88006j811645j082647
$$ 1055974 1284220 694021 -53315 293173 1599783 2266404 1278398 -533247 -1615894
36176a615894J53936O23718K11179k82028k43637J74189M34659L04429L0976n1004
$$ -1615894 -1461958 -838240 -627061 -909089 -1152726 -978537 -543878 -239449 -208473 -259477
36166b59477J32553L91168L63974k43857j098436j138281J82434J654923J454632
$$ -259477 -126924 264244 628218 384361 -714075 -1852356 -1669922 -14999 1439633
36157A439633k64259j274511l98484P65834L93067p17104n90207O20134R22376
$$ 1439633 1175374 -99137 -497621 268213 661280 -55824 -646031 -25897 896479
36148H96479k86946j426762j294257m89067J26905O12908R64415N73947m56572
$$ 896479 609533 -817229 -2111486 -2600553 -2473648 -1860740 -896325 -322378 -778950
36139g78950q35035J02942J195724J056398m4109q46471q57395m71807Q29M61730
$$ -778950 -1613985 -1511043 -315319 741079 696970 -149501 -1006896 -1478703 -1477874 -1016144
36129a016144O27593L54075J7704o7054j85642n66759o97814k8816J031536J534401
$$ -1016144 -388551 -34476 -16772 -83826 -269468 -836227 -1534041 -1562857 -531321 1003080
36119A003080J117268J51455q39815j332301q67166K89132R75489M59580m04463
$$ 1003080 2120348 2271803 1431988 99687 -767479 -478347 497142 956722 552259
36110E52259k42809Q58599J455075P86896l12736p69700o04434m96528p29517
$$ 552259 309450 1168049 2623124 3410020 3097284 2327584 1723150 1226622 497105
36101D97105j071877j222558r44013j53639P45738J035666N77059J25614L01197
$$ 497105 -574772 -1797330 -2741343 -2894982 -2149244 -1113578 -536519 -410905 -109708
36092a09708O72233M72924j42823l69975q2664M5040j99706j96209K84565M67464
$$ -109708 562525 1035449 892626 522651 439987 485027 285321 89112 373677 841141
36082H41141j98442j048809j211805q38431m36373K05010J217364J541886K57961
$$ 841141 642699 -406110 -1617915 -2456346 -2892719 -2687709 -1470345 71541 329502
36073C29502j409449j335944K94853J141114L93295m8985R51788J564433O9061
$$ 329502 -1079947 -2415891 -2121038 -979924 -586629 -635614 316174 1880607 1949668
36064A949668j879991j547161N96660J578225L77218r49662o77695M06890P89142
$$ 1949668 69677 -1477484 -880824 697401 1074619 124957 -552738 -145848 643294
36055F43294L09958k64164l97841M3012P05100O20579o92263j994709j574628
$$ 643294 953252 689088 291247 334259 1039359 1659938 967675 -1027034 -2601662
36046b601662K44464J406616J039862K99376L1038l73083j093237r31956N36190
$$ -2601662 -2357198 -950582 89280 388656 419694 46611 -1046626 -1978582 -1442392
36037a442392J624218Q45938p80070j262677l92753N23581P67486N35601j01125
$$ -1442392 181826 1027764 247694 -1014983 -1407736 -884155 -116669 418932 317807
36028C17807j041274j428917n02297J074755J872124J443341M82710l57359q29829
$$ 317807 -723467 -2152384 -2654681 -1579926 292198 1735539 2218249 1860890 1031061
36019A031061p09595q1018L37424Q8029k26935M9785M16686J19028l33923N3379
$$ 1031061 321466 240448 577872 665901 438966 488751 905437 1024465 690542 743921
36009G43921Q70063P43791m12340j158573p30323l0910j6555l99733n40954m86378
$$ 743921 1613984 2357775 1945435 786862 56539 25629 9074 -390659 -931613 -1417991
35999a417991m08556O705P85576J063411K04224r70104j020217K32197J478758
$$ -1417991 -1826547 -1819842 -1034266 29145 233369 -736735 -1756952 -1524755 -45997
35990d5997J570859P25515k7285o5796L69389N75159L4727j054758j757073j250439
$$ -45997 1524862 2250377 2223092 2157296 2526685 3101844 3136571 2081813 324740 -925699
35980i25699P3723Q12789K84112m40048j6568J031668R20607n70029j407308k18743
$$ -925699 -851976 -39187 244925 -195123 -211691 819977 1740584 1170555 -236753 -455496
35970d55496J500518J452371j96859j309347r82341m04984n77795r81468q84416
$$ -455496 1045022 2497393 2300534 991187 8846 -396138 -973933 -1955401 -2839817
35961b839817m54665l4595M51333Q65881P26157J15847k61907j83324k9392K08233
$$ -2839817 -3294482 -3329077 -2877744 -2011863 -1285706 -1169859 -1431766 -1615090 -1644482 -1436249
35951a436249P67157J005315O3826j281512j288410j0269O77563K08477J06756
$$ -1436249 -669092 336223 400049 -881463 -2169873 -2180142 -1502579 -1294102 -1187346
35942a187346R31619J094953n3578o95527J88899P28042m72171j503766m51246
$$ -1187346 -255727 839226 785648 90121 279020 1007062 534891 -968875 -1420121
35933a420121R23854J42309j370887n26108J925208K357135K01881j295874m22003
$$ -1420121 -496267 -353958 -1724845 -2250953 -325745 2031390 2233271 937397 515394
35924E15394Q86380R25649N13408L42410m86393j886102j907807j05196J086363
$$ 515394 1401774 2327423 2840831 3183241 2696848 810746 -1097061 -1202257 -115894
35915a15894J48841j024111m72383N39309N1730r26908j94320J653854K014005
$$ -115894 32947 -991164 -1463547 -924238 -872508 -1799416 -1993736 -339882 1674123
35906A674123L94691j006897p68676Q4050K07932j93729l13078j65881k43719
$$ 1674123 2068814 1061917 293241 377291 585223 391494 78416 -87465 -331184
35897c31184m90878l60604L19099R69355R00151K66950L0437O22322J086166L08463
$$ -331184 -822062 -1182666 -863567 105788 1005939 1272889 1303326 1925648 3011814 3320277
35887C320277j209557j866968j139524n3157N35322P92080Q55275L91494l60750
$$ 3320277 2110720 243752 -895772 -948929 -413607 378473 1233748 1625242 1264492
35878A264492n09349m49J94287j02642J43314J060463J100248m68318j944309
$$ 1264492 755143 754694 948981 846339 989653 2050116 3150364 2682046 737737
35869G37737j578502k08718J76196n55179q97969k36166N94989Q98889P62183
$$ 737737 -840765 -1049483 -873287 -1428466 -2326435 -2562601 -1967612 -1068723 -306540
35860c06540L47775j72695k15707N32137J274757R92606j12577r90109j142020
$$ -306540 41235 -131460 -347167 184970 1459727 2452333 2339756 1349647 207627
35851B07627p21030J88414J252622J412940P4521j557716j675215k46764J033651
$$ 207627 -513403 -324989 927633 2340573 2415094 857378 -817837 -1064601 -30950
35842c0950J066797L92695n2604j5581L51012P67674O80956k07533j153026j047009
$$ -30950 1035847 1428542 1375938 1360357 1711369 2479043 3159999 2952466 1799440 752431
35832G52431j6537N92869N8391p69601p08811K46862J046813P98691l55010j320638
$$ 752431 735894 1328763 1387154 617553 -91258 155604 1202417 2001108 1646098 325460
35822C25460j064159J83840J024081O23729j14894J17648R74757Q67629n97547
$$ 325460 -738699 -554859 469222 1092951 978057 1095705 2070462 2938091 2340544
35813B340544j850295j491195j96240L17385l56086r53218m62335N06044P51587
$$ 2340544 490249 -1000946 -1197186 -879801 -1235887 -2189105 -2651440 -2145396 -1393809
35804a393809L18165L85861J323692J901824J072272l68921r79814q41835j047255
$$ -1393809 -1075644 -689783 633909 2535733 3608005 3239084 2259270 1417435 370180
35795C70180j423896o93831R34067J429349J5669j342618p96727P07239J179295
$$ 370180 -1053716 -1747547 -813480 615869 631538 -711080 -1507807 -800568 378727
35786C78727O09402L75388O57069M72253k59338o25507m86551o16436j110664
$$ 378727 988129 1363517 2020586 2492839 2233501 1607994 1121443 505007 -605657
35777f05657j147638m02399N33527J123179J216276O49179l77969q73612k12461
$$ -605657 -1753295 -2155694 -1622167 -498988 717288 1366467 988498 114886 -97575
35768i7575O61713M62428m68524q26630m69318k35978j11355N23996J096734M32343
$$ -97575 564138 1026566 558042 -268588 -737906 -973884 -1085239 -561243 535491 967834
35758I67834q47435p76547P52515J506955L36598j108892j125217l98254l38175
$$ 967834 120399 -656148 96367 1603322 1939920 831028 -294189 -692443 -1030618
35749a030618o83530l83860L74939O29302K84491m8497j81335j97652J13370O46203
$$ -1030618 -1714148 -2098008 -1723069 -1093767 -809276 -857773 -1039108 -1236760 -1123390 -477187
35739d77187N78789l62359j035847m23444P36333J099381P75003P91191J055958
$$ -477187 101602 -260757 -1296604 -1720048 -983715 115666 890669 1681860 2737818
35730B737818N28082p09465j226538m25516M85793L28401l79650m45857J04502
$$ 2737818 3265900 2556435 1329897 904381 1390174 1718575 1338925 893068 997570
35721I97570K11645m51052r45458n23240J92466R4286p43046j095040l23959P28982
$$ 997570 1209215 758163 -187295 -710535 -518069 -423783 -1166829 -2261869 -2585828 -1856846
35711a856846R97284O31480M72875N96518L48737l35556o80136k99588J88721
$$ -1856846 -859562 -228082 244793 841311 1190048 854492 174356 -125232 63489
35702F3489J43079j80489j32327L29367N75430J20440o97223r13973l0565J089271
$$ 63489 206568 26079 -106248 223119 798549 918989 221766 -692207 -722772 366499
35692C66499J009259k95084j106595l44448O95335K44274j088109j134448M85799
$$ 366499 1375758 1080674 -25921 -370369 324966 569240 -518869 -1653317 -1167518
35683a167518J816597J539091N59528O8303j49559n52133o16424K4478M89766
$$ -1167518 649079 2188170 2747698 2816001 2666442 2114309 1497885 1522363 2012129
35674B012129m3023r03097r56507k43008M77629R79808J266587Q31138m96059
$$ 2012129 1969106 1066009 109502 -133506 344123 1323931 2590518 3421656 2925597
35665B925597j563753j099946M07959J220377N93571m95026q21022k58326L97326
$$ 2925597 1361844 261898 669857 1890234 2483805 1988779 1167757 909431 1306757
35656A306757L67019l47908q49345k63544J019583J608699R13768r9855m20043
$$ 1306757 1673776 1325868 476523 212979 1232562 2841261 3755029 3655174 3235131
35647C235131l06351l93176m68433j50089Q8260k41271m86977J40939R67167O86388
$$ 3235131 2928780 2535604 2067171 1917082 2005342 1764071 1277094 1418033 2385200 3071588
35637C071588n02056j047353k95752P49740J045719O87130K27290j33852l44249
$$ 3071588 2569532 1522179 1226427 1976167 3021886 3709016 3936306 3802454 3458205
35628C458205k98523j33127j07993j04749J44201L96384K11772j65848r9646L09076
$$ 3458205 3159682 3026555 2918562 2813813 2958014 3354398 3566170 3400322 3300676 3609752
35618C609752L39912l0683K7493P72855J310707R04703L8293l76573j77406K04624
$$ 3609752 3949664 3918981 3946474 4719329 6030036 6934739 6973032 6596459 6419053 6623677
35608F623677M86549N35262J26533o36163r94268l21790Q79547J419953R13091
$$ 6623677 7110226 7645488 7772021 7135858 6141590 5819800 6699347 8119300 9032391
35599I032391K28853J97720M26710L5913p16091n35299Q65180J838406Q93301
$$ 9032391 9261244 9458964 9885674 9921587 9205496 8670197 9535377 11373783 12267084
35590A2267084r53691j330830J63159J448579J152997N48072J259069K586375
$$ 12267084 11313393 9982563 10145722 11594301 12747298 13295370 14554439 17140814
35582A7140814K742436J729556J082837J249244J204105O70438P83133K035310
$$ 17140814 19883250 21612806 22695643 23944887 25148992 25819430 26602563 28637873
35574B8637873L230729L360055L235224M158699N816779O692582O274517N870005
$$ 28637873 31868602 35228657 38463881 42622580 48439359 55131941 61406458 67276463
35566F7276463P084784R997192J3085351J4924511J5826131J7415459K0339983
$$ 67276463 74361247 84358439 97443790 112368301 128194432 145609891 165949874
35559A65949874K2976316K3169372K0786742J7327103J3129867O658314k679665
$$ 165949874 188926190 212095562 232882304 250209407 263339274 269997588 267317923
35552B67317923j2365829j8805353k0957794k0737342k0143394j9321943j7601284
$$ 267317923 254952094 236146741 215188947 194451605 174308211 154986268 137384984
35545A37384984j5177796j2989294j1494311j0337100r087286p773813o649345
$$ 137384984 122207188 109217894 97723583 87386483 78299197 70525384 63876039
35538F3876039n805143n166223m663797m267454l933768l605575l222347k753029
$$ 63876039 58070896 52904673 48240876 43973422 40039654 36434079 33211732 30458703
35530C0458703k319326k185540k364587k327970j589170o17113m73861j236272
$$ 30458703 28139377 25953837 23589250 21261280 19672110 19054997 18581136 17344864
35522A7344864j628867r24578l07653j103935k345156j895102J18495J083294
$$ 17344864 15715997 14791419 14483766 13379831 11034675 9139573 9258068 10341362
35514A0341362k73578j841336j191088R30022J903089R47223l94673r08178r19440
$$ 10341362 10067784 8226448 7035360 7965382 9868471 10815694 10421021 9512843 8593403
35505H593403r35011p95791m72398l57030m35609k70208j9314l56171j110004
$$ 8593403 7658392 6862601 6390203 6033173 5597564 5327356 5308042 4951871 3841867
35496C841867j142288l1065J142556J258180N59336o339j28390j40805k01227
$$ 3841867 2699579 2668514 3811070 5069250 5628586 5622247 5493857 5353052 5151825
35487E151825j52063J6145N9800k10496p29284j183710j175609n82472K18100
$$ 5151825 4999762 5015907 5075707 4865211 4135927 2952217 1776608 1194136 1412236
35478A412236O87020O52337L27647k2313j91804o3651J59715N5878l48499m19871
$$ 1412236 2099256 2751593 3079240 3056927 2865123 2801472 2961187 3017065 2668566 2248695
35468B248695J31194O32264L66837l80091q60059r17025p43688j90762P09664
$$ 2248695 2379889 3012153 3378990 2998899 2138840 1221815 478127 287365 997029
35459I97029J114237M37064m24079k25985O54769Q38207K12105o1488K84136K27852
$$ 997029 2111266 2548330 2124251 1898266 2553035 3391242 3603347 3541859 3825995 4053847
35449D053847n53742j056421p31464k60535o2293L14638P39727K40406r81262
$$ 4053847 3500105 2443684 1712220 1451685 1389392 1704030 2443757 2684163 1702901
35440A702901j129154L97119J547543N15120j417902j776102m85984M70869K93447
$$ 1702901 573747 970866 2518409 3033529 1615627 -160475 -646459 -175590 117857
35431A17857J19791O85142J140661N87827n58091j198676p44274M72210J366410
$$ 117857 237648 922790 2063451 2651278 2093187 894511 150237 622447 1988857
35422A988857Q87405o74806j563195o13853J019512J297584L6655j096937j072298
$$ 1988857 2876262 2201456 638261 24408 1043920 2341504 2378159 1281222 208924
35413B08924m71144K3939N10411Q69422M25863p01873j231364n51851K23107J7133
$$ 208924 -262220 -238281 272130 1141552 1567415 865542 -365822 -917673 -694566 -677433
35403f77433m72531l7713R23559J077482M28193K22129O52201M37805q32155j605888
$$ -677433 -1149964 -1187677 -264118 813364 1241557 1463686 2115887 2553692 1721537 115649
35393A15649o42350R19250J143326R2626n33865j23391J92337l22919q36885m62164
$$ 115649 -526701 392549 1535875 1628501 1094636 971245 1163582 840663 3778 -458386
35383d58386L58866P18068M96037N9647m04374o10729j49468O07110N83054k86743
$$ -458386 -99520 618548 1114585 1174232 769858 159129 9661 616771 1199825 913082
35373I13082n88515L83198J251226O23837p37034j357567j386674j585167j222503
$$ 913082 324567 707765 1958991 2582828 1845794 488227 -898447 -2483614 -3706117
35364c706117N76430K298504J715650l41184r44832K33481N33711q98326j529315
$$ -3706117 -3129687 -831183 884467 543283 -401549 -168068 365643 -532683 -2061998
35355b061998L2370J431535O18146o01184J58049J568932Q86469j220490j671009
$$ -2061998 -2029628 -598093 20053 -581131 -423082 1145850 2032319 811829 -859180
35346h59180M9616J294606N35312p11587o48604M44495J219203R44748k10614
$$ -859180 -809564 485042 1020354 308767 -339837 104658 1323861 2268609 2057995
35337B057995j325817j184424K27440J126429K40646j013445n34515R87050J011981
$$ 2057995 732178 -452246 -224806 901623 1142269 128824 -405691 581359 1593340
35328A593340p01882j607372l81238J191797J226310L06834j54718j65816l51626
$$ 1593340 891458 -715914 -1097152 94645 1320955 1627789 1473071 1307255 955629
35319I55629m70632j64226K2497l19053m36867L27817J174369R54431q0974p85145
$$ 955629 484997 320771 343268 24215 -412652 -84835 1089534 2043965 1962991 1177846
35309A177846p66259m87418k25389Q1411L04550K71097J46901P7061j44388n28915
$$ 1177846 411587 -75831 -301220 -219809 84741 355838 502739 579800 435412 -93503
35299i3503n86900j58110Q2591l31637p10495j62787R33451J329464N73713n08823
$$ -93503 -680403 -838513 -755922 -1087559 -1798054 -1960841 -1027390 302074 875787 366964
35289C66964r41193n78928J3423K15291j09660m71032k76891L75719P66308N41541
$$ 366964 -574229 -1153157 -1139734 -924443 -1034103 -1505135 -1782026 -1406307 -639999 -98458
35279i8458J38658k2645j65857n51780q16571m83297K75231R12785J182418J051784
$$ -98458 40200 17555 -148302 -700082 -1516653 -1999950 -1724719 -811934 370484 1422268
35269A422268L77580p28768j532752j325266l13798O04249Q13546L77313k57304
$$ 1422268 1799848 1071080 -461672 -1786938 -2100736 -1496487 -682941 -305628 -562932
35260e62932n45641j40484O58369J043817P03159K80028L34995L70010l06714
$$ -562932 -1108573 -1249057 -590688 453129 1156288 1436316 1771311 2141321 1834607
35251A834607j156196r57628K52245R54034K31809r31945j115716l95422J19428
$$ 1834607 678411 -279217 -26972 927062 1158871 226926 -888790 -1284212 -1164784
35242a164784J39207L55616Q24183N55671p03138j464873m35965J261874J318400
$$ -1164784 -1025577 -669961 154222 709893 6755 -1458118 -1894083 -632209 686191
35233F86191m63146j742786r56578N76295Q80327K22844J77064P62278N62375
$$ 686191 223045 -1519741 -2476319 -1900024 -1019697 -796853 -619789 142489 704864
35224G04864n76664j074462k15210O58517L52597l71594k93809K63409K61342
$$ 704864 128200 -946262 -1161472 -502955 -150358 -521952 -815761 -552352 -291010
35215b91010j86323k40084j6328k97392q04496l33903J152893J973130R27588
$$ -291010 -477333 -717417 -733745 -1031137 -1835633 -2169536 -1016643 956487 1884075
35206A884075r24854j579701o15827N34580O80482K61753L01120P47141P07256
$$ 1884075 959221 -620480 -1236307 -701727 -21245 240508 541628 1288769 1996025
35197A996025N5469k56277K11016M84462l38568j459942j372521j02524Q20919
$$ 1996025 2051494 1795217 2006233 2490695 2152127 692185 -680336 -782860 38059
35188C8059N82531n9021l31082m80408p11443m35610N24354J104502M82777m86896
$$ 38059 620590 561569 230487 -249921 -961364 -1396974 -872620 231882 714659 227763
35178B27763n28694Q4617J69229k70308j20457P78388J198730M73467m58674n62310
$$ 227763 -300931 -216314 -47085 -317393 -437850 340538 1539268 2012735 1554061 991751
35168I91751j98378l04441q30882r28142l43565K56108L59881K88770N15948P86890
$$ 991751 793373 488932 -341950 -1270092 -1613657 -1357549 -997668 -708898 -192950 593940
35158E93940M18609o23486j457123j323475n38986n953j2304p7375R4859K03682
$$ 593940 1012549 389063 -1068060 -2391535 -2930521 -2936474 -2948778 -3026153 -2931294 -2727612
35148b727612M6394m7951J88312N03865O38785P49321R05507P26268L7852o21325
$$ -2727612 -2681218 -2729169 -2540857 -2036992 -1398207 -648886 256621 982889 1020741 399416
35138C99416p38535n85502o13285n94999j36205M00852L76461j9820p0375K47846
$$ 399416 -339119 -924621 -1537906 -2132905 -2269110 -1868258 -1491797 -1511617 -1581992 -1334146
35128a334146K97892l4880j75631N7859J61348o7443j39066K08825M84788K30997
$$ -1334146 -1036254 -1071134 -1246765 -1188906 -1027558 -1095001 -1234067 -1025242 -540454 -309457
35118c09457k94850n94433n42764k22335L07383P60152O85998J48481j39814K57869
$$ -309457 -604307 -1198740 -1741504 -1963839 -1656456 -896304 -210306 -61825 -201639 56230
35108E6230Q39347Q01937N9547o77631o70036R7637P47841K67932j161186j932176
$$ 56230 895577 1697514 1757061 1079430 409394 507031 1254872 1522804 361618 -1570558
35098a570558q80336R14019J357423L05768k33916P41840J591357N99551j302897
$$ -1570558 -2450894 -1536875 -179452 126316 -107600 634240 2225597 2825148 1522251
35089A522251j958276j078372j47917J20839L48579P53510P40664L44118L40887
$$ 1522251 -436025 -1514397 -1662314 -1541475 -1192896 -439386 301278 645396 986283
35080I86283O26767J61849j010883j411712m90135L65615J56813j07027N20325
$$ 986283 1613050 1774899 764016 -647696 -1137831 -772216 -615403 -722430 -202105
35071b02105Q86154k92943j681603r42667J454796K544036J090260q33287j128746
$$ -202105 684049 391106 -1290497 -2233164 -778368 1765668 2855928 2022641 893895
35062H93895m02956k76908p11176n84979J57708N71629M02945L08763N45871N74140
$$ 893895 490939 214031 -497145 -1082124 -924416 -352787 50158 358921 904792 1478932
35052A478932J9302p76181j229852j004442j12447R49500J326864O11167n70760
$$ 1478932 1498234 722053 -507799 -1512241 -1624688 -675188 651676 1262843 692083
35043F92083j201379r60835l06749K51968M90973L40558n5893l09693k17498j2662
$$ 692083 -509296 -1470131 -1776880 -1524912 -1033939 -693381 -749274 -1058967 -1276465 -1289127
35033a289127J20248L65399P04567N85085k14054r08331o67975J97517Q28758
$$ -1289127 -1168879 -803480 -98913 486172 272118 -636213 -1304188 -1106671 -277913
35024b77913J098207J317131J141211M7850j300358j542869n62417L26610L13121
$$ -277913 820294 2137425 3278636 3326486 2026128 483259 -79158 247452 560573
35015E60573n1391k05953m38077q41179p03082K38706R80435O29029k13371l79618
$$ 560573 509182 303229 -134848 -976027 -1679109 -1440403 -459968 169061 -44310 -423928
35005d23928J81957N69718K96022l39640q70511r31422k70733Q23001J444406
$$ -423928 -241971 327747 623769 284129 -586382 -1517804 -1788537 -965536 478870
34996D78870J063980K73952n0720L8118j53921p91736j306731j179802l98054
$$ 478870 1542850 1816802 1766082 1804200 1650279 858543 -448188 -1627990 -2026044
34987b026044O41615J259615R18632J7345k32655O44304J484844R53383n31334
$$ -2026044 -1384429 -124814 793818 811163 578508 1222812 2707656 3661039 3129705
34978C129705j342014q84019k06908l21494q97615r43495p2384J205050J940079
$$ 3129705 1787691 903672 696764 375270 -522345 -1465840 -1538224 -333174 1606905
34969A606905J367238l51537j847121j640049J59844J743964J564079L4799j102632
$$ 1606905 2974143 2622606 775485 -864564 -704720 1039244 2603323 2638122 1535490
34960A535490q47794R1328L78692l14488j052769r12162r5684N03623N40978M46569
$$ 1535490 687696 779024 1157716 843228 -209541 -1121703 -1217387 -713764 -172786 273783
34950B73783M86041L29806j92540n95867m57549p7022J01571K06272M62664M89429
$$ 273783 759824 1089630 897090 301223 -156326 -233348 -131777 74495 537159 1026588
34940A026588j52500j017800j205101n95677Q5716L81778N36099P76189Q55686
$$ 1026588 874088 -143712 -1348813 -1944490 -1858774 -1476996 -940897 -164708 690978
34931F90978N05689j29510o55114p24388k27490M79865O97022J57800m89588m63768
$$ 690978 1196667 1067157 412043 -312345 -539835 -59970 637052 794852 305264 -158504
34921a58504R7144M30114K87933J04942J33518J38315l6924k56506m75096p15240
$$ -158504 -61360 368754 656687 761629 895147 1033462 996538 740032 264936 -450304
34911d50304o80394o9239P08241Q49371K72974k88219l84164k84868k21355k4467
$$ -450304 -1130698 -1199937 -491696 357675 630649 342430 -41734 -326602 -547957 -572424
34901e72424K75488L39875K74754N84995J044408O70122o01888j348520o94079
$$ -572424 -296936 42939 317693 902688 1947096 2617218 2015330 666810 -27269
34892b7269J52375k70431j152969n39836J319329J866202K0791j919089j490661
$$ -27269 125106 -145325 -1298294 -1838130 -518801 1347401 1368192 -550897 -2041558
34883b041558L59345Q62715k75497o01530R48106K139254R16353j208051j322636
$$ -2041558 -1682213 -819498 -1094995 -1696525 -748419 1390835 2307188 1099137 -223499
34874b23499M52332J191393l41646j898297j185874R39663K039075J393646K08385
$$ -223499 228833 1420226 1078580 -819717 -2005591 -1065928 973147 2366793 2575178
34865B575178n25131p65457n42578J24875N82670J09663q55985j144998n24786
$$ 2575178 2050047 1284590 742012 866887 1449557 1559220 703235 -441763 -966549
34856i66549P8575P2100q9665J51576O65642R92805Q22311O4327q96431j131308
$$ -966549 -887974 -815874 -905539 -753963 -88321 904484 1726795 1791122 894691 -236617
34846b36617j57940J123062J386536O32756o3813l61830q24357j265782o33695
$$ -236617 -394557 728505 2115041 2747797 2683984 2322154 1497797 232015 -401680
34837d01680R21051J545188K75357j305292j320050l13648r5745p32445o35519
$$ -401680 519371 2064559 2339916 1034624 -285426 -599074 -694819 -1427264 -2062783
34828b062783N89003J351066N68321o64005p49684J94180Q11288M77143k47741
$$ -2062783 -1473780 -122714 445607 -218398 -968082 -773902 37386 514529 266788
34819B66788p61699r98465r20034l61371M09182P25951M55177K46678M61359N29866
$$ 266788 -494911 -1493376 -2413410 -2774781 -2365599 -1639648 -1184471 -937793 -476434 53432
34809E3432l810m74735q5129N88888L19972p25322j092342l49661K42648r1519
$$ 53432 49622 -425113 -510242 78646 398618 -326704 -1419046 -1768707 -1526059 -1617578
34799a617578l84896J92302O93501M8711q75287n98043M57997O48267k24789q15845
$$ -1617578 -2002474 -1810172 -1116671 -1067960 -1943247 -2541290 -2083293 -1435026 -1659815 -2475660
34789b475660n25481j4784M21886J086861J504444Q27427k42511p7456J001097
$$ -2475660 -3001141 -3015925 -2594039 -1507178 -2734 824693 582182 504726 1505823
34780A505823Q12017j016010j959023m76364J370916J026476p80622j545724p88866
$$ 1505823 2317840 1301830 -657193 -1133557 237359 1263835 483213 -1062511 -1851377
34771a851377K1472L01016O50726R01577K63877p22819o14350M48832P57330j33975
$$ -1851377 -1829905 -1528889 -878163 23414 287291 -435528 -1049878 -601046 156284 22309
34761B2309o17484K45324J091138M64268q05406q71810L30770J045274K52650
$$ 22309 -595175 -349851 741287 1205555 400149 -471661 -140891 904383 1157033
34752A157033r56350r27477L50395J229936N34831q78853j194866k9783J073084
$$ 1157033 200683 -726794 -376399 853537 1388368 509515 -685351 -715134 357950
34743C57950P49277m78060j196740j023842o16582l32013L2705M22403N11599
$$ 357950 1107227 629167 -567573 -1591415 -2207997 -2540010 -2507305 -2084902 -1573303
34734a573303M52761O86762J007739P41403o5284n37851k60550J39782j0862n19702
$$ -1573303 -1120542 -433780 573959 1315362 1250078 712227 451677 591459 580597 60895
34724F0895p38620m09315J65640M73395K13190l65244o22207l06868Q2776R2506
$$ 60895 -677725 -1087040 -921400 -448005 -234815 -600059 -1222266 -1529134 -1446358 -1353852
34714a353852L9094L66041P50208O53277L40826L79355M57753j53529j147383
$$ -1353852 -1314758 -948717 -198509 454768 795594 1174949 1632702 1479173 331790
34705C31790j402300o60178K00039O19963Q70877R91703N44640k71934n67298
$$ 331790 -1070510 -1730688 -1530649 -910686 -39809 951894 1496534 1224600 657302
34696F57302k10276o2158l58099k72246L54352M26514m04914p53861K60358J255358
$$ 657302 447026 384868 26769 -245477 108875 535389 130475 -623386 -363028 892330
34686H92330O54210o89409p94893L25694Q31795l4304j094875j254843o80015
$$ 892330 1546540 857131 62238 387932 1219727 1185423 90548 -1164295 -1844310
34677a844310J46240R89917J302738N66825n25708o27678K48559O78632R4725
$$ -1844310 -1698070 -708153 594585 1161410 635702 8024 256583 935215 1029940
34668A029940m37577k06506K0515l40063n02080R9907N03586j05416o91773j935
$$ 1029940 592363 385857 406372 66309 -435771 -335864 167722 62306 -629467 -631402
34658f31402J121184R44164l03867q11138j29891L47327j9802j34058O35338J165140
$$ -631402 489782 1433946 1130079 318941 189050 536377 516575 382517 1017855 2182995
34648B182995N20489l71375k96055J66242l63027j662383k039357p35742J030677
$$ 2182995 2703484 2332109 2036054 2202296 1839269 176886 -1862471 -2598213 -1567536
34639a567536J640734Q64091k22908o15713l47385j61429l79968m13838K60478
$$ -1567536 73198 937289 714381 98668 -248717 -410146 -790114 -1203952 -943474
34630i43474J002672P37291l18320p85755j99321L42854J28926K156O10257Q97112
$$ -943474 59198 796489 478169 -307586 -506907 -164053 -35127 -32971 577286 1474398
34620A474398j86602j587047j543915l21696L66801J65835K31146P58472N67652
$$ 1474398 1287796 -299251 -1843166 -2164862 -1798061 -1632226 -1401080 -642608 -74956
34611g4956n57928j212719o65696P2240K18174M12240J009148R99110j10226r80670
$$ -74956 -632884 -1845603 -2511299 -2439059 -2220885 -1808645 -799497 199613 89387 -891283
34601h91283n15853J76129l97209j496397j269556K84817J426416J359204R75406
$$ -891283 -1407136 -1231007 -1628216 -3124613 -4394169 -4109352 -2682936 -1323732 -348326
34592c48326J015075J141436R65519N92954J7513p96340j186540m17351R06059
$$ -348326 666749 1808185 2773704 3366658 3384171 2587831 1401291 983940 1889999
34583A889999J353121P09316J13285l5264o82609k055997k643868j371211M91922
$$ 1889999 3243120 3952436 4065721 4030457 3347848 1291851 -1352017 -2723228 -2231306
34574b231306J021828L66173J86673Q47094R42340j78302j103070m59378Q74595
$$ -2231306 -1209478 -843305 -656632 190462 1132802 954500 -148570 -607948 266647
34565B66647R82467k44066r86619l01284M80285p5538j163490r50950N28804J373692
$$ 266647 1249114 1005048 18429 -282855 197430 121892 -1041598 -1992548 -1463744 -90052
34555i0052O86174k40865j42106L74385K22005j95775J51841Q77140O05138p73120
$$ -90052 596122 355257 213151 587536 809541 613766 765607 1642747 2247885 1474765
34545A474765j756087j317955j56850M87724L28977q7303k86658j73087J30178
$$ 1474765 -281322 -1599277 -1756127 -1268403 -939426 -1026729 -1313387 -1486474 -1356296
34536a356296L72967L53248J73896J18124K39796L13887J58910k21165o95836
$$ -1356296 -983329 -630081 -456185 -338061 -98265 215622 374532 153367 -542469
34527e42469r68657p02201N070N33953N02181K89444L64987M67844P8207n68275
$$ -542469 -1511126 -2213327 -2208257 -1674304 -1172123 -882679 -517692 -49848 28359 -539916
34517e39916o66035J3912P74711Q38717J31456p51812j073225n89349J43453M13664
$$ -539916 -1205951 -1192039 -417328 421389 552845 -198967 -1272192 -1861541 -1718088 -1304424
34507a304424L98448Q77901J658412J351521n09004k199364j890571k09837P31183
$$ -1304424 -905976 -28075 1630337 2981858 2472854 273490 -1617081 -1826918 -1095735
34498a095735L10263k26160o7869K38571K77917M80008R05003P83433j11766q38040
$$ -1095735 -785472 -1011632 -1079501 -840930 -563013 -83005 821998 1605431 1493665 655625
34488F55625o54104N156M63576O99103P46804K37917p50475j262460o61964L91043
$$ 655625 1521 6677 470253 1169356 1916160 2154077 1403602 141142 -520822 -129779
34478a29779Q37177N10769n4722n23430q12131p18508j49905N23271Q00094N67540
$$ -129779 707398 1218167 1163445 640015 -172116 -890624 -1040529 -517258 282836 850376
34468H50376P4475l48557m38811k06427j7066r3867n4778N13663J183991J115506
$$ 850376 924851 576294 137483 -68944 -86010 -179877 -234655 279008 1462999 2578505
34458B578505K82156n02187p53490p18536o52680n44460n20568o63640n36127
$$ 2578505 2860661 2358474 1604984 886448 233768 -310692 -831260 -1494900 -2031027
34449b031027J84143Q22178N80668M860J77006P14171L23755p07530o74281N55009
$$ -2031027 -1846884 -1024706 -444038 -439178 -262172 451999 775754 68224 -606057 -51048
34439e1048R61647l69690j619881j132317O0172K19192l23334k56751K31054J23163
$$ -51048 910599 540909 -1078972 -2211289 -2151117 -1931925 -2255259 -2512010 -2280956 -2157793
34429b157793k48394K50096J383357J778791J034608L7112n65639q21193o80366
$$ -2157793 -2406187 -2156091 -772734 1006057 2040665 2077777 1512138 690945 10579
34420A0579n0007N69494N86639J66212k93267q91245j466458j035340O63910J950971
$$ 10579 -39428 530066 1116705 1282917 989650 98405 -1368053 -2403393 -1739483 211488
34410B11488J171020p79360j615894q15983K02385N91955P55144O99435j74222
$$ 211488 1382508 603148 -1012746 -1828729 -1626344 -1034389 -279245 420190 245968
34401B45968j417929j581302l46792R77089J430179J315809Q97893q3213j142394
$$ 245968 -1171961 -2753263 -3100055 -2122966 -692787 623022 1520915 1437702 295308
34392B95308j049867J93558R72819M49995j86529J85359P46006K09146r63715
$$ 295308 -754559 -561001 411818 861813 675284 860643 1606649 1815795 852080
34383H52080j247163l09886O84442P70199K07159j50249O3108L28318j17727j073549
$$ 852080 -395083 -704969 -20527 749672 956831 806582 869690 1198008 1080281 6732
34373F732j192302K38483J758274J318646o69939j572655k40641J306660Q91797
$$ 6732 -1185570 -947087 811187 2129833 1459894 -112761 -353402 953258 1845055
34364A845055p54787j409454o24476J65037J32006r9227N0161K66896J75114q2532
$$ 1845055 1090268 -319186 -943662 -778625 -646619 -745846 -695685 -428789 -253675 -336207
34354c36207l09992m97079m79780o0655M76592O16680L90681K74461L19894Q2729
$$ -336207 -646199 -1143278 -1623058 -1683713 -1207121 -590441 -199760 74701 394595 477324
34344D77324m82764p50152l23068L25855M92828J73641m2348J44872L56828J12288
$$ 477324 -5440 -755592 -1078660 -752805 -259977 -86336 -128684 16188 373016 485304
34334D85304m63328p57579m49188J32241N13211N94774M40093k9612o68940q31585
$$ 485304 21976 -735603 -1184791 -1052550 -539339 55435 495528 465916 -203024 -1034609
34324a034609j44937O83250O24183k34568q66500q34609o25008m20688K28303
$$ -1034609 -1179546 -496296 127887 -106681 -973181 -1807790 -2432798 -2853486 -2625183
34315b625183J161735J299119K60620p83352p09291N9414N23932O25822P26708
$$ -2625183 -1463448 -164329 96291 -687061 -1396352 -1336938 -813006 -187184 539524
34306E39524M67700n08530j319245p97505N99094J227914N21396m72654p93515
$$ 539524 1007224 498694 -820551 -1618056 -1018962 208952 730348 257694 -535821
34297e35821n42687p3238N13937Q10466K55474p54263j007461j74635O66847O48625
$$ -535821 -1078508 -1151746 -637809 172657 428131 -326132 -1333593 -1508228 -841381 -192756
34287a92756J81289j21265m33510q68730p57179J80314Q65727L04320p03554o38039
$$ -192756 -11467 -132732 -566242 -1434972 -2192151 -2011837 -1146110 -841790 -1545344 -2183383
34277b183383M21742J006525N85218J51743L22025L52715l36728r13563l49497
$$ -2183383 -1761641 -755116 -169898 -18155 303870 656585 319857 -593706 -943203
34268i43203Q96391J409805O77509m19263q55305n64283k18984k83688m49286
$$ -943203 -46812 1362993 2040502 1621239 765934 201651 -17333 -301021 -750307
34259g50307l9720R59599J554138R04880l56035p90222j70691K01575m40677j113142
$$ -750307 -790027 169572 1723710 2628590 2272555 1482333 1311642 1513217 1072540 -40602
34249d0602p25819J20085J97990k57596k6239R09580J236906M16447n54882p88488
$$ -40602 -766421 -646336 -448346 -705942 -732181 177399 1414305 1830752 1275870 487382
34239D87382n92205m65995k35675K04768L79880J66954K69837R94953J457889
$$ 487382 -104823 -570818 -806493 -601725 -221845 -54891 214946 1209899 2667788
34230B667788Q77064j43214n80279n59193q87385j507671j526313o01554O01982
$$ 2667788 3544852 3401638 2821359 2262166 1374781 -132890 -1659203 -2260757 -1658775
34221a658775J262015J044465J31468p64156p43569K25184R53414M68390n95256
$$ -1658775 -396760 647705 779173 15017 -728552 -503368 450046 918436 323180
34212C23180q87418k26132M22341N54647N63654O28268L60232k32834m77706j06653
$$ 323180 -564238 -790370 -368029 186618 750272 1378540 1738772 1505938 1028232 921579
34202I21579K29232o5566o74801q74182m38932K28628N53809K59285l51507o51199
$$ 921579 1150811 1085245 410444 -463738 -902670 -674042 -120233 139052 -212455 -863654
34192h63654m81626l61061n17264l11586O23532J311731O54534p05480j150200
$$ -863654 -1345280 -1706341 -2223605 -2535191 -1911659 -599928 54606 -650874 -1801074
34183a801074n33178k56927p57123o75543P57815K113513J725064J61327o16276
$$ -1801074 -2334252 -2591179 -3348302 -4023845 -3266030 -1152517 572547 733874 117598
34174A17598K5797P98441M60227o61364j315675q83721K8456M16039J05119r9800
$$ 117598 143395 941836 1402063 740699 -574976 -1458697 -1430241 -1014202 -909083 -1008883
34164a008883L81181J019414R96749M33291q10k80164p76054j139666p32436p338
$$ -1008883 -627702 391712 1388461 1821752 1820942 1540778 764724 -374942 -1107378 -1114716
34154a114716K2118l30370K16689J458335J568983M5052j222782q31013J19701
$$ -1114716 -1092598 -1422968 -1206279 252056 1821039 1866091 643309 -187704 -68003
34145f8003K03661l2224L60188O22066j72332r47836l44218O11321J40394r26681
$$ -68003 135658 103434 463622 1085688 913356 -34480 -378698 232623 373017 -553664
34135e53664l69635J337256J406462n88518j694065k02710J674548J339835m59408
$$ -553664 -923299 413957 1820419 1231901 -462164 -664874 1009674 2349509 1890101
34126A890101j370731r70656m41469j52123K77668M75530o4452n37158O7164R46735
$$ 1890101 519370 -451286 -892755 -1044878 -767210 -291680 -356132 -893290 -826126 120609
34116A20609N45376p13866q45837N00198J357770M74631q67686r86655j98001
$$ 120609 665985 -47881 -893718 -393520 964250 1438881 571195 -415460 -613461
34107f13461J25548k22549l40166J26760O15504O85286M59064J31547k07686l14911
$$ -613461 -487913 -710462 -1050628 -923868 -308364 376922 835986 967533 759847 444936
34097D44936L7199O54027J101298J154228P41409j95557j307030j726312j034411
$$ 444936 482135 1136162 2237460 3391688 4133097 3937540 2630510 904198 -130213
34088a30213j6563K66720j32918l82149k51098j74214j59350J88464O00805L70225
$$ -130213 -146776 119944 -12974 -395123 -646221 -820435 -979785 -791321 -190516 179709
34078A79709k57601k79201K48578J32896p39727q54676L75130J293399N98862
$$ 179709 -77892 -357093 -108515 24381 -715346 -1570022 -1194892 98507 697369
34069F97369m24992q8825P75069L46156q19862o39845P91700J181219j61432j231435
$$ 697369 272377 183552 958621 1304777 484915 -154930 636770 1817989 1656557 425122
34059D25122o56144L91639N64855L49980M70154L05956o21883j282937p78153
$$ 425122 -231022 160617 725472 1075452 1545606 1851562 1229679 -53258 -831411
34050h31411O5659J96368Q9962N21258Q81019L33654m92139o14033m20364n92728
$$ -831411 -765752 -569384 -479422 41836 922855 1256509 764370 150337 -270027 -862755
34040h62755m16985Q64090J963572J082987j008633j757246n44936O20921L28666
$$ -862755 -1279740 -415650 1547922 2630909 1622276 -134970 -679906 -58985 269681
34031B69681m63812m37145J55376M04796K11215l1664k50907m93773n64830k85022
$$ 269681 -194131 -631276 -475900 -71104 140111 108447 -142460 -636233 -1201063 -1486085
34021a486085L25708J112280J539781Q15604r07934k021017j315551J94139P08362
$$ -1486085 -1160377 -48097 1491684 2307288 1399354 -621663 -1937214 -1743075 -1034713
34012a034713K98673L44367Q17798M11018o89121p09404N17125Q54711n72165
$$ -1034713 -736040 -391673 426125 837143 148022 -561382 -44257 810454 238289
34003B38289j586215l70967J434978J179573p80856j808790q49612O40967J228783
$$ 238289 -1347926 -1718893 -283915 895658 114802 -1693988 -2543600 -1902633 -673850
33994f73850R61342L43483m09593q52742m07711O64295J342287J107838L76008
$$ -673850 287492 630975 221382 -631360 -1039071 -374776 967511 2075349 2451357
33985B451357l25470p98431q35885l24850K31746J17803n16247p21667j05305
$$ 2451357 2125887 1327456 491571 166721 398467 516270 23 -721644 -826949
33976h26949N82608N30397n4344l79230j79510J11302J41873P1847Q7697o9338
$$ -826949 -244341 286056 231712 -147518 -327028 -215726 -73853 -2006 85691 16353
33966A6353o27751j034217m11657J013065J735888Q66281m91645p00514R4822
$$ 16353 -611398 -1645615 -2057272 -1044207 691681 1557962 1066317 365803 460625
33957D60625L66530l49784r07588n78004p2826k0491J24441P97843J188015M72615
$$ 460625 827155 477371 -430217 -1008221 -1081047 -1101538 -977097 -179254 1008761 1481376
33947A481376o80941r46072j15185Q33037R99736K49611q73615j428896q90771
$$ 1481376 800435 -145637 -260822 572215 1571951 1821562 947947 -480949 -1371720
33938a371720j1768m375o17920l63822Q60564J143292l66250j606512n89456J326882
$$ -1371720 -1383488 -1387863 -2005783 -2369605 -1509041 -365749 -731999 -2338511 -2927967 -1601085
33928a601085J404849l29867j431251r16976j79541j29170m5469L54091J69755
$$ -1601085 -196236 -526103 -1957354 -2874330 -3053871 -3183041 -3228510 -2874419 -2704664
33919b704664n95649m47180J031628J986603J003042o37867r15223M0311O40753
$$ -2704664 -3300313 -3747493 -2715865 -729262 273780 -364087 -1279310 -1238999 -598246
33910e98246M43870L06560M52580J34963p20260r91140K118J248147J126958n62344
$$ -598246 -154376 152184 604764 739727 19467 -971673 -969555 278592 1405550 843206
33900H43206k190557k035267k03493J489456J583509M74775m14470m14654O4774
$$ 843206 -1347351 -3382618 -3586111 -2096655 -513146 -38371 -452841 -867495 -802721
33891h02721N23681P69502N30087l38223j215465j179022k21218P30615J001947
$$ -802721 -279040 490462 1020549 682326 -533139 -1712161 -1933379 -1202764 -200817
33882b00817O23783k17727j186674j406425k79769J284658J728632R84120L82224
$$ -200817 422966 205239 -981435 -2387860 -2667629 -1382971 345661 1329781 1712005
33873A712005L73860N0688p35532p47761L11061P78291l70641j598714j096980
$$ 1712005 2085865 2136553 1401021 653260 964321 1742612 1371971 -226743 -1323723
33864a323723L84443Q21670R881n53216k40249J30348K5692j57010j43294j32969
$$ -1323723 -939280 -117610 -107729 -660945 -901194 -770846 -745154 -902164 -1045458 -1178427
33854a178427j08899J29563L73471L50994L25026M91021L96387o6668K6366J037701
$$ -1178427 -1287326 -1157763 -784292 -433298 -108272 382749 779136 712468 738834 1776535
33844A776535J499578J74374j541087j430641k876L21847p21297q83403N39808
$$ 1776535 3276113 3450487 1909400 478759 475883 797730 76433 -806970 -267162
33835b67162J300116j6728j502441r67190O82389J137473J62055p23567q91009
$$ -267162 1032954 1016226 -486215 -1453405 -771016 366457 528512 -195055 -1086064
33826a086064q56913o16746L01444J438041J714540J002315P5806p22220j499192
$$ -1086064 -1942977 -2559723 -2258279 -820238 894302 1896617 1972423 1250203 -248989
33817b48989j822691j092128K23403R83124R53153Q33636Q28594M48857k40686
$$ -248989 -2071680 -3163808 -2940405 -1957281 -1004128 -170492 658102 1106959 866273
33808H66273m73849j22339j781m59779p17473j48139O52548P06652r779o42393
$$ 866273 392424 270085 268304 -191475 -908948 -1057087 -404539 302113 292334 -350059
33798c50059n44024J07677N88299L54813l35492n94465K0964P90477O56569m05534
$$ -350059 -894083 -786406 -198107 156706 -178786 -773251 -752287 38190 694759 289225
33788B89225j417681j641201j112384p7817J222177K113767J762492L00250r81615
$$ 289225 -1128456 -2769657 -3882041 -3959858 -2737681 -623914 1138578 1438828 457213
33779D57213j006777k5953R34947J225083Q32698K2590p90819j107727p46292
$$ 457213 -549564 -575517 359430 1584513 2417211 2439801 1648982 541255 -205037
33770b05037r7997K59463J10269l26381o60573n67588O92O87368R70156O47293
$$ -205037 -303034 -43571 66698 -259683 -920256 -1487844 -1487152 -799784 170372 817665
33760H17665K6643l53562j59902M05308O34072J579j011384j265373m53703L57294
$$ 817665 844308 490746 330844 736152 1370224 1371803 360419 -904954 -1358657 -1001363
33750a001363K32235k55680j2434P90622J056480N30978k9577k79523n24554n90367
$$ -1001363 -769128 -1024808 -1037242 -246620 809860 1340838 1311261 1031738 507184 -83183
33740h3183M8052Q30939M25203j050022j733123p19671N30402N31578m388L03094
$$ -83183 -35131 795808 1221011 170989 -1562134 -2281805 -1751403 -1219825 -1224213 -921119
33730i21119J053684Q97704n1814m86267j22441J00589j55508k62947n8228o1075
$$ -921119 132565 1030269 978455 492188 369747 470336 314828 51881 -6347 -67422
33720f7422j65602L24907J102041Q78544m75153j342640p04846L00688K22395
$$ -67422 -233024 91883 1193924 2072468 1597315 254675 -450171 -149483 72912
33711G2912m79357m17656L20026L70449n47550j071247l31656O65179N74438k73823
$$ 72912 -406445 -824101 -504075 -133626 -681176 -1752423 -2084079 -1418900 -844462 -1118285
33701a118285m66951K86468P48347J24466o51454l20803P69559J201032O26095
$$ -1118285 -1585236 -1298768 -550421 -425955 -1077409 -1398212 -628653 572379 1198474
33692A198474J48870M16784N63305l00609j505018j686685o89090L60816O17137
$$ 1198474 1347344 1764128 2327433 2026824 521806 -1164879 -1853969 -1493153 -876016
33683h76016L04776K6311p113P500k17533o91328q82896j96186J001047J446786
$$ -876016 -571240 -544929 -552042 -544542 -762075 -1453403 -2336299 -2532485 -1531438 -84652
33673h4652O39430k71614p5561O90836O50080j93613n18499J53911P56451L67039
$$ -84652 554778 283164 207603 898439 1548519 1354906 836407 990318 1746769 2113808
33663B113808n71903j109383r44761l79690J38645J81301k97483o72409l69406
$$ 2113808 1541905 432522 -512239 -891929 -753284 -571983 -869466 -1541875 -1911281
33654a911281K55011N38320O72959J109152J169584j20763j867131j885123Q7763
$$ -1911281 -1656270 -1117950 -444991 664161 1833745 1712982 -154149 -2039272 -1951509
33645a951509J655902J095487l55942p04223n2411K61151M0314q7P1156l16822
$$ -1951509 -295607 799880 443938 -260285 -312696 -51545 -11231 -11318 59838 -256984
33635b56984q26146o67277p0290J28903l934J99238N70066M26797O1289L55784
$$ -256984 -1083130 -1750407 -1820697 -1691794 -1695728 -1496490 -926424 -499627 -438338 -82554
33625h2554J007241P32909n65519j356237o63038N56950Q24609j6710r47170j069733
$$ -82554 924687 1657596 1092077 -264160 -927198 -370248 454361 437651 -509519 -1579252
33615a579252l04358P00682J059272M59142m28144p28070l97921N905K42370L48134
$$ -1579252 -1883610 -1182928 -123656 335486 -92658 -820728 -1218649 -1212744 -970374 -622240
33605f22240Q6379o18066j027520m69205M09395M82482K664J90879J084364J430153
$$ -622240 -535861 -1153927 -2181447 -2650652 -2241257 -1758775 -1756111 -1565232 -480868 949285
33595I49285Q53154L60508K90499l38429j637427j919342k77923J505330J285560
$$ 949285 1802439 2162947 2453446 2115017 477590 -1441752 -1719675 -214345 1071215
33586A071215l86108j281892p27517M2877K73870M90912Q79997O35751n34636
$$ 1071215 685107 -596785 -1324302 -1281425 -1007555 -516643 363354 999105 464469
33577D64469j554763j357984l17387L70245K45189o6646J09873N90472O51951
$$ 464469 -1090294 -2448278 -2765665 -2395420 -2150231 -2216877 -2107004 -1516532 -864581
33568h64581J30169k18914J80128O41943R2197j070834j181167K34058J448493
$$ -864581 -734412 -953326 -773198 -131255 -39058 -1109892 -2291059 -2057001 -608508
33559f08508Q55520p61859j429410o47084M40484R69691J056939Q56046K85538
$$ -608508 247012 -514847 -1944257 -2591341 -2150857 -1181166 -124227 731819 1017357
33550A017357l07637l57096m582J07703j22098l21353m88193p38958n64031L90514
$$ 1017357 709720 352624 348042 455745 333647 12294 -475899 -1214857 -1778888 -1388374
33540a388374J102609K74925j426396j909692o03880Q42979J162960R61177R74038
$$ -1388374 -285765 -10840 -1437236 -3346928 -3950808 -3107829 -1944869 -983692 -9654
33531i654O89069k27020p47845q0219Q42585Q15694J93020j01530k94585r25343
$$ -9654 679415 452395 -295450 -375669 466916 1282610 1475630 1374100 1079515 154172
33521A54172j231745k03107J299191J337815k94986j706885j462459j40090Q59482
$$ 154172 -1077573 -1280680 18511 1356326 1061340 -645545 -2108004 -2248094 -1388612
33512a388612Q92115K30167m15235l79180K28039M08060l64373j092612o14832
$$ -1388612 -496497 -266330 -681565 -1060745 -832706 -424646 -789019 -1881631 -2496463
33503b496463M77555O84151M0642J9966R47428J333670L03006r54412j005776
$$ -2496463 -2018908 -1334757 -1294115 -1274149 -326721 1006949 1309955 355543 -650233
33494f50233j50156L80753K08091j38207k49782j51896n5845k31085o32128n76351
$$ -650233 -800389 -419636 -211545 -349752 -599534 -751430 -807275 -1038360 -1670488 -2246839
33484b246839L95915J382239J049418k09104n74492L92416J004010K07618p82692
$$ -2246839 -1850924 -468685 580733 371629 -202863 189553 1193563 1401181 618489
33475F18489p39521m30477p93757q53049M65310J805523J113168r30731j710758
$$ 618489 -121032 -551509 -1345266 -2198315 -1733005 72518 1185686 254955 -1455803
33466a455803n47659O70573P01724M02633O06752P51794L32360r6473j17556j26191
$$ -1455803 -2003462 -1332889 -631165 -228532 378220 1130014 1462374 1365901 1248345 1122154
33456A122154k23528M2729L44754l05637j485698j314404N48845J774185O40320
$$ 1122154 898626 941355 1286109 980472 -505226 -1819630 -1270785 503400 1143720
33447A143720j263699j388064Q7919R47574M09607k37123r5486K56598K10127
$$ 1143720 -119979 -1508043 -1420124 -472550 -62943 -300066 -395552 -138954 71173
33438G1173k8522k85764p28019j039863n21958O58833J382813J060735K50488
$$ 71173 42651 -243113 -971132 -2010995 -2532953 -1874120 -491307 569428 819916
33429H19916m39470j013838j323996p77931N26436J326426P11818n37752j008129
$$ 819916 380446 -633392 -1957388 -2735319 -2208883 -882457 -170639 -708391 -1716520
33420a716520n58365k13025m08578m26632K59758J037419J101718O98174O37156
$$ -1716520 -2274885 -2487910 -2896488 -3323120 -3063362 -2025943 -924225 -226051 411105
33411D11105Q76259N04427p31376j733000j394646o5153R61583J016244M39713
$$ 411105 1287364 1791791 1060415 -672585 -2067231 -2132384 -1170801 -154557 285156
33402B85156k40975o83748n07586L25703R50292M46676o66727r03776K7014P89917
$$ 285156 44181 -639567 -1147153 -821450 128842 575518 -91209 -994985 -967971 -178054
33392a78054N64598J96773M09782L23785r15357k188195j769865J6709J228625
$$ -178054 386544 583317 993099 1316884 401527 -1786668 -3556533 -3539824 -2311199
33383b311199J072080N78187N59743N45329Q4312k97315m1542N26394P55565M52160
$$ -2311199 -1239119 -660932 -101189 444140 528452 231137 189595 715989 1471554 1923714
33373A923714j89452q13409r46910m59509N4778M1552r8144K48661N89135l038
$$ 1923714 1734262 920853 -26057 -485566 -430788 -389236 -487380 -238719 350416 347378
33363C47378j093309j244807k25553O77058P40577N76460M84452j58959j228901
$$ 347378 -745931 -1990738 -2216291 -1539233 -798656 -222196 262256 103297 -1125604
33354a125604j395594k81941O37824L79086l7598L24889N33072k67458q49510
$$ -1125604 -2521198 -2803139 -2165315 -1786229 -1823827 -1498938 -965866 -1233324 -2082834
33345b082834J01541J470676J484920P23195P93479J100114p0320j888732j756158
$$ -2082834 -1981293 -510617 974303 1697498 2490977 3591091 3520771 1632039 -124119
33336a24119K46182J075164m64675j915968j347337j93239j73996k59340R39972
$$ -124119 122063 1197227 732552 -1183416 -2530753 -2723992 -2897988 -3157328 -2217356
33327b217356K094863J245181o60522j131935k803P52012L85113l1573k9042k62691
$$ -2217356 -122493 1122688 462166 -669769 -672572 79440 464553 432980 403938 141247
33317A41247o48407k77064O45371Q68750L14572J81048N97721L30419p18307r51428
$$ 141247 -507160 -784224 -138853 729897 1044469 1225517 1823238 2153657 1435350 483922
33307D83922J65496R29864J29068r92630q79314o8995J22418j30654P3528N01176
$$ 483922 649418 1579282 1708350 715720 -163594 -232589 -110171 -240825 -167297 333879
33297C33879M24265J68540L09775K21542p51265j497402n95752J016718J129462
$$ 333879 758144 926684 1236459 1458001 706736 -790666 -1386418 -369700 759762
33288G59762k18103p49000L03338J002012N9878j032878o41576K96705P9305p43970
$$ 759762 541659 -207341 95997 1098009 1157887 125009 -516567 -219862 -140557 -884527
33278h84527l65828J096275J673456O32056n72213p40497n22911q33472j162424
$$ -884527 -1250355 -154080 1519376 2151432 1579219 838722 315811 -517661 -1680085
33269a680085o04988L93533O34171R3782k6828P27802J193693K87716j172107
$$ -1680085 -2285073 -1891540 -1257369 -1163587 -1190415 -462613 731080 1018796 -153311
33260a53311j319631K32374J711802J447602M1061n75087J20901N96087l69780
$$ -153311 -1472942 -1240568 471234 1918836 1959897 1384810 1505711 2101798 1732018
33251A732018j761066j676330k4709J291123R09443l42376q12323k16427L61572
$$ 1732018 -29048 -1705378 -1730087 -438964 470479 128103 -684220 -900647 -539075
33242e39075K45271o0134N5195L54278L37785J38669J81476L40224J77827j62907
$$ -539075 -293804 -353938 -298743 55535 393320 531989 713465 1053689 1231516 1068609
33232A068609j17203K35446J16550o70568j206846p04315L63261R91724R71236
$$ 1068609 951406 1186852 1303402 632834 -574012 -1278327 -915066 76658 1047894
33223A047894P54609M30702k70537j091277j270601o27330O8821J02788k77526
$$ 1047894 1802503 2233205 1962668 871391 -399210 -1026540 -957719 -854931 -1132457
33214a132457k91016K83377P63857L86723o10676j009505m7199J394783J735132
$$ -1132457 -1423473 -1140096 -376239 10484 -600192 -1609697 -1656896 -262113 1473019
33205A473019P80885j04396j25124q5165o52494r66910j61481R12473R88203M32631
$$ 1473019 2253904 2149508 2024384 1939219 1286725 319815 158334 1070807 2059010 2491641
33195B491641L18642L91532p3314l12586N68941J050724q83269l524102k853137
$$ 2491641 2810283 3201815 3128501 2815915 3384856 4435580 3552311 28209 -2824928
33186b824928J145065L521010J416146j726279j686810K63554L58587j087421
$$ -2824928 -1679863 1841147 3257293 1531014 -155796 107758 466345 -621076
33178f21076p35058J505179K117840q4837k086620j617264j73533K94058L79928
$$ -621076 -1356134 149045 2266885 2182048 95428 -1521836 -1695369 -1401311 -1021383
33169a021383J069889J366817K39176j130520j162446l38974P6067K93204R81804
$$ -1021383 48506 1415323 1654499 523979 -638467 -977441 -901374 -608170 373634
33160C73634J324314L00427j015173p34550P56230J228361K0364j131198r64879
$$ 373634 1697948 1998375 983202 248652 1004882 2233243 2253607 1122409 157530
33151A57530m04470o40830j141103p11476N03167J273405J012589K57434l13903
$$ 157530 -246940 -887770 -2028873 -2740349 -2237182 -963777 48812 306246 -7657
33142g657m96047k77205K79270P43185N42920k26846p06728l54870K87059M04221
$$ -7657 -503704 -780909 -501639 241546 784466 557620 -149108 -503978 -216919 187302
33132A87302J02772O0207K25356j15745q94491j055909k79811K77834j81255o49145
$$ 187302 290074 350281 575637 459892 -434599 -1490508 -1770319 -1492485 -1673740 -2322885
33122b322885L8785J040318O62802q41071j501892n81636N74936Q95818R29363
$$ -2322885 -2284100 -1243782 -580980 -1422051 -2923943 -3505579 -2930643 -2034825 -1105462
33113a105462J221170J124856K56659l54793J53806Q80662M77683p38905j308343
$$ -1105462 115708 1240564 1497223 1142430 1296236 2176898 2654581 1915676 607333
33104F07333p31640J17051L56709q6979p58720r91972k87324R62629J560265R27045
$$ 607333 -124307 -7256 349453 262474 -496246 -1488218 -1775542 -812913 747352 1674397
33094A674397j19499o13674o86652p81579n56596K80587Q63167L22373n26252
$$ 1674397 1554898 941224 254572 -527007 -1083603 -803016 60151 382524 -143728
33085a43728k44147Q14782Q76541m54277j513348j089010k3921L83554K07044
$$ -143728 -387875 426907 1303448 849171 -664177 -1753187 -1777108 -1393554 -1186510
33076a186510K03114L79479L15173J82890M15142P88333P37164K95860l4584j13013
$$ -1186510 -983396 -603917 -288744 -105854 309288 1097621 1834785 2130645 2096061 1983048
33066A983048j52950j35975L2271j7897o58635j328562j021622J04988O38356
$$ 1983048 1830098 1694123 1726394 1708497 1049862 -278700 -1300322 -1195334 -556978
33057e56978n2938o96592J72J148245Q17932r06436j756917n55848J052869J140438
$$ -556978 -609916 -1306508 -1306336 -158091 659841 -246595 -2003512 -2559360 -1506491 -366053
33047c66053K41457K1695L80443o1472j179281j358886l30263L08308p1318j3171
$$ -366053 -124596 -102901 277542 216070 -963211 -2322097 -2652360 -2344052 -2415370 -2428541
33037b428541J267154K118488J009354q74428j459612q65680n78726n86373K73811
$$ -2428541 -1161387 957101 1966455 1092027 -367585 -1233265 -1811991 -2398364 -2124553
33028b124553J593767J540412o4775j068298j10791J394118J410427L3688j045140
$$ -2124553 -530786 1009626 944851 -123447 -234238 1159880 2570307 2603995 1558855
33019A558855r23567k03648K52685L46783M91899Q08020Q02862J0105j070734
$$ 1558855 635288 431640 684325 1031108 1523007 2331027 3133889 3143994 2073260
33010B073260j234567j64186R04180Q12345N8112k56446k74186p34041j110643
$$ 2073260 838693 674507 1578687 2391032 2449144 2192698 1918512 1184471 73828
33001G3828l18556R53164Q14235o34542j004657O26388J938756Q43363j212384
$$ 73828 -244728 708436 1522671 888129 -116528 509860 2448616 3291979 2079595
32992B079595j443584J27739J029701J56140j054081j174129n00731J42893O43041
$$ 2079595 636011 763750 1793451 1949591 895510 -278619 -779350 -636457 6584
32983F584J011686Q42789R2348m68710k47462L18066M16791q4024o70002r11194
$$ 6584 1018270 1861059 1953407 1484697 1237235 1555301 1972092 1888068 1218066 306872
32973C06872p97241n30596k13141K71087R53237J309674N83982r93418j880717
$$ 306872 -490369 -1020965 -1234106 -963019 -9782 1299892 1883874 890456 -990261
32964i90261r63910P55643J275913K25306q51074q80282m90091l95810q3056Q77775
$$ -990261 -1954171 -1198528 77385 302691 -548383 -1428665 -1918756 -2314566 -2397622 -1519847
32954a519847J463854N92221r07337j275083l71799L33003K00282J95135R39253
$$ -1519847 -55993 536228 -371109 -1646192 -2017991 -1684988 -1484706 -1289571 -350318
32945c50318J558244J165466K51744k38890k50136k25815k39047k77719n53406
$$ -350318 1207926 2373392 2625136 2386246 2136110 1910295 1671248 1393529 840123
32936H40123p86912j84024J008803J143935l71096j528803m24187J581134J702815
$$ 840123 53211 -130813 877990 2021925 1650829 122026 -302161 1278973 2981788
32927B981788M5501o86015L23066Q63675k71879j216871m58712M54803k35926
$$ 2981788 3027289 2341274 2664340 3528015 3256136 2039265 1580553 2035356 1799430
32918A799430j288866o98055O68825O03211n20531m85145P68135J086827j8346
$$ 1799430 510564 -187491 481334 1084545 564014 78869 847004 1933831 1915485
32909A915485o10749O0180J94468j225354k395522j556596K12779Q55983M03755
$$ 1915485 1304736 1364916 1559384 334030 -2061492 -3618088 -3405309 -2549326 -2145571
32900b145571L26585R25373J183854O40188j18677n61405o74955n22887j79416
$$ -2145571 -1818986 -893613 290241 930429 811752 250347 -424608 -947495 -1126911
32891a126911J01843K13922L55597N05519L19909r6906r7767M01248O12866J98077
$$ -1126911 -1025068 -811146 -455549 49970 369879 272973 175206 576454 1189320 1387397
32881A387397j01762J89530L76851r8180m90275J4671P84682O80635j64919p17550
$$ 1387397 1285635 1475165 1852016 1753836 1263561 1278232 2062914 2743549 2578630 1861080
32871A861080o60463m86503m10122k87856k55608m45913m57668k2771L07922Q5619
$$ 1861080 1200617 714114 303992 16136 -239472 -685385 -1143053 -1165824 -857902 -772283
32861g72283q2345L99709Q15154K54283o12205m67237M01180N27739k71603p02104
$$ -772283 -854628 -454919 360235 614518 2313 -464924 -63744 463995 192392 -509712
32851e09712k82812L6416j43680O1394R41579J314487M48717o16040p49194m58867
$$ -509712 -792524 -756108 -899788 -838394 103185 1417672 1866389 1250349 501155 42288
32841D2288p06478j025752k81967J230290J852431P13745j150432j990627j117556
$$ 42288 -664190 -1689942 -1971909 -741619 1110812 1824557 674125 -1316502 -2434058
32832b434058N75728J557424J139554R7763l64060j23048n4317n06647p48045
$$ -2434058 -1858330 -300906 838648 936411 572351 449303 394986 -111661 -859706
32823h59706k34478M23874L37469m29182j060894r77483j88590Q71860J508237
$$ -859706 -1094184 -670310 -332841 -762023 -1822917 -2800400 -2988990 -2117130 -608893
32814f08893J267776N75466K68367K97935k08947j238779j420499p7330J374817
$$ -608893 658883 1234349 1502716 1800651 1591704 352925 -1067574 -1144904 229913
32805B29913J292461J87787k26278K28611J57059q30140j306746l11686J021908
$$ 229913 1522374 1710161 1483883 1712494 1869553 1039413 -267333 -579019 442889
32796D42889R98888m10331j746806j889853r62089K06209Q61930P62623K90814
$$ 442889 1441777 1031446 -715360 -2605213 -3567302 -3361093 -2499163 -1736540 -1445726
32787a445726N6590K05444L59413L27454L90724O35117N56601j83383j019188
$$ -1445726 -1389136 -1183692 -824279 -496825 -106101 529016 1085617 902234 -116954
32778a16954j073747k64211O93390J184649J080335M21075o07415j385821j234351
$$ -116954 -1190701 -1454912 -761522 423127 1503462 1924537 1317122 -68699 -1303050
32769a303050k99273M57693M15561k0049j61643K3110J37854R4690Q2839J00232
$$ -1303050 -1602323 -1144630 -729069 -749118 -910761 -887651 -749797 -655107 -572268 -472036
32759d72036Q9791K86827P72905R17607J28598r19334q77985K23234P12771k87374
$$ -472036 -382245 -95418 677487 1595094 1723692 804358 -73627 149607 862378 575004
$$ [...]
##END NTUPLES=NMR SPECTRUM
##END=
