##TITLE=31Pdec_IPACAT-25
 CCl4, 24 sc
 2.04.2021
##JCAMPDX= 6.0         $$ Bruker NMR JCAMP-DX V2.0
##DATA TYPE= NMR FID
##DATA CLASS= NTUPLES
##ORIGIN= UXNMR, Bruker Analytische Messtechnik GmbH
##OWNER= root
$$ XWIN-NMR		Version 3.5
$$ Fri Apr  2 12:31:57 2021 Russian Standard Time (UT+4h)  she@DPX200
##.OBSERVE FREQUENCY= 81.013821
##.OBSERVE NUCLEUS= ^31P
##.DELAY= (6, 6)
##.ACQUISITION MODE= SIMULTANEOUS
##.ACQUISITION SCHEME= undefined
##.AVERAGES= 24
##.DIGITISER RES= 16
##SPECTROMETER/DATA SYSTEM= spect
##.PULSE SEQUENCE= zgpg30
##.SOLVENT NAME= CDCl3
##.SHIFT REFERENCE= (INTERNAL, CDCl3, 0, 243.863)
##AUDIT TRAIL= $$ (NUMBER, WHEN, WHO, WHERE, WHAT)
$$ ##TITLE= Audit trail, XWIN-NMR		Version 3.5
$$ ##JCAMPDX= 5.01
$$ ##ORIGIN= Bruker BioSpin GmbH
$$ ##OWNER= she
$$ F:/spectra/data/she/nmr/P31/1/audita.txt
$$ ##AUDIT TRAIL=  $$ (NUMBER, WHEN, WHO, WHERE, WHAT)
(   1,<2021-04-02 12:30:21.95 +0400>,<she>,<DPX200>,
      <created by zg, POWCHK disabled, PULCHK disabled
       configuration hash MD5:
       00 E9 B6 7A A2 85 ED C7 34 08 36 98 17 FE 4E 26
       data hash MD5: 32K
       50 79 8C F5 95 EC 73 2F C9 89 5A 46 34 89 1D 91>)
$$ ##END=
$$ 
$$ hash MD5
$$ C0 AB DB D0 79 64 5D B5 FC 38 8E B4 38 CD FD 10
##$RELAX= 
##$RELAX= 
##$RELAX= 
##$RELAX= 
##$RELAX= 
##$RELAX= 
##$RELAX= 
##$RELAX= 
$$ Bruker specific parameters
$$ --------------------------
##$DU= <F:/spectra>
##$EXPNO= 1
##$NAME= <P31>
##$PROCNO= 1
##$TYPE= <nmr>
##$USER= <she>
##$AMP= (0..31)
100 100 100 100 100 100 100 100 100 100 100 100 100 100 100 100 100 100 
100 100 100 100 100 100 100 100 100 100 100 100 100 100 
##$AQSEQ= 0
##$AQ_mod= 1
##$AUNM= <au_zg>
##$AUTOPOS= <>
##$BF1= 81.014009
##$BF2= 200.13
##$BF3= 200.13
##$BF4= 200.13
##$BF5= 200.13
##$BF6= 200.13
##$BF7= 200.13
##$BF8= 200.13
##$BYTORDA= 1
##$CFDGTYP= 0
##$CFRGTYP= 5
##$CHEMSTR= <none>
##$CNST= (0..31)
1 1 145 1 1 1 1 1 1 1 1 1 1 1 1 1 1 1 1 1 1 1 1 1 1 1 1 1 1 1 1 1 
##$CPDPRG= <waltz16>
##$CPDPRG1= <>
##$CPDPRG2= <waltz16>
##$CPDPRG3= <>
##$CPDPRG4= <mlev>
##$CPDPRG5= <mlev>
##$CPDPRG6= <mlev>
##$CPDPRG7= <mlev>
##$CPDPRG8= <mlev>
##$CPDPRGB= <>
##$CPDPRGT= <>
##$D= (0..31)
0 1 0 0 0 0 0 0 0 0 0 0.03 2e-05 3e-06 0 0 0 0 0 0 0 0 0 0 0 0 0 0 0 0 
0 0 
##$DATE= 1617352221
##$DBL= (0..7)
120 120 120 11 120 120 24 19 
##$DBP= (0..7)
150 150 150 150 150 150 150 150 
##$DBP07= 0
##$DBPNAM0= <>
##$DBPNAM1= <>
##$DBPNAM2= <>
##$DBPNAM3= <>
##$DBPNAM4= <>
##$DBPNAM5= <>
##$DBPNAM6= <>
##$DBPNAM7= <>
##$DBPOAL= (0..7)
0.5 0.5 0.5 0.5 0.5 0.5 0.5 0.5 
##$DBPOFFS= (0..7)
0 0 0 0 0 0 0 0 
##$DE= 6
##$DECBNUC= <off>
##$DECIM= 3
##$DECNUC= <off>
##$DECSTAT= 4
##$DIGMOD= 1
##$DIGTYP= 9
##$DL= (0..7)
0 0 52 120 120 21 21 25 
##$DP= (0..7)
150 150 150 150 150 150 150 150 
##$DP07= 0
##$DPNAME0= <>
##$DPNAME1= <>
##$DPNAME2= <>
##$DPNAME3= <>
##$DPNAME4= <>
##$DPNAME5= <>
##$DPNAME6= <>
##$DPNAME7= <>
##$DPOAL= (0..7)
0.5 0.5 0.5 0.5 0.5 0.5 0.5 0.5 
##$DPOFFS= (0..7)
0 0 0 0 0 0 0 0 
##$DQDMODE= 0
##$DR= 16
##$DS= 0
$$ [...]
##$SUBNAM1= <"">
##$SUBNAM2= <"">
##$SUBNAM3= <"">
##$SUBNAM4= <"">
##$SUBNAM5= <"">
##$SUBNAM6= <"">
##$SUBNAM7= <"">
##$SUBNAM8= <"">
##$SUBNAM9= <"">
##$SW= 501.771253377433
##$SWIBOX= (0..15)
0 1 3 0 0 0 0 0 0 0 0 0 0 0 0 0 
##$SW_h= 40650.406504065
##$TD= 32768
##$TD0= 1
##$TE= 0
##$TE2= 300
##$TE3= 300
##$TEG= 300
##$TL= (0..7)
0 120 53 12 22 120 120 120 
##$TP= (0..7)
150 150 150 150 150 150 150 150 
##$TP07= 0
##$TPNAME0= <>
##$TPNAME1= <>
##$TPNAME2= <>
##$TPNAME3= <>
##$TPNAME4= <>
##$TPNAME5= <>
##$TPNAME6= <>
##$TPNAME7= <>
##$TPOAL= (0..7)
0.5 0.5 0.5 0.5 0.5 0.5 0.5 0.5 
##$TPOFFS= (0..7)
0 0 0 0 0 0 0 0 
##$TUNHIN= 0
##$TUNHOUT= 0
##$TUNXOUT= 0
##$USERA1= <user>
##$USERA2= <user>
##$USERA3= <user>
##$USERA4= <user>
##$USERA5= <user>
##$V9= 5
##$VALIST= <valist>
##$VCLIST= <CCCCCCCCCCCCCCC>
##$VD= 0
##$VDLIST= <DDDDDDDDDDDDDDD>
##$VPLIST= <PPPPPPPPPPPPPPP>
##$VTLIST= <TTTTTTTTTTTTTTT>
##$WBST= 1024
##$WBSW= 4
##$XGAIN= (0..3)
0 0 0 0 
##$XL= 0
##$YL= 0
##$YMAX_a= 7652
##$YMIN_a= -7333
##$ZGOPTNS= <>
##$ZL1= 120
##$ZL2= 120
##$ZL3= 120
##$ZL4= 120
##$ABSF1= 60
##$ABSF2= -190
##$ABSG= 5
##$ABSL= 3
##$ALPHA= 0
##$AQORDER= 0
##$ASSFAC= 0
##$ASSFACI= 0
##$ASSFACX= 0
##$ASSWID= 0
##$AUNMP= <proc_1d>
##$AZFE= 0.1
##$AZFW= 0.5
##$BCFW= 1
##$BC_mod= 2
##$BYTORDP= 1
##$COROFFS= 0
##$CY= 9.86611175537109
##$DATMOD= 1
##$DC= 1
##$DFILT= <>
##$DTYPP= 0
##$F1P= 182.46299112037
##$F2P= -745.623069630181
##$FCOR= 0.5
##$FTSIZE= 0
##$FT_mod= 0
##$GAMMA= 1
##$GB= 0
##$INTBC= 1
##$INTSCL= 1
##$ISEN= 30
##$LB= 1
##$LEV0= 0
##$LPBIN= 0
##$MAXI= 11.51145
##$MC2= 0
##$MEAN= 0
##$ME_mod= 0
##$MI= 1.244541
##$NCOEF= 0
##$NC_proc= 0
##$NLEV= 6
##$NOISF1= 0
##$NOISF2= 0
##$NSP= 1
##$NTH_PI= 0
##$NZP= 1
##$OFFSET= 243.8632
##$PC= 1.4
##$PHC0= -4461.271
##$PHC1= 217.4011
##$PH_mod= 0
##$PKNL= yes
##$PPARMOD= 0
##$PSCAL= 0
##$PSIGN= 0
##$REVERSE= no
##$SF= 81.0140731611343
##$SI= 65536
##$SIGF1= 0
##$SIGF2= 0
##$SINO= 80
##$SIOLD= 65536
##$SREGLST= <31P.CDCl3>
##$SSB= 0
##$STSI= 0
##$STSR= 0
##$SW_p= 25641.0256410257
##$SYMM= 0
##$S_DEV= 0
##$TDeff= 0
##$TDoff= 0
##$TI= <>
##$TILT= no
##$TM1= 0
##$TM2= 0
##$TOPLEV= 0
##$USERP1= <user>
##$USERP2= <user>
##$USERP3= <user>
##$USERP4= <user>
##$USERP5= <user>
##$WDW= 1
##$XDIM= 64
##$YMAX_p= 0
##$YMIN_p= 0
$$ End of Bruker specific parameters
$$ ---------------------------------
##NTUPLES= NMR FID
##VAR_NAME=  TIME,          FID/REAL,        FID/IMAG
##SYMBOL=    X,             R,               I
##VAR_TYPE=  INDEPENDENT,   DEPENDENT,       DEPENDENT
##VAR_FORM=  AFFN,          ASDF,            ASDF
##VAR_DIM=   16384,         16384,           16384
##UNITS=     SECONDS,       ARBITRARY UNITS, ARBITRARY UNITS
##FACTOR=    2.46e-05,      1,               1
##FIRST=     0,             0,               0
##LAST=      0.4030218,     0,               0
##MIN=       0,             -7333,           0
##MAX=       0.4030218,     7652,            0
$$ Real data points
##PAGE= N=1
##DATA TABLE= (X++(R..R)), XYDATA
0 0 0 0 0 0 0 -1 1 -3 3 -4 2 -4 3 -5 5 -5 8 -10 10 -14 15 -13 18 -20 24 -26 30 -37 46 -59 78 -113 207 -2175 -2550 7
36 7 762 2694 4594 5868 5283 7176 6180 6173 3871 3339 787 -78 -1886 -2037 -4181 -6982 -6268 -5622 -6569
55 -6569 -4473 -3924 -3726 -1515 483 1550 3571 4135 5022 5851 6450 5695 5219 3165 2685 1165 -1355 -3739
73 -3739 -3361 -4775 -7216 -4888 -6772 -5841 -4420 -3602 -2076 -185 1210 2687 4469 5754 5812 6630 6123
90 6123 5641 5772 2830 1430 1202 -2151 -2870 -4529 -5777 -5538 -4847 -6318 -5253 -3963 -3414 -1210 1466
107 1466 1380 3767 4404 5369 6014 6167 5190 4533 4041 2005 2259 -605 -2858 -3220 -3936 -5907 -5344 -6970
125 -6970 -5519 -3898 -4091 -2438 -885 715 1600 4170 4364 6190 6887 5698 5457 4139 2786 1325
141 1325 -231 -1675 -2652 -4719 -5215 -6037 -4308 -6007 -5011 -4153 -3022 -1285 787 1028 2698 4754 4707
158 4707 6905 5480 7055 4416 3983 2494 689 -750 -1867 -3395 -4043 -5488 -5993 -6196 -5308 -4684 -2958
175 -2958 -2278 -1006 1433 588 3752 4141 6067 5780 6005 5218 5123 2601 2057 931 -871 -2016 -3704
192 -3704 -4951 -5627 -5606 -5681 -4972 -2891 -2556 -1309 9 670 3598 4762 3975 5892 6918 6093 4141 3183
210 3183 1396 711 903 -1537 -2253 -3360 -4700 -5257 -5500 -4854 -4862 -3361 -3366 -924 1505 1150 3867 4339 4624
229 4624 5834 5007 4128 4896 3050 1496 668 -1543 -2911 -3705 -5803 -5407 -5502 -5661 -4385 -3632 -2948 -1399
247 -1399 -18 1870 3184 4339 3748 5638 7220 4510 3585 4314 2047 701 -103 -2996 -3073 -3335 -5342
264 -5342 -4388 -4805 -5997 -4066 -3722 -3070 -601 1414 1575 3581 4838 4528 5492 4958 5035 5520 2524 1358
282 1358 1031 -1376 -3034 -3387 -5364 -5024 -5111 -5530 -5018 -3638 -3755 -1383 -804 1149 2821 3426 5334 5429
300 5429 5359 5366 4873 4179 1669 404 -483 -2610 -1941 -4219 -6084 -5330 -5119 -5038 -4307 -2505 -2026 -409 582
319 582 2011 3137 4928 3256 5213 5574 4201 3317 2370 2708 1042 -2071 -2069 -3203 -3509 -5170 -4779 -5552
337 -5552 -4728 -2828 -3135 -2779 -593 1144 2400 3716 4348 4408 5722 4623 3791 3667 2673 955 -148
354 -148 -2643 -2794 -3436 -5689 -4579 -4373 -5016 -3131 -3047 -2164 -660 198 2290 3099 4271 4557 5880 4787
372 4787 4469 4067 2920 1681 75 -918 -2797 -2494 -4617 -5196 -3851 -4823 -4017 -1984 -3819 -1734 117
389 117 893 2232 3858 3367 4605 6384 5751 5092 3651 1481 994 33 -1376 -2819 -3648 -4242 -4394 -5874
407 -5874 -4927 -3176 -2456 -1904 -892 375 1788 3452 4028 4202 5046 5157 4985 4216 2935 1337 957 -80
425 -80 -1747 -2781 -4349 -5245 -4509 -4011 -3884 -4116 -3379 -2137 -469 1207 2284 3419 4541 4256 4745 4240
443 4240 3464 3838 2820 1807 1097 -970 -2098 -2834 -4038 -4702 -4330 -5586 -3927 -2409 -2495 -1727 658
460 658 1543 2710 3555 3866 4697 5037 3963 3523 3874 1167 341 -239 -2638 -3551 -4327 -4233 -4039 -5294 -4406
479 -4406 -3143 -2559 -2295 -147 1050 1699 3523 3906 4592 5673 4589 4190 3715 1776 657 342 -1868
496 -1868 -2819 -2681 -3516 -3608 -4965 -4794 -3144 -4013 -2056 -1096 1060 1107 2077 3804 3458 4707 4138 3629 3838
515 3838 3515 1453 1072 -670 -1564 -2969 -2851 -5124 -3565 -4641 -3564 -3364 -2245 -1923 471 1089 1325
532 1325 3006 3447 4880 4956 3651 3705 3820 2018 1078 970 -393 -2566 -3241 -3645 -4629 -3886 -4858 -4593 -2359
551 -2359 -1674 -733 64 1234 2137 3596 3418 5312 4532 3681 3177 2403 1022 1051 -872 -1632 -1864 -3642
569 -3642 -5346 -4354 -4726 -4715 -3385 -2733 -1474 -69 715 1479 3179 3957 4606 4645 4528 4735 4635 1782 1813
588 1813 957 -1880 -2418 -2807 -4467 -4309 -3836 -4521 -3623 -2772 -2260 -1442 1202 1720 1165 3480 3320 4367
606 4367 4266 3004 3804 4153 1444 -32 406 -1697 -2946 -3240 -4649 -5017 -5185 -2881 -3175 -2306 -1726 -155
624 -155 697 860 2676 3823 4213 4198 4806 3926 4139 2670 1540 476 -1019 -1385 -1634 -2993 -5253 -3951
642 -3951 -4043 -3601 -2674 -1746 -796 125 871 1438 2548 2327 3821 4755 3563 3315 1319 1605 509 46 -979
661 -979 -2085 -2592 -3494 -3795 -3796 -4003 -2560 -2507 -1616 -275 818 405 3428 3612 4263 5420 4111 3100 3396
680 3396 1796 -17 -108 -1600 -1886 -2035 -3481 -2958 -3152 -4135 -3740 -2444 -2668 -1093 -395 1297 1090 3575
698 3575 4370 4187 4830 2892 3619 3919 3275 499 -503 -1663 -2250 -1865 -4092 -2902 -3141 -4571 -4050 -1966
716 -1966 -729 -222 -89 250 2439 2408 3404 4338 4474 2826 4288 2733 1074 1043 -550 -1723 -2026 -2935
734 -2935 -4535 -2975 -4598 -3315 -1507 -2275 -1108 -360 -153 2270 2382 2056 3631 5123 4177 3928 3479
751 3479 2076 -31 263 -1561 -2351 -2731 -3829 -4823 -3141 -3959 -4014 -2598 -2784 -140 1560 1068 2692
768 2692 4997 3255 4288 3750 2638 4189 2894 752 406 -1826 -1681 -1796 -3504 -4743 -4004 -3383 -2681
785 -2681 -2319 -3187 -1299 152 -104 2172 2608 2199 3218 4883 2820 3114 3590 1198 505 399 -1812
802 -1812 -2680 -2109 -3817 -3026 -3357 -4107 -3307 -2560 -1859 -461 414 -330 3035 2204 2771 3370 4342 4039 3055
821 3055 2079 495 86 -36 -2123 -2466 -3520 -4547 -3393 -3293 -3130 -2576 -2400 -1748 173 866 1972 2041
839 2041 2678 3908 4342 4082 1875 3385 1138 1189 283 -1227 -2199 -1616 -2671 -4202 -4056 -3286 -2731 -2668
857 -2668 -1284 -990 1265 148 2838 2741 2699 4494 4480 3441 2888 2091 773 -86 -1031 -2200 -1695 -3387
875 -3387 -4039 -3378 -3517 -4010 -3391 -2239 -1394 -358 761 1072 4160 2406 2864 3340 2737 3153 2852 2108
893 2108 174 372 -517 -590 -1835 -3780 -3721 -2772 -3389 -3459 -2653 -2587 -522 1136 439 1581 2793 3616 3636
912 3636 3267 3389 2928 2266 1355 -392 176 -476 -681 -3379 -2826 -3293 -2462 -2851 -2293 -2876 -2259 173 1429
931 1429 710 2561 2820 3647 3886 3450 3306 3162 743 1645 -98 -2274 -2174 -1714 -3237 -3639 -3265 -4096
949 -4096 -3631 -2231 -1845 40 390 1300 1957 3604 2450 3376 3143 1752 3315 2053 279 371 -186 -2443
967 -2443 -1805 -2654 -3749 -3254 -3682 -3961 -2569 -1905 -1495 -1333 626 -102 2559 2027 2430 3473 3255 3248 2565
986 2565 2630 372 595 -320 -1609 -1935 -2446 -2611 -2696 -3734 -3131 -1286 -1489 -616 1747 79 318 2779
1004 2779 2102 3183 2535 2699 4557 2053 490 -189 -63 -1023 -1728 -1909 -3069 -3200 -2990 -2804 -1150 -2569
1022 -2569 -872 39 1350 969 2419 2688 2652 3267 3543 2574 2313 1365 1467 1361 -845 -2295 -1171 -1823
1040 -1823 -3228 -2264 -3439 -3105 -1660 -2237 -590 1058 399 1212 2197 3272 3228 4164 2007 3644 1868
1057 1868 -140 721 -26 -1224 -1400 -1590 -2394 -3435 -2688 -2780 -2689 -2224 -1749 -870 -617 791 1732 3072 2428
1076 2428 3052 3655 3616 2919 1716 -311 381 -635 -2419 -1317 -2766 -3246 -3010 -4424 -3631 -2918 -1887
1093 -1887 -1053 838 935 1218 2370 1446 3321 4150 2572 2711 2173 1606 74 -21 -2230 -2387 -1436 -3006
1111 -3006 -2492 -2273 -3302 -2710 -1884 -2774 484 970 873 1991 2694 2243 3258 3434 2641 2185 1200 812 554
1130 554 236 -1885 -1883 -2274 -3310 -2919 -2882 -1993 -2090 -1245 -344 -318 -130 1476 2156 2360 3151 2055 3170 3281
1150 3281 3150 1165 743 517 -1142 -1155 -1949 -2529 -2686 -3400 -3040 -2971 -2118 -2374 -496 -238 1440 2227 2383
1169 2383 2619 3642 2217 3031 2869 681 1030 1151 -357 -2142 -1668 -3006 -3376 -1767 -3464 -3509 -2254
1186 -2254 -1976 -514 463 817 188 1870 3560 2982 3244 2605 1562 2082 835 -40 1263 -1161 -947
1203 -947 -2197 -2586 -2879 -2223 -3962 -1992 -2201 -2208 -98 973 -525 711 3092 1611 3183 3748 3337
1220 3337 2434 1218 1595 811 -1127 -2573 -1227 -1657 -3756 -1801 -3204 -3559 -1983 -912 -1819 114
1236 114 1231 893 1992 2565 2754 3738 1948 1833 1886 1872 -644 618 -1571 -1820 -1895 -3277 -3490 -2913 -3013
1255 -3013 -2097 -1004 -2140 -200 391 -320 2002 2438 1076 2569 2820 2382 1921 2528 588 537 94 -1562
1273 -1562 -1035 -1891 -3595 -2137 -2554 -3099 -1996 -1529 -1197 368 507 1557 2388 1638 2374 3292 2122 2461
1291 2461 2084 1828 -98 486 -722 -1360 -1716 -2796 -2584 -2771 -2067 -2206 -1230 -1127 -236 1009 661 1302
1309 1302 2969 1494 2838 2511 1838 2177 2706 518 -100 -151 -746 -2117 -2488 -2127 -2687 -3730 -2062 -2487
1327 -2487 -1853 -1324 518 204 1602 2105 1900 3270 1996 2397 1112 2507 1032 559 335 -1338 -1331 -1604
1345 -1604 -2991 -2895 -1419 -3062 -1790 -1948 -411 -156 301 819 2417 3347 1239 1883 3725 2467 1931
1362 1931 2358 -165 1482 -31 -1000 -2577 -2823 -2357 -1123 -954 -3037 -2174 -1555 -1019 350 610 242
1379 242 1584 2141 2462 2817 2288 2900 2390 619 1536 741 -721 -1583 -1946 -2702 -2565 -2212 -2903 -2363 -1564
1398 -1564 -1500 -643 522 -137 481 1355 2071 2902 2414 2990 2092 1917 815 -991 355 -141 -1527 -1289
1416 -1289 -3012 -1506 -2175 -3140 -1063 -2555 -1792 370 1438 652 3058 1727 1480 2891 3033 3474 1811
1433 1811 822 366 592 -1601 -507 -1006 -2537 -3797 -2120 -1938 -1949 -1677 -1326 -854 883 914 2162 2057
1451 2057 1876 2758 3055 2081 1255 2759 580 778 -668 -1864 -1332 -1794 -3319 -1137 -2114 -3043 -1256
1468 -1256 -1282 -1094 47 727 2156 1639 1246 2339 2047 2591 1750 2206 1622 -645 755 -252 -1983 -1068
1486 -1068 -2260 -2419 -1448 -2106 -1932 -494 -1205 244 -51 -152 865 1430 2479 2065 3308 1851 2390
1503 2390 1320 749 283 223 -1270 -1556 -1083 -2613 -1476 -1641 -2735 -2403 -2343 -1184 478 -522 859
1520 859 2036 1931 1873 2494 1870 2312 1787 961 -421 93 -959 -791 -504 -2302 -3379 -2733 -2958 -2994 -948
1539 -948 -2150 -1576 611 383 778 1804 1817 2009 1108 2409 1291 1846 910 162 135 -464 -1845 -1498 -2733
1558 -2733 -2320 -2001 -3376 -2077 -1276 -1502 347 454 197 1533 911 1699 2420 2076 1805 1724 1878 344
1576 344 -980 -225 -1933 -1279 -2849 -3665 -2204 -3093 -2565 -735 -2173 -589 759 776 1123 1829 2412 2371
1594 2371 2297 1995 1315 1883 808 695 792 -1460 -1742 -1540 -2318 -2055 -2421 -2025 -1372 -2093 -369 -72 2206
1613 2206 263 1241 716 977 2471 2688 1277 981 1705 46 194 125 -773 -1027 -1684 -2221 -2579 -2816 -1953
1632 -1953 -970 -2319 278 -172 985 1308 1787 2940 1551 3108 1959 1146 1585 578 -165 -588 -614
1649 -614 -1452 -1387 -2410 -1952 -1847 -1844 -2704 -1878 -1688 -415 33 1007 1574 1771 1112 1429 1803 1638 1501 1892
1669 1892 99 342 -133 -1193 -686 -1895 -2382 -2155 -1544 -1850 -112 -831 -1513 1218 -631 -615 1507 1495
1687 1495 1060 2199 2172 1562 1531 -240 -319 562 -150 -1129 -1774 -3086 -2645 -1263 -2420 -887 -731 -1485 -9
1706 -9 480 -580 1272 1969 1288 2280 3091 1649 2310 1911 155 -416 -1617 -1750 -1648 -2517 -2742 -1427 -1424
1725 -1424 -2942 -1113 -927 -1207 200 820 1233 1357 1468 1874 2095 1597 881 2015 757 -138 543 -1093
1743 -1093 -837 -1639 -2294 -2381 -3046 -2167 -843 -402 -1847 37 1192 766 546 1090 2091 2277 2198 1311 1889
1762 1889 595 1 215 -268 12 85 -2021 -2165 -1262 -1839 -2031 -1704 -1783 -981 436 434 242 1386 1535 2164
1782 2164 2287 1715 2273 1295 735 1113 416 -583 -555 -814 -1106 -1949 -1198 -2248 -1817 -1318 -2029 204 1264
1801 1264 -102 1537 2202 2401 1765 2584 1224 874 1953 271 491 -297 -898 -1097 -1953 -1415 -1279 -1658
1819 -1658 -1851 -613 -356 -644 -724 -731 90 3028 1996 1584 2160 1127 1515 1654 987 146 217 319 -936
1838 -936 -1230 -1116 -2618 -1231 -1710 -1675 -715 -1447 27 -243 -550 1363 2553 364 1108 3253 853 595
1856 595 1646 -607 354 491 -1001 -2005 -1721 -3018 -1584 -1681 -2031 -2430 -177 -1602 -419 -428 485 2363
1874 2363 1619 981 1926 1884 2344 1782 767 1246 -45 -457 -946 -1127 -1019 -2129 -920 -1528 -1806 -691
1892 -691 -1338 420 1456 160 1497 2477 1472 1933 3335 2303 1368 768 -712 784 69 -292 -929
1909 -929 -1655 -2671 -1933 -2892 -2078 -359 -515 -1098 830 1222 570 1348 420 414 1876 1938 2225 2320 938 449
1929 449 270 -163 -692 -1203 -2297 -1991 -1450 -1180 -760 -912 -1451 486 -222 136 600 1043 1590 1210 1879
1948 1879 1215 1160 1027 1099 -224 406 -1127 384 -361 -2045 -1294 -901 -1787 -1164 -504 114 198 616 772
1967 772 24 1999 769 1189 1699 2103 1202 1643 844 143 151 -1193 -1237 -1706 -1378 -2128 -1862 -1703 -207 -701
1987 -701 -392 -504 266 388 1461 2995 857 2708 1919 940 1134 381 343 815 -707 -570 -2221 -2614
2005 -2614 -1720 -1396 -1615 -1212 -154 -1624 -875 887 340 2058 2250 661 1441 1750 685 706 1098 -601
2023 -601 1156 -898 -599 -976 -919 -1440 -1799 -1950 -2596 -1526 -11 -446 578 597 569 2596 1679 175 2524
2042 2524 2027 1898 1406 -729 -66 -557 -1828 512 -911 -2316 -1139 -999 -951 -137 -91 -639 -212 1537
2060 1537 -115 1432 1833 1024 1513 1652 1931 1156 255 363 1898 135 -778 -1354 -1200 -1342 -926 -1892
2078 -1892 -2460 -246 -1462 -523 -318 875 1604 467 1126 1499 1655 1245 976 1024 1341 451 -66 -871 -722
2097 -722 -1415 -2447 -1158 -994 -1847 -2093 -689 -831 -15 -450 -914 1552 2187 1341 1815 1920 617 1194
2115 1194 1639 -409 175 744 -2229 -1488 -1113 -1586 -1281 -1686 -1520 -1021 685 -681 904 -534 219 1470
2133 1470 1332 2006 1896 646 993 1772 547 1233 44 -230 -608 -621 -596 -371 -1073 -2187 -785 -885 -1710
2152 -1710 -162 838 -397 175 959 73 1351 1116 1102 609 2017 -245 -1154 451 -380 -539 -1399 -1717
2170 -1717 -1088 -383 -1912 -545 -1270 -1702 -940 158 452 1417 1042 1041 1917 606 771 1336 243 57 -598
2189 -598 -545 -1079 -73 -2164 -1075 -1551 -1443 -2121 -414 -1150 -382 452 -394 994 2130 524 726 1957
2207 1957 1260 1193 1080 161 594 143 -1172 -918 -1527 -2186 -1209 -941 -1221 -104 -1008 -845 141 1020 1111 2002
2227 2002 1090 1758 2858 1417 1752 1232 808 -348 659 -724 -648 -54 -425 -999 -1521 -772 -60 -1256
2245 -1256 -416 -629 663 129 299 2472 610 1504 2710 1920 1885 2164 471 -982 366 -429 43 -776
2263 -776 -1674 -1136 -1012 -2207 -734 -151 -278 -646 243 -129 709 797 297 1290 717 1096 2034 483 -574
2282 -574 -447 -578 -964 -688 -1390 -1151 -1256 -2012 -1045 -1108 -1702 -258 850 537 159 1420 1003 1475 1560 -11
2302 -11 1761 403 317 -807 529 -649 -703 -335 -1491 -1136 -720 -1876 -491 -155 -253 375 562 -451
2320 -451 915 1759 770 1433 2099 1492 1705 269 -42 274 -263 -785 285 -1052 -1726 -1310 -730 -1767
2338 -1767 -988 -757 -947 681 521 906 1504 1789 2022 2705 386 921 1689 235 -1494 -267 -1175 -1069
2356 -1069 -352 -1645 -599 -465 -1402 -517 -647 -601 -561 -21 414 1330 2229 427 1125 2214 799 1954
2374 1954 -369 -839 1046 -213 -142 -494 -1124 -1424 -1100 -1134 -717 -835 24 334 194 615 858 2635 1282
2393 1282 1144 1515 -134 724 -150 1211 -501 -194 -1111 -117 -367 -1799 -1421 -910 -2230 -716 -1063 -951
2411 -951 348 345 998 987 1164 749 922 2090 792 1599 344 -266 1527 -956 -1582 -402 -1279 -756 -822
2430 -822 -962 -848 -724 -928 -1029 258 280 686 -313 663 1678 1479 676 1658 1266 103 369 3 -982
2449 -982 -81 -232 -954 -966 -165 -1509 -489 -1075 -452 169 971 1009 1844 1205 475 339 808 1603 672 534
2469 534 -562 961 241 -907 -121 -1160 -763 -1089 -600 -588 -260 144 -492 740 -241 908 1429 1153
2487 1153 1319 1306 379 702 1114 618 32 288 197 -709 -812 -1659 -1568 -207 -1980 -1051 513 -1107 346
2506 346 407 -360 1295 1817 1290 1847 954 355 1608 344 -204 18 -754 -10 -387 -866 -968 -704 -1743
2525 -1743 -1586 -320 -285 -527 691 747 329 1031 1468 1889 1692 949 395 2105 229 -18 -318 190 -1646
2544 -1646 -519 -1249 -1507 -1103 -322 -493 -783 -361 -428 1573 209 791 1701 1009 1420 1844 532 496 511
2563 511 -628 517 175 117 734 -889 -777 -1589 -1555 -1234 -845 36 -557 704 1042 487 1232 1360 1357 1187
2583 1187 525 -347 2218 171 -125 615 -365 -73 -1070 -922 -1309 -1143 -1379 -1217 -976 -840 -737 -179 154
2602 154 971 2020 1052 1145 1844 -460 1217 633 250 393 116 -354 -630 -253 -809 -1075 -1170 -1529 -1802 -463
2622 -463 -816 880 395 -138 733 2161 -103 1897 562 683 978 -423 -243 1036 -1116 -1067 -633 -1035
2640 -1035 -1111 -761 -2165 -1186 -666 -534 83 668 1319 854 512 1435 150 821 364 94 563 333 887
2659 887 640 -1380 -70 -852 -1343 -558 -1089 -1816 -270 81 -312 905 34 957 990 378 1202 978 1092
2678 1092 677 1612 1589 -398 491 -33 -1485 354 -1234 -1316 -575 -1071 -848 164 -268 -1024 59 454
2696 454 613 1592 103 536 1037 622 870 1824 -822 -276 392 -812 -1313 -488 -2290 -785 -1349 -1569
2714 -1569 -380 -970 -1658 531 2272 92 523 1092 512 2455 939 -585 1147 294 72 552 -296
2731 -296 -893 -1208 -933 -667 -488 -656 -1132 217 -692 361 294 -168 292 1059 986 1297 2711 1293 -83
2750 -83 767 -805 96 604 -337 517 -308 -993 73 -435 -1511 -100 -1010 -281 1086 309 104 904 1245
2769 1245 -32 1878 1369 425 599 43 -577 148 -101 -732 71 -892 -1338 -163 -958 -76 287 304 -664
2788 -664 1111 437 342 2435 1126 876 2918 828 1097 148 -1075 -504 622 -374 -500 -200 -1230 -1254
2806 -1254 -813 -1372 -396 793 141 -374 -59 1218 1383 1235 -182 1563 387 801 1183 84 -341 895
2824 895 -737 -1076 186 683 -1814 -840 -638 -1121 306 -353 214 257 176 -189 2056 309 743 1774
2842 1774 907 707 597 489 1192 384 -1306 -1115 -339 -2016 -676 -808 -422 -947 -921 -725 -487 -382 -254
2861 -254 720 1064 527 1152 636 845 963 655 -741 -449 -875 -1220 -65 -1084 -2147 -1559 -1650 -596 -1012
2880 -1012 -746 515 -41 -108 638 373 1092 1078 885 669 397 341 -757 -690 317 -284 -750 -518 -2317 -592
2900 -592 -896 -681 -183 -721 -573 -15 602 810 669 419 1807 2166 993 183 435 1027 -451 932 534
2919 534 -1009 -155 -1160 -814 -970 -64 -1224 -701 440 -336 -209 -151 849 2200 82 1127 667 527
2937 527 -32 667 -56 -694 22 -783 708 -121 -598 -688 -1224 -1404 -672 -357 -603 -126 374 272 -308 512
2957 512 1675 1223 1569 -142 307 -381 -1454 186 50 -443 -204 -832 -833 -672 -1329 -1105 -514 -753 -1236
2976 -1236 1037 706 217 430 313 295 2112 985 636 1850 -422 142 -565 525 -2223 -799 -562
2993 -562 -1427 -368 -1213 -1582 -795 -380 -746 395 -503 581 1092 -114 2114 280 -234 528 1685 957
3011 957 643 -476 -1034 -151 -189 -671 -766 -1630 -192 -1602 -380 493 645 -278 349 1797 964 449 699
3030 699 846 774 17 38 -263 133 806 -990 -205 -915 -826 -98 -1033 -295 -305 -398 -1162 599 -24 890 1189
3051 1189 -181 632 1412 930 175 810 -229 162 647 -1186 -928 -2082 -1496 -812 -852 -1277 -96 -76 -188
3070 -188 695 350 -373 951 1531 -298 654 -108 877 -753 705 -383 145 -541 -1646 60 -1209
3087 -1209 -1164 -1435 -1436 485 -295 -330 167 -907 1539 1243 761 1260 696 324 -397 1017 473 359 77 222
3107 222 -613 61 -214 -1647 -493 -1080 -1355 180 -232 -777 1022 -137 19 1796 804 250 567 611
3125 611 740 193 907 -390 -277 -598 -670 -411 -1298 -489 -1114 -386 -1694 705 -20 -11 -173 530 -113 1125
3145 1125 522 484 1275 1031 265 -93 -535 -345 718 -306 -706 292 -675 717 -658 -732 334 -466 -1163
3164 -1163 329 860 -202 826 721 32 395 161 -243 1640 944 331 323 -105 244 518 -1259 -793 988
3183 988 -998 522 -688 312 -27 415 299 -805 -51 839 140 708 402 1073 562 865 -179 60
3201 60 485 -587 -901 -2628 -876 -142 -176 -882 -900 58 168 485 358 829 308 467 351 1314 139 1344
3221 1344 108 276 -154 -723 -1383 659 -366 -903 -1236 -986 -1188 -169 -1393 -487 599 20 731 1415
3239 1415 -51 508 1277 131 -55 1203 -38 -166 712 -1329 -1623 -42 -1037 -681 -1016 -300 -153 -430
3257 -430 63 105 324 -534 -283 601 -47 -713 1586 907 835 693 -509 304 -259 -1105 -224 -173 -391 430
3277 430 -487 -1170 -239 -256 -820 756 530 411 561 1193 294 1479 688 491 616 45 76 439 -808 -746
3297 -746 -299 -438 -930 -957 -988 41 -505 -1140 336 179 -937 193 463 41 610 1235 527 639 913
3316 913 -393 915 -209 -81 75 -1299 -1376 -291 -499 -942 605 97 -192 1212 -365 964 1328
3333 1328 1811 624 352 608 -131 397 755 -528 179 1 -733 475 -1374 -1788 -1691 -295 -851 126
3351 126 -527 484 564 1024 212 752 547 1901 691 397 363 1627 -336 1122 752 -1402 -1172 -1366
3369 -1366 -1409 43 -895 -552 256 -1348 -595 156 1001 -476 1200 476 293 1204 309 364 519 -227 -217
3388 -217 1662 -967 -249 -689 -1355 -780 -217 -1148 -445 503 695 -301 1122 451 1473 53 242 887
3406 887 1017 99 -484 1074 -232 179 240 -175 -37 386 -1113 -1199 -475 -580 392 -449 -479 1106 423 989
3426 989 1238 28 -175 320 667 -148 2 -198 -118 1036 -412 -538 289 -688 -968 -573 -1357 -1439 -61
3445 -61 -298 -386 778 1174 571 593 -397 130 1529 1310 13 540 828 -362 282 -1141 -146 -1089 -947
3464 -947 -404 -178 -1112 -1119 -75 -1033 -2 885 491 725 670 224 1451 417 -127 226 868 -1120 126
3483 126 -648 -59 -657 -1181 -1701 -162 -1367 246 -429 -292 840 594 -375 466 1603 943 796 1242
3501 1242 1106 -299 543 -677 -613 117 -811 -675 -1515 -714 -517 17 1017 -130 -906 -339 226 -182 133
3520 133 274 281 -597 1381 986 -231 1505 -584 -149 -433 -558 -1370 -365 -686 -302 -140 -779 -621 322
3539 322 -767 6 811 357 975 753 965 1242 633 -464 473 759 419 -174 300 -417 4 -1187 -331
3558 -331 -877 -213 -596 -43 -538 337 960 88 -982 537 1232 -378 1469 1316 668 40 149 406 -733
3577 -733 -738 -336 595 -1656 -1523 -12 -299 -1164 -908 15 139 484 -494 228 1814 795 -67 868 -170
3596 -170 -207 549 -821 -374 -254 53 -352 790 -1717 -364 -39 -317 -572 263 297 1492 405 788 -65
3615 -65 495 109 311 884 -659 -39 -66 -715 380 76 -551 152 -1 -976 -784 -257 -1079 230 302 373
3635 373 203 -282 -203 376 103 132 1242 214 -200 598 -558 264 431 136 673 -616 -1053 -91 -664
3654 -664 -193 675 -362 417 -122 378 467 332 -44 329 150 166 935 -308 1096 -304 -417 -367 -773 -544
3674 -544 -702 -1007 439 -1211 -647 -438 747 100 175 692 -237 1545 984 453 659 9 -94 322 -266
3693 -266 -113 164 -54 -990 386 -820 -297 -644 -713 -401 -169 -237 -80 667 -233 589 985 -120 -550 1789
3713 1789 219 -484 1183 299 -332 -493 -497 30 -736 -863 -214 -353 251 -25 -282 612 396 -1355 -521
3732 -521 483 1494 947 583 610 -446 176 -565 -66 -755 -414 -407 108 -2039 -782 -259 -1108 235 -152
3751 -152 281 -152 -700 400 788 604 313 -356 414 504 261 221 645 -8 -550 -542 454 -503 -695 -1006 -359
3772 -359 -672 218 238 295 337 675 -198 64 1325 206 277 391 659 -227 -567 -79 88 -743 -249 0 -1162
3793 -1162 -840 -831 -667 -834 153 509 412 400 -82 827 1332 80 241 844 -62 -126 541 -518 30 -192 -39
3814 -39 -600 383 -157 -175 -128 -1132 -479 390 299 -224 1596 -5 1061 1099 -139 564 -163 1237 139
3833 139 292 -428 1263 -853 -1459 1847 -1282 -934 522 -942 -1061 416 -25 -174 856 -639 875
3850 875 554 1826 1061 470 965 1245 -5 -771 40 -179 -75 509 810 -1104 -949 378 -443 -104 366
3869 366 716 760 1297 123 261 81 -440 749 -198 -800 65 -318 -1156 -354 -165 -208 654 -1003 -625 -629
3889 -629 -548 -109 710 -745 -420 1060 -334 401 453 -295 482 1327 -333 989 -208 -874 -212 444 -750
3908 -750 -24 -606 -1147 -97 -125 -78 257 -1171 -933 1052 32 -193 95 21 984 -349 912 108 506
3927 506 -36 -453 570 -929 -310 -309 -1056 40 202 -2094 -219 405 -877 731 192 1141 484 89
3945 89 283 739 1746 119 1269 378 5 297 21 -290 104 413 -503 -393 1119 -608 320 -846
3963 -846 83 1147 787 65 1274 917 414 407 204 -28 963 202 9 290 -29 -52 -1018 -1360 383 -545
3983 -545 -803 -1277 505 -593 -135 642 -349 1344 225 1321 -96 665 229 -844 622 -964 -1
4000 -1 -1222 -1451 -1115 -252 -1593 -603 361 -902 92 750 -376 -132 638 -390 551 1567 173 -360
4018 -360 1665 -16 1064 -18 -1003 -76 -302 -797 -269 128 -391 -715 -561 -1175 -268 531 -98 105 -511
4037 -511 194 1683 -993 395 190 317 -474 287 -511 230 1045 -27 130 108 348 243 70 -372 -805
4056 -805 -223 112 -707 -94 -622 560 808 47 625 -126 152 1122 638 -776 -417 -695 -830 -37 42 -1383
4076 -1383 -244 -627 -678 -89 -444 -922 178 794 969 1135 192 -32 1586 621 50 -268 401 80 -74
4095 -74 907 24 935 -486 -1405 -1014 -238 -444 -545 -417 -352 538 -182 324 698 -1104 862 600 -622
4114 -622 484 -251 -188 310 -47 346 588 -631 -1942 -1063 -292 -798 -777 -61 -517 505 572 145 441 -107
4134 -107 -67 763 -1 419 499 -984 7 427 -820 -1338 -1382 -881 -42 603 179 -10 397 -711 -510 -176
4154 -176 -246 461 531 -583 865 892 -277 892 1055 -592 965 -47 -1859 418 -666 -1502 -560 -556
4172 -556 -907 -420 -436 -1550 198 8 -454 1112 -324 291 -156 -588 228 -173 -345 -605 384 -264 8
4191 8 1070 -819 -368 1099 -560 -639 62 -1359 26 -443 -227 827 551 -339 280 799 59 192 1333
4210 1333 -74 -259 -388 -472 75 -99 -45 -599 852 -1567 1041 -564 -812 -317 338 -290 -88 -113 730
4229 730 1634 26 -1137 526 707 -1026 745 -108 -345 -173 -319 -863 -971 -660 -747 -232 319 876 -280
4248 -280 -713 885 -474 786 110 329 1472 521 187 -289 498 410 390 -192 109 -382 -67 -1199 -1440
4267 -1440 459 228 -466 -378 201 -823 1098 1917 1479 584 1313 481 359 -510 1023 639 -64 -613 -114
4286 -114 -369 -44 769 -147 779 240 -475 -1031 1756 516 619 -49 -73 1170 859 288 251 313 -208 -681
4306 -681 605 -669 -576 -583 -684 470 -439 8 -373 1085 -1611 674 487 -444 627 1284 -732 1564
4324 1564 551 122 99 524 -639 442 119 -550 -156 -1572 -1351 -182 -692 -888 366 87 -54 1124
4342 1124 792 -1322 -322 526 86 798 2 450 1310 689 817 -752 272 -1018 -385 -1187 781 -13
4360 -13 -1179 190 -325 -552 1044 233 -90 491 -747 347 848 180 -881 384 -37 -1209 199
4377 199 247 487 -226 -527 -575 -120 -489 -404 -355 -570 39 952 -517 107 926 768 -370 -355 106 1034 223
4398 223 432 120 560 -763 -775 146 -621 368 967 -829 -742 -75 -112 95 329 -372 298 296 -532 1457 -458
4419 -458 257 351 -646 42 -602 -212 -420 105 140 -1126 395 -50 33 398 -339 -78 477 64 367 -114
4439 -114 1057 -242 1253 -443 979 -57 -971 -577 -5 -362 -798 -484 -604 -102 690 -1025 -943 -371
4457 -371 -1085 -372 358 -318 125 -637 782 455 531 -243 378 973 -572 363 -288 49 -128 -738 -219 429
4477 429 -139 -588 -141 -269 -700 -404 38 332 426 -96 26 627 569 -135 458 30 -132 950 -459 -461 296
4498 296 -702 -384 -679 -351 532 1017 -226 -1065 -80 -190 453 322 -113 -187 571 -1047 438 645 149
4517 149 1430 -6 -1174 338 -55 -1076 61 -185 65 -636 -300 -787 827 -512 -125 -37 -230 -123
4535 -123 1007 -112 272 518 -435 348 -182 135 -1442 954 197 -1107 319 -606 -464 274 -114 539
4553 539 610 -307 -165 760 727 1284 480 -727 1290 279 452 94 -1123 -340 403 -588 -1122 806 -289
4572 -289 -1233 860 -32 -243 345 -38 568 813 -592 348 318 -303 104 606 -403 -507 1112 -398 -1011
4591 -1011 -297 -1436 -1161 165 112 -313 -557 687 -730 -426 -117 693 716 -79 428 1012 2 885 655
4610 655 705 -636 238 -736 -20 180 -240 -16 -59 -1698 349 -151 75 -293 -22 -127 43 -136 -700 628
4630 628 1030 270 771 -388 -753 240 -1006 -548 -313 -300 -867 -123 -32 -1595 692 -379 -755 92 -567
4649 -567 6 1808 381 617 -18 -152 -200 767 -519 -692 -412 -674 236 647 -983 97 -302 -410 621
4668 621 680 278 312 399 -98 966 -154 818 567 -253 -504 670 -677 -279 -231 -147 -595 354 -222 18
4688 18 401 -2010 133 56 -522 -131 1391 -631 -937 934 373 258 190 1013 48 87 -115 -217 208 -584
4708 -584 -748 48 -685 -793 -80 498 1194 -465 208 -301 76 -54 1161 289 -296 64 720 -475 304
4727 304 1089 361 334 1169 -369 -19 143 -162 277 -853 17 130 418 -706 115 -677 -287 2363 680
4746 680 1096 155 317 -242 461 -39 227 545 90 -38 1019 -1099 142 -271 480 -109 -34 -85 -135 290
4766 290 -143 545 404 -315 639 1248 267 896 93 -954 335 -366 -896 -118 -341 -699 383 -1040 -599
4785 -599 302 336 310 -345 754 1164 91 645 1073 1275 -126 496 1128 163 777 -23 -412 164 577 -82
4805 -82 -289 140 660 -456 -108 -105 1032 -365 -197 1107 653 399 499 825 -830 1310 45 10 -375
4824 -375 100 -528 466 -832 -997 -666 321 -415 -883 -460 -80 537 1038 881 1150 -627 -194 890 -104
4843 -104 322 1636 -170 41 301 -770 519 295 -555 1025 919 -1081 146 -638 -1006 479 95
4860 95 -767 635 -447 883 1478 826 -490 22 -323 -713 45 592 -1237 -223 -501 -1001 -407 -280
4878 -280 -940 429 -474 -135 -993 319 365 1361 -42 100 -13 200 371 248 -61 268 418 542 514 1123
4898 1123 149 433 -98 -1225 376 753 -825 971 -64 -98 1014 340 -1024 777 839 -860 -200
4915 -200 443 124 -499 -67 312 -239 -930 -701 -89 767 -24 87 -292 -748 -181 624 -299 572 718 -119
4935 -119 527 -1481 -872 1391 -515 -979 728 -504 -632 -794 -96 -1063 544 -727 -1001 215 -315
4952 -315 -134 99 567 1376 1377 -347 174 135 -510 -704 83 -2015 219 -17 -1645 -15 -802 -857 702
4971 702 421 -74 63 551 -1669 -21 -93 -347 380 252 1901 732 -365 -432 160 -255 -684 858 3
4990 3 -842 424 -555 -638 -19 -1327 -17 645 -992 -488 -253 4 16 -441 -289 -66 107 -802 -24 -36
5010 -36 801 -672 -79 -624 234 -199 -1156 -116 578 258 -487 241 338 769 -648 470 771 480 458 632
5030 632 498 679 219 -740 62 1096 81 113 214 -1052 -507 -539 251 -1006 664 7 -1576 1240
5048 1240 358 -423 997 -910 -170 995 -710 263 -1090 813 381 915 -666 249 129 -804 -766 104
5066 104 -1291 546 -874 196 -634 -311 944 857 316 -259 586 247 -219 -118 4 -334 -352 -871 317
5085 317 -555 35 -375 -344 94 -900 -78 -359 -292 542 779 497 1440 -564 -30 799 -122 375 7 -446
5105 -446 -679 -19 -489 324 -111 -171 -240 532 -481 -519 672 -733 1208 -166 -237 135 296 410 803 189
5125 189 -934 1227 239 -312 126 1119 -311 -4 398 -1048 499 121 101 -96 -350 -602 957 -191
5143 -191 319 -130 -343 557 1361 -520 32 813 664 -176 380 594 -624 -963 -773 128 -1087 -1483 -457
5162 -457 747 1319 457 272 -15 1198 -407 -1738 56 1301 159 865 77 538 240 546 -1036
5179 -1036 408 428 -258 970 -1075 216 -610 667 -1284 393 -26 -254 722 -406 -594 582 -573
5196 -573 724 -22 -510 505 246 -1371 -699 1104 -386 686 -1116 -46 180 -17 -342 312 1323
5213 1323 11 353 308 -852 399 68 429 144 -465 -687 -59 -84 3 177 -597 64 570 -829 -1026
5232 -1026 913 -88 -482 427 684 -75 680 34 -460 613 805 -1107 877 -189 15 424 -53 -202
5250 -202 68 -195 260 762 -535 599 490 -1065 922 -524 -678 -387 -107 900 -659 -458 -676 -791
5268 -791 315 -226 699 10 175 -339 196 -784 -79 158 -1646 647 -1150 439 497 97 366 945 1120
5287 1120 -1016 116 383 722 661 88 -530 477 -992 -637 -345 -355 238 -172 -724 -588 758 206 -59
5306 -59 691 -140 1282 284 -316 582 -416 -955 -75 -395 -594 -506 -94 304 1111 -301 -470 279 -126 -66
5326 -66 1467 281 -934 658 -204 249 -43 947 -86 385 -180 269 451 322 123 -183 -288 -1303
5344 -1303 619 53 356 42 322 720 -211 115 -462 1011 360 503 929 -983 298 841 -665 1112
5362 1112 739 538 -320 -221 -894 519 128 -90 347 87 -440 65 527 -1043 1315 373 -152 939 -364
5381 -364 146 35 -67 -312 1388 382 -487 445 -853 -483 1489 -492 -471 1542 -1450 659 518 31
5399 31 785 1379 -382 -251 180 482 4 1444 -918 348 424 -1029 -1021 23 -1021 500 631 -1039
5417 -1039 -842 -388 -353 604 329 -159 -175 -88 625 679 -301 -969 -538 -35 -396 328 -380 -703 976 -193
5437 -193 -428 555 -187 17 648 -815 -570 -350 -21 2 77 -77 146 553 -930 -228 -56 153 22 799
5457 799 -515 517 519 -146 -176 377 -380 35 -259 -239 86 -54 -1 1213 1298 -472 625 330 -83 163
5477 163 282 -983 798 543 644 479 448 -1316 -401 -10 -664 30 919 -492 -810 39 174 276 -1065
5496 -1065 328 253 816 -326 1018 -549 -499 585 -78 548 58 -1087 -231 656 -1243 46 250 -974
5514 -974 581 -40 -687 638 1084 -189 78 1097 -441 971 501 -68 770 -184 -352 108 -563 -638
5532 -638 -736 -368 -639 852 -883 -1103 -265 -1422 425 919 289 189 290 -178 370 698 -112 250 997
5551 997 273 262 1451 -859 -493 -399 -242 -41 392 -1256 -824 438 -911 28 73 -707 336 -330 608
5570 608 518 330 -421 -615 -799 -575 82 -347 -790 -310 -1445 -599 -740 -477 567 210 -909 -1040 645
5589 645 -743 77 250 632 251 1143 445 -423 1024 -469 -730 369 -1456 373 -588 -36 -146 -78
5607 -78 -742 132 307 -15 -522 2031 -482 168 -59 -328 -263 -258 -695 -516 -290 -95 198 207 259 -612 -130 190
5629 190 -372 -934 -905 -150 -103 -726 -578 423 72 139 -224 747 205 -8 -431 1082 -1317 775 544 -117
5649 -117 -203 31 -497 -683 1037 182 1039 344 163 423 789 25 -141 566 -410 1164 363 -1026 168
5668 168 -265 -422 71 157 -1074 1106 -138 -922 314 -192 -731 454 -504 -667 1204 199 -219 356
5686 356 -555 1247 -554 1157 -170 -403 300 -417 -269 -235 -359 81 -306 -502 612 495 431 986 45
5705 45 137 735 -281 692 525 -709 634 21 -372 119 398 -1383 -400 612 -250 559 -164 -1339 18
5724 18 -632 -1022 200 737 -545 724 298 399 904 32 -181 247 -593 137 1380 -1698 -326 355
5742 355 85 -114 1122 -698 -185 405 278 -818 678 24 54 274 133 -811 224 -40 -87 593 -587
5761 -587 -601 995 -627 197 849 -904 528 -314 -10 -188 -561 -391 -407 711 232 434 -715 650
5779 650 1068 -213 -433 -120 153 247 350 -537 588 85 -1105 860 553 -125 -290 -126 78 684 -640
5798 -640 569 660 -27 677 769 717 -781 -700 745 -141 320 185 77 212 42 -212 -11 -15 -747 56 -466
5819 -466 -1268 -797 289 -339 239 386 -481 210 188 31 601 549 51 292 790 -403 167 -692 -1199 881
5839 881 -8 -966 -503 189 -474 5 -601 118 430 -230 -313 -283 -106 -78 -57 -871 551 12 190 632 382
5860 382 -1247 267 -387 -611 -56 -534 -444 -205 -207 -725 446 185 507 1419 479 -728 878 674 -305
5879 -305 1508 -172 -702 590 972 -1134 839 -783 17 108 297 -918 10 226 -882 -462 -216 -578
5897 -578 -625 204 586 159 152 702 -126 810 29 -250 -621 -186 99 -1273 779 -124 -735 184 349 -1142
5917 -1142 -268 51 -127 169 345 -39 509 -285 -980 304 -219 -242 -396 277 -20 -477 945 -755 987
5936 987 435 -320 309 -2 248 -196 -438 -190 -184 -219 -272 911 84 -109 1988 -303 -867 533 140 -198
5956 -198 -128 -701 -507 100 -1625 -365 -3 365 350 1180 -455 -226 319 -138 -318 352 101 359 -156 -930
5976 -930 452 -149 -920 946 -615 -620 302 -542 145 749 -291 391 864 817 -702 571 54 -275 -11
5995 -11 -18 -121 -500 -47 -543 803 -965 -309 -677 -372 160 -486 -432 -115 302 -302 -610 422 -668 775
6015 775 1164 -876 1550 -164 501 385 946 -314 -1144 -178 -973 436 -45 -876 510 474 -962 -109
6033 -109 -660 -1071 672 429 -397 412 -280 -926 -403 688 75 -82 379 -755 -211 -421 355 -471 37
6052 37 42 934 -1281 -120 930 -682 527 -540 -438 63 1400 -505 -829 339 488 -196 765 -314
6070 -314 109 293 -1135 8 -324 246 -770 274 -1359 570 585 -159 668 -438 -346 585 1135 172
6088 172 271 108 936 653 -636 -843 186 -629 -993 -253 -193 -29 297 -448 -1069 536 -862 -166 466
6107 466 -144 567 874 395 841 -531 -1212 -909 -824 -485 805 484 -210 770 -622 -1011 -3 -126 78
6126 78 -462 1041 -5 97 -81 113 218 -316 -910 452 515 -4 -55 367 -417 805 -254 -93 -245
6145 -245 -349 -644 1149 -132 431 99 -510 -197 627 -539 770 275 -431 503 -327 -1175 1036 1164
6163 1164 159 259 821 -242 267 1429 -232 1286 97 116 13 745 -874 462 412 -238 94 487
6181 487 -439 21 -344 668 942 -64 695 144 -459 -380 1321 -469 -899 62 279 -22 220 -969 -644
6200 -644 621 412 -170 1229 848 267 671 -952 606 97 -758 -700 525 -417 -574 266 -1136 -543
6218 -543 60 -146 221 -251 -550 74 122 223 414 276 -689 1353 280 -354 1408 -862 -89 600 -263
6237 -263 -413 88 -205 -628 -919 -1466 542 914 -133 -144 564 -95 -611 -115 5 -420 644 -264 336
6256 336 949 -27 1091 1336 -358 269 902 74 433 1318 -236 -799 976 -113 649 -74 16 -544 762
6275 762 172 185 1057 -596 840 678 187 84 -705 -1021 504 25 138 1276 -1223 349 221 -104
6293 -104 1155 -2 735 907 1053 -222 331 894 808 -1067 435 202 -68 1519 418 -556 47 -907
6311 -907 -307 -417 -529 -171 280 -320 637 206 -1205 442 397 1165 576 30 -1023 -53 796 643 -13
6330 -13 665 -398 846 -732 -1822 -345 -860 -491 163 -293 -1429 600 -316 -1032 -450 -129 -525 -317
6348 -317 471 31 969 -103 297 326 -263 343 743 -660 274 414 -27 -612 448 -866 -630 -551 -350
6367 -350 336 661 -627 731 -205 -283 184 235 -1149 1274 72 1 255 -961 -48 22 201 -600 -580 -413
6387 -413 -1042 1354 -453 500 802 -6 -362 1632 -320 482 310 -981 -515 136 -715 386 -71 414
6405 414 818 135 -64 313 795 -620 249 830 1096 1298 943 -1759 553 158 -449 464 1052 15 -78
6424 -78 -274 -1398 -187 181 -1080 27 497 1246 453 476 -752 -318 497 -293 -628 -116 730 564 1491
6443 1491 -662 1113 591 -277 -167 -535 -434 554 -98 -590 313 -1105 155 387 492 -402 -636 -1176
6461 -1176 106 228 -637 825 341 -208 -100 650 -1061 134 242 -1008 -371 -399 -642 -457 -825 -56
6479 -56 428 792 -151 1338 -768 227 -146 -606 -1049 -135 -400 405 1134 -70 -292 330 -387 570 84
6498 84 -198 -874 93 449 427 -402 -992 164 813 -512 -1216 114 -372 119 417 -380 1039 149 -689
6517 -689 979 228 -126 278 892 -129 -69 -417 79 -247 195 -571 1154 -363 -910 1046 -821 -418
6535 -418 1019 -93 -64 1289 -676 1346 -217 -570 766 424 -143 428 285 718 -1417 -76 -440
6552 -440 1165 -271 -530 122 147 -665 538 246 -312 -81 -285 -499 579 204 -977 152 -103 -965
6570 -965 777 134 -1597 -163 920 -345 1357 -409 -814 278 -219 -65 -660 147 116 522 -147 115
6588 115 705 -420 -979 1514 -326 765 917 314 -952 637 -237 1704 487 552 306 527 -433 -462
6606 -462 191 -194 1097 74 -110 -350 -263 -1059 496 195 398 122 227 -1367 -156 156 -1759 218
6624 218 -219 -1059 -13 201 -2011 -228 -972 -478 513 869 -814 -146 -296 -384 229 -958 309 -840
6642 -840 59 113 208 102 -385 167 59 -1 863 -42 -412 -63 -318 371 781 458 -416 338 -53 210 -848
6663 -848 -1166 267 434 68 1082 -209 -716 180 33 -161 379 -107 -476 -157 1020 -587 -204 -212 -1228
6682 -1228 -487 -308 47 995 54 177 1191 -806 26 -380 184 -747 407 1043 -424 764 171 152
6700 152 133 454 -149 845 -152 -144 592 -178 -748 -920 -584 1032 -95 -958 71 -264 -692 89 838 -658
6720 -658 666 -307 -127 -353 -36 -510 505 -115 -453 1003 -108 -48 -11 1386 102 136 463 -36 1103
6739 1103 -722 -329 512 -1009 -350 -475 -400 374 690 -438 -447 967 -26 -381 -991 10 358 -595 -542
6758 -542 898 211 -254 343 36 -98 311 628 -473 848 -317 -441 796 512 -217 417 479 -174 130
6777 130 -934 -233 473 -567 -1018 -348 -533 -53 569 -1300 -130 3 796 -390 1101 -449 -597 1244
6795 1244 -1394 227 713 -906 416 1062 -18 -551 539 -1658 355 -123 -583 150 440 56 -487
6812 -487 536 186 335 552 266 71 -130 671 -27 760 -612 835 -1298 -347 476 -712 -529 301
6830 301 19 -1108 489 -641 -407 388 56 -352 436 553 -446 1139 35 301 917 -532 497 872
6848 872 -400 12 387 -1306 -370 -691 -712 20 22 -862 137 -32 -196 488 -1338 -1091 1490 -7 -10 434
6868 434 641 -1000 632 -69 30 -195 31 -818 -622 402 57 273 169 168 -349 -64 -64 488 -331 -487 1002
6889 1002 361 395 1463 49 317 225 -146 -452 -267 621 -844 318 344 -282 525 -349 -714 291 -91
6908 -91 220 812 -353 -925 -166 222 237 137 -533 626 42 -869 385 -162 -480 -68 -257 -225 161 -703
6928 -703 420 -21 -680 -555 925 130 -483 661 -567 -516 1020 -736 193 700 -554 -110 229 -892
6946 -892 45 -111 142 112 601 -522 -364 303 -717 909 -55 -199 648 -5 -968 -218 978 -1335 282
6965 282 121 389 -304 -37 -221 241 -12 322 1012 -176 220 745 726 504 1602 -481 -636 1097 650
6984 650 25 1271 246 -633 667 534 -540 -125 -231 282 -910 -420 -1104 256 -1033 -261 877
7001 877 526 -27 305 -336 435 220 -782 223 1096 647 -1208 826 -1015 -199 122 -1160 524 613
7019 613 -1052 570 -726 298 -501 580 -228 140 1663 504 -136 -71 -83 970 531 -191 325 -141
7037 -141 -2 181 -862 313 901 -345 -1096 1292 105 510 -1098 -219 -176 302 -697 -135 350 -371
7055 -371 121 208 -108 -1127 376 -230 -800 -536 -570 320 527 274 320 -127 -1176 -763 741 570 -93 -253
7075 -253 -320 -41 -761 -1229 -150 317 462 -851 -304 89 696 -919 191 592 -392 -774 715 686 -584
7094 -584 -229 -11 488 146 -237 681 1216 -620 357 402 -806 -705 680 -1012 270 252 109 -36 81
7113 81 -934 131 757 -444 659 -1345 -318 753 757 -1032 146 -572 215 726 -180 298 154 -305
7131 -305 -443 1081 -1539 -331 486 406 -750 -793 19 -247 -220 -802 -869 -163 -152 -531 -99 -343 609 870
7151 870 -1155 -810 10 -1198 247 445 -542 -101 266 -580 1029 345 -543 29 -564 213 889 1991
7169 1991 -446 639 1004 -1708 554 771 179 -197 -467 -371 810 890 -353 674 217 -132 -113 -368
7187 -368 149 -12 -96 209 499 484 107 799 22 -475 629 575 -348 211 221 -299 -340 -731 334 -129 -1073
7208 -1073 331 76 -985 519 -574 364 119 221 -158 1071 1745 638 18 805 94 983 372 74
7226 74 303 930 -358 260 176 -726 633 -290 -838 995 653 -661 -269 -749 -247 1053 -520 -616 99
7245 99 -809 -793 806 374 -458 21 -1332 485 803 -961 -353 605 172 -671 -455 -499 -998 395 -402
7264 -402 -175 572 -380 847 204 -1326 -702 750 121 624 -246 279 1410 -798 -1014 1024 -847 -983
7282 -983 487 -496 599 332 980 -945 843 996 -687 -779 20 150 69 366 41 -347 -980 -462 999
7301 999 235 -417 635 1313 -297 -221 237 352 1121 -1287 -623 -838 -106 27 -247 -429 -292 464 -419
7320 -419 64 93 -211 -748 -613 -1383 -81 -583 -484 487 456 93 628 471 716 -989 173 -283 754 226
7340 226 -652 822 22 -1080 812 775 -20 692 -163 -161 768 10 -677 605 -984 894 396 -210 85
7359 85 -428 -273 264 359 -78 426 574 -490 118 128 -189 1253 1109 23 920 -244 -568 1244 -113
7378 -113 -669 360 943 -465 638 -1278 -828 740 7 358 -336 596 -1072 -1298 -1334 315 47 -329
7396 -329 -144 194 516 555 566 -641 -73 1438 -1131 794 951 -235 480 281 -206 -776 782 -424
7414 -424 285 600 -485 -56 -743 -283 -161 -186 -1289 -580 453 -885 -979 247 -980 456 79 109 332
7433 332 238 662 -29 -403 -395 -200 -307 83 992 -356 718 70 -1255 -447 -68 -775 492 -639 200
7452 200 39 893 455 1429 826 -148 -523 -783 -494 40 -111 -580 -743 94 -65 228 -892 -1292 428
7471 428 -425 -139 348 -257 -692 180 -3 -350 -343 -279 -288 916 -380 17 950 481 -495 131 300 -736 364
7492 364 -477 -199 156 258 1205 -601 -521 100 745 -119 -168 441 -904 371 49 -91 192 74 -444 199
7512 199 -273 -260 -517 907 223 668 -558 -7 73 62 -448 256 -27 628 775 -306 195 198 -545 -580 1449
7533 1449 -1384 -534 -715 497 -175 -530 -1021 -483 980 -186 376 639 296 150 -196 -160 208 647 -1565
7552 -1565 717 435 -148 -427 1019 -523 -690 -448 -948 20 -248 1156 607 -184 -835 -239 -603 172
7570 172 -603 -324 240 -201 838 -1084 138 11 317 454 -309 -580 -361 480 42 1291 538 -31 -16
7589 -16 845 -30 759 -144 -382 918 81 -107 259 203 -245 -229 -917 -895 963 -1254 274 1711 -637
7608 -637 -58 979 -729 -200 -504 -1462 -144 1516 -473 176 -660 -443 -235 -638 -616 -57 597 -496
7626 -496 -243 289 -142 -219 -697 -466 835 -256 -867 627 -675 28 1017 -19 24 -109 -41 219 1038
7645 1038 -573 -372 913 408 -302 400 -1570 96 26 276 -818 480 -307 -712 -93 -89 1179 -387
7663 -387 -188 1357 1440 -581 1031 517 -592 -404 63 -503 546 260 -1502 89 106 -687 149 -83
7681 -83 -428 600 -349 -436 92 155 7 1652 -109 593 773 -396 -786 575 -278 -861 -228 225 -671
7700 -671 353 -483 -479 1099 -313 324 -573 -870 145 -132 -108 530 -435 -78 535 -190 -226 433 10 -995
7720 -995 250 26 -140 662 82 380 -390 -32 -29 728 -242 -652 -475 -1155 213 663 -125 -1198 -134
7739 -134 202 -444 515 -609 -189 589 -773 624 883 -372 968 545 98 486 693 -708 472 493
7757 493 121 612 871 -861 422 749 -375 -398 598 -1086 403 179 -747 -889 169 -920 247 646
7775 646 -237 473 -541 -408 51 742 -746 -90 360 16 25 680 -1165 316 -724 179 -323 40 -365
7794 -365 163 -86 -257 1160 -491 -354 222 669 1017 -1099 -604 1135 214 -1095 190 833 -743 -361
7812 -361 336 -478 -347 -43 -613 358 -547 206 -664 404 -140 63 217 -476 1814 682 -633 -3 -181
7831 -181 -712 475 -814 -769 -574 -1200 -79 854 -221 -528 -419 -1845 55 -611 -250 167 855 -451
7849 -451 201 -111 -603 314 1550 -603 154 2 -618 -491 862 -241 -1186 379 20 82 635 768 314
7868 314 123 -695 1085 1105 -131 -495 1113 -24 94 410 -1087 553 389 -479 494 -13 13 334 -931
7887 -931 506 253 426 -643 -886 -108 403 524 89 168 -164 752 176 973 -621 109 510 659 -97
7906 -97 674 -356 -872 1086 -404 -254 647 -304 162 886 148 820 -265 16 269 -460 -912 407 424
7925 424 -1538 1625 279 -1331 290 -246 86 1025 427 87 384 193 -648 550 -246 608 -112 -171
7943 -171 115 753 -167 268 100 522 -112 1021 -912 646 31 539 476 -340 524 -181 1300 7 -760
7962 -760 492 -638 2 342 840 844 366 489 -87 -274 -441 19 801 -351 90 -693 -911 470 1460
7981 1460 -1197 568 576 -129 1463 -720 -480 987 -1010 -519 687 -786 -243 621 37 -770 833
7998 833 328 -385 919 -53 -252 -473 -181 1563 1515 12 -888 321 -127 663 450 -173 461 514 -302
8017 -302 357 -65 -58 778 -1464 -99 -362 256 738 668 -581 -725 391 235 -633 136 -677 -346 478 -304
8037 -304 -260 1380 483 -614 -631 204 -268 -409 169 581 627 -343 333 -248 71 -250 294 -175 -472 -15
8057 -15 -1084 -484 -378 -238 481 1120 340 437 389 -201 458 -863 -410 704 759 147 257 -163 433 1011
8077 1011 242 -503 1696 40 -137 1011 -18 181 926 390 12 943 -488 42 411 -775 -644 1039
8095 1039 -402 -512 757 -484 587 360 696 -146 585 726 467 1587 -19 -307 80 264 702 517
8113 517 -53 599 -91 -355 363 722 -323 -481 -230 74 -227 1469 -1160 433 46 -839 106 -101 911
8132 911 88 -91 -1217 -44 347 -879 570 -7 79 -217 810 22 1846 -57 336 353 -609 274
8150 274 80 -87 -13 1262 46 1195 772 -959 837 846 -204 -320 1138 -763 187 -166 -930 -508
8168 -508 -122 583 370 808 -1064 -241 -761 370 252 -459 -1112 -760 -439 192 1134 45 -609 585 1242
8187 1242 156 -76 761 -340 -312 -1007 791 -104 -194 -198 452 340 -538 1 -81 -1078 84 -544 703 -72
8207 -72 -491 -917 299 116 28 988 -550 79 29 404 50 11 264 343 -75 -1300 -616 849 -475 148
8227 148 -93 -292 777 -271 -405 -17 673 -335 87 -867 -628 736 37 -193 -97 -812 -62 -361 -1278
8246 -1278 224 -176 121 -977 -25 -220 -462 515 91 675 -27 -748 -72 -681 -435 -250 -383 -1698 1111
8265 1111 -619 -132 292 771 553 310 627 244 -557 -476 369 929 1159 -64 -797 -769 -125 655 416 155
8285 155 134 365 -1236 -152 246 33 962 -1 -450 383 -143 596 714 -475 160 555 -639 615 132
8304 132 -1175 -632 -312 104 140 -11 201 -361 204 -473 810 517 -275 707 620 560 292 -134 386 106
8324 106 -270 -1301 212 -526 128 938 415 -274 -127 -780 -855 132 -425 -40 495 -771 355 747 -688
8343 -688 63 319 -661 -181 133 -53 24 135 -1180 125 -94 -1660 -334 683 -161 98 258 -1151
8361 -1151 -366 268 -172 766 1304 76 -457 -459 -912 251 -343 -452 591 -93 -1433 296 858 -2169
8379 -2169 718 112 849 682 -514 -141 1113 -561 -911 42 -397 1036 133 -294 -542 -355 -467 270
8397 270 953 -510 -399 1060 648 448 -638 363 -44 525 -30 -541 919 222 -124 -142 -409 38 -638
8416 -638 -29 -302 147 152 329 254 583 -225 -235 813 -740 31 -567 955 -1067 -1015 -597 -695 -1059 928
8436 928 -1 269 -200 608 458 992 -243 -63 1271 -393 -1472 1184 -229 -445 -111 51 228 -315
8454 -315 73 860 346 -451 -399 552 -449 -154 239 -638 98 700 -371 -278 1549 102 -255 1397 -94
8473 -94 -75 627 -53 180 301 -636 -794 174 -1086 845 -344 227 114 -411 -185 516 -62 63 -7 281
8493 281 194 228 -493 -402 -68 297 25 -823 -272 -331 -493 58 -156 1184 -224 539 129 -418 768 528
8513 528 -644 -415 -262 -92 113 -339 -537 -560 -53 -683 -162 203 -818 401 242 -1034 -390 -305 -162
8532 -162 594 229 -392 -122 826 45 -252 -283 52 242 -853 -243 189 -436 269 1032 -188 -1097 905
8551 905 -902 -300 97 -981 238 867 -264 -839 31 -413 399 -825 -1122 500 564 -973 92 -597
8569 -597 -273 -489 106 -178 -828 -1201 -463 467 173 -776 388 333 321 231 626 -560 1046 -840 -235 222
8589 222 -1181 682 -258 -326 -27 -122 -1060 -755 -1352 -262 436 1170 -743 -344 69 219 -280 1182 48
8608 48 489 835 -805 545 -116 -647 569 182 -516 -242 -807 -1146 363 645 -1179 -1053 136 -552
8626 -552 159 -78 -431 316 7 -872 281 647 40 564 -131 -241 345 7 0 674 664 -432 740 242
8646 242 52 -605 -589 -213 612 -600 -271 65 368 239 529 -730 -69 625 576 -424 607 -620 -411
8665 -411 651 -1073 492 138 -332 368 281 -711 -461 -1305 -716 90 501 1051 -960 -281 463 -601 514
8684 514 92 -109 686 -1288 392 -1042 485 -308 -881 -575 451 212 -662 127 -663 -357 1270 -160
8702 -160 -761 1162 -964 658 320 -273 289 -390 120 95 -40 130 -439 566 -286 850 649 -229 -4
8721 -4 -657 -579 279 -658 64 204 573 941 1532 -641 88 -205 -250 -841 279 195 -927 1264 884 485
8741 485 472 -422 282 756 38 -800 563 -373 -1091 1211 -919 9 -528 -753 140 449 -307 870 -194
8760 -194 308 685 -85 -353 134 85 -712 -291 326 -189 708 580 -71 -142 344 -588 608 279 -59 1074
8780 1074 83 -151 -79 -546 -406 -268 391 -236 492 -1127 -83 1324 525 -1 29 -331 740 47 -341
8799 -341 -42 -464 -508 346 477 -311 -726 169 -131 -240 -946 -52 -641 -772 413 -23 601 -353 -165 134
8819 134 -534 348 625 -191 164 -709 478 278 -872 -1630 667 355 -212 715 -291 -563 -444 -999 519
8838 519 888 -236 279 935 716 -659 581 -1156 -1111 564 385 6 -747 -171 439 179 -1595 69
8856 69 1387 -188 -653 600 -724 -385 -478 -747 1099 -496 -390 1228 173 -216 342 -272 -1540 -497
8874 -497 -117 487 30 1118 -192 731 -195 876 442 -364 -104 -729 -643 -457 -141 -380 -554 255 -290
8893 -290 -658 -676 -61 -274 1000 -626 -425 -351 -786 -367 -96 -68 -666 485 275 -294 -228 -10 -51 -887 427
8914 427 146 186 -668 227 722 -587 431 216 -751 -1294 22 31 1095 87 -1564 -62 177 -535 180
8933 180 475 -239 1500 -841 -526 581 301 -736 500 54 203 639 -433 529 619 42 1149 62
8951 62 23 1287 1110 243 160 740 -186 -223 1850 -286 813 1188 307 120 162 -133 -334 128 -76 44
8971 44 -584 -903 -60 -534 -135 11 888 -226 1045 147 -510 1114 -269 685 370 -147 248 125 313
8990 313 -1448 -8 501 -666 64 566 -516 368 -156 -894 1017 -1444 174 352 224 179 944 -1143
9008 -1143 -1159 204 1404 219 154 -28 198 712 -720 345 -122 -437 1260 -75 564 386 -402 -72
9026 -72 942 -432 -370 -791 392 189 1390 -138 -86 235 -451 986 -276 -598 -65 1186 -227 -1960
9044 -1960 -221 -1624 -372 35 -1999 -1422 142 650 -242 1017 -1340 -544 420 -528 164 -47 -9 181
9062 181 605 -339 -181 852 -277 35 758 -634 479 37 -662 485 1365 -755 264 -318 -57 313
9080 313 146 -505 301 -238 -176 746 -127 -481 620 282 -690 -127 -768 -917 1265 -721 -1 98 -41 199
9100 199 -366 278 -307 421 -804 -110 220 840 397 694 -569 471 506 -382 460 -371 -592 93 200
9119 200 -686 988 -389 84 742 -844 -539 -58 200 -213 473 37 -450 -277 -1336 -220 -296 711
9137 711 -457 -269 -669 -51 341 -1234 163 728 -753 114 786 -77 -283 545 -1084 654 173 -285
9155 -285 -299 156 -928 465 367 -463 -135 120 437 640 765 -615 -304 -352 -218 530 -325 -915 24 992
9175 992 304 908 90 -1088 -297 314 290 -145 37 -330 213 -602 -661 -435 376 -619 -1147 289 -94 -92 117
9196 117 -154 115 375 81 -608 -1374 -444 1020 -250 332 602 -394 485 -818 -432 -130 -25 -718 237
9215 237 -650 -389 144 1286 -581 818 -671 -598 -373 -647 -689 360 -195 -317 381 274 -553 -324 -722
9234 -722 -159 1280 461 -270 -613 -42 -579 992 -653 166 604 -30 85 -140 446 505 1979 -86 -47
9253 -47 98 -299 -127 1174 -1063 -280 -311 -602 -404 1646 -450 -216 1580 -649 -183 825 -884 260
9271 260 678 -762 158 -328 -61 23 -293 -201 349 700 320 376 -885 -464 959 -584 -233 -432 373 -479
9291 -479 -146 -308 427 1220 253 -211 852 -253 -490 -149 -72 66 1344 -831 -882 1726 -271 625 453
9310 453 106 77 367 -417 274 -701 -836 457 208 -438 646 290 -985 771 -77 -1088 837 109
9328 109 -53 832 -449 -1436 -188 257 104 593 -452 -719 726 -223 -860 669 -164 486 258 -89
9346 -89 -413 -475 233 -324 948 323 744 195 -695 1365 804 -321 -728 856 -1317 390 240 31 246
9365 246 1325 -691 -135 542 -1293 -90 549 -191 41 308 488 530 280 -793 -94 -371 -450 562 64
9384 64 -61 -330 -769 -1450 822 143 -627 204 -134 -435 548 687 279 1141 -1179 -1168 309 701 317 -356
9404 -356 123 12 17 334 -156 381 -660 -115 -134 -845 514 272 -615 -470 770 -1092 940 607 457
9423 457 -4 375 -696 246 357 323 -314 -246 -172 313 -294 518 -128 -14 19 334 -235 201 442 -344 -342 -597
9445 -597 -267 262 595 -379 -404 -83 -826 475 -58 -31 130 -349 -750 -180 707 452 1031 411 -1170 107
9465 107 1007 -183 151 -125 -1370 -550 -90 -990 368 120 -67 516 -457 -921 494 -488 44 -557 -187
9484 -187 60 -42 -41 -411 297 76 359 269 -889 -1055 730 -134 937 642 300 341 1090 -582 -908 -428
9504 -428 316 -403 906 -1538 -743 244 -411 718 686 -1406 33 147 213 -415 45 -629 21 962 1
9523 1 250 153 -718 -585 -351 45 -63 -754 -1295 347 821 -395 795 485 523 -329 -1327 -789 752 -124
9543 -124 -398 367 -99 128 -117 -130 130 1224 313 -37 -272 -1253 35 -345 -365 -466 295 -90 -253 162
9563 162 -405 -466 142 -81 366 1208 -286 133 611 -595 198 -1077 671 730 -605 -71 -178 960 -656
9582 -656 667 -368 29 931 1346 377 352 787 -768 -30 -426 339 292 -476 -635 -70 -334 474 62 -441
9602 -441 137 357 -627 499 310 -276 -475 796 -769 -1208 -298 -347 -121 321 -366 1177 -282 -732 211
9621 211 625 231 -519 -8 -178 1503 608 -981 305 -381 -501 -182 554 222 -293 89 -187 -513 -704
9640 -704 56 -871 936 -24 1141 -227 -460 1158 -718 -953 915 -731 -414 604 -125 109 -455
9657 -455 -765 -515 -292 -598 85 1054 -86 200 1319 191 -158 458 -894 374 -16 -659 161 867
9675 867 -371 -131 -180 -507 -550 -751 -124 -378 573 -266 223 112 -259 551 366 -568 1296 -1602 -8
9694 -8 929 38 -1082 332 123 -8 -69 -412 883 1023 -915 -483 368 -103 515 456 -790 896 -38
9713 -38 558 573 528 177 -75 -135 -234 -233 -760 -407 -710 615 318 502 -191 -1097 -165 119 -1194 -423 -81 -1166
9735 -1166 375 -1326 -400 122 -758 -711 827 758 1374 1774 285 67 472 -341 -136 912 -397 427
9753 427 878 -27 -563 469 -384 -238 -253 -1213 257 -537 13 1282 1518 150 -162 899 -37 305 1009
9772 1009 468 -744 458 -852 -948 -324 225 201 -1030 -998 384 385 -30 194 462 -158 559 -693 -1334
9791 -1334 980 747 196 506 637 -1411 730 -504 -162 394 -1287 -791 838 -604 -180 1092 -575
9808 -575 -644 298 187 -676 511 -347 -456 99 -107 -677 -598 -1342 250 -179 470 359 -261 -132 95 70
9828 70 -765 38 -74 -1159 1290 551 -67 735 -370 -1061 303 -545 -1166 -332 -228 66 659 -630 178
9847 178 201 -219 -567 -415 -459 -915 781 -904 -387 1067 -523 -1509 507 -1272 -981 160 -437 789
9865 789 866 -466 -604 -96 -263 723 -51 777 -733 -601 -371 32 280 121 560 -41 -13 205 -970 -353
9885 -353 418 -713 -466 1106 -10 -599 922 -688 -484 -266 -245 -720 319 295 -394 440 -365 -1185 388
9904 388 -93 -297 1196 -11 -319 1063 -617 -226 -330 -1236 426 426 -283 473 -190 -313 -447 254 -28
9923 -28 -99 533 101 81 448 -576 730 -591 -284 644 -134 200 172 -331 -205 958 -1212 439 1211
9942 1211 235 -778 1526 366 -231 623 -800 64 736 -31 -719 578 279 80 -678 708 -970
9959 -970 115 -1404 -265 48 -692 -189 -445 -750 -537 279 -1883 1577 162 -519 -92 -236 -986 262
9977 262 -730 -127 1024 331 -1716 689 44 -283 784 444 99 629 -289 614 -153 459 357 711 246
9996 246 -427 798 289 261 577 -135 -1269 167 870 213 966 550 -373 302 390 26 280 -585 113 958
10016 958 504 953 24 -291 932 -353 -1167 777 -65 -924 941 269 93 -331 602 -364 -1053 -79
10034 -79 -550 20 1189 -982 -1044 -852 -186 144 -884 -375 542 315 -557 1292 -881 -621 859 -362
10052 -362 9 97 -487 -637 138 -476 380 745 2 -729 678 438 157 792 99 819 -185 -203 966
10071 966 1408 -866 1520 -103 -689 818 846 -1261 515 190 -73 469 -125 -784 80 539 -64 112
10089 112 -185 -315 309 -114 387 85 -18 -363 239 488 -576 260 -498 -419 1164 -1124 -178 -156 -802
10108 -802 -88 171 -157 -147 153 -419 34 81 -559 -361 204 -286 -187 1042 -1103 449 -831 -1481 -863
10127 -863 1201 -596 52 592 -617 -758 -331 76 320 433 -755 350 -1010 -302 -269 -325 523 -669
10145 -669 471 158 -82 -846 -237 -20 -323 344 -326 -807 523 1097 -1136 -888 1059 -307 840 843
10163 843 -423 760 366 -419 1046 -432 -286 1747 258 -821 796 843 355 408 464 -1550 988
10180 988 956 -717 103 -23 -22 14 199 2 115 59 -778 130 334 198 715 -53 -745 201 -636 -36 91
10201 91 -1349 168 79 -710 -57 352 324 692 -1 -193 -82 -150 -937 243 554 -855 523 261 -208
10220 -208 753 417 -689 -94 622 -190 1287 -23 -688 796 -888 -133 640 -99 -260 -265 -892 -372 139
10239 139 -788 -510 700 179 -1208 -193 -57 -863 1301 -504 -491 -564 -1106 -370 413 21 -215 1190
10257 1190 69 -47 -208 -1977 -185 -151 -433 466 909 -26 -116 -341 -1014 342 366 -570 1091 834 -597
10276 -597 -176 -539 -530 427 103 -338 945 346 -1090 741 371 664 -40 -315 -807 312 643 -887 887
10295 887 -738 5 -636 130 -48 -95 -688 -129 178 -340 -159 543 208 -1126 394 -225 277 97 95 -317
10315 -317 844 301 -159 984 -171 464 552 -236 -247 -126 -209 -117 -940 -26 -220 832 471 517 275 -386
10335 -386 -41 -866 -761 -131 417 -505 766 478 36 510 -125 -265 223 116 -484 507 30 660 267
10354 267 58 532 346 3 359 590 -1457 144 577 -1220 -82 562 36 -595 9 -601 419 -684
10372 -684 -1208 -379 992 57 -90 -514 -703 760 233 -671 185 -719 207 15 632 248 236 -405 -41
10391 -41 1991 92 -693 544 -617 -861 1410 -997 96 564 219 1172 248 -1176 -1079 620 520
10408 520 -543 -420 -524 -850 572 -128 761 -34 -1273 119 -32 -261 -1056 147 -1838 -444 137
10425 137 726 830 -324 -367 -127 -249 855 310 -171 154 -657 -134 -1176 970 508 -449 485 -615
10443 -615 608 656 295 -820 27 -429 -914 -634 224 -333 426 -1219 162 814 216 213 -93 -836 1468
10462 1468 -43 694 1041 -206 202 1084 475 -757 -392 223 -86 1040 935 -748 -253 29 -704 1141
10480 1141 806 -194 639 78 372 92 -788 -239 -549 283 337 349 177 -602 1152 15 530 -589 -786
10499 -786 -740 25 -57 -195 300 -686 -571 590 -9 74 -104 358 -524 464 -1044 -280 317 359 908 483
10519 483 -1271 -1174 -28 -1078 842 107 -193 616 1238 -425 1577 666 -301 427 -617 -395 -151 244
10537 244 -306 941 -645 402 -108 272 419 -506 761 -378 504 706 -212 664 -145 20 -361 -181
10555 -181 -430 480 -740 187 235 -793 664 -54 -331 -208 154 -434 -471 -319 79 -102 -202 -1029 1371
10574 1371 -476 -104 470 -230 331 -2 400 -960 493 -585 -713 1059 -326 -177 610 661 141 921
10592 921 -861 -217 204 -554 209 525 223 36 802 345 28 719 -713 -193 727 -1443 -14 146
10610 146 -590 -116 -182 -562 -197 -279 -483 396 549 -361 636 612 -783 326 809 -685 -221 509 -378 -238
10630 -238 -123 -1132 521 1140 595 599 640 521 -555 -258 441 159 -363 -1064 -1149 -241 -833 -183 -855 -321
10650 -321 54 -1049 -318 486 85 16 1447 -402 -236 456 -488 522 786 -404 70 803 -459 116
10668 116 235 -1683 -691 -299 -723 -447 264 -837 706 273 -122 1373 -635 345 25 -175 -154 271
10686 271 150 -1176 1240 128 -897 49 -1099 394 484 451 228 334 173 717 359 -1185 836 611
10704 611 -260 -446 964 -50 57 -113 261 244 654 -279 -449 -15 -667 328 -334 31 277 366 -481 726
10724 726 92 -394 -483 907 -443 584 -498 -16 1029 -76 -226 -280 -959 -522 1454 -154 -243 29
10742 29 91 106 47 -221 154 707 -258 146 682 -328 -395 493 302 -781 477 -851 -453 214 -611 321
10762 321 385 -811 243 1086 -786 490 1312 -243 408 -356 76 706 554 137 924 -730 -1104 1031
10780 1031 281 -1174 1157 374 -578 -37 -247 190 880 -676 -223 66 -659 16 862 -38 -468 731
10798 731 -833 -141 505 225 -155 892 -160 -711 346 -1151 -264 256 -267 -160 610 -542 -996 -48
10816 -48 -712 -437 -35 -459 980 -24 -406 123 -436 -787 459 163 -1041 598 -235 -574 196 -212
10834 -212 159 -107 -166 236 -897 168 -483 48 914 -281 624 -390 256 462 -733 556 333 -202
10852 -202 -789 1379 -71 67 437 -69 -629 -351 -246 -364 -520 1252 -230 193 -568 92 555 -815
10870 -815 128 -365 -909 642 129 -254 188 704 257 -883 1227 -618 -468 387 -538 585 241 -572
10888 -572 979 -182 -769 125 -428 -81 -557 -538 -247 -211 633 446 -690 -144 -967 958 -550 771
10906 771 -47 -636 -332 296 -462 692 707 708 625 -657 -402 335 601 725 1031 -865 -206 115 822 -449
10926 -449 869 387 -206 308 1113 -823 479 -192 -607 -205 706 183 765 305 175 88 -989 636
10944 636 167 -781 61 -9 122 337 140 -144 -186 1095 75 -543 1024 -1025 152 -1329 26 1323
10962 1323 -369 -614 31 -699 -942 295 -205 50 98 633 -130 -1131 916 -280 412 479 394 763 108
10981 108 -222 243 820 59 726 376 -620 -471 132 1015 498 -119 520 365 -657 612 -71 323 -180
11000 -180 -145 411 1002 -180 185 664 294 457 239 24 -260 342 588 -519 -734 -238 -5 -989 -171
11019 -171 -524 -89 -103 -153 6 1004 -843 513 635 739 665 -418 -499 -126 -263 -140 692 -45 87 578
11039 578 -987 -503 694 -690 -691 72 -727 97 217 -619 -140 710 -809 1360 500 -948 -701 294
11057 294 -1353 -279 229 265 74 161 38 1089 1693 -1116 -81 301 5 -907 -348 -820 266 713
11075 713 -485 754 -173 480 1184 -332 13 65 -100 -797 472 -131 -11 767 603 444 527 51 -329
11094 -329 1618 -230 573 217 -219 -358 368 174 3 1620 -1282 -702 567 -152 -295 -406 180 -202
11112 -202 243 -431 -491 170 -119 56 -794 -618 360 -304 -570 722 -462 719 283 146 -31 709 -7
11131 -7 -333 1572 -437 -632 299 429 -80 306 -257 486 -336 -719 -351 1071 -1021 -127 541 378 -134
11150 -134 -604 218 374 980 -184 -290 -186 -501 221 -382 -850 565 1181 -1318 724 794 -517 149
11168 149 -566 402 -9 544 -345 106 -305 182 -439 331 -70 593 -157 353 -115 158 -116 623 264 -804
11188 -804 153 -462 -23 662 265 -23 -263 620 414 -522 -1161 -1143 320 -1296 186 738 -1082 370
11206 370 610 -39 -425 750 -1036 -561 456 -904 -204 -130 -857 1346 -77 217 -835 143 -1125
11223 -1125 -462 -17 348 244 390 -1631 168 -386 -756 353 -1283 -610 164 -1032 99 179 -647 479
11241 479 856 -529 -277 383 -247 -378 -908 880 614 132 -803 4 505 -344 359 1541 -240 534
11259 534 -166 -375 -150 450 -782 345 928 210 73 -283 -377 -33 417 -285 -246 1314 -449 764 7
11278 7 369 -130 309 220 502 321 -674 184 -192 -305 97 195 -187 1330 492 -546 -558 -121 -729 -1170 583
11299 583 -457 85 -193 91 694 -475 419 -1039 -421 -404 792 -392 449 238 -516 -796 -170 -643
11317 -643 -5 803 -1292 1195 308 135 138 -678 -802 873 187 119 296 1302 830 305 -254 -369 -562
11336 -562 144 -331 553 -996 -365 99 256 -575 1000 250 -729 339 -702 -786 236 -557 -181 236
11354 236 108 -191 -483 -1018 60 161 462 701 -407 516 172 740 22 -933 -397 -567 942 -1129
11372 -1129 -1014 184 -254 -100 74 -145 -333 161 282 -920 81 910 204 755 -310 -305 494 -176 -760
11391 -760 1174 142 -756 -101 753 -1037 6 -568 150 101 -571 -237 625 -516 474 911 -587 202
11409 202 -212 -669 -967 337 426 -176 -62 -50 253 -40 15 196 653 -1365 594 389 -469 945 665
11428 665 -835 310 887 -205 -240 -846 475 957 48 613 880 -440 -821 -93 -503 -251 1131 562
11446 562 -752 1250 8 354 391 123 -1022 363 -50 -351 455 -705 -301 -23 -1479 1161 -875
11463 -875 -649 750 -559 299 122 1954 -911 749 433 -1622 1225 455 -1345 665 481 22 12
11480 12 -529 -118 672 -337 -195 1132 -442 -590 719 -321 -1205 1009 730 -907 477 -570 -393
11497 -393 324 -511 -963 310 -799 501 -40 372 -415 458 587 -276 -75 -340 203 461 -1600 904
11515 904 556 -441 -232 65 -544 -442 -592 -676 406 785 -597 298 -25 -1454 378 307 -336 873 -379
11534 -379 -105 754 44 739 746 -18 143 333 -245 -595 1299 -911 -1269 1056 -635 -253 556 -603 -442
11553 -442 647 -66 -107 812 -137 31 791 -1064 -200 -82 -842 170 193 -1463 279 -177 -447 -607 294
11572 294 -307 65 -111 -371 1216 -752 -520 -33 -424 436 -1001 -690 426 757 -402 -1560 513
11589 513 155 -450 59 -153 329 442 -47 723 998 -955 159 -3 76 1235 -148 -1084 128 315
11607 315 -229 166 313 -596 -377 936 125 437 1399 -592 90 -22 -716 -58 -503 -747 -267 -230 -307 207
11627 207 -598 -130 215 129 11 -407 -388 -321 19 263 -1018 457 212 -1347 358 -485 -1347 32 98
11646 98 186 -934 284 -640 607 -689 -334 1001 331 25 12 -738 934 -453 217 349 119 -81
11664 -81 -487 995 -847 436 352 719 70 -658 516 -1198 650 -35 205 218 -372 -206 750 -1169
11682 -1169 673 171 -1073 -561 20 -289 -330 186 -681 -113 423 -410 430 -217 -318 277 -238 -746 -510
11701 -510 -421 -509 617 33 -479 1382 -225 -524 -137 -635 -138 -48 736 -108 664 -29 192 -192 221 399
11721 399 -268 -760 457 140 -71 1043 397 -609 529 -38 -645 -593 329 -426 452 -1073 -11 1282
11739 1282 -192 -291 77 -165 381 -121 -643 131 551 -501 -547 -64 -699 -285 326 -111 958 967 430 954
11759 954 1106 437 -651 315 -252 -658 -410 -929 108 130 -618 211 754 -936 568 181 -334 657 -422
11778 -422 -374 653 -196 -840 806 217 1402 294 -603 548 582 -856 -1317 -989 -132 385 812 -314
11796 -314 -377 1725 81 790 -162 -724 -1648 431 -561 224 727 -188 424 79 305 543 1072 -199 -263
11815 -263 -308 -128 396 0 -866 119 501 -407 -676 283 -486 291 576 -430 -136 755 -243 743 -519
11834 -519 -78 546 -240 -33 925 -386 -774 -226 710 128 -192 51 79 -35 -594 141 -410 -514 -924 612
11854 612 -369 -147 72 189 -971 544 -443 -470 -72 -53 876 886 -247 -550 280 330 785 -113 -302 245
11874 245 875 -620 -339 279 -651 479 -981 -952 312 569 -611 744 -544 -782 183 -266 175 -251
11892 -251 132 -1098 623 -296 541 722 96 -317 -500 -84 -571 1651 -701 325 -736 -692 -398 405
11910 405 -16 -90 -855 -702 -322 -175 -829 362 600 -655 540 897 119 -272 762 247 1021 -107
11928 -107 -61 -634 -570 181 569 589 -365 241 -1010 374 338 -937 -35 -6 -1892 -438 1034 -640 -692
11947 -692 435 -639 -297 1055 438 -372 494 -1122 510 -66 -763 -634 1170 -844 -322 871 -922
11964 -922 -869 -142 -167 -573 -341 -380 531 760 109 -142 740 -336 1037 230 96 154 -167 -710 85 -620
11984 -620 -67 360 174 67 -104 364 -192 421 -896 216 360 -554 -819 -471 -41 -168 1495 -362
12002 -362 -537 -873 -496 -132 306 462 637 -25 96 -264 -28 129 -86 447 -935 -62 595 -1064 241
12021 241 419 252 794 744 -134 292 -595 335 1317 -156 -577 -74 -449 -246 -436 -548 56 -719 -505 229
12041 229 1450 -75 271 770 68 160 754 248 392 462 -1282 -557 574 -1288 -1056 602 69 515
12059 515 64 -1484 923 -391 -12 -322 964 -193 356 -328 191 -1058 694 -716 213 584 -1079
12076 -1079 1567 -1236 -839 -124 100 -1386 877 -113 -481 -121 -841 76 53 -368 -139 587 -1256 -86
12094 -86 82 148 -123 354 -259 102 761 -855 -439 -327 -114 653 -451 480 -174 607 -1505 -183 979
12113 979 -1326 571 313 -634 -13 738 946 553 -304 -909 683 -239 -534 43 -1034 -8 283 -154
12131 -154 -139 781 371 186 -136 -749 -828 96 276 78 1460 497 561 -209 -899 460 951 -182 33 337
12151 337 -613 -793 553 -999 -654 116 -1171 -601 -164 -87 374 21 -1247 -300 298 -1197 256 796
12169 796 -1110 -136 822 -562 409 1576 -615 -785 -308 -655 132 -868 -487 948 -795 -142 810
12186 810 8 -228 856 -636 -467 878 -214 -840 602 334 -28 480 -907 766 548 166 -611
12203 -611 483 -495 60 472 -447 -1147 501 -874 -1158 -428 296 43 -898 -1163 630 527 -697 -605
12221 -605 705 -249 -460 363 -701 479 264 -29 91 526 -565 677 -50 335 -116 277 -328 478
12239 478 -255 -327 333 -773 -369 609 -266 -129 -201 -1136 -831 203 -629 299 603 17 -259 511 -522
12258 -522 271 904 -581 270 558 -293 -837 364 -659 -24 220 -297 -555 397 -1062 804 155 -13
12276 -13 140 -488 1193 -284 -592 235 577 478 490 347 15 66 559 140 -644 220 -607 -413 664 -88
12296 -88 -552 557 -42 -1222 1442 7 -390 -118 -169 -273 993 309 -416 -790 -831 -422 75 -1261 -622
12315 -622 169 -265 1169 1350 -746 1082 -464 -108 84 -340 -85 84 647 -927 123 585 -467
12332 -467 -528 1661 -498 816 26 -735 38 23 -1258 173 -957 -789 134 0 586 988 341 -901
12350 -901 670 -1447 -140 -461 -1750 378 -17 -277 -524 -26 -123 127 -64 -76 801 524 -47 747 -2
12369 -2 -213 -217 -177 -368 635 1241 730 -4 194 -632 518 -333 -217 -357 -164 1270 758 -94 -290 712
12389 712 149 397 1390 632 -199 304 828 29 750 -942 -87 271 332 -18 1003 -952 288 825 -907
12408 -907 676 1144 56 -612 86 -99 -1106 -61 -1094 841 167 -933 893 -1039 -532 -336 329
12425 329 -570 -112 725 -617 -836 -249 461 -439 1469 73 311 -306 198 -109 -399 -424 149 -96 -1140
12444 -1140 -451 603 -446 -96 -824 -120 750 892 -1138 368 -360 -291 1338 -555 -1315 -50 570
12461 570 -149 369 -257 -19 -786 -1120 680 1059 -189 173 -384 -699 -298 -608 -721 -483 188 -424 157
12480 157 179 -433 1188 -78 -579 869 718 -709 397 326 1017 -201 -938 -1143 6 147 358 961
12498 961 -1476 151 828 448 -1061 1089 -127 200 222 -752 69 660 -231 125 190 -613 63 -78 -537
12517 -537 486 -366 -766 1276 -1011 -1471 -225 87 -211 981 419 -209 -190 -516 -555 284 153 -780 662
12536 662 -414 284 8 193 -198 1055 -270 48 -163 72 170 284 -932 -118 803 -136 -387 -631 735
12555 735 -86 805 -45 543 -170 82 -49 554 524 65 1225 -761 1675 -252 -551 -177 1461 1207
12573 1207 -767 -206 -531 510 -365 -1302 818 -457 -942 1481 26 -853 502 422 -290 519 -345
12590 -345 -264 471 541 -380 246 -848 -729 -541 -660 262 1088 -524 304 698 -124 -711 944 -753 -673
12609 -673 -197 658 411 896 -340 855 559 -612 577 -925 -248 -617 704 -828 504 -371 -704
12626 -704 461 339 -2049 395 321 -1300 475 -607 38 780 -608 -499 1039 -586 672 -258 -325
12643 -325 -381 1286 -444 -91 -868 261 -759 61 -981 -745 33 -455 1025 1493 -158 1000 419
12660 419 -217 136 -77 509 718 491 -324 -493 271 -1243 -4 205 -14 -244 -642 -510 760 80 -553
12679 -553 605 316 -1274 105 -129 -51 1004 -265 -121 439 18 442 432 -3 262 897 -583 -381
12697 -381 258 1 -1138 -129 -856 179 493 -266 -699 197 -1420 -608 1012 -446 140 -59 -292 -159
12715 -159 367 -358 -252 119 -363 314 382 497 764 339 82 -757 428 408 414 -416 -438 588 249 -6 816
12736 816 577 -840 -714 747 -216 285 536 -323 520 -778 -180 -529 -789 -732 740 -519 -304 -117
12754 -117 -485 1419 301 -335 251 -396 -1679 900 -657 -175 587 129 324 -120 235 -72 -148 211
12772 211 -421 -998 442 300 666 609 -470 1475 710 -890 -802 -247 -94 678 -274 -118 -218 456 356
12791 356 735 -194 -52 -55 -820 464 -119 -747 -988 185 381 -821 413 -7 387 149 57 -947 -666
12810 -666 -10 143 -253 -319 947 500 -1035 63 391 32 1025 495 829 -563 1014 -294 813 415
12828 415 -207 486 618 -331 694 -116 -782 80 -643 -721 533 1201 296 -527 527 -830 658 -917
12846 -917 -1187 -274 -764 47 -319 -282 -822 1197 -81 -582 1623 -175 -80 -151 -84 -176 384 -320 745 523
12866 523 -1071 410 -59 -82 -616 -314 168 -523 61 -323 294 -47 -747 566 105 -124 405 -358 5
12885 5 456 943 -895 574 -821 -440 -193 -511 1239 -1172 -224 -200 151 -648 -703 272 -263 -790 976
12904 976 -143 -428 -466 489 434 -254 -196 83 946 -142 -27 693 -508 -73 -55 -783 782 -160 131 844
12924 844 491 -704 79 -771 23 -122 334 198 -254 309 -386 239 290 -90 320 -83 479 -301 -427 713
12944 713 354 -762 -815 149 181 109 -69 -237 -36 157 5 147 -652 -47 1339 -115 -699 -370 1222
12963 1222 -447 631 545 282 1305 -11 -103 335 214 -245 402 322 -1254 191 633 880 74 -217
12981 -217 -764 13 49 160 460 212 -47 1481 -4 -180 1409 -17 -9 -127 519 34 563 -127 -509
13000 -509 526 -19 429 375 -457 18 920 -262 395 1017 -882 -827 372 -491 -325 166 -89 286 -642
13019 -642 -221 843 619 -501 -219 766 -238 675 -52 -342 732 740 -534 -270 183 -479 207 255 -472
13038 -472 253 -437 -1998 1267 32 -850 -564 -747 449 1107 -731 -289 1103 237 1688 448 -826
13055 -826 -471 162 -562 26 286 -78 139 631 -914 68 -369 -299 22 826 -330 1376 -11 -90 -159
13074 -159 779 127 482 677 -750 -550 -30 -152 176 -398 -1197 1341 -623 385 162 -83 -837 1100
13092 1100 196 -768 178 -155 -389 245 -427 -155 1174 -49 730 382 -566 -134 676 -529 -304 274
13110 274 -736 527 -777 -711 205 -185 -167 -954 58 -259 662 642 -426 192 426 150 -536 -184 -246
13129 -246 596 -180 470 -801 319 501 933 -377 -122 1055 -300 -276 772 -276 -761 139 -319 -830
13147 -830 912 -243 -70 285 206 -653 502 -325 -162 112 -788 867 754 300 714 -43 -848 132 -196
13166 -196 -221 74 565 -692 159 1034 -251 493 495 187 1437 389 -48 -24 -1437 -231 1558 -543
13184 -543 -824 962 114 -515 127 -353 -745 -368 -678 117 -344 152 65 40 -462 -443 117 -193 674 493
13204 493 -1375 -116 -204 -550 -44 325 -245 -162 883 -804 283 -296 -911 850 954 657 -48 961
13222 961 435 -415 -332 126 120 580 -810 962 880 -666 405 -770 -812 246 -492 -52 723 212 -589
13241 -589 423 830 -1218 1307 -68 177 332 394 353 493 -605 -105 789 316 616 558 22 544 746
13260 746 72 253 376 -1173 341 511 460 247 448 115 1133 741 -693 853 734 -208 -55 371
13278 371 -16 39 -174 -181 95 418 -743 236 691 -789 421 -127 -559 75 -578 -659 503 -343 -511 949
13298 949 -376 -597 -392 227 43 168 -107 350 868 -541 -62 608 -961 526 73 367 577 112
13316 112 -334 795 443 -841 562 137 -1107 832 582 -758 334 391 -381 -113 -565 -360 507 373
13334 373 522 -968 352 -1261 52 -802 -53 379 -476 -189 818 55 -80 475 -231 -289 -540 -71
13352 -71 -678 515 -233 206 553 -810 299 467 180 936 448 -316 -471 664 111 -281 200 -848
13370 -848 -72 242 -599 23 -228 307 68 -582 -794 68 701 587 398 -459 -640 750 -708 908 465
13389 465 411 -727 -415 -530 -37 -72 447 -720 70 50 -636 1106 -386 426 228 -1022 188 -587 337
13408 337 -195 -107 -703 927 14 -920 405 653 115 -646 717 -107 -842 130 -529 -313 -47 -427 -13
13427 -13 496 542 888 663 -292 567 -1088 -10 238 488 -216 -327 -137 -465 636 370 296 -270 99 446
13447 446 755 122 -490 173 -696 -36 299 -404 364 1360 198 716 518 89 -519 1099 -1857 534
13465 534 125 -378 762 -572 -12 390 639 276 1038 434 34 1172 -115 -961 887 -1086 -255 514
13483 514 -378 -277 -1009 -293 -1377 702 100 35 -189 -265 -815 63 170 139 1015 86 -41 148 -476 172
13503 172 224 615 -115 381 101 -197 228 -223 -558 398 -1140 385 -84 -227 384 387 53 -228 1853 -270
13523 -270 439 16 284 -523 -581 -198 137 -930 -823 759 415 249 -169 -771 97 141 -64 -1568 -429
13542 -429 -730 47 606 -558 -183 495 -221 -581 -557 -112 -363 882 240 317 467 -312 -966 26 -732 -657
13562 -657 453 -427 -164 235 -668 97 100 -1164 703 -35 779 583 332 -129 -149 860 -497 -234 -209
13581 -209 -325 1262 -499 -1396 193 1145 -638 -373 -238 -308 -339 236 478 1278 45 -712 1037 -212
13599 -212 -759 -394 -1233 -426 236 243 -1148 283 -294 -226 -83 -340 -441 451 -1033 -542 280 273 -179 115
13619 115 97 206 15 -660 -356 -219 -702 1317 -834 -995 186 525 -225 1026 -1009 -537 745 49
13637 49 450 825 -25 -604 -367 1062 -1262 103 -787 325 876 665 -367 981 -288 292 163 615
13655 615 751 381 -840 1081 -130 -1157 909 -1057 -59 192 -471 -1408 -263 -813 368 290 1109
13672 1109 614 634 736 -596 1451 75 -915 934 -269 -598 -717 396 -1309 738 286 -120 178
13689 178 -521 94 666 134 -139 632 -604 -288 -226 -1065 -706 -315 -538 322 528 165 668 1156 -107
13708 -107 968 -164 142 -298 482 -307 -349 382 -492 -349 45 -731 402 1108 -310 1186 -384 -509
13726 -509 160 203 -391 438 125 192 -99 -41 -1104 499 596 1090 207 -264 -637 138 1028 -827 217 -327
13746 -327 229 837 -439 -516 -924 -1687 -611 814 202 459 -26 -133 -301 381 -476 0 448 -421 -39
13765 -39 -151 441 743 518 -114 -242 -1135 -142 -43 535 -1200 581 -504 -328 -512 548 24 768 -308
13784 -308 -387 1044 -62 -15 -198 -502 817 -201 -499 -430 426 8 -143 -174 -262 -533 1407 -329 -1376
13803 -1376 22 -160 -198 695 -910 646 -183 -335 104 588 -586 -25 1475 1124 248 65 -585 -70
13821 -70 -232 -354 56 -432 -695 546 956 -383 1623 242 -241 1067 -301 551 492 1348 -826 697
13839 697 156 422 88 -675 -178 856 498 -670 239 -309 -261 -341 -559 -496 432 -176 -887 -661 -1037 -493
13859 -493 32 -415 -289 891 431 -733 -143 -37 800 -244 -942 637 136 630 271 -131 -201 -247 130
13878 130 598 974 362 -128 284 -1000 623 797 -222 93 -14 -659 274 485 -183 819 622 -413
13896 -413 -1106 115 620 559 281 482 -173 -39 184 -206 605 -416 526 258 -49 -453 327 119 434
13915 434 -352 -120 1289 99 -524 207 -208 -986 -6 -425 -314 -389 2 -740 281 493 -265 166 640
13934 640 -280 -411 -518 23 788 118 352 495 519 67 708 161 -506 -565 -496 -1231 113 281 299 736 -1563
13955 -1563 431 -56 -724 305 1076 22 -426 81 -908 -412 506 -529 -451 83 -1282 599 -166 -26
13973 -26 120 -524 485 42 -373 317 416 -842 -611 -44 387 -1152 207 -998 -99 112 -108 -394 1039
13992 1039 786 -336 299 219 129 378 -325 -712 388 -373 124 948 -491 893 41 -765 810 826 -518
14011 -518 -303 414 -340 -63 -769 303 -763 527 -189 549 357 -759 1375 625 -1470 -140 42
14028 42 -714 793 -228 109 -521 -96 -419 -224 162 -453 335 655 -110 755 221 162 -84 -644 219 -22
14048 -22 11 -874 1160 -86 -307 1018 454 856 424 -487 653 538 52 1189 -256 -687 1063 -586
14066 -586 -275 319 319 -285 -301 1184 -931 -406 -435 250 304 82 -601 993 -995 -368 628 695 -655 -371
14086 -371 135 -819 1174 156 -433 1376 -547 207 -330 1028 619 23 -439 -739 728 -1054 -10
14103 -10 -373 -935 542 15 -764 57 -118 -184 -1036 550 185 1064 598 355 -612 1050 -614 952 -428
14122 -428 -1062 -396 -499 49 422 60 -876 1185 359 -15 1080 -392 -1027 -93 -44 210 -644 -588 -856
14141 -856 225 559 -693 119 939 -369 40 -585 430 298 -1365 349 772 -957 607 880 42
14158 42 -134 47 98 283 67 -451 -430 42 657 178 149 -265 -687 425 -1390 845 -95 43 596 460
14178 460 282 -374 249 257 -249 -77 178 -87 37 -1048 -266 328 138 -95 -211 -226 412 -903 -1260 -72
14198 -72 254 179 -119 732 -932 -23 522 -1074 681 -90 -694 405 -642 -589 5 4 212 -428 40 -1136
14218 -1136 1002 -310 -657 401 -701 125 797 -156 -513 725 400 307 -441 -163 164 -665 -60 1227
14236 1227 803 109 1136 -260 -411 321 -232 726 234 720 -515 372 -1163 632 515 -428 -37 -371
14254 -371 238 -371 1292 -886 142 -448 -1347 572 -505 -726 742 -786 -826 -594 557 -540 522
14271 522 897 -1089 -629 209 -320 872 525 -333 859 -58 209 -6 11 -91 514 -394 -377 94 446
14290 446 -1323 -4 -16 -112 701 -548 -231 -489 710 451 1002 -511 -29 -323 207 637 544 -66 -690
14309 -690 -718 -685 345 588 612 1155 169 623 1036 239 -865 131 710 -777 220 -283 -391 -228 -139 -67
14329 -67 719 925 26 -364 -187 881 742 703 -203 481 107 -699 -240 2 505 193 -1144 834 521
14348 521 -257 -93 -161 -704 -245 613 159 376 -448 -1160 985 45 -881 -822 278 -834 619 252 -325
14367 -325 -499 258 -529 787 962 -46 617 827 -769 74 262 -1188 602 -399 -1105 596 147
14384 147 537 921 -320 -198 11 743 -1033 44 12 -961 1751 -919 784 837 -1260 694 1062 -263
14402 -263 -141 -302 20 809 917 -527 1108 -136 -565 387 1328 -455 -19 971 -444 -729 -52 -415
14420 -415 625 -626 -816 -1267 395 -151 194 254 -231 258 260 -1568 118 195 353 514 -626 -342 503
14439 503 535 -87 -22 -104 -11 1054 -796 72 898 115 294 1180 174 -29 262 -545 236 580 -1747 -438
14459 -438 128 -1079 646 122 47 154 246 -1088 437 -97 184 -117 174 -1050 424 -551 -921 494
14477 494 134 -981 31 1346 -345 477 -272 -1565 -464 -189 -39 -449 -855 225 146 8 -1040
14494 -1040 45 -834 402 642 -1271 252 496 -805 -1737 478 15 -808 1057 -444 -67 188 -36
14511 -36 -1186 407 -416 -247 831 -710 684 279 357 -76 -103 -331 363 -319 -193 893 -616 -391
14529 -391 1017 41 -1109 681 412 168 510 -384 -1329 79 -395 469 99 326 -8 1481 -42 420
14547 420 1109 56 -336 122 -149 -182 659 -443 697 -129 -439 360 1101 871 8 477 188 599 218
14566 218 178 -32 -727 -1689 198 289 425 202 708 -170 -21 177 41 -334 -154 -499 810 -51 -1316
14585 -1316 469 -34 -630 510 359 -571 590 360 138 -986 -305 262 205 -997 51 922 585 723
14603 723 153 -968 -213 209 -653 274 792 129 35 509 10 283 -225 -358 1305 -41 -700 -648 -178
14622 -178 -899 -307 -598 -834 -191 -572 -413 880 -105 299 658 51 145 221 -341 24 11 149 -526 21
14642 21 -728 87 323 -96 750 -118 365 548 1019 -180 -29 385 339 48 1530 -411 -473 322 -795
14661 -795 -312 445 -1046 -596 341 -601 255 203 -84 81 329 -952 602 740 934 -262 -660 -733 -33
14680 -33 465 -254 -76 -518 -1135 341 368 626 710 -525 -1070 438 328 -526 -608 -838 611 -669 641
14699 641 608 508 131 -633 -45 -869 -1090 272 624 -356 218 -706 -239 633 -116 1193 191 -65 138
14718 138 -215 -1540 322 402 -1055 652 308 92 383 -1243 -732 -225 177 -1016 109 -618 -554 900
14736 900 356 -328 -476 1196 -934 743 51 -710 579 734 -1069 387 -332 -1173 -180 -283 131 -708
14754 -708 -789 726 890 -1968 197 858 -1044 612 133 -98 858 117 -311 740 48 -709 -455 -895
14772 -895 -504 851 -260 436 52 -40 -1225 356 -246 -918 729 239 625 43 -294 -491 -224 -32
14790 -32 -103 -71 258 375 839 311 628 -199 89 -122 666 -472 -464 406 -759 -813 140 -341 -476 1383 -1044
14811 -1044 299 -807 -802 326 -272 -1382 -391 -807 -398 620 1024 -1595 301 254 18 1181 527 -783
14829 -783 749 143 -83 324 113 -108 74 -146 -231 994 44 -281 -478 331 260 4 833 -70 1270
14848 1270 -282 233 1316 -428 170 752 -231 150 1142 -892 216 286 -916 -641 1083 -61 -281
14865 -281 68 267 191 -191 -1092 213 -223 -425 253 1762 594 -766 375 -1239 1176 670 760 293
14883 293 -324 321 -213 188 237 344 -233 -738 1112 160 -584 -708 -145 124 1180 -411 283 1068 -1113
14902 -1113 -21 -249 185 -267 206 131 -28 541 476 890 -25 -662 -462 -372 70 -1120 -591 -881 -436 17
14922 17 382 -574 308 43 848 1389 -237 182 1361 -380 1625 554 323 617 126 -36 88 335
14940 335 -907 448 170 613 44 150 -915 550 639 -1418 -317 -590 -1009 720 -649 -663 689
14957 689 -710 -130 -450 -891 -451 1011 -773 166 -173 -202 -289 335 -290 447 778 114 1208 568 -924
14976 -924 -806 -216 -1438 -219 561 877 1119 -793 -968 63 -59 -507 449 -164 -899 -92 187 138 -7
14995 -7 -110 215 529 -657 568 816 -258 -1214 803 -518 -271 918 38 476 387 543 -419 -72 -245
15014 -245 -874 148 140 -61 -164 178 -452 984 275 258 -927 -277 99 -433 -130 -110 156 -642 -110 828
15034 828 -555 188 748 497 756 355 -434 464 134 352 38 425 -695 636 -242 -559 -21 -1148
15052 -1148 39 857 -702 855 -362 -208 240 462 -1013 107 -20 -1206 -540 -163 743 410 101
15069 101 -1642 -644 -128 -575 700 1 -114 171 -31 1026 1137 -279 619 433 48 -936 -749 -292
15087 -292 -279 358 -509 183 369 -825 -360 -274 115 974 574 -25 -694 -493 -636 -297 485 -223 -65 526
15107 526 -151 22 -46 458 125 1171 -1098 4 292 38 -996 -569 -1009 -1024 733 -941 -490 971
15125 971 262 -155 374 -808 1108 371 -539 -609 -819 -295 88 50 350 -627 -364 486 -52 -933 185
15144 185 456 -300 -682 161 635 -1234 -275 -478 -68 574 -1286 -2 -449 -864 208 -168 -666 76
15162 76 1278 -951 -435 229 -283 -144 499 -505 -1240 -95 -406 -202 89 1133 72 1331 -313
15179 -313 -170 -695 -240 210 -203 32 828 -805 354 1104 -781 -137 368 622 549 754 -212 -60 250
15198 250 142 290 -396 -792 -138 863 -615 59 497 -5 -313 122 229 -387 -78 -426 -196 -307 -597
15217 -597 1198 189 -351 363 7 -191 1123 -333 -693 -371 286 -433 502 261 -128 -739 -451 -225
15235 -225 901 -375 -1160 363 -43 -190 361 -1014 116 224 108 -563 -641 -613 -92 474 -905 -372
15253 -372 183 267 343 -42 389 -158 281 -140 -24 -536 404 -223 -19 -376 -327 311 -492 1143 380 -402
15273 -402 -895 -745 -523 -1018 88 303 181 838 -564 816 46 -900 1076 -396 -421 761 303 438
15291 438 407 -421 -412 296 -25 250 421 -762 -463 743 -611 -161 -233 399 -477 34 612 24 56 -387
15311 -387 -142 931 -490 473 -719 -243 806 -515 427 544 93 192 -409 884 -632 -394 -255 1110
15329 1110 134 473 402 59 -155 -260 -334 -215 -614 659 -530 -183 509 138 -41 -299 653 -76 237
15348 237 -520 446 1134 49 -173 306 714 1044 229 648 -154 955 119 426 435 -1118 754 -29 1069
15367 1069 -353 -609 169 -143 650 -397 218 320 -830 -194 180 -812 661 -128 24 415 -279 445
15385 445 -605 -257 -83 110 813 397 -6 -892 -87 84 -22 586 370 -286 -712 -176 -333 -973 189
15404 189 -95 -384 -120 17 -103 477 -302 905 778 27 -264 -8 -893 698 -50 -595 -674 353 -485
15423 -485 -637 892 -1272 666 188 -122 368 -202 -498 -173 947 649 -803 -1341 -673 -935 -731 -903
15441 -903 -348 -200 388 708 1053 83 175 1482 -635 174 529 -783 -387 39 -583 274 288 421 1261
15460 1261 -348 147 493 -1115 351 557 -352 118 -500 -513 216 1065 -681 368 -463 -277 9 497
15478 497 -974 556 -134 -116 218 95 -436 -282 249 -220 1017 -517 183 431 -701 -1125 118 -471
15496 -471 -575 311 -356 713 -825 -704 521 892 -360 -428 315 -480 1325 272 -316 63 805 -485
15514 -485 483 23 151 23 -583 -1450 -533 1076 -385 -148 143 241 710 395 -1061 -747 303 -546 716
15533 716 315 -106 323 175 503 -309 384 -134 735 -617 -1097 1692 -454 -727 64 38 -1194 -7
15551 -7 142 -133 495 592 605 661 458 -26 473 -351 343 1210 -889 -450 35 -777 603 636 -1314 274
15571 274 924 630 -226 -585 -246 290 1264 -527 209 546 -183 986 -453 -201 -176 311 -1041 205
15589 205 -1059 -799 418 104 815 109 482 1003 205 -487 -659 1135 -321 -545 44 -102 363 1075
15607 1075 -33 176 569 19 -253 -5 -727 784 1228 -71 -409 252 180 -417 -948 -940 856 -1057 -10
15626 -10 -870 -1176 -687 -45 -343 -768 101 -317 -787 -291 -329 -352 742 579 85 -399 50 -379 1012 -497
15646 -497 872 710 303 -832 131 -617 3 613 -606 184 1238 199 841 276 518 -630 394
15663 394 -280 609 926 -1326 37 773 -753 -992 -181 360 679 72 -907 -421 143 -1031 1516 195
15681 195 -145 655 718 1053 1349 203 -462 1004 -407 -255 636 -19 -961 -194 -719 -28 672 14 187
15700 187 339 983 -717 634 212 365 243 -736 -1019 477 -748 280 750 -1667 1071 -779 -837
15717 -837 -663 -125 -971 777 389 -394 -422 -106 -576 -295 615 583 131 494 -339 -4 -110 -451 -676 182
15737 182 -101 -472 187 -2060 26 -1065 -396 -642 -90 512 90 -42 74 49 -309 -13 18 -489 -449 1049
15757 1049 246 599 102 -657 447 75 -203 -190 524 -1104 410 226 -430 -4 127 -586 1079 1436
15775 1436 -693 -520 -666 -1068 -239 -447 345 1305 531 -1077 217 -521 -340 68 474 -54 737 -626
15793 -626 -287 754 233 -414 1106 106 -772 1290 -730 -45 194 775 182 327 -761 1318 307
15810 307 -880 1123 -553 -584 -502 1067 -44 68 60 -1332 -111 225 -898 -15 1464 -1425 442
15827 442 350 -266 624 -897 -881 -295 17 582 344 150 -841 147 246 -295 767 118 -189 394 -538 -287
15847 -287 1634 -1471 -653 -190 -276 -102 190 37 -1000 -235 -1059 355 1235 -708 1225 1048 -1704 -281
15865 -281 574 -917 501 -299 -524 -1248 -672 -1262 -103 -118 -619 1170 -221 -538 1029 841 -580 -176
15883 -176 615 -67 449 -31 -95 -370 -72 -234 1065 -1043 -858 517 262 627 -208 189 -756 1406 -798
15902 -798 -261 11 -776 888 1103 -1042 -683 -315 613 255 -676 -119 390 -457 -100 -670 -87 -1032 -330
15921 -330 857 -650 771 33 -232 -343 1339 -1020 33 760 40 103 -379 -105 -182 -205 -384 -597 -534
15940 -534 -619 1 -539 -99 614 -145 349 -863 -372 42 392 -583 1159 -38 427 374 -132 -473 -408 742
15960 742 -196 368 -171 -710 180 290 -162 427 609 373 67 767 -999 186 -250 -79 228 -855 -239
15979 -239 -366 24 -915 -18 -97 -712 509 314 -38 395 180 -1555 388 -261 -595 629 -907 -829 -386
15998 -386 -684 972 338 189 407 -336 -398 -648 -505 478 -252 -254 -1084 366 616 688 518 336 -696 364
16018 364 -284 -872 -267 -604 -701 593 -239 -476 -118 99 -532 598 451 -374 15 312 268 533 17 -369
16038 -369 433 817 -268 626 -502 363 -553 52 379 1080 -365 -822 -74 -585 243 685 182 -130 -78
16057 -78 -752 536 685 254 -450 636 -425 -119 452 -152 149 735 55 -660 1020 -198 593 320
16075 320 -753 -251 -235 -697 313 -877 139 35 -60 -185 -108 -156 -1264 460 -335 -973 360 -128 -65
16094 -65 1091 -476 -227 406 -914 -71 -324 -847 251 535 -60 -288 -514 -852 568 -597 -685 101
16112 101 422 -716 1092 610 -123 598 -390 -195 701 -625 -59 -216 -460 -189 229 -1435 -269 169
16130 169 1103 105 702 796 -148 786 -323 -169 654 -190 -359 476 389 312 942 -46 -538 1409 476 -762
16150 -762 704 288 -199 342 -213 448 1160 -948 628 -501 -666 626 136 -1529 -617 577 491 -763
16168 -763 570 -54 343 427 -589 581 580 -1264 26 1040 -1474 634 149 1058 95 607 -1062 604
16186 604 -687 -1078 423 250 -510 -366 -236 648 704 -121 -535 47 -452 -34 301 -392 498 425 303 -540
16206 -540 140 -127 -129 964 545 840 -941 -405 -120 1355 -419 151 -569 424 34 35 -770 366 435 -140
16226 -140 -4 81 -945 975 709 -797 251 245 -496 952 -726 -303 260 -693 260 -23 1138 -62
16244 -62 672 -90 -232 -161 -24 -350 34 -1339 -283 -101 -867 288 535 287 60 439 166 10 -97
16263 -97 12 296 463 -271 357 885 -1320 279 1043 137 277 -42 101 52 -704 248 1224 354 -286 1141
16283 1141 558 2 907 -614 -484 300 83 -82 1108 654 693 585 -725 -834 474 -296 285 430
16301 430 -9 311 419 228 467 -360 246 376 -1034 -1110 -1809 399 -742 -42 243 -652 -100 835 -233
16320 -233 -105 184 -514 283 859 -878 989 455 -71 621 -695 -550 857 -52 -774 587 468 -5
16338 -5 -670 -131 122 542 -269 -73 1731 -265 -1296 569 177 -990 -438 -1252 89 486 -481 83
16356 83 -32 -1062 -27 1104 -1185 277 -352 672 270 -266 -781 498 611 704 1056 -196 121 -424
16374 -424 45 -334 390 -398 29 -940 926 -691 197
16383A97
$$ Imaginary data points
##PAGE= N=2
##DATA TABLE= (X++(I..I)), XYDATA
0 0 0 0 0 0 0 1 -1 0 1 -2 2 -3 2 -3 1 -4 2 -7 2 -5 4 -6 9 -8 12 -14 16 -18 29 -34 54 -87 191 2189 -5891 -6330 -6863 -4927
38 -4927 -5049 -3381 -821 -937 1758 3232 4619 4637 7297 5710 5691 5358 4604 2634 1110 -1884 -1964 -3235
56 -3235 -4831 -5520 -6086 -6353 -6565 -5126 -4640 -2300 -1845 -401 1819 4408 4075 5532 6412 5636 6239 4883
74 4883 2950 1259 738 -1836 -1458 -3734 -6091 -5931 -7007 -6340 -4860 -4112 -3462 -1692 -752 1164 2124
91 2124 3965 5387 6241 5289 4666 5121 3950 3172 2124 -719 -1824 -3732 -4634 -5498 -6435 -6910 -5448 -4391
109 -4391 -4551 -2496 -460 321 1951 5082 5124 5740 5909 5932 6260 5095 2270 2507 549 -1519 -2104 -3177
127 -3177 -4398 -4972 -6294 -7333 -6114 -4441 -3163 -1729 867 725 3653 4035 4744 5226 7652 5389
143 5389 5870 4309 2114 2341 512 -1025 -2188 -3409 -4790 -5483 -6129 -6623 -4403 -4623 -2304 -147 -269
160 -269 2179 3142 3546 4962 6255 5748 5742 4907 3238 2568 1695 -1309 -1641 -3251 -5765 -5740 -6336 -5333 -4687
179 -4687 -4209 -3324 -1218 -1692 -162 1829 3335 5308 5660 5190 4207 6132 4799 2587 1760 333 -1890
196 -1890 -3082 -3112 -5586 -5131 -6000 -4929 -4082 -3595 -2543 -478 43 2049 3816 4179 5190 5761 5654 4775
214 4775 4428 4257 2232 1151 -1032 -2007 -3345 -5501 -5137 -5658 -7000 -5165 -4201 -4106 -2151 -120 2040
231 2040 2897 3686 4658 6258 5921 4947 5046 4212 2693 2763 222 -2105 -2878 -2962 -5499 -5362 -5873 -4768 -4967
250 -4967 -3849 -1835 -387 -337 1500 3699 5003 6228 4828 4824 4915 5381 3569 1993 2644 209 -1024
267 -1024 -3095 -4308 -4205 -4879 -5449 -4726 -4261 -3443 -1190 -1012 519 2293 3610 3894 4930 5588 4348
284 4348 5369 4901 3257 1365 125 -1940 -1589 -3960 -4210 -4856 -4701 -5728 -3706 -4247 -2905 -1609 -271
301 -271 1654 3962 4342 4744 4852 5185 4694 4360 2669 2382 53 -1165 -1547 -2824 -4015 -4150 -4865 -5817
319 -5817 -5059 -4533 -3093 -1092 1032 1144 1857 3640 3842 4572 4979 4232 4851 3839 2435 2339 667 -2069
337 -2069 -2239 -2012 -5555 -4977 -4984 -6423 -4019 -3734 -3554 -1195 224 930 3702 4134 3093 4687 5471 4975
355 4975 5143 3329 1943 1034 -921 -1072 -2177 -3838 -3387 -4685 -5741 -3362 -2628 -3521 -1622 -34 -175
372 -175 2715 3433 3831 4284 4961 4633 4592 3459 2082 2371 865 -814 -1459 -2401 -3318 -4570 -5613 -5949
390 -5949 -3779 -4109 -2834 -1135 -908 815 2959 3671 4356 5660 5090 4265 4579 2313 1222 1528 -212
407 -212 -857 -3253 -4239 -4187 -4421 -5020 -5082 -3588 -2617 -1732 65 52 1629 3664 2678 3437 5398 4410 5103
426 5103 4088 2440 2255 627 -1219 -2047 -3529 -3342 -3798 -5108 -5545 -3405 -3150 -2939 -856 -53 898
443 898 2935 2696 3435 5520 4693 4562 4317 4020 2365 1111 -1183 -1284 -1773 -3903 -3970 -3952 -4814 -5287 -3408
462 -3408 -3073 -2758 -49 -118 2018 3308 3156 4017 5289 4879 4912 3210 1648 1846 296 -966 -2335 -2325
480 -2325 -4088 -3440 -3713 -5071 -4063 -4025 -3301 -824 -438 1338 1633 3464 4347 4595 4918 3553 4383 3575
498 3575 2158 2357 -930 -1777 -2018 -3855 -4149 -4607 -4197 -4750 -3604 -2852 -1893 -407 -303 1507 3539 2845
516 2845 4665 4649 3708 4746 3306 1529 2044 1212 -1342 -3053 -3063 -4183 -4638 -4702 -4648 -3998 -3128 -3125 -1021
535 -1021 -385 602 2667 2465 4009 4392 3767 3661 3579 3469 1644 1673 412 -1778 -1363 -3171 -3280 -4625
553 -4625 -4105 -4002 -2640 -2795 -2308 -775 -423 819 3246 3544 3861 5668 4712 3597 3130 2264 1898 894
571 894 -1668 -2063 -2541 -3751 -3307 -4356 -5085 -4085 -3352 -2549 -1923 -215 1021 3247 2329 2745 5260 3700
589 3700 4894 4487 3647 1623 683 360 -1043 -2186 -2584 -4748 -4155 -4077 -4596 -3183 -2716 -1714 -792 -595
607 -595 1474 919 3301 4607 4556 4143 3701 4839 2393 1931 1256 -126 -2554 -1809 -3452 -3891 -3644 -4624
625 -4624 -3609 -3541 -2870 -774 -813 -468 2887 2439 3015 4375 4375 3261 3578 3148 2784 1332 -199 -2301 -1657
644 -1657 -3713 -4420 -3760 -4919 -4359 -4045 -4139 -3123 -775 -814 1119 2861 2627 4049 5377 4159 3392 2717
662 2717 2156 2058 1459 -620 -1543 -2309 -3964 -3910 -3485 -4573 -2751 -2008 -3451 -630 -486 659 2201 3049
680 3049 3378 3781 3889 3028 4676 2286 1740 825 110 -1001 -2874 -2438 -4502 -2961 -4369 -4829 -3444
697 -3444 -3124 -2857 -514 -123 989 2758 3163 2984 4566 3540 3285 3753 1980 1257 1185 -675 -1182 -851
715 -851 -3209 -4260 -3516 -4058 -4421 -2595 -1905 -1258 169 287 1400 2778 2886 4476 3736 3425 4892 3385
733 3385 2222 2916 -177 -1787 -1769 -2885 -3545 -3230 -3838 -3459 -3550 -2941 -2344 -384 -175 2335 3500 2190
751 2190 3836 3987 4546 3085 3163 1737 1383 433 -48 -2258 -778 -2481 -3930 -3011 -4168 -4229 -2750 -3010
769 -3010 -2183 192 -435 2011 2453 2653 3815 3830 3103 4508 3800 1846 1864 835 -895 -1547 -1719 -3900
787 -3900 -4428 -3674 -3658 -3334 -2564 -2927 -628 -73 1553 2540 1732 2872 3014 2584 3180 3204 2252 887 1310
806 1310 -1212 -1908 -2160 -3234 -3383 -3039 -3576 -2696 -3057 -1852 -1878 201 936 1235 1854 1789 4172 3588 3750
825 3750 3595 2790 1747 1892 992 -1230 -1545 -2244 -3195 -3999 -3094 -3695 -2310 -2894 -2223 -523 35 -353 2372
844 2372 2797 2942 3953 2209 4189 3383 2162 1424 1024 -115 -1453 -1854 -3660 -2596 -4268 -4070 -4258
861 -4258 -2838 -2761 -969 -720 93 565 2716 2105 3428 3928 2666 2518 2353 1805 257 413 -1485 -1068
879 -1068 -1712 -3125 -3894 -4065 -3568 -2278 -3067 -2740 -974 1015 373 1382 1784 3618 2936 3480 3528 3016
897 3016 1697 881 1915 -513 -2496 -1332 -3348 -3048 -4018 -3589 -3050 -3636 -2874 -1820 68 -655 826
914 826 2358 1811 2653 4390 2949 3590 3109 2057 1751 445 -1341 -715 -2669 -4114 -3621 -4165 -4461 -2621
932 -2621 -3118 -2626 -352 -813 -15 2187 1801 2797 2672 3891 3581 3754 2368 848 2035 125 -989
949 -989 -1322 -2512 -3265 -3236 -3518 -3727 -2308 -2913 -2319 -349 -92 1074 2823 1661 3021 3245 3560 3552 2667
968 2667 1620 680 554 -788 -625 -212 -3670 -2671 -1973 -2111 -3519 -3267 -2499 -1005 117 83 2685 1919
986 1919 3666 2418 3981 3242 3903 1866 1608 2258 -77 -1219 -1190 -2955 -2576 -2346 -3675 -3405 -3657 -2000
1004 -2000 -685 -268 476 1460 3700 2071 2921 2900 3002 3766 3685 1349 1819 681 -1273 -999 -2009 -2896
1022 -2896 -3104 -1866 -4733 -2610 -1162 -1731 19 162 742 2731 2574 2722 2632 3410 3513 3668 2222 1082
1040 1082 1261 -407 -877 -595 -2464 -3731 -1522 -3320 -2259 -2067 -2013 -1564 -1134 -542 711 2354 1962
1057 1962 3655 3725 2949 3358 3255 2051 1140 287 -511 -726 -1434 -2627 -2800 -2808 -3740 -3186 -2189 -2159 -481 292
1077 292 474 1050 1025 2391 3055 3290 3075 2670 1789 679 1034 746 -571 -2043 -2691 -3489 -2879 -2865 -2520
1096 -2520 -1139 -1744 -1444 -1083 10 1068 3313 2494 3884 4038 3242 3260 3427 1763 1682 1108 -1826 -2039
1114 -2039 -2046 -2003 -2333 -1758 -3207 -2573 -2261 -2946 -1035 335 -337 1823 2199 2852 3442 3567 2609 2382 3047
1133 3047 2125 172 -539 -939 -308 -1972 -3178 -3233 -3236 -3809 -1534 -2328 -1566 -496 578 937 2344 1385
1151 1385 2499 2918 1972 3656 1960 2011 711 1308 -1442 -1670 -795 -2686 -2541 -2789 -4112 -2780 -2015
1168 -2015 -2094 -1073 -331 63 158 2354 2473 3413 3393 3289 3459 3185 -456 233 -509 -269 -523 -1724 -2659
1187 -2659 -1831 -3301 -3570 -2915 -2709 -1732 -329 -136 1356 2694 1801 2013 3297 2635 2202 3575 1740
1204 1740 1220 1090 -853 -1204 -1664 -1961 -3147 -1694 -3398 -2975 -1928 -2188 -1267 -546 190 1530 2038 2654
1222 2654 2577 3674 2160 2351 2486 276 26 -108 -823 -457 -2521 -2979 -2684 -1970 -3319 -3161 -1199 -1388
1240 -1388 -931 81 1168 2170 2606 1916 3283 2023 2918 2990 1996 579 670 -918 -296 -806 -2656 -2302
1258 -2302 -2879 -3716 -3227 -2669 -2178 -689 -995 -36 1488 2218 1883 3815 3082 1791 2333 2159 269 628
1276 628 108 598 -388 -2517 -2310 -2594 -2908 -3350 -2426 -2844 -1291 894 -153 871 2113 2822 2112 2268
1294 2268 2203 2904 2632 1482 1066 871 -660 -2177 -1459 -2167 -3074 -2908 -3155 -1792 -592 -2023 -1148 -1257
1312 -1257 -927 1109 1093 1842 1592 2633 1208 2449 2426 688 1696 566 -1303 -586 -1693 -3087 -2044
1329 -2044 -1982 -2520 -2730 -2100 -1140 188 -341 132 1315 2239 1541 3503 2425 2123 4294 2290 1195 826
1347 826 -522 -856 -721 -1452 -2574 -1958 -2127 -1866 -1563 -1895 -1418 -727 -870 1424 1941 1663 944 2177 3115
1366 3115 2355 2067 1277 708 -62 -1443 -813 -1032 -2628 -2308 -1542 -4380 -1993 -2045 -2032 -1130 -349 150 1665
1385 1665 1759 1506 2467 2145 2426 2334 2119 468 -136 -22 -177 -1331 -1089 -3371 -2805 -3110 -2823 -1315 -1146
1404 -1146 -1145 -372 -48 607 814 2316 953 2557 2695 2255 2253 1705 373 787 -1376 -318 -1511 -2050 -1830
1423 -1830 -2479 -3458 -2120 -1348 -1893 -1881 -204 47 1116 2479 2026 2757 1851 810 3114 840 436 1411
1441 1411 803 -802 -1124 -1868 -3246 -1205 -2509 -2120 -2489 -1362 -990 -398 240 1301 1123 1802 2860
1458 2860 2343 1411 1410 3135 1226 1214 1149 -649 -307 -1531 -2052 -2172 -2345 -3789 -1984 -1019 -2397 -74
1476 -74 -66 -181 1853 1863 2128 3622 3531 2130 1157 1701 755 1103 -150 -591 -953 -2149 -2940 -2485 -2736 -2110
1496 -2110 -1614 -897 -1676 277 511 1790 2098 1632 1461 2423 2323 1232 2565 528 1319 824 -309 -1340
1514 -1340 -1249 -2730 -1390 -858 -3173 -2140 -45 -1580 -108 -68 531 575 1034 1481 1864 2573 1988 2915
1532 2915 1148 1188 1652 381 -1401 -397 -1825 -2352 -1450 -2213 -2583 -1659 -1477 -1521 174 157 375 1225 1715
1551 1715 1131 3045 2097 1308 1713 1378 1052 1243 -341 -272 -941 -2259 -1436 -1894 -2922 -1459 -1436 -3074
1569 -3074 -1549 7 938 2440 1301 1758 2565 1310 2479 2168 1695 99 800 262 -1245 -552 -1011
1586 -1011 -1692 -1514 -2906 -2470 -843 -880 -1418 -387 50 398 2082 827 2096 3033 1921 1826 2142 1202
1604 1202 1148 719 373 -883 -1274 -1642 -1443 -2873 -3008 -2044 -1696 -1905 -1596 73 303 110 1723 2081 2558
1623 2558 1839 1198 2428 1832 151 407 -386 -1029 -624 -1697 -2315 -1764 -1894 -2219 -1619 -931 -1640 -523
1641 -523 -747 -172 2449 1738 1985 1867 1505 2228 2173 940 208 -151 -286 -1205 -57 -1890 -2448 -2024 -2373
1660 -2373 -1595 -1847 -1211 -590 196 421 950 1053 1754 1776 1960 1788 1873 1607 927 230 1132 -832 -950 -1723
1680 -1723 -963 -972 -1163 -2697 -593 -1549 -2538 24 136 1183 973 1514 1934 2661 2802 2495 1381 968 760
1699 760 -571 -614 -91 -1102 -1726 -1888 -1346 -1609 -1585 -1568 -1244 -963 -438 -145 902 1961 1545 1058 1401 896
1719 896 1444 2119 1983 1269 557 3 -669 -540 -1910 -1890 -2125 -994 -1253 -1253 -1657 471 804 542 1538 1360
1739 1360 1329 1667 2498 1958 1860 2014 -331 1042 129 -699 -931 -1524 -2056 -1311 -1013 -2299 -905 -1544 -314
$$ [...]
##END NTUPLES=NMR FID
##END=
