##TITLE=31Pdec_IPAC-AT-34B
 CDCl3 
  64 sc
 26.10.2023
##JCAMPDX= 6.0         $$ Bruker NMR JCAMP-DX V2.0
##DATA TYPE= NMR SPECTRUM
##DATA CLASS= NTUPLES
##ORIGIN= UXNMR, Bruker Analytische Messtechnik GmbH
##OWNER= root
$$ XWIN-NMR		Version 3.5
$$ Fri Oct 27 15:45:29 2023 Russian Standard Time (UT+4h)  she@DPX200
##.OBSERVE FREQUENCY= 81.013821
##.OBSERVE NUCLEUS= ^31P
##.ACQUISITION MODE= SIMULTANEOUS
##.ACQUISITION SCHEME= undefined
##.AVERAGES= 64
##.DIGITISER RES= 16
##SPECTROMETER/DATA SYSTEM= spect
##.PULSE SEQUENCE= zgpg30
##.SOLVENT NAME= D2O
##.SHIFT REFERENCE= (INTERNAL, D2O, 0, 248.564)
##AUDIT TRAIL= $$ (NUMBER, WHEN, WHO, WHERE, WHAT)
$$ ##TITLE= Audit trail, XWIN-NMR		Version 3.5
$$ ##JCAMPDX= 5.01
$$ ##ORIGIN= Bruker BioSpin GmbH
$$ ##OWNER= she
$$ F:/spectra/data/she/nmr/P31/1/pdata/1/auditp.txt
$$ ##AUDIT TRAIL=  $$ (NUMBER, WHEN, WHO, WHERE, WHAT)
(   1,<2023-10-27 15:44:40.39 +0400>,<she>,<DPX200>,
      <continue with go, POWCHK disabled, PULCHK disabled
       configuration hash MD5:
       00 E9 B6 7A A2 85 ED C7 34 08 36 98 17 FE 4E 26
       data hash MD5: 32K
       57 27 02 1F 4B 76 15 1D 44 7D 51 31 72 E1 02 D5>)
(   2,<2023-10-27 15:44:42.45 +0400>,<she>,<DPX200>,
      <Start of raw data processing
       efp BC_mod = 2 LB = 5 FT_mod = 6 PKNL = 1 PHC0 = -10534.89 PHC1 = -166.3103 SI = 64K 
       data hash MD5: 64K
       2A D9 C9 A0 9F 9A C2 0E 3F 32 D0 35 56 37 C9 63>)
(   3,<2023-10-27 15:45:01.12 +0400>,<she>,<DPX200>,
      <pk PHC0 = -181.9931 PHC1 = 373.2003 
       data hash MD5: 64K
       25 3A 92 EE 30 58 27 4E 21 91 01 9D C8 99 0D 1E>)
(   4,<2023-10-27 15:45:06.60 +0400>,<she>,<DPX200>,
      <abs ABSG = 5 
       data hash MD5: 64K
       EE 63 C0 0D ED F9 20 83 F8 3A 4D 96 49 A3 8E 94>)
$$ ##END=
$$ 
$$ hash MD5
$$ 54 B2 97 C0 85 7E 6B D0 C6 87 87 48 AB 03 A1 84
##$RELAX= 
##$RELAX= 
##$RELAX= 
##$RELAX= 
##$RELAX= 
##$RELAX= 
##$RELAX= 
##$RELAX= 
##$RELAX= 
$$ Bruker specific parameters
$$ --------------------------
##$DU= <F:/spectra>
##$EXPNO= 1
##$NAME= <P31>
##$PROCNO= 1
##$TYPE= <nmr>
##$USER= <she>
##$AMP= (0..31)
100 100 100 100 100 100 100 100 100 100 100 100 100 100 100 100 100 100 
100 100 100 100 100 100 100 100 100 100 100 100 100 100 
##$AQSEQ= 0
##$AQ_mod= 1
##$AUNM= <au_zg>
##$AUTOPOS= <>
##$BF1= 81.014009
##$BF2= 200.13
##$BF3= 200.13
##$BF4= 200.13
##$BF5= 200.13
##$BF6= 200.13
##$BF7= 200.13
##$BF8= 200.13
##$BYTORDA= 1
##$CFDGTYP= 0
##$CFRGTYP= 5
##$CHEMSTR= <none>
##$CNST= (0..31)
1 1 145 1 1 1 1 1 1 1 1 1 1 1 1 1 1 1 1 1 1 1 1 1 1 1 1 1 1 1 1 1 
##$CPDPRG= <waltz16>
##$CPDPRG1= <>
##$CPDPRG2= <waltz16>
##$CPDPRG3= <>
##$CPDPRG4= <mlev>
##$CPDPRG5= <mlev>
##$CPDPRG6= <mlev>
##$CPDPRG7= <mlev>
##$CPDPRG8= <mlev>
##$CPDPRGB= <>
##$CPDPRGT= <>
##$D= (0..31)
0 1 0 0 0 0 0 0 0 0 0 0.03 2e-05 3e-06 0 0 0 0 0 0 0 0 0 0 0 0 0 0 0 0 
0 0 
##$DATE= 1698406997
##$DBL= (0..7)
120 120 120 11 120 120 24 19 
##$DBP= (0..7)
150 150 150 150 150 150 150 150 
##$DBP07= 0
##$DBPNAM0= <>
$$ [...]
##$SUBNAM3= <"">
##$SUBNAM4= <"">
##$SUBNAM5= <"">
##$SUBNAM6= <"">
##$SUBNAM7= <"">
##$SUBNAM8= <"">
##$SUBNAM9= <"">
##$SW= 501.771253377433
##$SWIBOX= (0..15)
0 1 3 0 0 0 0 0 0 0 0 0 0 0 0 0 
##$SW_h= 40650.406504065
##$TD= 32768
##$TD0= 1
##$TE= 0
##$TE2= 300
##$TE3= 300
##$TEG= 300
##$TL= (0..7)
0 120 53 12 22 120 120 120 
##$TP= (0..7)
150 150 150 150 150 150 150 150 
##$TP07= 0
##$TPNAME0= <>
##$TPNAME1= <>
##$TPNAME2= <>
##$TPNAME3= <>
##$TPNAME4= <>
##$TPNAME5= <>
##$TPNAME6= <>
##$TPNAME7= <>
##$TPOAL= (0..7)
0.5 0.5 0.5 0.5 0.5 0.5 0.5 0.5 
##$TPOFFS= (0..7)
0 0 0 0 0 0 0 0 
##$TUNHIN= 0
##$TUNHOUT= 0
##$TUNXOUT= 0
##$USERA1= <user>
##$USERA2= <user>
##$USERA3= <user>
##$USERA4= <user>
##$USERA5= <user>
##$V9= 5
##$VALIST= <valist>
##$VCLIST= <CCCCCCCCCCCCCCC>
##$VD= 0
##$VDLIST= <DDDDDDDDDDDDDDD>
##$VPLIST= <PPPPPPPPPPPPPPP>
##$VTLIST= <TTTTTTTTTTTTTTT>
##$WBST= 1024
##$WBSW= 4
##$XGAIN= (0..3)
0 0 0 0 
##$XL= 0
##$YL= 0
##$YMAX_a= 10893
##$YMIN_a= -2405
##$ZGOPTNS= <>
##$ZL1= 120
##$ZL2= 120
##$ZL3= 120
##$ZL4= 120
##$ABSF1= 248.5645
##$ABSF2= -253.2056
##$ABSG= 5
##$ABSL= 3
##$ALPHA= 0
##$AQORDER= 0
##$ASSFAC= 0
##$ASSFACI= 0
##$ASSFACX= 0
##$ASSWID= 0
##$AUNMP= <proc_1d>
##$AZFE= 0.1
##$AZFW= 0.5
##$BCFW= 0
##$BC_mod= 2
##$BYTORDP= 0
##$COROFFS= 0
##$CY= -3
##$DATMOD= 1
##$DC= 0
##$DFILT= <>
##$DTYPP= 0
##$F1P= 0
##$F2P= 0
##$FCOR= 1
##$FTSIZE= 65536
##$FT_mod= 6
##$GAMMA= 0
##$GB= 0
##$INTBC= 1
##$INTSCL= 6.047779e-11
##$ISEN= 30
##$LB= 5
##$LEV0= 0
##$LPBIN= 0
##$MAXI= 10000
##$MC2= 0
##$MEAN= 0
##$ME_mod= 0
##$MI= 50
##$NCOEF= 0
##$NC_proc= -9
##$NLEV= 6
##$NOISF1= 182.463
##$NOISF2= 159.3651
##$NSP= 0
##$NTH_PI= 0
##$NZP= 0
##$OFFSET= 248.5645
##$PC= 4
##$PHC0= -10716.88
##$PHC1= 206.89
##$PH_mod= 1
##$PKNL= yes
##$PPARMOD= 0
##$PSCAL= 0
##$PSIGN= 0
##$REVERSE= no
##$SF= 81.0140089999694
##$SI= 65536
##$SIGF1= 159.3651
##$SIGF2= -187.1042
##$SINO= 113.3802
##$SIOLD= 16384
##$SREGLST= <1H.CDCl3>
##$SSB= 0
##$STSI= 65536
##$STSR= 0
##$SW_p= 40650.406504065
##$SYMM= 0
##$S_DEV= 0
##$TDeff= 32768
##$TDoff= 0
##$TI= <>
##$TILT= no
##$TM1= 0
##$TM2= 0
##$TOPLEV= 0
##$USERP1= <user>
##$USERP2= <user>
##$USERP3= <user>
##$USERP4= <user>
##$USERP5= <user>
##$WDW= 1
##$XDIM= 65536
##$YMAX_p= 384614278
##$YMIN_p= -120287423
$$ End of Bruker specific parameters
$$ ---------------------------------
##NTUPLES= NMR SPECTRUM
##VAR_NAME=  FREQUENCY,     SPECTRUM/REAL,   SPECTRUM/IMAG
##SYMBOL=    X,             R,               I
##VAR_TYPE=  INDEPENDENT,   DEPENDENT,       DEPENDENT
##VAR_FORM=  AFFN,          ASDF,            ASDF
##VAR_DIM=   65536,         65536,           65536
##UNITS=     HZ,            ARBITRARY UNITS, ARBITRARY UNITS
##FACTOR=    0.620285442955139, 1,           1
##FIRST=     20137.2065510682, 0,            0
##LAST=      -20513.1999529968, 0,           0
##MIN=       -20513.1999529968, -120287423,  0
##MAX=       20137.2065510682, 384614278,    0
$$ Real data points
##PAGE= N=1
##DATA TABLE= (X++(R..R)), XYDATA
$$ [...]
37624 -218487 408716 1155871 1977473 2890684 3924148 4927149 5554894 5575261 5137048
37615 5137048 4652411 4480709 4784191 5539125 6486824 7112906 6891298 5661350 3740866
37606 3740866 1691640 49495 -767801 -484745 939644 3212996 5733865 7790658
37598 7790658 8890194 9031577 8660271 8275754 8065772 7926288 7731943 7443269 6963300
37589 6963300 6044925 4438781 2129374 -559599 -3058935 -4814263 -5576223 -5468580 -4756708
37580 -4756708 -3634173 -2322512 -1228913 -720822 -711508 -714971 -410184 74388 589390 1453462
37570 1453462 3241119 6170892 9964885 14295875 19113791 24458771 30150745 35784501
37562 35784501 40942815 45400269 49312900 53333476 58401652 65249889 74139748 85108790
37554 85108790 98253497 113489196 130039621 146370244 160669207 171300446 176955117
37547 176955117 176859250 171176062 161054287 147958271 132904865 116482311 99502457
37540 99502457 83286090 69128370 57590984 48388612 40829786 34292242 28478843 23481428
37532 23481428 19606796 16970174 15200903 13628306 11780390 9649288 7519207 5692951
37524 5692951 4423509 3930976 4288197 5275358 6446838 7381112 7838221 7694890 6822741
37515 6822741 5109359 2606512 -359144 -3227726 -5406353 -6563893 -6860974 -6875899 -7155464
37506 -7155464 -7742927 -8206676 -8195547 -7869799 -7664201 -7726699 -7825736 -7819125 -7929205 -8371918
37496 -8371918 -8897127 -8955836 -8284968 -7130279 -5912978 -4869494 -4006399 -3157710 -1989720
37487 -1989720 -169783 2261972 4751004 6589852 7395187 7195587 6219775 4800212 3417938
37478 3417938 2585161 2564265 3272237 4477457 5976339 7538394 8820006 9483558 9417351
37469 9417351 8807772 8018316 7394038 7076433 6909577 6565473 5863542 4983378 4315491
37460 4315491 4115195 4357474 4889632 5585219 6280987 6662622 6357809 5188306 3301448
37451 3301448 1045038 -1276285 -3548597 -5801578 -8014734 -9938699 -11122386 -11185100
37443 -11185100 -10121836 -8366422 -6564960 -5256588 -4657222 -4602778 -4652839 -4341102 -3450437
37434 -3450437 -2106519 -619591 761072 1974603 3115937 4321889 5646670 6989739
37426 6989739 8145267 8948198 9363427 9416612 9069860 8216124 6802553 4932964 2842004
37417 2842004 783157 -1054321 -2534875 -3521341 -3890229 -3639561 -2935437 -1973324 -817954
37408 -817954 502746 1732414 2380449 2118115 1118566 -110566 -1190041 -2076013 -2908066
37399 -2908066 -3855020 -5103905 -6769096 -8688213 -10439312 -11691304 -12463366 -12934783 -13086667
37390 -13086667 -12691146 -11646314 -10194746 -8792095 -7857013 -7655743 -8277995 -9579966 -11150452
37381 -11150452 -12426965 -12942468 -12553880 -11518497 -10354255 -9506066 -8990152 -8306199 -6783051
37372 -6783051 -4156941 -902412 2016140 3795022 4281097 3905058 3233330 2650676 2403964
37363 2403964 2732233 3763442 5300152 6859344 7987430 8458576 8140562 6834296 4441370
37354 4441370 1269657 -2015777 -4831785 -6982145 -8502580 -9377838 -9565954 -9192178 -8489447
37345 -8489447 -7525918 -6169352 -4377721 -2367407 -401338 1458106 3269294 4995484
37337 4995484 6512184 7753189 8689196 9202127 9152716 8580599 7688532 6614498 5384664
37328 5384664 4140081 3221647 2880288 2997806 3238126 3416459 3571038 3704263 3656036
37319 3656036 3340526 3007891 3126325 3978266 5423288 7057498 8540328 9751066 10736276
37310 10736276 11637348 12651719 13897095 15206220 16141516 16348773 15890239 15139042 14357229
37301 14357229 13468409 12234590 10550686 8557679 6580799 4992656 4029396 3665100
37293 3665100 3696314 3930331 4184329 4131291 3398282 1992022 488380 -438908 -698186
37284 -698186 -869286 -1625179 -3167750 -5178217 -7121297 -8545835 -9275398 -9476009 -9504350
37275 -9504350 -9591364 -9687468 -9665158 -9601941 -9737262 -10157386 -10669424 -11068069 -11415748 -11894276
37265 -11894276 -12388940 -12409640 -11559681 -10012502 -8399838 -7272435 -6816419 -7070881 -8166801
37256 -8166801 -10152779 -12663708 -14968266 -16422277 -16825637 -16331401 -15103407 -13154323
37248 -13154323 -10514866 -7474900 -4559117 -2238875 -727682 -70194 -265110 -1110767
37240 -1110767 -2024180 -2355831 -2050082 -1786720 -2241158 -3298319 -4198303 -4393258 -4056602
37231 -4056602 -3800147 -4148756 -5325031 -7265814 -9644494 -11981932 -13916034 -15385992
37223 -15385992 -16526136 -17441216 -18131093 -18559674 -18710702 -18580304 -18130501 -17225398 -15652438
37214 -15652438 -13326985 -10503918 -7663862 -5115400 -2797461 -539838 1585150 3262741
37206 3262741 4178711 4124702 2954768 667752 -2403320 -5622999 -8373721 -10310362 -11302265
37197 -11302265 -11276824 -10271645 -8614465 -6898910 -5683568 -5220063 -5472352 -6306752 -7568856
37188 -7568856 -9032126 -10447723 -11722661 -12931651 -14038995 -14700608 -14505960 -13379003
37180 -13379003 -11549411 -9111582 -5848762 -1662425 2942374 7002850 9769357 11196310
37172 11196310 11835653 12333470 12960836 13468610 13326928 12151981 9965426 7123436 4111003
37163 4111003 1413762 -608451 -1926843 -2879507 -3813576 -4653623 -4944677 -4341878 -2931497
37154 -2931497 -1043838 1082339 3327022 5481453 7181230 8086907 8093178 7373211 6259691
37145 6259691 5064469 3947213 2902596 1835444 639503 -722091 -2084950 -2993804
37137 -2993804 -2866945 -1417228 1017305 3582758 5401073 6035564 5589386 4450308 2970050
37128 2970050 1342567 -316163 -1893905 -3329128 -4645687 -5837245 -6737485 -7102719
37120 -7102719 -6833493 -6035573 -4858968 -3379730 -1678917 53625 1556002 2583848
37112 2583848 2957413 2653437 1945806 1353485 1293879 1778553 2508659 3214268 3805708 4263989
37102 4263989 4572987 4818118 5225487 5987753 7052400 8103474 8733106 8644800 7764729
37093 7764729 6219259 4231326 2066857 68702 -1388803 -2135437 -2391792 -2588229 -2960959
37084 -2960959 -3432669 -3914252 -4548439 -5501922 -6603427 -7385598 -7529911 -7158929 -6637039
37075 -6637039 -6172201 -5701526 -5130055 -4575669 -4332811 -4631485 -5458436 -6563090 -7572330
37066 -7572330 -8149205 -8205054 -8051162 -8232967 -9040452 -10168012 -10972421 -11083331 -10649666
37057 -10649666 -9975839 -9089956 -7789883 -6003073 -3942658 -1944639 -285427 863169
37049 863169 1469818 1710143 1887167 2152878 2294113 1861887 577163 -1353419 -3310282
37040 -3310282 -4658456 -5098124 -4668179 -3507209 -1734581 419561 2503524 4001567
37032 4001567 4624279 4432773 3734673 2900573 2200883 1709908 1363118 1130836 1054308 1034625
37022 1034625 701333 -311600 -1947338 -3730191 -5213957 -6291769 -7029924 -7365542 -7097652
37013 -7097652 -6106554 -4496500 -2592489 -874036 195558 465260 280178 291869 1002328
37004 1002328 2429685 4135817 5535793 6254493 6311746 6026956 5737381 5576856 5459793
36995 5459793 5185060 4539758 3418051 1960843 570816 -299218 -419696 146825 1214575
36986 1214575 2663373 4449975 6448576 8300224 9479540 9608153 8748525 7352235
36978 7352235 5898589 4620867 3560616 2740537 2173650 1774204 1388685 915550 328397
36969 328397 -378719 -1160421 -1837342 -2158302 -2006234 -1510203 -937037 -495182 -213745 68633
36959 68633 601134 1500156 2544451 3228960 3135902 2332931 1400666 988151 1240569 1622972
36949 1622972 1350292 57655 -1904589 -3775746 -4927260 -5174385 -4755269 -4134730 -3734983
36940 -3734983 -3671713 -3686634 -3378458 -2512893 -1111462 678311 2719500 4949022 7388892
36931 7388892 10019656 12509573 14137236 14216980 12705972 10298902 7877150 5952042
36923 5952042 4638725 3948318 3908100 4458877 5416727 6581248 7816325 9037912 10218475
36914 10218475 11420023 12717012 13995343 14861678 14868250 13906092 12355022 10782724 9494913
36905 9494913 8430440 7460038 6632692 6055164 5678098 5372647 5145919 5078940 5059032 4794677
36895 4794677 4189118 3553044 3341247 3767955 4735182 5987180 7194268 7980568 8053799
36886 8053799 7351000 6031877 4390857 2813003 1674523 1121017 984180 1047077 1343485
36877 1343485 2035417 3017324 3849818 4178653 4093181 3957869 3953101 3886573 3442527 2535618
36867 2535618 1393449 324071 -563279 -1398001 -2336786 -3360051 -4276413 -4850281 -4889675
36858 -4889675 -4328522 -3378915 -2575737 -2484434 -3256981 -4525519 -5765680 -6690682 -7269005
36849 -7269005 -7503523 -7348383 -6815965 -6032614 -5142913 -4203902 -3175563 -1964255 -483983
36840 -483983 1244452 3018204 4524784 5530215 5973483 5867804 5181577 3898057 2182051
36831 2182051 412369 -992227 -1778104 -1921032 -1562246 -915163 -187963 465222 941607
36822 941607 1165690 1131451 1001419 1098053 1691334 2755442 3957886 4898751 5365486 5415966
36812 5415966 5300020 5302761 5572465 6021561 6383550 6379452 5854125 4823098 3459593 2007918
36802 2007918 616923 -744827 -2115572 -3268153 -3735990 -3201849 -1801669 29344
36794 29344 1950368 3870376 5784301 7624930 9335758 10985208 12680066 14332105
36786 14332105 15568112 15960726 15400610 14213988 12869860 11617171 10491748 9610342
36778 9610342 9238165 9468862 9998565 10389587 10500161 10519103 10628296 10772879 10722164 10193804
36768 10193804 8942268 6944249 4591991 2567325 1401816 1176131 1619466 2345535
36760 2345535 2949646 3090275 2687496 1987774 1271398 513033 -532883 -1917566 -3311386
36751 -3311386 -4270097 -4583509 -4326197 -3686547 -2847714 -1972140 -1174087 -477553 140598
36742 140598 635514 848006 601103 -138268 -1153729 -1999929 -2175966 -1416255 69990
36733 69990 1645446 2620533 2669941 1925286 708754 -769282 -2472223 -4417455 -6579029
36724 -6579029 -8851487 -10998532 -12639128 -13399038 -13148669 -12062338 -10424798 -8441826
36716 -8441826 -6279320 -4198498 -2514594 -1384521 -693155 -182147 329242 835081 1174683
36707 1174683 1136107 601966 -305448 -1210112 -1677675 -1481217 -703143 375803 1441417
36698 1441417 2251682 2723702 3006515 3409341 4150040 5156247 6154726 6934337 7452216
36689 7452216 7695866 7550955 6873231 5654183 4071479 2391908 832347 -534327 -1771061
36680 -1771061 -2939465 -3940389 -4534245 -4568606 -4159626 -3598511 -3091014 -2634651 -2154170
36671 -2154170 -1720654 -1604497 -2076272 -3112760 -4307518 -5143577 -5403371 -5296573 -5201701
36662 -5201701 -5372611 -5926041 -6974987 -8595041 -10633659 -12646748 -14077681 -14503914 -13770796
36653 -13770796 -11997987 -9511844 -6747791 -4165666 -2166093 -943818 -347177 18291
36645 18291 394227 566947 60786 -1331327 -3256514 -5043875 -6208800 -6775046 -7196353
36636 -7196353 -7934117 -8984424 -9791067 -9728680 -8735418 -7432390 -6614320 -6673052 -7465664
36627 -7465664 -8557742 -9493285 -9949896 -9827149 -9269081 -8590647 -8143022 -8152493 -8557227 -8977684
36617 -8977684 -8965017 -8365192 -7401732 -6382545 -5416753 -4456196 -3471789 -2450746 -1307714
36608 -1307714 3602 1260985 2009258 1939353 1210555 347300 -181958 -282738 -176127
36599 -176127 -72064 75785 486292 1247471 2143483 2794872 2922593 2450884 1430130
36590 1430130 -30060 -1743905 -3465160 -5003722 -6330461 -7541899 -8727152 -9892013
36582 -9892013 -11005516 -12072016 -13112527 -14085007 -14871165 -15350025 -15434452 -15025299 -14025377
36573 -14025377 -12492564 -10737327 -9155739 -7941221 -7003720 -6135372 -5165424 -3991192
36565 -3991192 -2614886 -1198815 30252 983991 1719346 2214747 2311954 2011300 1689423
36556 1689423 1806619 2393323 2969647 2997578 2312363 1105296 -375307 -2004577 -3716128
36547 -3716128 -5368866 -6738918 -7633284 -7954213 -7618977 -6500967 -4597706 -2267235 -132695
36538 -132695 1356264 2198579 2656723 2973904 3385424 4188944 5498963 6955971 7927742
36529 7927742 8051640 7441908 6419347 5289667 4394426 4049950 4248354 4616335 4847699
36520 4847699 5012753 5259519 5383590 4959333 3815502 2117408 12480 -2511958 -5350230
36511 -5350230 -8120707 -10462075 -12355556 -14001494 -15462966 -16586460 -17250292 -17561670
36503 -17561670 -17777516 -18083734 -18445633 -18609834 -18241113 -17122957 -15300972 -13081229 -10900120
36494 -10900120 -9134070 -7919368 -7090527 -6332783 -5458507 -4547300 -3826240 -3472040 -3556493
36485 -3556493 -4094267 -5020993 -6115286 -7033321 -7485044 -7390940 -6902143 -6310295 -5895340
36476 -5895340 -5754384 -5741392 -5629485 -5354594 -5045098 -4801091 -4532464 -4065224 -3325462 -2338419
36466 -2338419 -1125495 249091 1523941 2285486 2295066 1766341 1242575 1136478 1356337
36457 1356337 1383765 757260 -483090 -1826964 -2760765 -3166008 -3266857 -3310572 -3410626
36448 -3410626 -3613293 -3898599 -4051974 -3713863 -2727332 -1380528 -132272 952064 2384474
36439 2384474 4761927 8056195 11405989 13642304 14082613 12922786 10992759 9215770
36431 9215770 8215617 8165020 8739642 9212252 8845095 7424335 5442465 3693686 2674611
36422 2674611 2356155 2414033 2548053 2596819 2492444 2225850 1877862 1651531 1824450 2610078
36412 2610078 4025581 5885416 7908508 9822276 11436517 12749254 14002113 15484368
36404 15484368 17163809 18584181 19248675 19064610 18298037 17149897 15577439 13596103
36396 13596103 11597159 10204718 9806156 10242250 10893495 11029531 10199629 8498517 6561222
36387 6561222 5228425 5053605 5990182 7485557 8889468 9836881 10313848 10426504 10168934
36378 10168934 9427423 8143419 6388183 4279003 1905985 -604065 -2992309 -4915684
36370 -4915684 -6133632 -6660889 -6757318 -6792461 -7108107 -7940549 -9366224 -11237421 -13168268
36361 -13168268 -14656881 -15307433 -14997816 -13898097 -12393164 -10983609 -10150091 -10173734 -11014366
36352 -11014366 -12345750 -13697545 -14586517 -14622900 -13641502 -11806482 -9565358 -7452379 -5905038
36343 -5905038 -5220519 -5586692 -7028605 -9241519 -11497724 -12856629 -12654058 -10913422 -8312740
36334 -8312740 -5737155 -3803657 -2662944 -2067727 -1584807 -885349 33571 931226 1666172
36325 1666172 2358974 3104439 3626226 3447171 2450963 1097375 -28123 -749424 -1241004
36316 -1241004 -1532349 -1313467 -323456 1214987 2716042 3766927 4407573 4847794 5062770
36307 5062770 4827933 4111338 3245744 2631236 2371688 2301645 2300441 2444508 2831688 3341033
36297 3341033 3624239 3340114 2411269 1066305 -388057 -1852478 -3479161 -5438798 -7689062
36288 -7689062 -9963482 -11896451 -13136292 -13473628 -12998271 -12103980 -11241043 -10643762 -10280821
36279 -10280821 -9946605 -9325604 -8123510 -6349663 -4454196 -3024444 -2333212 -2284401 -2722344
36270 -2722344 -3570508 -4654124 -5636489 -6271258 -6587842 -6728496 -6740322 -6662669 -6710552 -7182102
36260 -7182102 -8158228 -9356281 -10258361 -10344446 -9286540 -7063629 -3956579 -431654 2985290
36251 2985290 5805091 7712377 8704687 9050661 9058593 8910958 8690237 8394590 7822881
36242 7822881 6581430 4419428 1602618 -1130642 -3019735 -3695386 -3256922 -2099349
36234 -2099349 -696814 555931 1415588 1781637 1661385 1149700 402080 -408536 -1119643
36225 -1119643 -1608906 -1864921 -2012118 -2170612 -2281365 -2171895 -1812221 -1378704 -1027643
36216 -1027643 -771193 -674656 -995252 -1916311 -3217132 -4401740 -5139566 -5444370 -5494429
36207 -5494429 -5503164 -5769213 -6596746 -8016263 -9681719 -11117577 -11974156 -12010547 -11013260
36198 -11013260 -8918986 -6001763 -2845701 -119054 1665577 2348447 2239827 1985527
36190 1985527 2149651 2857144 3838968 4747183 5341579 5460835 5032078 4212768 3425785
36181 3425785 3115289 3411121 4014588 4393235 4128874 3196328 1988829 1032151 572564
36172 572564 387186 -9468 -969695 -2481585 -4227254 -5782176 -6784583 -7024038 -6457576
36163 -6457576 -5182984 -3437488 -1635406 -306492 180150 -74616 -508066 -478835 324068
36154 324068 1764170 3395023 4681692 5259104 5147345 4701217 4272285 3957724 3708137
36145 3708137 3514799 3313085 2824690 1782121 328217 -1060361 -2112764 -2964876 -3676424
36136 -3676424 -3814309 -2846419 -916554 1023846 1931847 1439064 -32186 -1700120 -2893754
36127 -2893754 -3260014 -2718161 -1322493 785298 3288375 5646718 7279472 7898170 7693066
36118 7693066 7180569 6810822 6640214 6357872 5676406 4714235 3946641 3772363 4196276
36109 4196276 4953428 5856622 6983784 8612233 11015947 14224078 17887044 21427597
36101 21427597 24367637 26451009 27481559 27271726 25895715 23832355 21651093 19605894
36093 19605894 17654737 15761466 14010692 12536308 11534659 11235622 11604097 12144714
36085 12144714 12304987 12065006 11823917 11687062 11245954 10230390 9049836 8399566 8499423
36076 8499423 8965833 9296191 9215007 8631566 7575626 6266242 5075078 4313291 4078246
36067 4078246 4280752 4734992 5233633 5623883 5826557 5754875 5273486 4320932 3044271
36058 3044271 1737036 653168 -100293 -585553 -1040603 -1757086 -2766495 -3652836 -3850172
36049 -3850172 -3205647 -2168063 -1366682 -1052189 -965205 -671191 28414 958860 1767756
36040 1767756 2254410 2540164 2937387 3671628 4736740 5968421 7174334 8160499 8680966
36031 8680966 8456010 7345112 5582866 3833526 2896947 3232685 4702716 6721313 8589830
36022 8589830 9731929 9825029 8919424 7431326 5877587 4549714 3465813 2580574 1897758
36013 1897758 1339912 642212 -490929 -2122182 -4022019 -5855768 -7375688 -8425866
36005 -8425866 -8835346 -8428699 -7231090 -5623984 -4135697 -2963477 -1780920 -171492
35997 -171492 1756218 3344627 4037025 3928468 3585161 3432496 3466066 3496137 3456827 3387627
35987 3387627 3252519 2951745 2523397 2216149 2274913 2667376 3077844 3185879 2914194 2384781
35977 2384781 1700172 879832 35934 -499890 -348950 607233 2144854 3897656 5556431
35968 5556431 6897981 7786483 8260826 8538906 8801117 8987140 8917130 8606438 8340633
35959 8340633 8418127 8934956 9854610 11128440 12607141 13922021 14647232 14637099 14132821
35950 14132821 13511758 12973833 12461641 11813637 10974776 10108673 9531724 9516731 10146757
35941 10146757 11342111 12962970 14840812 16779595 18626916 20329677 21854080 23104821
35933 23104821 24039427 24823321 25700124 26666224 27414490 27670965 27479222 27094129 26732764
35924 26732764 26543395 26694703 27295007 28212362 29099509 29637597 29713188 29385694 28774197
35915 28774197 27997331 27183983 26554503 26512120 27546307 29863723 33068234 36329710 38975964
35906 38975964 40913666 42477966 43985048 45516920 47041085 48538129 49946617 51119315
35898 51119315 51980885 52701458 53571823 54645738 55575870 55865233 55255300 53860864 52011138
35889 52011138 50001578 47875322 45311107 41808005 37188906 31964827 27064275 23144700
35881 23144700 20244103 18067016 16393179 15119048 14117668 13297055 12759211 12731867 13321574
35872 13321574 14411112 15772764 17193940 18510830 19605661 20392462 20817528 20961482
35864 20961482 21156633 21815384 22965908 24052688 24398671 23842887 22765144 21546650 20254224
35855 20254224 18876605 17592146 16634846 16049994 15745955 15694541 15938295 16470802 17249693
35846 17249693 18276847 19509308 20687451 21396993 21389389 20821074 20160987 19869612 20117594
35837 20117594 20729431 21379416 21884257 22314230 22790960 23204416 23227290 22681223 21876922
35828 21876922 21533071 22291058 24228368 26779558 29145602 30886475 32220640 33752542
35820 33752542 35829862 38110805 39779173 40228106 39561854 38482263 37778390 37936369 39059127
35811 39059127 40914693 43017904 44855228 46187667 47102634 47721251 47956054 47664500 46967129
35802 46967129 46268559 45957237 46157953 46749506 47541787 48471258 49710767 51536588 53980524
35793 53980524 56684845 59262467 61737436 64385115 67113474 69280278 70283900 70159797
35785 70159797 69433169 68543185 67608776 66599553 65391990 63602471 60639266 56140475
35777 56140475 50358530 44083680 38245258 33573466 30464831 28959572 28758560 29298085
35769 29298085 29918190 30112274 29731506 28942491 27915019 26551185 24590417 21996737 19186594
35760 19186594 16845068 15513153 15273318 15707455 16149837 16120263 15624573 15025219 14611117
35751 14611117 14364890 14164450 14074271 14315338 15016101 16124878 17527545 19087613 20543297
35742 20543297 21525524 21796094 21419187 20639902 19664099 18628738 17698709 17043115 16718295
35733 16718295 16699965 17052892 17924610 19258481 20582805 21236746 20874593 19733003 18401178
35724 18401178 17350820 16665560 16142958 15575707 14899979 14096287 13030711 11502094 9489758
35715 9489758 7284932 5270620 3548032 1847643 -134864 -2329853 -4256971 -5402319
35707 -5402319 -5626296 -5215474 -4566851 -3840546 -2905862 -1578408 143111 2083340 4078378
35698 4078378 6089756 8118093 10056251 11686939 12827531 13430672 13524450 13117646 12248109
35689 12248109 11107390 9994626 9072434 8239846 7337571 6427209 5758506 5504307 5679602
35680 5679602 6305829 7423617 8814369 9882621 10046102 9241819 7929175 6628933 5575821
35671 5575821 4750249 4031824 3282623 2473611 1833339 1722404 2207830 2834582 2970883
35662 2970883 2381885 1383297 473951 -46612 -91523 394365 1439926 2850438 4123568
35653 4123568 4695248 4339400 3332174 2199554 1273163 462276 -558056 -1924933 -3330503
35644 -3330503 -4201942 -4190405 -3493882 -2649152 -1993707 -1397417 -544442 625516 1847328
35635 1847328 2828303 3491333 3939335 4290667 4564714 4654708 4418414 3880770 3346914 3228482
35625 3228482 3751800 4902604 6602114 8765188 11149545 13320104 14897238 15795322
35617 15795322 16163517 16160783 15843606 15218171 14380689 13686413 13759177 15110798 17580958
35608 17580958 20246707 22055439 22562208 22037227 21021982 19954488 19108638 18597539 18321094
35599 18321094 18043177 17640413 17268421 17263646 17867674 18952574 19927658 20011822 18796122
35590 18796122 16582556 14061119 11639129 9200447 6522725 3755647 1391215 -125503
35582 -125503 -649451 -292554 710601 2060795 3394536 4305478 4438926 3641163 2034266
35573 2034266 -94201 -2471000 -4855249 -6911640 -8222050 -8545257 -8041795 -7159775 -6265849
35564 -6265849 -5378546 -4233848 -2599929 -546543 1595675 3544928 5270002 6809130
35556 6809130 7962761 8346137 7791702 6566037 5125450 3771801 2603123 1642149 877047
35547 877047 286801 -25180 177161 948403 1891444 2400651 2169661 1285919 -126989
35538 -126989 -2041012 -4157741 -5682419 -5800818 -4423248 -2334646 -618248 -3802 -661035
35529 -661035 -2357784 -4681162 -7191527 -9495401 -11238789 -12103864 -11910866 -10747591 -8936026
35520 -8936026 -6838733 -4720534 -2756849 -1037576 512579 2122081 3948067 5861389
35512 5861389 7538070 8777348 9661861 10383187 10978016 11286012 11114976 10359246 8954429
35503 8954429 6822618 3975981 686214 -2538547 -5232661 -7232698 -8619865 -9416296
35495 -9416296 -9409038 -8321395 -6153515 -3362296 -738039 940315 1291241 528493 -710678
35486 -710678 -1807048 -2475634 -2689115 -2415387 -1563808 -176019 1460421 2951838 4018181
35477 4018181 4594697 4826870 5005163 5398023 6044073 6727670 7212254 7481088 7730042
35468 7730042 8173880 8877902 9682476 10212470 10046993 9032731 7460347 5868016 4659804
35459 4659804 3922987 3506917 3134579 2490037 1425396 191419 -657258 -706349 10000
35450 10000 1185317 2606981 4227256 5953726 7545369 8733294 9326039 9186675 8252832
35441 8252832 6663188 4774994 2957244 1394740 144324 -684438 -907572 -410509 767323
35432 767323 2475924 4480745 6428762 7906235 8633122 8585634 7884914 6601316 4722817
35423 4722817 2285347 -531222 -3414924 -5955389 -7698128 -8325172 -7894077 -6839528
35415 -6839528 -5615958 -4323704 -2768471 -905925 877009 2014706 2259905 1843328
35407 1843328 1160475 429079 -287368 -849567 -1023551 -718124 -113352 521709 1066021
35398 1066021 1535894 1924022 2186429 2394651 2785547 3578691 4742230 5940611 6713850
35389 6713850 6777015 6242375 5550164 5091974 4862015 4523832 3833931 2948026 2308386 2302225
35379 2302225 3031988 4302806 5769929 7189410 8609311 10244736 12078601 13672321
35371 13672321 14523731 14595497 14337175 14144014 13919641 13258796 11987852 10425749 9132057
35362 9132057 8484626 8523718 9124142 10188602 11587388 12953110 13702814 13412460 12173448
35353 12173448 10501520 8891959 7529403 6400864 5525473 4957151 4630515 4341207 3910134
35344 3910134 3316119 2664877 2084935 1667115 1447180 1400206 1459825 1554999 1618099 1584521
35334 1584521 1466868 1454290 1817305 2569831 3266908 3341577 2739166 2078527 2038590 2669037
35324 2669037 3468082 4067906 4606998 5410883 6569720 7956786 9418491 10693969 11290281
35315 11290281 10776487 9270473 7440606 5961406 5101915 4835147 5074595 5631538 6134252
35306 6134252 6276179 6159419 6224471 6795957 7778282 8767315 9312213 9064725 7904527
35297 7904527 6125519 4442971 3607571 3901118 5023155 6438632 7734667 8661054 9050664
35288 9050664 8898598 8448630 7995786 7578439 7016419 6265644 5530746 4938939 4324167
35279 4324167 3543746 2857761 2695274 3051466 3399051 3305667 2942617 2840071 3268083 4007218
35269 4007218 4651758 4992642 5121868 5269138 5555179 5881306 6094685 6251426 6571660
35260 6571660 7045910 7247653 6761800 5766392 4960690 4847128 5246129 5601726 5598336 5315492
35250 5315492 4890780 4287525 3466171 2621708 2098417 2081718 2444721 2887314 3172284 3248253
35240 3248253 3232843 3311310 3590918 4002835 4379363 4663908 4990734 5483574 6014480 6279827
35230 6279827 6147975 5845901 5737995 5952462 6254986 6248276 5676180 4610703 3420913
35221 3420913 2530656 2130336 2101310 2204760 2264215 2122779 1557557 444398 -962365
35212 -962365 -2090116 -2535889 -2467669 -2453811 -2899975 -3713499 -4511337 -5076173 -5558877 -6258528
35202 -6258528 -7251355 -8256829 -8863467 -8872296 -8415088 -7771295 -7141022 -6633659 -6405996 -6664145
35192 -6664145 -7438029 -8395515 -8988164 -8838380 -7965408 -6623004 -4983090 -3065359 -966680
35183 -966680 968957 2335680 3029891 3351380 3704421 4251402 4900232 5547203 6193343
35174 6193343 6813637 7259843 7397166 7260026 6958973 6492424 5812909 5088494 4715274
35165 4715274 4941412 5547189 6004806 5939027 5386649 4669960 4105305 3791673 3566983 3146717
35155 3146717 2364359 1297714 160088 -869389 -1664825 -2112515 -2200766 -2120651 -2112148 -2160726
35145 -2160726 -1950609 -1164583 237656 2024705 3827240 5213623 5791330 5400862 4210660
35136 4210660 2570611 803489 -850627 -2204264 -3149789 -3678535 -3802812 -3513839 -2901583
35127 -2901583 -2262978 -1964021 -2158723 -2679194 -3192394 -3439285 -3365781 -3072576 -2610563 -1818325
35117 -1818325 -482263 1233149 2610788 2837088 1690179 -304884 -2398502 -4171772
35109 -4171772 -5552476 -6450355 -6568615 -5639785 -3814710 -1753742 -243560 353105 279033
35100 279033 17782 -185504 -395687 -693792 -988056 -1136788 -1128860 -1082378 -1129567 -1322909
35090 -1322909 -1587090 -1775812 -1893035 -2260709 -3286177 -4946200 -6608285 -7500709 -7339998
35081 -7339998 -6459208 -5433711 -4681056 -4287306 -3992854 -3342177 -2045902 -299722 1318997
35072 1318997 2303113 2516551 2108663 1335974 560701 252690 758000 2014925 3588255
35063 3588255 5030204 6184059 7135188 7916333 8319937 8049518 7073476 5760712 4549432
35054 4549432 3471833 2143486 314888 -1663048 -3049265 -3342926 -2603932 -1238174
35046 -1238174 314890 1654242 2421596 2447870 1868009 975481 -41079 -1178784 -2493752
35037 -2493752 -3960186 -5407287 -6521387 -6958133 -6558371 -5466197 -3995003 -2417882
35029 -2417882 -950035 141255 571162 224808 -760622 -2102205 -3483459 -4595417 -5232331
35020 -5232331 -5427215 -5402206 -5311083 -5093480 -4634612 -3986263 -3343742 -2846845 -2466332 -2041671
35010 -2041671 -1380805 -403075 713928 1580069 1914964 1834546 1720156 1786962 1876990 1718736
35000 1718736 1303533 920522 846287 1073115 1357750 1495251 1510841 1586469 1821979 2080248
34990 2080248 2056892 1502582 430782 -815300 -1696952 -1785922 -1061093 49522 931166
34981 931166 1112676 412060 -1094016 -3113360 -5171861 -6769103 -7661037 -8029335 -8316719
34972 -8316719 -8844902 -9594428 -10350372 -10975149 -11434080 -11592061 -11174362 -10043788 -8416613
34963 -8416613 -6675494 -5041479 -3573995 -2410551 -1754834 -1566317 -1452878 -989952 -61559
34954 -61559 1140686 2309894 3181550 3710807 4205286 5070567 6236276 7012040 6776289
34945 6776289 5740895 4809518 4714376 5468678 6572869 7490190 7952729 8119683 8532276
34936 8532276 9673890 11440419 13184814 14332173 14763108 14563726 13716540 12252762 10477785
34927 10477785 8737010 7037571 5175900 3245074 1786630 1348698 1980133 3161914
34919 3161914 4130927 4296081 3529818 2191170 849871 -62557 -370244 -31662 954481
34910 954481 2477721 4215746 5669057 6339919 5975391 4749083 3215992 2004666 1488900
34901 1488900 1727784 2638800 4111251 5935730 7727658 9009783 9383334 8646429 6841027
34892 6841027 4263087 1408318 -1170833 -3034006 -3970824 -4062303 -3687080 -3407527 -3701139
34883 -3701139 -4672223 -5977656 -7048967 -7427808 -6961329 -5798850 -4315000 -3023497 -2403119
34874 -2403119 -2634500 -3462315 -4371568 -4948256 -5102343 -5012430 -4915143 -4893527 -4751016 -4088645
34864 -4088645 -2650420 -700417 998806 1707546 1266027 135033 -1094650 -2201111
34856 -2201111 -3362557 -4771548 -6307832 -7632763 -8547922 -9142238 -9558909 -9754597 -9615966
34847 -9615966 -9227365 -8829329 -8497006 -8029074 -7216998 -6080347 -4751856 -3282716 -1736715
34838 -1736715 -422722 153514 -347475 -1807516 -3715686 -5492080 -6779996 -7494907 -7643082
34829 -7643082 -7154364 -5966325 -4257099 -2466231 -997137 62207 894450 1710599 2597047
34820 2597047 3491420 4194195 4457452 4179371 3517497 2770861 2194145 1954471 2146009
34811 2146009 2712933 3417487 4023590 4492543 4883656 5091058 4818610 3837118 2181077
34802 2181077 105740 -2049279 -3976174 -5516971 -6702924 -7607031 -8180944 -8338063 -8150491
34793 -8150491 -7799295 -7339226 -6710236 -6025602 -5630938 -5736966 -6135903 -6437642 -6507356 -6550516
34783 -6550516 -6854864 -7581663 -8717598 -10032599 -11086314 -11455404 -11041315 -10103770 -8990641
34774 -8990641 -7905828 -6909089 -5991763 -5091173 -4139849 -3201405 -2515334 -2320877 -2622753
34765 -2622753 -3134154 -3403592 -2999754 -1733778 94863 1664813 2069017 1009799 -904833
34756 -904833 -2629626 -3457481 -3318097 -2440487 -961931 1045893 3357397 5629515 7656296
34747 7656296 9436437 10940864 11907119 11935548 10790712 8637832 6035119 3652982 1883232
34738 1883232 676810 -202357 -794384 -907202 -451020 331172 1043187 1472171 1681466
34729 1681466 1822641 1918257 1808724 1292985 360537 -718260 -1614106 -2270678 -2918713
34720 -2918713 -3715359 -4470444 -4801413 -4472812 -3515807 -2136794 -656611 523395 1075598
34711 1075598 925435 244324 -683762 -1511429 -1835493 -1354715 -89143 1629631 3414077
34702 3414077 5042401 6501849 7933786 9489215 11067838 12187580 12287388 11229176
34694 11229176 9373511 7118649 4550392 1665190 -1250962 -3716495 -5485938 -6660041
34686 -6660041 -7317365 -7234530 -6141345 -4210220 -2141257 -671041 1160 276879 686847
34677 686847 1448708 2514165 3879939 5604871 7500540 9059868 9877905 10022359 9798065
34668 9798065 9206634 7829322 5239350 1392834 -3322582 -8179778 -12223014 -14588193
34660 -14588193 -14977961 -13806059 -11803876 -9569435 -7528022 -6067006 -5377029 -5145217
34652 -5145217 -4650666 -3310110 -1097437 1551956 4105862 6162135 7479030 7954927
34644 7954927 7593874 6450409 4650161 2518302 616723 -501252 -665181 -206703 334830
34635 334830 656225 886165 1395000 2420112 3816664 5098362 5713844 5365709 4163442
34626 4163442 2509646 822548 -655140 -1815312 -2549095 -2750084 -2442843 -1805440 -1022411
34617 -1022411 -187115 616357 1239730 1577062 1677670 1628401 1339156 559826 -862961
34608 -862961 -2803807 -4917080 -6797781 -8108578 -8685164 -8599017 -8094233 -7445848 -6875999
34599 -6875999 -6514248 -6316958 -6061233 -5560095 -4872723 -4143975 -3242997 -1797459 299990
34590 299990 2607554 4524055 5848397 6807632 7663170 8503026 9355250 10254385 11131046
34581 11131046 11780106 12012916 11800818 11297295 10787699 10533655 10514674 10370151 9780951
34572 9780951 8908776 8283306 8242055 8656125 9200860 9633981 9719972 9173100 7926984 6311430
34562 6311430 4707265 3086252 1111087 -1335428 -3918300 -6136356 -7654640 -8370847
34554 -8370847 -8409023 -8156532 -8112627 -8511381 -9134444 -9567989 -9550952 -8987191 -7762507 -5781007
34544 -5781007 -3213549 -574209 1511128 2580783 2456224 1281950 -463060 -2116476
34536 -2116476 -3159299 -3444509 -3122322 -2427317 -1588656 -831787 -294082 81914 457633
34527 457633 856520 1088907 964792 531281 67695 -107398 183995 887687 1715688 2287238
34517 2287238 2393166 2183567 2098311 2603588 3939714 6007619 8422708 10707019 12473452
34508 12473452 13423247 13233874 11654204 8863010 5654298 3079932 1822327 1879890 2724027
34499 2724027 3641896 4072737 3916022 3601565 3675868 4204142 4686136 4635274 4112641 3586874
34489 3586874 3395083 3500692 3697938 3835952 3797730 3429210 2644355 1606999 739644
34480 739644 487623 1015845 2090737 3245667 4075215 4417295 4361098 4188283 4267838 4816325
34470 4816325 5626582 6101895 5707738 4438093 2808296 1407207 497332 3577 -232783
34461 -232783 -262460 -52565 382941 949516 1593219 2397391 3446160 4540969 5125474
34452 5125474 4606038 2812622 182328 -2472255 -4405027 -5290589 -5299761 -4896667 -4556999
34443 -4556999 -4624098 -5278587 -6444511 -7690279 -8423366 -8378191 -7886033 -7548755 -7670171
34434 -7670171 -8099573 -8571069 -9024409 -9560940 -10224403 -10913683 -11455036 -11707068 -11636744 -11339507
34424 -11339507 -10979246 -10708046 -10644145 -10844702 -11187780 -11313356 -10846254 -9751746 -8380203
34415 -8380203 -7110644 -6063932 -5247853 -4836122 -5083511 -5961959 -7069957 -7991381 -8621935
34406 -8621935 -9024880 -9058378 -8349494 -6710485 -4481724 -2363039 -909815 -202327 84010
34397 84010 386384 982151 1847353 2728184 3446921 4193839 5417513 7312826 9444701
34388 9444701 10968968 11242765 10223016 8383104 6379195 4752268 3729150 3133861
34380 3133861 2495079 1347001 -468944 -2714492 -4923873 -6699353 -7899745 -8544556
34372 -8544556 -8539379 -7599309 -5573600 -2837197 -220921 1547333 2340263 2598198 2867706
34363 2867706 3364418 3884470 4068556 3763470 3141567 2462853 1776945 952901 -15555
34354 -15555 -867762 -1289785 -1173889 -609636 277461 1367370 2475473 3364701 3875931
34345 3875931 4052060 4171548 4658998 5855797 7779327 10124394 12532695 14797968 16775322
34336 16775322 18236323 18993683 19139134 18980033 18679653 18056052 16790621 14787686 12327675
34327 12327675 9949085 8189609 7323448 7247358 7612589 8059541 8298784 8053243 7127365
34318 7127365 5628791 3996310 2662066 1703755 897919 59339 -769643 -1427932 -1822051
34309 -1822051 -2005610 -2156764 -2469985 -2984133 -3514442 -3830201 -3892999 -3837930 -3753123 -3631962
34299 -3631962 -3567831 -3800279 -4413642 -5087322 -5318279 -4881600 -3963694 -2893516 -1922056
34290 -1922056 -1280981 -1227889 -1827078 -2723236 -3305780 -3192174 -2537326 -1852655 -1541868 -1622691
34280 -1622691 -1866525 -2136404 -2511524 -3066931 -3618282 -3791207 -3345108 -2349865 -1041637
34271 -1041637 383031 1776814 2967629 3826293 4405235 4910124 5512322 6241397 7039079
34262 7039079 7815393 8435051 8770632 8861778 8957969 9286791 9764175 9998764 9614487 8564455
34252 8564455 7167161 5902103 5152941 5025583 5307805 5611141 5617352 5217682 4429015
34243 4429015 3255533 1747193 215176 -721564 -442238 1244500 3925309 6786461
34235 6786461 9008623 10099492 10021997 9096362 7771049 6433440 5348948 4649284 4288084
34226 4288084 4043507 3662892 3042761 2262021 1490449 929850 787599 1166644 1947553
34217 1947553 2872289 3769230 4590005 5187601 5207069 4350480 2728860 847077 -788651
34208 -788651 -2041817 -3177098 -4552692 -6209559 -7715691 -8508267 -8487969 -8212303 -8390344
34199 -8390344 -9221506 -10322559 -11233243 -11838844 -12333323 -12973922 -13924129 -15139968 -16256025
34190 -16256025 -16679621 -15967822 -14132562 -11524996 -8486881 -5249475 -2163734 174649
34182 174649 1242201 1078050 365360 -61880 204398 1043772 2127195 3157266 3841024
34173 3841024 3927478 3478680 2960142 2813721 2971179 3018776 2858170 2938130 3665817 4738730
34163 4738730 5281893 4685705 3257976 2068843 2159807 3776792 6218050 8396314 9614464
34154 9614464 9877886 9576444 9003586 8180744 6960230 5163143 2724045 -117976 -2788865
34145 -2788865 -4724203 -5855866 -6719121 -8012931 -10026599 -12453624 -14688478 -16254669
34137 -16254669 -16968530 -16791412 -15675421 -13647156 -10968389 -8048667 -5150247 -2266695
34129 -2266695 698660 3767694 6922099 10080992 12873742 14600496 14707659 13333839
34121 13333839 11227035 9138909 7482881 6544994 6672477 7994798 10076682 12084035
34113 12084035 13327091 13579233 12964524 11727142 10129862 8413371 6748255 5268497
34105 5268497 4184984 3789099 4257395 5451891 6949034 8274879 9131137 9457637 9333342
34096 9333342 8812599 7835119 6319950 4385925 2453498 1048827 458493 583253 1122193
34087 1122193 1840660 2622942 3332666 3751639 3722287 3307994 2742504 2219200 1795764 1543793
34077 1543793 1719255 2641288 4327986 6319738 7968638 8906652 9175366 8951417 8305082
34068 8305082 7275784 6030028 4805403 3766294 3040091 2834620 3335265 4428924 5624946
34059 5624946 6309737 6076213 4888924 3098330 1344524 304225 357564 1401621 2909288
34050 2909288 4142317 4469306 3750910 2502003 1504749 1119755 1035329 745447 152231
34041 152231 -397704 -546015 -244079 265406 602952 410090 -462802 -1844415 -3368497
34032 -3368497 -4722986 -5744177 -6333751 -6412238 -5968650 -5071574 -3824863 -2389866 -1052652
34023 -1052652 -176930 -36736 -686608 -1927109 -3323614 -4346252 -4689882 -4524944 -4324664
34014 -4324664 -4368406 -4468530 -4225943 -3496627 -2573897 -1975645 -2086672 -2924058 -4152085
34005 -4152085 -5322896 -6158743 -6659233 -7015442 -7488534 -8311286 -9533332 -10877308 -11854924
33996 -11854924 -12161995 -11948182 -11608737 -11315245 -10839501 -9862351 -8382492 -6778317 -5529089
33987 -5529089 -4943564 -5106169 -5931738 -7176176 -8455008 -9377003 -9706799 -9393296 -8519576
33978 -8519576 -7354181 -6415655 -6246721 -6951109 -8040421 -8898969 -9374507 -9795484 -10467383
33969 -10467383 -11339834 -12181595 -12881133 -13465954 -13970294 -14455983 -15123177 -16225061 -17773943
33960 -17773943 -19353259 -20278570 -20002597 -18429336 -15894965 -12888790 -9811093 -6946014
33952 -6946014 -4528387 -2723484 -1563751 -980161 -874614 -1094864 -1388608 -1510815 -1388862
33943 -1388862 -1086613 -620610 32551 695845 920629 309358 -1117521 -2941573 -4667007
33934 -4667007 -5941425 -6549449 -6377928 -5461852 -3991095 -2199728 -258100 1693014 3408382
33925 3408382 4489621 4551095 3514601 1768655 -1010 -1209627 -1695671 -1759797 -1948344
33916 -1948344 -2733575 -4256926 -6279786 -8360207 -10075560 -11104007 -11217463 -10357154 -8753085
33907 -8753085 -6874198 -5187434 -3963671 -3278960 -3097401 -3302534 -3706564 -4090478 -4242614
33898 -4242614 -3978838 -3167540 -1724079 441019 3373153 6828949 10108732 12333043
33890 12333043 13010190 12303377 10761550 8920902 7176462 5822492 5028588 4806939 5075097
33881 5075097 5694680 6425935 7002943 7394399 7907368 8883412 10291744 11673081 12438545
33872 12438545 12226773 11160229 9902038 9312930 9794825 10936777 11911475 12184780 11749133
33863 11749133 10810837 9527700 8071613 6689332 5542613 4568519 3570060 2392629
33855 2392629 1011381 -451093 -1777632 -2833664 -3703565 -4523374 -5148407 -5131708 -4116388
33846 -4116388 -2162794 354927 3048463 5629996 7866135 9594533 10784180 11487024
33838 11487024 11737371 11573708 11159247 10810646 10861211 11478695 12597972 14032815 15670809
33829 15670809 17531808 19587393 21568695 23079789 23941800 24331173 24518331 24542787 24215777
33820 24215777 23390754 22158893 20804920 19619058 18710015 17925194 16946387 15503911 13531652
33811 13531652 11171858 8708356 6484530 4756073 3530889 2602737 1809337 1213074
33803 1213074 967106 1061287 1294640 1476378 1564482 1608047 1641733 1673368 1726088 1847778
33793 1847778 2079587 2427048 2877181 3463243 4286411 5393475 6603926 7540218 7906935
33784 7906935 7705426 7130385 6347522 5497356 4853774 4759892 5300148 6139745 6809643 7129673
33774 7129673 7283005 7504486 7782603 7882160 7596943 6936693 6081854 5193493 4302422 3406746
33764 3406746 2655163 2353386 2715565 3615113 4636567 5383914 5697296 5581416 5038850
33755 5038850 4072388 2796580 1407406 11880 -1402522 -2768698 -3812736 -4245390
33747 -4245390 -4048155 -3466851 -2742480 -1967182 -1212030 -642329 -388572 -351640 -235119 217774
33737 217774 1053376 2155521 3412227 4802782 6301362 7706700 8665404 8983044 8879841
33728 8879841 8771428 8760702 8539398 7911085 7211259 6961464 7212354 7537813 7681067 7861315
33718 7861315 8286058 8655945 8452105 7581595 6443944 5407272 4517115 3759232 3305011
33709 3305011 3309925 3630050 3919037 3926990 3583630 2905629 2016983 1214352 790806 711522
33699 711522 559776 -140529 -1575143 -3541172 -5532687 -6902814 -7137240 -6158314 -4380017
33690 -4380017 -2414618 -715856 533218 1305871 1579717 1237090 56799 -2135304 -5227253
33681 -5227253 -8741240 -12019260 -14469694 -15681492 -15483334 -14036084 -11802398 -9276171
33673 -9276171 -6703130 -4079015 -1342488 1506396 4391906 7139249 9518112 11445553
33665 11445553 13106018 14706877 16117075 16927408 16933633 16423634 15897042 15588871 15349450
33656 15349450 14926882 14282155 13641746 13279846 13251267 13367558 13468072 13621114 13906673
33647 13906673 14046950 13500827 12053514 10185086 8736045 8276323 8832202 10030136 11313762
33638 11313762 12127609 12151456 11446902 10310700 8992200 7613667 6293132 5198732 4487897
33629 4487897 4311333 4850780 6162757 7895269 9288476 9624277 8727659 7024541 5142811
33620 5142811 3482631 2121286 1018791 199981 -313470 -679232 -1186797 -1930960 -2563995
33611 -2563995 -2462733 -1201454 1076632 3666113 5677761 6578127 6526254 6183431 6117255
33602 6117255 6390254 6722600 6906854 6919995 6731480 6241084 5455929 4570416 3799956 3243604
33592 3243604 2959486 3046208 3542212 4310262 5125416 5877944 6660326 7672254 9017423
33583 9017423 10485072 11479188 11270573 9473428 6345006 2643598 -772844 -3259645
33575 -3259645 -4512346 -4617436 -4044387 -3477310 -3489259 -4249235 -5476509 -6681229 -7496626
33566 -7496626 -7835284 -7809807 -7620713 -7550215 -7904481 -8770121 -9854148 -10743981 -11347659 -11900167
33556 -11900167 -12477970 -12709186 -12127685 -10708033 -8899144 -7205104 -5876759 -4934477 -4285110
33547 -4285110 -3797714 -3431810 -3364683 -3908111 -5246394 -7264189 -9541016 -11371148 -11866983
33538 -11866983 -10380542 -7089108 -3124334 74823 1676170 1836947 1337103 917967
33530 917967 863874 1015844 1074276 897719 564091 223518 -12347 -31531 285542 899729
33520 899729 1487421 1645997 1294314 791887 583379 740800 898520 635786 -97602 -927864
33510 -927864 -1405614 -1392317 -1096204 -763603 -426409 1573 483212 862521 1098158 1338318
33500 1338318 1714424 2203983 2801535 3707864 5183076 7232742 9553545 11754508 13497994
33491 13497994 14459657 14384374 13336379 11817945 10498013 9775829 9602971 9688327 9854260
33482 9854260 10225681 11080843 12491894 14154033 15659528 16915666 18164636 19601352
33474 19601352 21163015 22762555 24524259 26632666 29117949 32017800 35651986 40455930
33466 40455930 46486762 53222136 59790659 65184231 68294345 68153204 64492279 58084632
33458 58084632 50441440 43147107 37357980 33588996 31677268 30962728 30692901 30370389
33450 30370389 29804921 29031108 28327418 28202417 29109311 31062843 33582536 36032420 37985841
33441 37985841 39291687 39873856 39513214 37860512 34771106 30723465 26833168 24240291
33433 24240291 23307944 23358174 23193388 21946654 19594327 16820687 14440073 12882535 12122368
33424 12122368 11946028 12122497 12298896 11937901 10575894 8153221 5006805 1592603 -1664862
33415 -1664862 -4330356 -6028092 -6684597 -6591076 -6101649 -5299439 -4018256 -2144733 163429
33406 163429 2510549 4431645 5559426 5754432 5172958 4212430 3320717 2768076 2543893
33397 2543893 2462869 2379264 2305951 2362685 2673289 3320546 4313386 5521614 6677178 7516882
33387 7516882 7937532 7996972 7794255 7371508 6688777 5673720 4362827 3015308 1976344
33378 1976344 1372925 1095145 1192562 2096380 4178324 7154387 10213232 12775010 14911370
33369 14911370 17026146 19435248 22366371 26045262 30503499 35451366 40591754 46012869
33361 46012869 52133020 59349517 67827347 77362318 87095867 95442095 100712429 102046444
33353 102046444 99703641 94527255 87349674 78894757 69898443 61053882 52886629 45756461
33345 45756461 39855017 35102216 31177961 27815488 25022840 22920637 21422531 20178596
33337 20178596 18789523 16995973 14747403 12257040 9989338 8410984 7620185 7251563
33329 7251563 6826427 6200478 5612184 5273152 4982562 4256767 2873403 1199760 -101131
33320 -101131 -637019 -468413 193679 1258132 2664318 4218416 5699337 7061509 8366188
33311 8366188 9511852 10182294 10146067 9568182 8985140 8978401 9846206 11500289 13578976
33302 13578976 15610050 17096954 17575729 16755917 14697197 11834281 8801066 6214302
33294 6214302 4520470 3850040 3929599 4272636 4614552 5114752 6006647 7107447 7855488
33285 7855488 7846348 7157805 6086917 4763084 3210212 1697126 749810 667691 1113439
33276 1113439 1332475 816992 -299104 -1498836 -2426819 -3112535 -3762819 -4507067 -5342089
33267 -5342089 -6132897 -6563856 -6236086 -4992877 -3117292 -1081594 880575 2862327 5015234
33258 5015234 7362023 9881878 12631699 15733682 19332874 23573069 28500644 33972348
33250 33972348 39744423 45590085 51113406 55444277 57451801 56540673 53175212 48479293
33242 48479293 43414608 38462749 33885682 29899953 26489935 23278652 19776536 15766203
33234 15766203 11462872 7406895 4218213 2309665 1689878 1995760 2701206 3301347 3408572
33225 3408572 2843941 1696758 225113 -1351585 -2953711 -4575162 -6183867 -7650273
33217 -7650273 -8671177 -8792937 -7679782 -5455456 -2722547 -184584 1755268 3104335
33209 3104335 4159417 5312290 6811813 8583123 10326607 11868937 13371833 15137592
33201 15137592 17246583 19402339 21037956 21531517 20473406 17927748 14473038 10912159
33193 10912159 7900633 5801267 4728177 4569371 5007962 5694087 6470910 7393444 8540673
33184 8540673 9888299 11344863 12770947 13891484 14297560 13696760 12217057 10411908
33176 10411908 8903528 7995066 7605325 7500005 7476087 7315101 6733360 5585323 4120482
33167 4120482 2870374 2199626 2045947 2113764 2172070 2099793 1832775 1455689 1255709 1502515
33157 1502515 2214890 3280511 4709886 6544895 8552089 10291052 11594200 12793469
33149 12793469 14355079 16417215 18754563 20998747 22715417 23405343 22710460 20712460
33141 20712460 17960344 15177955 12930960 11442987 10572200 9969719 9375959 8788656 8290446
33132 8290446 7759997 6894734 5567273 4069377 2928532 2506143 2798233 3560595 4518714
33123 4518714 5423060 6010459 6114307 5934346 6086587 7136796 8983484 10848644 12017233
33114 12017233 12498482 12826564 13324129 13806818 14008093 14011192 14099984 14358612 14633061 14806441
33104 14806441 14868515 14680217 13897620 12308588 10176784 8088916 6428369 5078916 3662312
33095 3662312 1978504 173476 -1417958 -2474865 -2785312 -2298791 -1136558 534465
33087 534465 2653765 5161947 7695034 9596300 10485748 10777997 11375638 12753134 14504378
33078 14504378 15884601 16629579 17092010 17724933 18685400 19922171 21396160 23109510 25074378
33069 25074378 27371101 30125855 33294692 36529029 39394536 41739026 43796901 45985540
33061 45985540 48677852 52073303 56067601 60184660 63804870 66615890 68820903 70860354
33053 70860354 73006211 75291268 77710949 80307266 83054630 85824662 88538295 91275821
33045 91275821 94197032 97440598 101157321 105538584 110670050 116347254 122131007 127657165
33037 127657165 132915788 138244600 144044522 150449418 157246624 164188148 171457135 179778321
33029 179778321 189925911 202056742 215587719 229774519 244347712 259514969 275404276
33022 275404276 291646028 307551777 322624116 336805114 350217923 362680086 373422927
33015 373422927 381198201 384614278 382425086 373674618 357871594 335363648 307695159
33008 307695159 277435680 247309768 219206825 193865812 171332962 151518556 134295657
33001 134295657 119322899 106076012 94145102 83447708 74152456 66438703 60276618
32994 60276618 55326195 51038451 46944198 42891460 39003403 35473683 32482380 30224611
32986 30224611 28819457 28134502 27827825 27621824 27438907 27259968 27047626 26930384 27276787
32977 27276787 28334852 29823073 31083580 31678732 31690968 31408054 30898961 30029992 28778908
32968 28778908 27326694 25800523 24062913 21879648 19282891 16665761 14467438 12835495
32960 12835495 11681691 10991620 10868886 11194611 11430320 10984386 9770309 8262919 7010968
32951 7010968 6242710 5951599 6139236 6792769 7705421 8508065 8927295 8946062 8701884 8291914
32941 8291914 7692799 6812666 5586922 4047312 2308928 466181 -1474175 -3450851
32933 -3450851 -5072968 -5596284 -4397415 -1587981 1933777 5173005 7760461 9908863
32925 9908863 11753115 13000781 13347735 13027705 12681886 12690311 12828039 12628864 11923817
32916 11923817 10929656 9953930 9194080 8789018 8871688 9471631 10456277 11688288 13221064
32907 13221064 15216521 17624185 20055249 22120805 23911751 26061691 29315808 34094577
32899 34094577 40441096 48203640 57144152 67003046 77716926 89681839 103718891 120651619
32891 120651619 140774738 163491870 187164356 209148564 226120361 234816948 233124586
32884 233124586 221074614 201056485 176860818 152073316 128986646 108665612 91591797
32877 91591797 77944978 67431468 59287928 52684711 47066247 42123472 37669389 33652662
32869 33652662 30110762 26942434 23814682 20423108 16788489 13224409 10109047 7758348
32861 7758348 6349117 5754618 5510960 5148204 4583343 4071480 3788151 3613710 3354294
32852 3354294 3021044 2795327 2793322 2956042 3158344 3377367 3740101 4398404 5343020 6345229
32842 6345229 7083566 7308276 6917562 6006755 4930191 4207889 4179937 4694355 5205240
32833 5205240 5214087 4609048 3640190 2661909 1870402 1171724 288701 -913677 -2204502
32824 -2204502 -3186155 -3723556 -4056557 -4458134 -4920212 -5256517 -5393860 -5442934 -5570128 -5946563
32814 -5946563 -6773804 -8166208 -9928096 -11542301 -12480623 -12545222 -11924664 -10977201 -9973042
32805 -9973042 -8961253 -7794819 -6292283 -4452726 -2556527 -1031043 -175408 9483
32797 9483 -241492 -632174 -916171 -943472 -735996 -539999 -696729 -1368466 -2400205 -3466968
32787 -3466968 -4293643 -4691025 -4498673 -3686384 -2550367 -1659709 -1473435 -2015040 -2963198
32778 -2963198 -4008609 -5035055 -5969827 -6587478 -6580192 -5844618 -4652079 -3482717 -2660304
32769 -2660304 -2126760 -1546726 -618715 687637 2145490 3493504 4653825 5713201 6642834
32760 6642834 7055509 6357627 4243134 1029023 -2529895 -5711889 -8091366 -9492130
32752 -9492130 -9929665 -9675560 -9210116 -8910081 -8727852 -8213997 -6875904 -4547736 -1507671
32743 -1507671 1671656 4400102 6314083 7375812 7811146 7958809 8117557 8445338 8945603
32734 8945603 9541715 10168392 10791754 11359878 11768624 11896557 11684208 11196140 10599823
32725 10599823 10039709 9517991 8960827 8440593 8247308 8637136 9565388 10816302 12398750
32716 12398750 14646774 17840652 21831622 26131325 30281915 34022669 37169712 39532466
32708 39532466 41036127 41849777 42308449 42713046 43239127 44016160 45206007 46909094 48968495
32699 48968495 50930061 52270974 52678216 52105869 50662479 48581503 46286801 44304539
32691 44304539 42972023 42238678 41756862 41089338 39833866 37736120 34846687 31507318
32683 31507318 28055250 24588276 21130638 17926810 15326922 13341473 11528353 9469168
32675 9469168 7250903 5342008 4068043 3368966 3054637 3111780 3643604 4581366 5588823
32666 5588823 6278079 6449631 6095425 5264568 4048819 2688003 1546996 894149 749200
32657 749200 998998 1569808 2356211 3025446 3092847 2321945 1016265 -158381 -661058
32648 -661058 -419679 221022 840034 1271772 1668624 2263008 3084356 3931048 4592923 5035923
32638 5035923 5367790 5701953 6090325 6529018 6987183 7467291 8042480 8748716 9407220
32629 9407220 9673729 9378785 8760851 8244943 8009942 7862363 7505807 6851588 6133687
32620 6133687 5854988 6534434 8236487 10283043 11680091 12020864 11858723 12073706 13034651
32611 13034651 14536453 16297921 18086965 19362732 19271789 17331636 13995440 10344528
32603 10344528 7293959 5186151 3944693 3329017 3073676 3052680 3402752 4345766 5828237
32594 5828237 7438250 8706079 9380766 9412235 8844145 7827343 6620417 5460697 4495769
32585 4495769 3895450 3885402 4502151 5383701 6001150 6128061 5944899 5657805 5191766 4384214
32575 4384214 3353723 2450211 1796025 1046373 -242691 -2047653 -3809556 -4947038 -5327262
32566 -5327262 -5198959 -4820097 -4310066 -3791138 -3446185 -3342624 -3298499 -3001122 -2224786 -945075
32556 -945075 638266 2147872 3232903 3839386 4210513 4537288 4691626 4406352 3636664
32547 3636664 2607807 1555678 565988 -353661 -1197658 -1982114 -2728111 -3416054 -4058173
32538 -4058173 -4776914 -5616160 -6239397 -6049939 -4797033 -2967324 -1418219 -668356 -649556
32529 -649556 -1040778 -1626988 -2347522 -3246894 -4515033 -6429068 -9062199 -12041743 -14679680
32520 -14679680 -16350040 -16732503 -15816064 -13852604 -11327862 -8810966 -6701528 -5145323
32512 -5145323 -4212707 -4031134 -4616936 -5655281 -6632048 -7217481 -7404920 -7267724 -6764809
32503 -6764809 -5903859 -4962273 -4338206 -4148016 -4065432 -3589563 -2428266 -629291 1579235
32494 1579235 4002940 6506887 8840421 10537781 11164192 10735862 9793830 8956779 8441374
32485 8441374 8055438 7507916 6565835 5031192 2847780 292113 -2126097 -4039723 -5392954
32476 -5392954 -6219554 -6439600 -5983320 -4976737 -3666700 -2248367 -894710 122419 525663
32467 525663 300108 -196317 -428017 -14304 1039085 2356331 3464618 4115577 4345461
32458 4345461 4243775 3770339 2859313 1601349 204004 -1185082 -2508329 -3683931 -4592480
32449 -4592480 -5212867 -5689230 -6202364 -6781809 -7256100 -7396594 -7142915 -6694218 -6329352
32440 -6329352 -6123991 -5915432 -5565393 -5143845 -4785697 -4496532 -4234614 -4069281 -4043247 -3915855
32430 -3915855 -3298061 -2131382 -854750 11148 281194 -49465 -1228317 -3708667 -7592523
32421 -7592523 -12269660 -16752032 -20312114 -22687833 -23748672 -23242463 -21069939 -17707709
32413 -17707709 -14094439 -10988848 -8542481 -6542305 -4889129 -3683123 -2983995 -2745894
32405 -2745894 -2977664 -3712455 -4715814 -5416705 -5323805 -4479240 -3391048 -2537879 -2025682
32396 -2025682 -1707120 -1502972 -1492852 -1683966 -1796579 -1433543 -527885 486314 1090573
32387 1090573 1243885 1411461 2077763 3408829 5372079 7872590 10554232 12662647 13459264
32378 13459264 12856062 11487583 10107814 9028567 8147449 7310125 6471875 5580399 4494790
32369 4494790 3103004 1472249 -164379 -1564220 -2609572 -3319687 -3784892 -4115757 -4421303
32360 -4421303 -4771316 -5163785 -5573408 -6038046 -6613168 -7187135 -7449214 -7214791 -6795135
32351 -6795135 -6865762 -7823052 -9317790 -10539042 -10949487 -10653439 -10074776 -9451762 -8756210
32342 -8756210 -7998579 -7423006 -7357408 -7962925 -9160783 -10707853 -12274515 -13519513 -14193081
32333 -14193081 -14172844 -13372944 -11691033 -9158392 -6133706 -3228910 -976438 415593
32325 415593 1025188 1070558 845119 652159 642171 724141 747414 791516 1195286 2256135
32315 2256135 3929245 5823668 7442751 8440302 8770935 8704225 8643899 8786014 8906820
32306 8906820 8585354 7698339 6592608 5649288 4764285 3477081 1655329 -152307 -1193503
32297 -1193503 -1235520 -674157 -18454 547738 1138458 1934873 3058403 4514116 6136317
32288 6136317 7645649 8830712 9652689 10181441 10514502 10757296 10955122 11003673 10757011
32279 10757011 10294822 9947017 9918901 9960032 9535000 8316178 6456331 4443205 2781738
32270 2781738 1769098 1442654 1679269 2338889 3302774 4424179 5571735 6755320 8075265
32261 8075265 9473335 10673774 11494834 12099138 12767423 13483867 13888458 13578538 12312055
32252 12312055 10001640 6756530 2993342 -640137 -3539653 -5355463 -6065535 -6023008
32244 -6023008 -5884506 -6264614 -7368438 -9007186 -10874847 -12621612 -13748395 -13786217 -12738792
32235 -12738792 -11171142 -9735412 -8713113 -8032572 -7495495 -6860038 -5914860 -4685208 -3484894
32226 -3484894 -2636305 -2223067 -2184303 -2465555 -2915455 -3202071 -3072544 -2635533 -2200067 -1894991
32216 -1894991 -1631753 -1380838 -1257781 -1324408 -1495945 -1685127 -1888163 -2096346 -2281180 -2547040
32206 -2547040 -3183562 -4442630 -6248523 -8146157 -9562577 -10212551 -10331958 -10470533 -10971092
32197 -10971092 -11669856 -12135151 -12093882 -11539741 -10581980 -9413352 -8365004 -7715873 -7354929
32188 -7354929 -6796826 -5643348 -3973423 -2270080 -1064604 -639234 -892806 -1380875 -1559171
32179 -1559171 -1089267 41833 1593792 3147113 4194991 4402468 3850774 2889610 1706518
32170 1706518 191682 -1719849 -3745182 -5411145 -6417847 -6770456 -6661207 -6313786 -5865266
32161 -5865266 -5336284 -4787086 -4495828 -4793320 -5629484 -6479145 -6826189 -6620281 -6132643
32152 -6132643 -5536984 -4869527 -4313889 -4236870 -4855445 -5998302 -7252044 -8279207 -8998496
32143 -8998496 -9527066 -9939686 -10052452 -9534531 -8342104 -6973957 -6158149 -6292598 -7246357
32134 -7246357 -8579376 -9778393 -10375384 -10130170 -9195773 -7949568 -6581312 -4945509 -2844533
32125 -2844533 -334349 2273070 4571601 6203654 7038393 7335030 7615408 8251057 9231590
32116 9231590 10388373 11699176 13210382 14724831 15761715 15906912 15166807 13964502
32108 13964502 12803369 11897596 11073746 10022382 8651369 7181805 5930103 5080930
32100 5080930 4690348 4810178 5519483 6839322 8616568 10434698 11669485 11820876 10940797
32091 10940797 9682932 8820456 8724671 9327658 10415357 11730613 12834422 13169391 12474308
32082 12474308 11085043 9692842 8785690 8368219 8195189 8166322 8399702 8920951 9386811
32073 9386811 9253139 8263209 6690790 5025799 3472040 1845499 -70570 -2192143
32065 -2192143 -4155383 -5543748 -6069378 -5696460 -4732675 -3732495 -3140055 -2968473 -2872087
32056 -2872087 -2510788 -1751710 -527704 1321830 3896758 6925032 9728686 11591108
32048 11591108 12175630 11600122 10167165 8095412 5537012 2815168 556885 -521582
32040 -521582 -77588 1521103 3297950 4168853 3491612 1308107 -1816791 -5179922 -8260282
32031 -8260282 -10779540 -12536601 -13256739 -12670662 -10766852 -7940417 -4869010 -2235907
32023 -2235907 -516101 114874 -201548 -1082695 -2109107 -3031274 -3773977 -4250184 -4248628
32014 -4248628 -3572278 -2272376 -687948 771780 1880570 2653649 3212557 3640172 3960338
32005 3960338 4192874 4356459 4404587 4204473 3616584 2594041 1215622 -329007 -1775035
31996 -1775035 -2886264 -3608691 -4095937 -4502598 -4754780 -4591488 -3825054 -2479528 -676919
31987 -676919 1481287 3832404 6026926 7606661 8242779 7893194 6786441 5331130 4022257
31978 4022257 3320016 3505246 4579840 6258509 8057685 9480695 10239086 10351743 10017433
31969 10017433 9389294 8500513 7396800 6258888 5318672 4662182 4179837 3744766 3411797
31960 3411797 3406923 3934999 5025804 6542320 8277006 10036175 11703807 13266507 14726179
31951 14726179 15942135 16615782 16515331 15707177 14513377 13267269 12166905 11305491 10700400
31942 10700400 10261020 9838372 9368155 8900373 8450959 7901200 7098421 6000359 4688588
31933 4688588 3325860 2151879 1400548 1073743 827041 221690 -855518 -2058124 -2853834
31924 -2853834 -2896709 -2205029 -1134137 -228951 27003 -505762 -1517296 -2471209 -3029557
31915 -3029557 -3334653 -3884704 -5090356 -6913283 -8915950 -10616913 -11749261 -12229968 -12036099
31906 -12036099 -11192784 -9790300 -7900074 -5497611 -2540860 896330 4604665 8265390
31898 8265390 11392259 13340593 13616041 12308342 10157575 8086177 6614316 5673490
31890 5673490 4890208 3990554 2955089 1856843 656648 -721419 -2085073 -2881363 -2580651
31881 -2580651 -1183841 719874 2406034 3502091 4125547 4702494 5646734 7043078 8542715
31872 8542715 9624758 9999088 9702578 8829864 7336757 5197796 2645383 134521 -1882391
31863 -1882391 -3081533 -3280768 -2507830 -1084625 465170 1669453 2283953 2270645 1708048
31854 1708048 787631 -136268 -608336 -323663 603737 1667578 2364192 2590525 2628057
31845 2628057 2784683 3136384 3546945 3739147 3315755 1945847 -280568 -2770174 -4845265
31836 -4845265 -6208680 -6937422 -7178786 -7043640 -6686003 -6202909 -5421720 -4017870 -1940320
31827 -1940320 440295 2697898 4721009 6618482 8409007 9973840 11237583 12210281
31819 12210281 12853688 13069905 12890884 12583910 12473333 12658930 12941671 13023191 12763673
31810 12763673 12260486 11725430 11333848 11168089 11179510 11094439 10438159 8888006 6733779
31801 6733779 4873121 4162583 4723535 5921413 6972790 7473728 7392658 6778394 5648287
31792 5648287 4116369 2473195 1059944 95166 -339859 -187893 621521 2053284 3862814
31783 3862814 5692564 7278880 8507922 9284698 9479586 9091014 8367936 7624671 6941598
31774 6941598 6166503 5217314 4251285 3483690 2959164 2593481 2345883 2217126 2117728 1887734
31764 1887734 1488654 1090834 932579 1154872 1788789 2780608 3898298 4657036 4538681
31755 4538681 3445837 1908897 683770 49787 -431355 -1372032 -2830163 -4255195 -5148032
31746 -5148032 -5592251 -6033465 -6681287 -7312179 -7601533 -7436540 -6856087 -5859699 -4411949
31737 -4411949 -2583784 -604974 1201826 2507769 3070174 2837071 1983503 832458 -256001
31728 -256001 -961727 -1096361 -704975 -34104 675270 1354938 2042785 2707494 3228806 3552733
31718 3552733 3791081 4113691 4532602 4798140 4547680 3638149 2376142 1375720 1125130
31709 1125130 1666628 2649853 3596791 4101610 3944524 3208581 2288904 1639750 1428747
31700 1428747 1473575 1537723 1634062 1993615 2756996 3745296 4578449 5048677 5359579 5936264
31690 5936264 6979097 8251708 9318116 9909484 10023469 9772375 9251552 8527896 7662538
31681 7662538 6731305 5844669 5110114 4558254 4177716 4029119 4172808 4408570 4275280
31672 4275280 3503877 2378010 1480094 1189274 1605453 2771890 4588997 6534292 7884816
31663 7884816 8387538 8470011 8688060 9226915 10050453 11207418 12738536 14508047 16380219
31654 16380219 18369148 20341643 21746461 21989293 21049791 19475430 17798843 16183883
31646 16183883 14576583 12913742 11164909 9422679 8009414 7299165 7381302 8031677 8963883
31637 8963883 9880474 10309599 9724485 7975618 5434855 2647160 24037 -2121602 -3598015
31628 -3598015 -4613473 -5794285 -7641420 -10035308 -12407398 -14237023 -15213288 -15145595 -14081670
31619 -14081670 -12477712 -10925544 -9624725 -8310272 -6722807 -4930974 -3135432 -1398819
31611 -1398819 264900 1680907 2583969 2865439 2642574 2118541 1459684 765761 56187
31602 56187 -708660 -1515934 -2215117 -2614528 -2669201 -2522853 -2375186 -2373311 -2619390 -3174956
31592 -3174956 -4009390 -5032135 -6249817 -7811398 -9774743 -11860984 -13586900 -14672045
31584 -14672045 -15185718 -15229035 -14610489 -12988158 -10294146 -6905635 -3438968 -508841 1348787
31575 1348787 1757658 694199 -1402848 -3777036 -5633166 -6366314 -5730511 -3957761 -1703036
31566 -1703036 245473 1304664 1253537 196584 -1544271 -3554132 -5454782 -6984079
31558 -6984079 -8003729 -8498126 -8578150 -8418747 -8161143 -7931832 -7956342 -8502663 -9576358
31549 -9576358 -10730679 -11327143 -11016996 -9923371 -8413873 -6830808 -5438890 -4465405 -4069720
31540 -4069720 -4308196 -5177498 -6639840 -8548924 -10596874 -12408351 -13677240 -14165556 -13615523
31531 -13615523 -11806389 -8804019 -5122036 -1507117 1534570 3996563 6121358 7924367
31523 7924367 9063052 9208154 8460782 7343468 6450642 6167616 6589010 7472233 8250052
31514 8250052 8346413 7695588 6881905 6589157 6909920 7322231 7330893 6956151 6529266 6178256
31504 6178256 5677084 4727539 3225831 1280016 -845012 -2740740 -3981391 -4395773 -4181637
31495 -4181637 -3657454 -2927099 -1864874 -396981 1286810 2765797 3533048 3166610 1574640
31486 1574640 -811180 -3193823 -4917259 -5849031 -6257003 -6395065 -6302383 -5953721 -5453431
31477 -5453431 -5010904 -4773382 -4732386 -4785248 -4869441 -5037789 -5404028 -6020854 -6827177 -7692537
31467 -7692537 -8435046 -8765664 -8325849 -6939270 -4864719 -2719260 -1091426 -223159 -17817
31458 -17817 -249612 -731434 -1367620 -2120480 -2897371 -3438334 -3385776 -2556990 -1131152 507299
31448 507299 2097279 3588418 4903958 5752173 5793429 4973092 3592367 2021594 405446
31439 405446 -1302722 -3063271 -4604679 -5599193 -5939712 -5781080 -5326887 -4674519 -3920114
31430 -3920114 -3312445 -3127190 -3328430 -3457152 -2974354 -1736711 -125317 1248010 1941047
31421 1941047 1910984 1515436 1299703 1639066 2481028 3441905 4153704 4464220 4335137 3720312
31411 3720312 2660775 1403052 265848 -609169 -1267098 -1698246 -1710539 -1132771 -125602
31402 -125602 777835 1017259 472610 -382763 -856277 -629913 26165 630358 985909 1238683
31392 1238683 1542859 1803183 1706883 889719 -870993 -3430653 -6200677 -8451045 -9781334
31383 -9781334 -10245444 -10050403 -9312505 -8153954 -6833870 -5628265 -4684812 -4109390 -4051497
31374 -4051497 -4493740 -4999953 -4881876 -3692887 -1507423 1238981 4058976 6599867 8737423
31365 8737423 10617405 12527346 14594365 16572193 17957285 18348033 17724951 16414356
31357 16414356 14798337 13084630 11379502 9915391 9040301 8893794 9198754 9515936 9683995
31348 9683995 9911444 10472899 11433881 12636770 13777357 14454801 14337747 13452604 12264101
31339 12264101 11340652 10906939 10743882 10475850 9885921 8991312 7932571 6843305 5776956
31330 5776956 4709821 3629756 2633857 1877709 1353628 753537 -304549 -1813141 -3187810
31321 -3187810 -3655991 -2872856 -1150582 836606 2453843 3271650 3092504 2014369 435558
31312 435558 -1134606 -2325560 -3005524 -3249649 -3286614 -3384860 -3657347 -3993221 -4269363 -4587668
31302 -4587668 -5174553 -6043147 -6886194 -7364850 -7424847 -7253292 -6950812 -6312282 -4969340
31293 -4969340 -2765345 17581 2829173 5239792 7127533 8542670 9554882 10285112
31285 10285112 10895081 11358379 11339437 10520159 9041499 7432493 6065735 4832286 3384481
31276 3384481 1536854 -633013 -2900642 -4947200 -6359087 -6732712 -5863599 -3883346
31268 -3883346 -1267525 1329005 3385493 4742025 5479863 5597101 4932191 3455286 1507525
31259 1507525 -360981 -1746599 -2523277 -2686913 -2191159 -1000122 684546 2295927 3161491
31250 3161491 3058010 2470140 2112804 2171089 2178508 1669938 734528 -170303 -708750 -758414
31240 -758414 -187239 1149199 3150045 5364121 7169682 8015871 7643201 6329398 4937652
31231 4937652 4477725 5425065 7445171 9755383 11675902 12870592 13250085 12800933 11528481
31222 11528481 9539532 7156756 4875338 3116614 2025403 1547196 1636432 2275528 3320484
31213 3320484 4472515 5442418 6065595 6274405 6113903 5852180 5946988 6765051 8329235
31204 8329235 10356210 12464818 14296663 15548205 16072758 16013457 15740153 15530531 15265092
31195 15265092 14470127 12727060 10083006 7068283 4327963 2268063 1023287 609509
31187 609509 943862 1713535 2367694 2370514 1520482 60470 -1497361 -2689991 -3329134
31178 -3329134 -3464060 -3154591 -2347706 -1028843 555596 1920686 2612331 2459713 1661739
31169 1661739 734655 287011 591203 1236855 1314789 116832 -2283473 -5125822 -7567543
31160 -7567543 -9174609 -9959888 -10156305 -10048772 -9942549 -10132161 -10782732 -11822273 -13009048
31151 -13009048 -14164335 -15336021 -16699692 -18311905 -20007314 -21523300 -22631509 -23086217
31143 -23086217 -22515142 -20527338 -17061759 -12630336 -8093208 -4065326 -535430 2850745
31135 2850745 6121823 8689324 9764994 8992027 6643267 3355099 -196502 -3484094
31127 -3484094 -6256615 -8559467 -10531070 -12172294 -13415417 -14371435 -15299256 -16273923 -17076575
31118 -17076575 -17524107 -17735805 -17898123 -17888040 -17377603 -16334487 -15238760 -14716354 -15030284
31109 -15030284 -15953092 -17014842 -17781891 -17986768 -17582933 -16772867 -15910848 -15244530 -14706518
31100 -14706518 -14014078 -12997561 -11761137 -10489843 -9224311 -7959867 -6883465 -6296536
31092 -6296536 -6264858 -6513930 -6738064 -6861480 -6918994 -6874355 -6740477 -6740880 -7084644 -7583493
31082 -7583493 -7733174 -7276629 -6537788 -6074530 -6078242 -6222372 -6057371 -5447753 -4629879 -3954902
31072 -3954902 -3643428 -3737856 -4182311 -4886663 -5738664 -6602966 -7300018 -7556875 -7047255 -5639642
31062 -5639642 -3679730 -1917234 -996810 -978863 -1380631 -1641205 -1489524 -934799 -63810
31053 -63810 1088947 2553306 4376607 6529640 8806252 10835568 12255651 12923800 12987232
31044 12987232 12761435 12518009 12343865 12160290 11831107 11214300 10142714 8477679 6285621
31035 6285621 3947509 2017661 935079 836231 1537785 2591456 3403146 3488503 2761376
31026 2761376 1581608 456460 -369545 -1094452 -2172682 -3912408 -6164048 -8343474
31018 -8343474 -9760280 -9971595 -8931365 -6950905 -4561800 -2272624 -288706 1524634
31010 1524634 3307756 4873946 5837251 6052852 5774215 5348745 4921339 4510081 4211145
31001 4211145 4175630 4452408 4969787 5604625 6139201 6209096 5494548 4058377 2433416
30992 2433416 1300628 1028430 1431721 1902702 1847313 1153231 281053 -180456 -80233
30983 -80233 221291 316434 151990 -77986 -279456 -520907 -784312 -833031 -402150 570546
30973 570546 1968662 3656595 5481872 7143982 8235196 8536095 8231598 7745008 7369560
30964 7369560 7129305 6960553 6875045 6861509 6714754 6091614 4767030 2824446 650084
30955 650084 -1197216 -2176350 -1995328 -770984 1036900 2888828 4408249 5442268 5967764
30946 5967764 5955832 5297486 3871868 1734571 -769946 -3155740 -5099186 -6590004 -7799861
30937 -7799861 -8857050 -9754707 -10413361 -10785544 -10904405 -10824410 -10502470 -9806464 -8749897
30928 -8749897 -7690819 -7124351 -7184500 -7445191 -7299589 -6468071 -5097548 -3544687 -2255903
30919 -2255903 -1744728 -2359146 -3921825 -5725164 -7007875 -7425088 -7075813 -6229166 -5125952
30910 -5125952 -3944322 -2797121 -1729396 -768270 16684 519378 650679 391404 -161234
30901 -161234 -804529 -1374305 -1920294 -2669546 -3761204 -5064855 -6298061 -7265668 -7954934
30892 -7954934 -8486498 -9033045 -9688025 -10310385 -10565831 -10234898 -9445526 -8522593 -7685003
30883 -7685003 -7009224 -6596719 -6557633 -6803700 -7036163 -7020338 -6777156 -6473687 -6242593 -6148294
30873 -6148294 -6192925 -6261356 -6145405 -5714271 -5031244 -4286667 -3695294 -3464821 -3716961 -4351315
30863 -4351315 -5090549 -5746257 -6346448 -6931210 -7372914 -7560664 -7672641 -8079311 -8991248
30854 -8991248 -10323763 -11841270 -13244250 -14137264 -14167550 -13346848 -12147287 -11175027 -10762774
30845 -10762774 -10857661 -11165582 -11341212 -11181043 -10793774 -10551076 -10732606 -11182998 -11390891
30836 -11390891 -10936926 -9814225 -8294299 -6578128 -4705782 -2801456 -1233196 -367012
30828 -367012 -201297 -413286 -795811 -1469271 -2551182 -3770441 -4604256 -4742908 -4254492
30819 -4254492 -3357725 -2275723 -1338159 -949534 -1252640 -1926419 -2485319 -2749225 -2910947
30810 -2910947 -3181986 -3502239 -3618222 -3353758 -2745032 -1941917 -1051173 -140195 619566
30801 619566 946729 719090 199453 -175438 -258543 -305114 -597125 -1135333 -1773566 -2421946
30791 -2421946 -2900150 -2753742 -1558592 529764 2747545 4350991 5165597 5470864 5503511
30782 5503511 5212177 4433840 3176726 1710619 430263 -376042 -684988 -716919 -771509
30773 -771509 -1055956 -1597711 -2258115 -2840675 -3218498 -3318319 -2939821 -1696580 669281
30764 669281 3857515 7022803 9326962 10465397 10665342 10326905 9796526 9381913 9335890
30755 9335890 9710264 10319816 10963567 11671543 12672336 14123642 15927276 17807333 19500194
30746 19500194 20826228 21631799 21761675 21129721 19785235 17883175 15606462 13129923
30738 13129923 10630359 8292586 6284549 4700708 3502450 2535607 1663352 882654
30730 882654 249630 -313333 -1051292 -2175659 -3678381 -5343514 -6833875 -7748544 -7792611
30721 -7792611 -7076782 -6179582 -5729472 -5897174 -6355880 -6654611 -6508968 -5843800 -4795994
30712 -4795994 -3677299 -2720712 -1826295 -735640 533242 1643826 2355318 2703070 2685467
30703 2685467 2114109 1024529 -22373 -391275 -14610 699511 1482665 2373808 3300960
30694 3300960 3899383 3914248 3542142 3198962 3085059 3075862 2875994 2161520 739945 -1229669
30684 -1229669 -3222259 -4692047 -5442249 -5634998 -5537868 -5340561 -5124251 -4884453 -4606029
30675 -4606029 -4375674 -4362801 -4624765 -5001749 -5283257 -5412161 -5450546 -5444433 -5455602 -5656546
30665 -5656546 -6215430 -7073817 -7977469 -8770728 -9560968 -10539171 -11692541 -12713624 -13132150
30656 -13132150 -12531510 -10748013 -7977843 -4728316 -1636316 764080 2267696 3111388
30648 3111388 3778858 4509534 4972137 4568575 3120291 1116876 -819171 -2587280 -4544004
30639 -4544004 -6824672 -8958623 -10277505 -10583209 -10257316 -9760629 -9212023 -8515087 -7728078
30630 -7728078 -7126596 -6928568 -7108963 -7506655 -7962129 -8248746 -7962887 -6648305 -4109248
30621 -4109248 -626402 3095253 6211256 8122002 8736210 8381081 7415871 5967715 4075691
30612 4075691 1971194 43883 -1461220 -2566753 -3367232 -3861948 -4049275 -4055219 -4044832
30603 -4044832 -4057068 -4021830 -3913944 -3818586 -3864440 -4146178 -4678155 -5348275 -5926164 -6196468
30593 -6196468 -6129343 -5913586 -5814101 -5978919 -6335714 -6647943 -6705836 -6487072 -6078457 -5393884
30583 -5393884 -4042426 -1615171 1831865 5604496 8700855 10335336 10248102 8695523
30575 8695523 6259239 3589657 1134171 -1032186 -3107173 -5203470 -7036113 -8001032
30567 -8001032 -7624310 -5946515 -3462075 -738607 1837447 4012720 5580653 6486244
30559 6486244 6945446 7303864 7737593 8156445 8401697 8449332 8384349 8256919 8036085 7662201
30549 7662201 7062291 6117573 4698787 2793976 600765 -1526726 -3242574 -4374417
30541 -4374417 -5000497 -5378469 -5720526 -5960867 -5771587 -4895553 -3477545 -1992299 -811358
30532 -811358 105264 1076773 2365528 4033034 6004779 8110387 10084745 11692203 12889684
30523 12889684 13757297 14253120 14188886 13519375 12507847 11464898 10404683 9106300 7487537
30514 7487537 5798588 4461835 3822011 4013949 4900903 6068668 6984081 7276197 6893639
30505 6893639 6014197 4856252 3562923 2164165 591689 -1211506 -3126357 -4820481
30497 -4820481 -5944366 -6414420 -6522839 -6752727 -7410981 -8356363 -9075550 -9078322 -8252112 -6850078
30487 -6850078 -5212854 -3592238 -2195466 -1219697 -743845 -676505 -921101 -1542923 -2636966
30478 -2636966 -4002514 -5062933 -5233460 -4412472 -3099136 -2019077 -1627142 -1916226 -2571763
30469 -2571763 -3179979 -3310358 -2589169 -857373 1763290 5039422 8796150 12782550 16406063
30460 16406063 18824412 19457888 18392554 16252493 13735188 11258863 8890237 6474459
30452 6474459 3886763 1261867 -1040946 -2748517 -3897364 -4709880 -5363882 -5994159 -6794741
30443 -6794741 -7878020 -8999073 -9613004 -9344580 -8370941 -7300424 -6697128 -6682976 -6880969
30434 -6880969 -6722534 -5942660 -4867865 -4153939 -4162595 -4621922 -4908798 -4565478 -3501936
30425 -3501936 -1872146 28837 1766585 2878841 3108862 2497566 1247616 -400444
30417 -400444 -2126024 -3502236 -4172612 -4091223 -3563138 -3056843 -2949724 -3306173 -3749324
30408 -3749324 -3596165 -2346469 -204559 1921639 3070907 2947866 2020092 972487 151574
30399 151574 -480846 -1021708 -1432462 -1683570 -1948751 -2510900 -3467399 -4636718 -5825192
30390 -5825192 -7105613 -8686842 -10487847 -11987944 -12635365 -12372138 -11636849 -10835411 -9912074
30381 -9912074 -8490740 -6356098 -3713117 -1020131 1320527 3079257 4103482 4232932
30373 4232932 3385529 1731269 -268115 -2054841 -3257221 -3829314 -3995466 -4120158 -4579243
30364 -4579243 -5606059 -7151298 -8896268 -10441857 -11487077 -11848708 -11415169 -10193962
30356 -10193962 -8415987 -6530473 -5045168 -4328071 -4491787 -5400126 -6764862 -8236800
30348 -8236800 -9417601 -9885778 -9400327 -8176739 -6854682 -6042596 -5899924 -6233171 -6905900
30339 -6905900 -7968473 -9396823 -10921838 -12223152 -13158932 -13696388 -13733201 -13148663 -12007273
30330 -12007273 -10600176 -9286813 -8351461 -7956486 -8118636 -8729194 -9676396 -10936282 -12456628
30321 -12456628 -13957128 -14943704 -14959212 -13795770 -11524342 -8458623 -5109719 -2023162
30313 -2023162 464648 2296363 3520332 4154172 4276366 4130930 4001437 4014967 4171146
30304 4171146 4516782 5146937 6015371 6860989 7378991 7426428 7085221 6625070 6381882 6485948
30294 6485948 6616180 6172868 4863813 3069397 1490947 473912 -192426 -871261 -1707833
30285 -1707833 -2704814 -3909775 -5300511 -6563939 -7208348 -6949448 -5895757 -4353764 -2568476
30276 -2568476 -690900 1118284 2665362 3791891 4417104 4526269 4156816 3397087 2380002
30267 2380002 1264991 190745 -806867 -1827646 -2988845 -4233324 -5293191 -5883103
30259 -5883103 -5914563 -5522109 -4946527 -4418867 -4051629 -3717273 -3055764 -1724483 313005
30250 313005 2781429 5346378 7782895 9920157 11590756 12734813 13457743 13870007 13928427
30241 13928427 13562611 12937222 12449835 12411466 12779605 13212281 13319369 12873726 11905547
30232 11905547 10664076 9403759 8109652 6469824 4213368 1480168 -1201195 -3300617
30224 -3300617 -4615415 -5268877 -5512432 -5574287 -5597943 -5600702 -5473716 -5087175 -4434551 -3657195
30214 -3657195 -2911097 -2226842 -1518975 -718135 132864 904346 1458747 1694645 1568134
30205 1568134 1132467 550821 24871 -286906 -239946 377197 1769659 3881870 6230775
30196 6230775 8066915 8763266 8130327 6488497 4521500 2979004 2323153 2502342 3009351
30187 3009351 3178521 2526602 974226 -1141572 -3292682 -5080695 -6354418 -7024878 -6898764
30178 -6898764 -5853878 -4147664 -2366205 -991103 -109562 422216 683405 665633 430263
30169 430263 123484 -149478 -345024 -367096 -28227 834041 2225714 3956687 5670458
30160 5670458 6937203 7433314 7115264 6225079 5123309 4132907 3520090 3525274 4285157
30151 4285157 5645203 7065829 7833744 7522848 6331955 4953717 4067033 3912952 4271175
30142 4271175 4729343 4964546 4890872 4639255 4380882 4151667 3903660 3724085 3857943 4405431
30132 4405431 5079311 5383161 5000281 3942097 2406472 627423 -1178913 -2860014 -4323303
30123 -4323303 -5422937 -5943287 -5846340 -5459934 -5201895 -5114584 -4871621 -4257017 -3410281 -2550950
30113 -2550950 -1734552 -1036699 -738062 -1063888 -1841657 -2637538 -3163264 -3339334 -3027225
30104 -3027225 -1996176 -249627 1809744 3682715 5167483 6373375 7408616 8133877
30096 8133877 8201359 7300742 5408786 2860793 194475 -2089201 -3654379 -4326521 -4071352
30087 -4071352 -2987813 -1249290 983340 3560051 6247076 8689014 10527120 11599100
30079 11599100 12064128 12335237 12806633 13541473 14209690 14390860 13966111 13192771 12404613
30070 12404613 11688623 10867694 9756471 8402351 7086206 6103757 5552586 5337214 5362165
30061 5362165 5667595 6352172 7397360 8576887 9475123 9576017 8468514 6134836 3059465
30052 3059465 -34620 -2598014 -4419597 -5509267 -5992892 -6118773 -6168919 -6230398 -6128028
30043 -6128028 -5690308 -5041391 -4528663 -4371394 -4479266 -4654076 -4906042 -5506514 -6739489
30034 -6739489 -8649040 -11029970 -13591680 -16064172 -18186507 -19720799 -20554096 -20758770
30026 -20758770 -20533732 -20138164 -19879458 -20014759 -20508479 -20888569 -20419380 -18441046 -14619061
30017 -14619061 -9116787 -2736594 3234967 7649235 10106862 10911029 10522884 9303953
30009 9303953 7745498 6530963 6083162 6197042 6335018 6191415 5806942 5281246 4657074
30000 4657074 4080188 3837098 4158738 5096940 6583119 8439956 10286924 11568622 11764949
29991 11764949 10563861 7914125 4092999 -251181 -4304363 -7462469 -9480684 -10300440
29983 -10300440 -9935070 -8619236 -6886301 -5284770 -4023293 -2965332 -1883537 -615586
29975 -615586 889548 2432787 3492780 3582476 2844756 2147143 2389194 3732593 5611845
29966 5611845 7421934 9001603 10432319 11603974 12196645 12063861 11468801 10861297 10457998
29957 10457998 10080898 9407761 8384154 7393842 6993506 7447861 8537758 9816842 10962290
29948 10962290 11816127 12230596 12119158 11703183 11505059 11932407 12894842 13861268 14204397
29939 14204397 13484258 11628064 9054807 6542748 4740525 3751274 3274526 3091699 3249376
29930 3249376 3812997 4687530 5760135 7015699 8353756 9406684 9722165 9137633 7906674
29921 7906674 6478123 5200869 4201748 3470991 3035090 3008449 3401088 3889580 3929388
29912 3929388 3199781 1867532 327781 -1225713 -2835190 -4434812 -5656732 -6060734
29904 -6060734 -5495162 -4205239 -2663810 -1336001 -506265 -178005 -82870 138397 653935
29895 653935 1301635 1775659 1969967 2059566 2182168 2147877 1644408 722756 -130476 -519590
29885 -519590 -606038 -898451 -1636277 -2520368 -3045911 -3004187 -2663588 -2540384 -2987280 -3933538
29875 -3933538 -5019517 -6004726 -6970381 -8039341 -8987006 -9325335 -8833951 -7896502 -7204812
29866 -7204812 -7106668 -7228782 -6735029 -5035589 -2349003 431479 2481582 3645788 4305802
29857 4305802 4827688 5321431 5830208 6422050 6971806 7069684 6345855 4831280 2907774
29848 2907774 985848 -690730 -2060460 -3258751 -4608292 -6437710 -8796120 -11288213
29840 -11288213 -13147140 -13549587 -12100911 -9189465 -5807976 -2900448 -869739 321866
29832 321866 799741 688808 188465 -566180 -1686666 -3284058 -4965756 -5826891 -5131212
29823 -5131212 -2942797 -43832 2636917 4468807 5239900 5106678 4419012 3434431 2166770
29814 2166770 569440 -1192579 -2793277 -4080511 -5236936 -6530386 -7941058 -9081306
29806 -9081306 -9482480 -8975763 -7849598 -6674962 -5956426 -5880538 -6290754 -6796281 -6900387
29797 -6900387 -6168344 -4446078 -1976336 724137 3103196 4702039 5188941 4482520 2919967
29788 2919967 1177597 -118824 -725485 -738688 -369740 92060 186234 -561844 -2234996
29779 -2234996 -4398585 -6541627 -8583283 -10777370 -13146819 -15231036 -16476229 -16709642
29771 -16709642 -16111087 -14887481 -13209859 -11412068 -9968936 -9154523 -8852900 -8792711 -8839681
29762 -8839681 -8936194 -8852095 -8174231 -6578129 -4071587 -1035124 1888015 4035792 5090103
29753 5090103 5300896 5271160 5452164 5871945 6310414 6561453 6437222 5693178 4201769
29744 4201769 2233687 401132 -786786 -1280110 -1393264 -1455558 -1612503 -1860479 -2115861
29735 -2115861 -2236275 -2094618 -1703721 -1215959 -739513 -182535 664058 1885349 3297110
29726 3297110 4511051 5124766 4922019 4003886 2748480 1561110 604881 -204466 -945963
29717 -945963 -1537801 -1910809 -2259055 -2961287 -4209045 -5807284 -7406943 -8865063 -10290672
29708 -10290672 -11785820 -13270199 -14579374 -15601827 -16211640 -16142244 -15104745 -13105811
29700 -13105811 -10572447 -8086436 -6020847 -4462016 -3383904 -2746171 -2415704 -2146970
29692 -2146970 -1757146 -1287835 -935001 -861002 -1127133 -1725500 -2524241 -3168949 -3197087 -2388694
29682 -2388694 -998319 415610 1383904 1742866 1561222 1003523 305335 -224560 -308473
29673 -308473 136922 925452 1666915 1921402 1386790 57068 -1758771 -3613581 -5162895
29664 -5162895 -6255998 -6851509 -6954721 -6697451 -6403480 -6436178 -6923159 -7675407 -8412053
29655 -8412053 -9020408 -9545500 -9967013 -10094121 -9732300 -8900528 -7809939 -6640208 -5418688
29646 -5418688 -4143871 -2929730 -1920272 -1094217 -285331 572086 1336679 1867894 2223928
29637 2223928 2524254 2700020 2569604 2152718 1698844 1315170 732233 -412866 -2152543
29628 -2152543 -4186863 -6226104 -8155658 -9876684 -11182903 -11901609 -12086254 -12011174 -12014678
29619 -12014678 -12335990 -12976783 -13632889 -13825575 -13204501 -11746480 -9665785 -7202466 -4549519
29610 -4549519 -1916608 445399 2296307 3432344 3678499 2950719 1388564 -594350
29602 -594350 -2448436 -3735146 -4305493 -4295195 -3955886 -3450916 -2757877 -1721211 -184793
29593 -184793 1878145 4270809 6551371 8150270 8625228 7918851 6442064 4905057 3966257
29584 3966257 3900215 4526618 5470913 6503802 7609010 8764373 9782417 10426370 10597888
29575 10597888 10331709 9679855 8711032 7580469 6475887 5500363 4713762 4271585 4376145
29566 4376145 5058426 6148619 7518899 9194298 11089803 12764772 13659440 13596140 12908418
29557 12908418 12045647 11168942 10174286 8971465 7605702 6151056 4635478 3150416
29549 3150416 1986558 1548753 2036596 3181403 4359191 5043290 5167621 5047896 5020028
29540 5020028 5242179 5776930 6631336 7566193 7977760 7200549 5042905 2012512 -983411
29531 -983411 -3146738 -4119382 -4051276 -3479329 -3043778 -3135734 -3737866 -4616174 -5636727 -6829091
29521 -6829091 -8158435 -9350141 -10014470 -9916851 -9099313 -7797325 -6300225 -4839904 -3501484
29512 -3501484 -2218051 -927129 234783 956799 1027139 559545 -75906 -514271 -591911
29503 -591911 -398501 -246788 -548779 -1578254 -3274896 -5278237 -7123968 -8386525 -8762765
29494 -8762765 -8251574 -7328613 -6772096 -7120459 -8271919 -9647337 -10688123 -11152962 -11060803
29485 -11060803 -10538947 -9746469 -8807136 -7744174 -6531240 -5225962 -3990301 -2971128
29477 -2971128 -2247562 -1924869 -2174568 -3081782 -4476282 -5976641 -7199440 -7921968 -8121161
29468 -8121161 -7946836 -7644999 -7420996 -7330202 -7304255 -7263049 -7155928 -6895271 -6317151 -5284486
29458 -5284486 -3871997 -2451093 -1544359 -1504745 -2254849 -3321082 -4161000 -4511475 -4466084
29449 -4466084 -4249889 -3930337 -3332616 -2217420 -532964 1504435 3555767 5347608 6715069
29440 6715069 7530968 7686891 7175356 6165460 4981319 3985989 3403365 3157129 2888813
29431 2888813 2215139 989754 -717908 -2830990 -5290042 -7838564 -9954094 -11143447
29423 -11143447 -11283658 -10630877 -9589745 -8556269 -7867396 -7715337 -8083355 -8829159 -9783208
29414 -9783208 -10690790 -11190685 -11093534 -10691473 -10551217 -10865780 -11138862 -10633464 -9049964
29405 -9049964 -6673742 -3984623 -1311960 1158645 3256635 4830652 5821270 6247849
29397 6247849 6139542 5535254 4562634 3487271 2643707 2259996 2271773 2258709 1606781 -125750
29387 -125750 -2848529 -5879879 -8290733 -9394865 -9004194 -7363801 -5000735 -2614963
29379 -2614963 -856340 49929 469811 1020448 2019175 3282756 4356436 4782665 4231952
29370 4231952 2682776 632621 -1032155 -1589505 -943136 456099 2015499 3257751
29362 3257751 3857892 3683681 2864875 1739877 691135 -613 -274581 -371106 -689609
29353 -689609 -1377455 -2060828 -2138812 -1393281 -224573 713467 994724 540962 -540388
29344 -540388 -2072309 -3793934 -5351807 -6375217 -6603693 -6005220 -4805485 -3379174 -2084371
29335 -2084371 -1174362 -783865 -894049 -1308068 -1754713 -2060781 -2190618 -2145173 -1935741 -1691376
29325 -1691376 -1680105 -2121322 -2987315 -4003693 -4790191 -5007814 -4514564 -3490968 -2343843
29316 -2343843 -1376629 -587238 142546 755653 1073131 1097387 1073761 1204952 1442956 1610541
29306 1610541 1572414 1183288 208570 -1506972 -3782851 -6106830 -7895670 -8739532 -8534430
29297 -8534430 -7555847 -6350662 -5331359 -4412662 -3202741 -1607043 -65602 911501 1271204
29288 1271204 1324617 1288458 1160889 984078 973394 1374887 2407072 4325974 7225976
29279 7225976 10638909 13613207 15460254 16306407 16715790 16929402 16761325 16142713 15377342
29270 15377342 14756457 14211838 13521959 12648730 11655968 10432601 8749698 6577582 4156026
29261 4156026 1729840 -616395 -2788827 -4482380 -5299706 -5098171 -4173894 -3065903 -2146331
29252 -2146331 -1366993 -394239 1000546 2674176 4199959 5162698 5356575 4787865 3606564
29243 3606564 2061799 459212 -892976 -1730003 -1911135 -1564642 -1138685 -1148016 -1747115
29234 -1747115 -2597986 -3249014 -3607781 -3947013 -4489968 -5149015 -5708927 -6121606 -6532926
29225 -6532926 -7141303 -8140663 -9651107 -11454393 -12817488 -12871454 -11356673 -8911378 -6525303
29216 -6525303 -4792970 -3761327 -3305110 -3378383 -3909549 -4698929 -5548377 -6396033 -7247561
29207 -7247561 -8047200 -8669091 -8962361 -8762338 -7958689 -6643474 -5123296 -3684130 -2393020
29198 -2393020 -1242729 -441259 -359226 -1090874 -2179520 -2926060 -2958565 -2389783 -1425109
29189 -1425109 -1234 2032048 4440161 6519712 7586848 7492372 6626202 5534968 4646773
29180 4646773 4272461 4639715 5789599 7468042 9177928 10368272 10651376 9957934 8521604
29171 8521604 6653100 4511960 2174174 -59742 -1564329 -1756066 -579135 1447174
29163 1447174 3674662 5757156 7635176 9211885 10193039 10306302 9636413 8685536 8084208
29154 8084208 8212065 8990871 9921212 10331354 9751635 8178697 5971800 3482269 876557
29145 876557 -1642052 -3626891 -4642289 -4725674 -4418858 -4286995 -4514574 -4977941 -5531165
29136 -5531165 -6106568 -6636178 -6995214 -7000202 -6436434 -5190951 -3454416 -1736119 -579376
29127 -579376 -242269 -634411 -1469591 -2453050 -3448316 -4555752 -5941650 -7509627 -8854579
29118 -8854579 -9669287 -10099318 -10534383 -11125988 -11717329 -12215604 -12764170 -13440170 -13989675
29109 -13989675 -14065321 -13660900 -13138760 -12808737 -12578211 -12041239 -10847223 -8966253 -6672580
29100 -6672580 -4349297 -2310704 -752478 197533 436182 -63233 -1125647 -2315411 -3082250
29091 -3082250 -3060078 -2259556 -965760 518686 1984980 3232904 4027394 4233233 3963229
29082 3963229 3550493 3381301 3714136 4536051 5531329 6277595 6571937 6551711 6470070 6415511
29072 6415511 6282010 5910614 5187044 4121322 2983312 2298244 2521077 3658783 5281015
29063 5281015 6898797 8270691 9396470 10365424 11254607 12082595 12796202 13296542 13441141
29054 13441141 13009592 11808448 9976716 8127437 6957303 6619070 6570253 6086972 4870614
29045 4870614 3193104 1616163 609641 275735 315778 321004 162273 52669 226219
29036 226219 672173 1225058 1769812 2242926 2535346 2561415 2430741 2448927 2893683 3774384
29026 3774384 4768611 5384720 5269749 4452432 3311272 2305658 1730023 1643253 1903015
29017 1903015 2242624 2411397 2295027 1880621 1166027 229681 -649174 -1143255 -1210234 -1115210
29007 -1115210 -1070038 -1038152 -973377 -1003240 -1172302 -1190315 -703952 274242 1467765 2809187
28997 2809187 4518087 6663889 8903310 10770904 12081080 12965310 13664874 14383584 15194630
28988 15194630 15919435 16129475 15400517 13635129 11173732 8636532 6615651 5367609
28980 5367609 4693842 4138837 3350075 2256384 966554 -359430 -1486930 -2087065 -1905190
28971 -1905190 -995815 238782 1263044 1696176 1465936 739152 -288008 -1522328 -2891853
28962 -2891853 -4196223 -5146869 -5587847 -5614434 -5441641 -5206018 -4927834 -4616265 -4346519
28953 -4346519 -4206978 -4148650 -3882076 -3006938 -1375580 637273 2308034 3073291 2880799
28944 2880799 2098622 1185782 449452 -21713 -296605 -447668 -419832 -97154 486834 1094021
28934 1094021 1483639 1582428 1396851 873439 -17085 -1115675 -2161281 -3072183 -4029292
28925 -4029292 -5226122 -6605232 -7891743 -8832452 -9335894 -9402169 -9008500 -8139059 -6926815
28916 -6926815 -5689471 -4741932 -4173042 -3878974 -3832073 -4217235 -5212789 -6679456 -8161052
28907 -8161052 -9183975 -9475872 -8924532 -7525256 -5550258 -3719033 -2937162 -3615489 -5205010
28898 -5205010 -6545975 -6810587 -6121300 -5253037 -4848367 -5025573 -5611426 -6442622 -7315557
28889 -7315557 -7856984 -7703363 -6806520 -5421079 -3799654 -2042828 -273598 1183327 1902327
28880 1902327 1617700 382719 -1433568 -3241072 -4411354 -4555885 -3770595 -2643471 -1955495
28871 -1955495 -2240227 -3500900 -5281401 -6996602 -8225505 -8792853 -8732487 -8254032 -7647863
28862 -7647863 -7071299 -6408501 -5418478 -4027510 -2417012 -855421 447708 1335726 1721481
28853 1721481 1703416 1574149 1623604 1988420 2741457 3996741 5759704 7719130 9386431
28844 9386431 10526204 11360106 12278836 13416117 14568351 15467326 16007966 16166402 15761125
28835 15761125 14400979 11756162 7929148 3563754 -439750 -3373865 -4992595 -5465598
28827 -5465598 -5138030 -4282760 -2973392 -1141271 1223222 3895962 6437186 8386349
28819 8386349 9475593 9742352 9496198 9110877 8726598 8153859 7187196 6046090 5371134
28810 5371134 5665603 6786570 8070703 8917583 9179936 9084808 8974780 9155199 9796215
28801 9796215 10806837 11828730 12473714 12617599 12445971 12214518 11987683 11621261 11001125
28792 11001125 10285321 9856678 9983615 10559710 11246618 11825464 12258257 12385933 11772605
28783 11772605 10040081 7320542 4260407 1609168 -112172 -663707 -91364 1215759
28775 1215759 2627359 3580394 3783613 3143029 1672237 -373347 -2377506 -3619400 -3771764
28766 -3771764 -3128363 -2334475 -1923399 -2062637 -2596655 -3218359 -3621182 -3604803 -3151662 -2455430
28756 -2455430 -1852617 -1660371 -2026876 -2905072 -4115646 -5377674 -6316368 -6590462 -6133221
28747 -6133221 -5255836 -4441746 -4011732 -3971531 -4117793 -4254893 -4389819 -4809735 -5914776
28738 -5914776 -7828160 -10119243 -11969230 -12643216 -11813665 -9560860 -6290386 -2724464
28730 -2724464 224213 1839612 1991278 1155326 59679 -727116 -1002233 -900171 -727760
28721 -727760 -782920 -1240905 -2099020 -3145048 -4024271 -4482084 -4593354 -4654672 -4806771 -4900202
28711 -4900202 -4837504 -4901237 -5526819 -6774829 -8211702 -9322940 -9880704 -9901580 -9474134
28702 -9474134 -8753929 -7969611 -7270039 -6633247 -6022001 -5515834 -5153314 -4762764 -4168597
28693 -4168597 -3540770 -3325050 -3764814 -4615483 -5349353 -5505430 -4847705 -3433940 -1702832
28684 -1702832 -360467 34442 -594327 -1952619 -3724243 -5703661 -7692133 -9474550
28676 -9474550 -10935507 -12072381 -12853152 -13148286 -12828388 -11860370 -10323337 -8455707 -6713513
28667 -6713513 -5633625 -5510035 -6214642 -7346147 -8474421 -9237228 -9395373 -8988756 -8396701
28658 -8396701 -8071160 -8156846 -8425148 -8542138 -8290731 -7560500 -6301999 -4584565 -2608805
28649 -2608805 -585181 1330485 2920691 3828859 3744987 2679974 989471 -857789 -2474436
28640 -2474436 -3581732 -4018362 -3818431 -3228762 -2578997 -2134338 -2067003 -2488286 -3428955
28631 -3428955 -4797748 -6407365 -8047473 -9526179 -10689775 -11480198 -12001466 -12497662 -13211542
28622 -13211542 -14194601 -15176846 -15602670 -14884885 -12763385 -9504927 -5780667 -2344020 250616
28613 250616 1799299 2493920 2806276 3170968 3685187 4147069 4393484 4506926 4641927
28604 4641927 4753593 4623935 4137076 3435216 2811027 2533067 2766179 3525516 4609550
28595 4609550 5619844 6143755 5973871 5192367 4115749 3200132 2925800 3610056 5195729
28586 5195729 7193221 8898037 9772344 9711225 9015452 8169006 7646054 7803809 8738125
28577 8738125 10113164 11228495 11457667 10714827 9457102 8235085 7323457 6773551 6625053
28568 6625053 6884100 7349185 7655695 7572458 7185174 6764857 6548144 6677338 7210546 8037506
28558 8037506 8831687 9251667 9237736 9020430 8819802 8651462 8455993 8233598 7891409 7091492
28548 7091492 5530215 3432845 1592764 805912 1313480 2756010 4441920 5570896
28540 5570896 5489975 4109686 2098345 422484 -427734 -700012 -907861 -1267735 -1637197
28531 -1637197 -1832789 -1877145 -1980046 -2328222 -2850473 -3200783 -3081736 -2587920 -2084521 -1720392
28521 -1720392 -1246241 -392182 781968 2056684 3349280 4566461 5290344 4983700 3613728
28512 3613728 1878532 730956 786965 2150882 4516094 7266205 9663608 11187168
28504 11187168 11721873 11412407 10477031 9256346 8245654 7794830 7743663 7503940 6538398
28495 6538398 4688278 2093033 -1026194 -4460988 -8037139 -11606467 -14910324 -17418997
28487 -17418997 -18504090 -17978773 -16436094 -14877701 -13940347 -13530980 -13177738 -12576867 -11727226
28478 -11727226 -10683613 -9400058 -7870947 -6295932 -4966344 -3975561 -3122130 -2159453
28470 -2159453 -1118753 -312921 18607 29564 162073 707238 1521386 2212544 2563987
28461 2563987 2717156 2965718 3451034 4070445 4605700 4895080 4932334 4856736 4823939 4838766
28451 4838766 4726590 4303044 3558179 2657703 1812185 1181447 815404 549166 -25201
28442 -25201 -1293718 -3190128 -5080256 -6193144 -6207073 -5415169 -4379917 -3482491 -2728341
28433 -2728341 -1822373 -369829 1882338 4844121 8059844 10917757 12942226 13959646
28425 13959646 14086695 13633601 12983888 12440356 12082768 11767291 11307523 10668682 9967501
28416 9967501 9293501 8575964 7647019 6417137 4998635 3723623 3071175 3471832 4997108
28407 4997108 7135506 8930112 9490586 8528296 6513214 4367969 2952053 2657733 3283610
28398 3283610 4178140 4558830 3880428 2101393 -290298 -2522277 -3910507 -4132346 -3278383
28389 -3278383 -1736106 -13398 1436987 2330563 2525004 1904135 382309 -1884074 -4347770
$$ [...]
##END NTUPLES=NMR SPECTRUM
##END=
