##TITLE=31Pdec_AT-57
 DMSO-d6, 256 sc
 16.2.2023
##JCAMPDX= 6.0         $$ Bruker NMR JCAMP-DX V2.0
##DATA TYPE= NMR SPECTRUM
##DATA CLASS= NTUPLES
##ORIGIN= UXNMR, Bruker Analytische Messtechnik GmbH
##OWNER= root
$$ XWIN-NMR		Version 3.5
$$ Thu Feb 16 16:04:41 2023 Russian Standard Time (UT+4h)  she@DPX200
##.OBSERVE FREQUENCY= 81.013821
##.OBSERVE NUCLEUS= ^31P
##.ACQUISITION MODE= SIMULTANEOUS
##.ACQUISITION SCHEME= undefined
##.AVERAGES= 256
##.DIGITISER RES= 16
##SPECTROMETER/DATA SYSTEM= spect
##.PULSE SEQUENCE= zgpg30
##.SOLVENT NAME= CDCl3
##.SHIFT REFERENCE= (INTERNAL, CDCl3, 0, 248.564)
##AUDIT TRAIL= $$ (NUMBER, WHEN, WHO, WHERE, WHAT)
$$ ##TITLE= Audit trail, XWIN-NMR		Version 3.5
$$ ##JCAMPDX= 5.01
$$ ##ORIGIN= Bruker BioSpin GmbH
$$ ##OWNER= she
$$ F:/spectra/data/she/nmr/P31/1/pdata/1/auditp.txt
$$ ##AUDIT TRAIL=  $$ (NUMBER, WHEN, WHO, WHERE, WHAT)
(   1,<2023-02-16 16:03:38.34 +0400>,<she>,<DPX200>,
      <continue with go, POWCHK disabled, PULCHK disabled
       configuration hash MD5:
       00 E9 B6 7A A2 85 ED C7 34 08 36 98 17 FE 4E 26
       data hash MD5: 32K
       51 63 BB 3B B1 7E BC 6F 48 A7 94 94 30 59 CA AB>)
(   2,<2023-02-16 16:03:54.48 +0400>,<she>,<DPX200>,
      <Start of raw data processing
       efp BC_mod = 2 LB = 1 FT_mod = 6 PKNL = 1 PHC0 = -10957.28 PHC1 = 19.81271 SI = 64K 
       data hash MD5: 64K
       CC 1E AD 04 E2 97 93 FF 71 99 3A 36 D3 19 80 83>)
(   3,<2023-02-16 16:04:09.85 +0400>,<she>,<DPX200>,
      <pk PHC0 = 29.21415 PHC1 = 0 
       data hash MD5: 64K
       A5 CB 0D 49 36 33 37 66 35 89 AB B8 B3 03 6B 57>)
$$ ##END=
$$ 
$$ hash MD5
$$ 3E 55 3E 59 9F E3 1C 10 A8 96 57 61 EC 14 7B 2A
##$RELAX= 
##$RELAX= 
##$RELAX= 
##$RELAX= 
##$RELAX= 
##$RELAX= 
##$RELAX= 
##$RELAX= 
##$RELAX= 
$$ Bruker specific parameters
$$ --------------------------
##$DU= <F:/spectra>
##$EXPNO= 1
##$NAME= <P31>
##$PROCNO= 1
##$TYPE= <nmr>
##$USER= <she>
##$AMP= (0..31)
100 100 100 100 100 100 100 100 100 100 100 100 100 100 100 100 100 100 
100 100 100 100 100 100 100 100 100 100 100 100 100 100 
##$AQSEQ= 0
##$AQ_mod= 1
##$AUNM= <au_zg>
##$AUTOPOS= <>
##$BF1= 81.014009
##$BF2= 200.13
##$BF3= 200.13
##$BF4= 200.13
##$BF5= 200.13
##$BF6= 200.13
##$BF7= 200.13
##$BF8= 200.13
##$BYTORDA= 1
##$CFDGTYP= 0
##$CFRGTYP= 5
##$CHEMSTR= <none>
##$CNST= (0..31)
1 1 145 1 1 1 1 1 1 1 1 1 1 1 1 1 1 1 1 1 1 1 1 1 1 1 1 1 1 1 1 1 
##$CPDPRG= <waltz16>
##$CPDPRG1= <>
##$CPDPRG2= <waltz16>
##$CPDPRG3= <>
##$CPDPRG4= <mlev>
##$CPDPRG5= <mlev>
##$CPDPRG6= <mlev>
##$CPDPRG7= <mlev>
##$CPDPRG8= <mlev>
##$CPDPRGB= <>
##$CPDPRGT= <>
##$D= (0..31)
0 1 0 0 0 0 0 0 0 0 0 0.03 2e-05 3e-06 0 0 0 0 0 0 0 0 0 0 0 0 0 0 0 0 
0 0 
##$DATE= 1676548564
##$DBL= (0..7)
120 120 120 11 120 120 24 19 
##$DBP= (0..7)
150 150 150 150 150 150 150 150 
##$DBP07= 0
##$DBPNAM0= <>
##$DBPNAM1= <>
##$DBPNAM2= <>
##$DBPNAM3= <>
##$DBPNAM4= <>
##$DBPNAM5= <>
##$DBPNAM6= <>
##$DBPNAM7= <>
##$DBPOAL= (0..7)
0.5 0.5 0.5 0.5 0.5 0.5 0.5 0.5 
##$DBPOFFS= (0..7)
$$ [...]
##$SUBNAM2= <"">
##$SUBNAM3= <"">
##$SUBNAM4= <"">
##$SUBNAM5= <"">
##$SUBNAM6= <"">
##$SUBNAM7= <"">
##$SUBNAM8= <"">
##$SUBNAM9= <"">
##$SW= 501.771253377433
##$SWIBOX= (0..15)
0 1 3 0 0 0 0 0 0 0 0 0 0 0 0 0 
##$SW_h= 40650.406504065
##$TD= 32768
##$TD0= 1
##$TE= 0
##$TE2= 300
##$TE3= 300
##$TEG= 300
##$TL= (0..7)
0 120 53 12 22 120 120 120 
##$TP= (0..7)
150 150 150 150 150 150 150 150 
##$TP07= 0
##$TPNAME0= <>
##$TPNAME1= <>
##$TPNAME2= <>
##$TPNAME3= <>
##$TPNAME4= <>
##$TPNAME5= <>
##$TPNAME6= <>
##$TPNAME7= <>
##$TPOAL= (0..7)
0.5 0.5 0.5 0.5 0.5 0.5 0.5 0.5 
##$TPOFFS= (0..7)
0 0 0 0 0 0 0 0 
##$TUNHIN= 0
##$TUNHOUT= 0
##$TUNXOUT= 0
##$USERA1= <user>
##$USERA2= <user>
##$USERA3= <user>
##$USERA4= <user>
##$USERA5= <user>
##$V9= 5
##$VALIST= <valist>
##$VCLIST= <CCCCCCCCCCCCCCC>
##$VD= 0
##$VDLIST= <DDDDDDDDDDDDDDD>
##$VPLIST= <PPPPPPPPPPPPPPP>
##$VTLIST= <TTTTTTTTTTTTTTT>
##$WBST= 1024
##$WBSW= 4
##$XGAIN= (0..3)
0 0 0 0 
##$XL= 0
##$YL= 0
##$YMAX_a= 4723
##$YMIN_a= -6478
##$ZGOPTNS= <>
##$ZL1= 120
##$ZL2= 120
##$ZL3= 120
##$ZL4= 120
##$ABSF1= 0
##$ABSF2= 0
##$ABSG= 0
##$ABSL= 0
##$ALPHA= 0
##$AQORDER= 0
##$ASSFAC= 0
##$ASSFACI= 0
##$ASSFACX= 0
##$ASSWID= 0
##$AUNMP= <proc_1d>
##$AZFE= 0.1
##$AZFW= 0.5
##$BCFW= 0
##$BC_mod= 2
##$BYTORDP= 0
##$COROFFS= 0
##$CY= -3
##$DATMOD= 1
##$DC= 0
##$DFILT= <>
##$DTYPP= 0
##$F1P= 0
##$F2P= 0
##$FCOR= 1
##$FTSIZE= 65536
##$FT_mod= 6
##$GAMMA= 0
##$GB= 0
##$INTBC= 1
##$INTSCL= 6.047779e-11
##$ISEN= 30
##$LB= 1
##$LEV0= 0
##$LPBIN= 0
##$MAXI= 10000
##$MC2= 0
##$MEAN= 0
##$ME_mod= 0
##$MI= 50
##$NCOEF= 0
##$NC_proc= -10
##$NLEV= 6
##$NOISF1= 182.463
##$NOISF2= 159.3651
##$NSP= 0
##$NTH_PI= 0
##$NZP= 0
##$OFFSET= 248.5645
##$PC= 4
##$PHC0= -10928.07
##$PHC1= 19.81271
##$PH_mod= 1
##$PKNL= yes
##$PPARMOD= 0
##$PSCAL= 0
##$PSIGN= 0
##$REVERSE= no
##$SF= 81.0140089999694
##$SI= 65536
##$SIGF1= 159.3651
##$SIGF2= -187.1042
##$SINO= 113.3802
##$SIOLD= 16384
##$SREGLST= <1H.CDCl3>
##$SSB= 0
##$STSI= 65536
##$STSR= 0
##$SW_p= 40650.406504065
##$SYMM= 0
##$S_DEV= 0
##$TDeff= 32768
##$TDoff= 0
##$TI= <>
##$TILT= no
##$TM1= 0
##$TM2= 0
##$TOPLEV= 0
##$USERP1= <user>
##$USERP2= <user>
##$USERP3= <user>
##$USERP4= <user>
##$USERP5= <user>
##$WDW= 1
##$XDIM= 65536
##$YMAX_p= 489294447
##$YMIN_p= -537522472
$$ End of Bruker specific parameters
$$ ---------------------------------
##NTUPLES= NMR SPECTRUM
##VAR_NAME=  FREQUENCY,     SPECTRUM/REAL,   SPECTRUM/IMAG
##SYMBOL=    X,             R,               I
##VAR_TYPE=  INDEPENDENT,   DEPENDENT,       DEPENDENT
##VAR_FORM=  AFFN,          ASDF,            ASDF
##VAR_DIM=   65536,         65536,           65536
##UNITS=     HZ,            ARBITRARY UNITS, ARBITRARY UNITS
##FACTOR=    0.620285442955139, 1,           1
##FIRST=     20137.2065510682, 0,            0
##LAST=      -20513.1999529968, 0,           0
##MIN=       -20513.1999529968, -537522472,  0
##MAX=       20137.2065510682, 489294447,    0
$$ Real data points
##PAGE= N=1
##DATA TABLE= (X++(R..R)), XYDATA
$$ [...]
$$ plain form
35219 2744509 -20056197 -49571650 -64889566 -62847170 -40403037 -4573003 15636263
35212 15636263 2427536 -18849940 -16665962 -8241989 -34426126 -87058047 -110139158
35205 -110139158 -79075895 -33566724 -16815623 -21380583 -17563375 -4290416 -3187603
35198 -3187603 -19205521 -33415361 -30586844 -17390595 -11687318 -19504297 -25299421 -9935576
35190 -9935576 21278224 42545577 46126166 54539182 76323938 76131551 23746619 -45639990
35182 -45639990 -65234963 -25062146 18905745 25544862 11205817 1653936 -9632933
35175 -9632933 -31310170 -43480042 -30339596 -15038552 -26803211 -50425665 -42569971
35168 -42569971 6711130 55748836 58186255 13203478 -36026550 -48765857 -27555216
$$ packed form
35219B744509k2800706k9515453j5317916K042396K2444133L5830034K0209266
35212A5636263j3208727k1277476K183978Q423973k6184137n2631921k3081111
35205a10139158L1063263M5509171J6751101m564960L817208J3272959J102813
35198c187603j6017918j4209840K828517J3196249N703277p816979n795124J5363845
35190i935576L1213800K1267353L580589Q413016K1784756j92387n2384932o9386609
35182d5639990j9594973M0172817M3967891O639117j4339045r551881j1286869
35175i632933k1677237j2169872J3140446J5301044j1764659k3622454P855694
35168d2569971M9281101M9037706K437419m4982777m9230028j2739307K1210641
$$ plain form
35161 -27555216 -8388763 -10860577 -14019155 6192245 34143664 34919237 6672832 -17289501
35153 -17289501 -15086381 2586575 15364841 11832200 -9854651 -34767744 -34778868 -8192958
35145 -8192958 543718 -40322993 -88871710 -78565789 -16524769 26286899 17503858
35138 17503858 -9600087 -32176810 -66881620 -108759814 -114206764 -68411546 -3251715
35131 -3251715 69817226 166209033 244062998 208643170 50529050 -107808899 -163947518
35124 -163947518 -151424619 -139737582 -113222224 -42043506 12331001 -18298677 -78457918
35117 -78457918 -66745781 -1254993 18328671 -18032456 -30000782 410013 14480041
35110 14480041 14761628 72747740 174743564 201561361 111889485 20734291 30946271
$$ packed form
35161b7555216J9166453k471814l158578K0211400K7951419P75573k8246405k3962333
35153a7289501K203120J7672956J2778266l532641k1686851k4913093j1124K6585910
35145h192958Q736676m0866711m8548717J0305921O2041020M2811668q783041
35138A7503858k7103945k2576723l4704810m1878194n446950M5795218O5159831
35131c251715P3068941R6391807P7853965l5419828j58114120j58337949n6138619
35124a63947518J2522899J1687037K6515358P1178718N4374507l0629678o0159241
35117g8457918J1712137O5490788J9583664l6361127j1968326L0410795J4070028
35110A4480041K81587N7986112J01995824K6817797q9671876r1155194J0211980
$$ plain form
35103 30946271 95203098 116215174 86428693 49339530 7679761 -42197108 -51555272
35096 -51555272 16953771 113762034 165123562 169546953 168437749 168451719 158324026 154680739
35088 154680739 162542199 136959010 55486673 -17152369 -13971833 27747572 28068628
35081 28068628 -6918798 -11479691 13719913 4247735 -49485605 -85852072 -79174760
35074 -79174760 -71524407 -83635361 -79697046 -44279728 -18346515 -28979790 -46055526
35067 -46055526 -36092036 -4978177 32227583 67948642 72438505 11130102 -83996258
35060 -83996258 -122892788 -68662885 15799056 61379317 71844353 73596522 52507080
35053 52507080 -4034688 -55392708 -61635746 -50629545 -68113427 -93021156 -72167706
$$ packed form
35103C0946271O4256827K1012076k9786481l7089163m1659769m9876869r358164
35096e1555272O8509043R6808263N1361528M423391j109204J3970j0127693l643287
35088A54680739P861460k5583189q1472337p2639042L180536M1719405L21056
35081B8068628l4987426m560893K5199604r472178n3733340l6366467O677312
35074g9174760P650353j2110954L938315L5417318K5933213j0633275j7075736
35067d6055526R963490L1113859L7205760L5721059M489863o1308403r5126360
35060h3996258l8896530N4229903Q4461941M5580261J0465036J752169k1089442
35053E2507080n6541768n1358020o243038J1006201j7483882k4907729K0853450
$$ plain form
35046 -72167706 -19498776 -5378450 -45713917 -71632167 -30908646 34473281 45659942
35039 45659942 -10490392 -70017722 -69681062 -10264351 55904825 83360118 72656323
35032 72656323 56912093 59760789 74434292 79237861 59497014 14340499 -40349431
35025 -40349431 -70566293 -45457054 27242010 99866905 129048032 110297464 65074395
35018 65074395 14572723 -22649210 -29607411 -7971104 16539807 22357959 15143215
35011 15143215 10634777 8564864 -1664485 -20215029 -33502161 -23283888 21534901
35004 21534901 82223574 101387535 35119907 -73161145 -115249974 -44788896 57729329
34997 57729329 87186659 45985049 20243379 48939900 84489568 82544928 64344063
$$ packed form
35046g2167706N2668930J4120326m0335467k5918250M0723521O5381927J1186661
35039D5659942n6150334n9527330L36660N9416711O6169176K7455293j0703795
35032G2656323j5744230K848696J4673503M803569j9740847m5156515n4689930
35025d0349431l0216862K5109239P2699064P2624895K9181127j8750568m5223069
35018F5074395n0501672l7221933o958201K1636307K4510911N818152p214744
35011A5143215m508438k069913j0229349j8550544j3287132J0218273M4818789
35004B1534901O0688673J9163961o6267628j08281052m2088829P0461078J02518225
34997E7729329K9457330m1201610k5741670K8696521L5549668j944640j8200865
$$ plain form
34990 64344063 65885375 73238704 43603162 -31993639 -113311534 -148332592 -114098701
34983 -114098701 -31442389 52051296 100309226 111463293 99980899 71849860 33618454
34976 33618454 7550892 9550749 25121578 37754179 65018830 125124911 180944337
34969 180944337 172361752 105126710 49115549 36348109 23000631 -20354538 -44692105
34962 -44692105 708555 75690105 98408838 61330281 30603261 36071169 29592259
34955 29592259 -28239642 -93748918 -91414821 -13849857 67720933 88383176 54790047
34948 54790047 16723919 -3538424 -27571235 -69279077 -98146763 -76856936 -20153213
34941 -20153213 14416128 -6723342 -62972811 -117791177 -156175360 -174442666 -164442868
$$ packed form
34990F4344063J541312P353329k9635542p5596801q1317895l5021058L4233891
34983a14098701Q2656312Q3493685M8257930J1154067j1482394k8131039l8231406
34976C3618454k6067562J999857J5570829J2632601K7264651O0106081N5819426
34969A80944337q582585o7235042n6011161j2767440j3347478m3355169k4337567
34962d4692105M5400660P4981550K2718733l7078557l0727020N467908o478910
34955B9592259n7831901o5509276K334097P7564964Q1570790K0662243l3593129
34948E4790047l8066128k0262343k4032811m1707842k8867686K1289827N6703723
34941b0153213L4569341k1139470n6249469n4818366l8384183j8267306R999798
$$ plain form
34934 -164442868 -129169079 -92623986 -73500906 -65623716 -60810020 -69125573 -92505143
34927 -92505143 -98309481 -53749235 18337348 50379685 5655533 -76142790 -120789697
34920 -120789697 -99049878 -52936733 -39660663 -59017232 -56022419 -762232 63053492
34913 63053492 75701870 42852983 16246146 9535103 -8346998 -38692316 -42400563
34906 -42400563 -21631666 -38219667 -110232380 -157559236 -109694002 -14504748 28202608
34899 28202608 -301919 -44314800 -78497869 -120365287 -153946741 -130096150 -50832946
34892 -50832946 21020016 49971837 60357882 68052048 47854395 -5643012 -44192546
34885 -44192546 -27955630 18605361 40264931 11807087 -45973453 -79872174 -36276268
$$ packed form
34934a64442868L5273789L6545093J9123080P877190M813696q315553k3379570
34927i2505143n804338M4560246P2086583L2042337m4724152q1798323m4646907
34920a20789697K1739819M6113145J3276070j9356569K994813N5260187O3815724
34913F3053492J2648378l2848887k6606837o711043j7882101l0345318l708247
34906d2400563K0768897j6588001p2012713m7326856M7865234R5189254M2707356
34899B8202608k8504527m4012881l4183069m1867418l3581454K3850591P9263204
34892e0832946P1852962K8951821J0386045P694166k0197653n3497407l8549534
34885d4192546J6236916M6560991K1659570k8457844n7780540l3898721M3595906
$$ plain form
34878 -36276268 75887686 160549888 133452758 43814308 20771005 88288269 125029518
34871 125029518 44090730 -80153998 -127258039 -93417845 -58074901 -48155045 -29245564
34864 -29245564 1474769 6135862 -18436810 -31933548 -17866800 382851 10387322
34857 10387322 25222468 48466829 69853331 90287377 109879363 104365229 59192230
34850 59192230 11425723 6836705 30515576 35311370 23118990 33061696 59843258
34843 59843258 59601436 40349427 66366616 149017474 205693810 168383583 80174661
34836 80174661 38527445 75236673 130593043 128306274 52637112 -35859276 -55256896
34829 -55256896 8299048 72974978 54579509 -26506197 -81136679 -81155910 -81342729 -106922953
$$ packed form
34878c6276268J12163954Q4662202k7097130q9638450k3043303O7517264L6741249
34871A25029518q0938788j24244728m7104041L3840194L5342944R919856J8909481
34864b9245564L0720333M661093k4572672j3496738J4066748J8249651J0004471
34857A0387322J4835146K3244361K1386502K0434046J9591986n514134m5172999
34850E9192230m7766507m589018K3678871M795794j2192380R942706K6781562
34843E9843258k41822j9252009K6017189Q2650858N6676336l7310227q8208922
34836H0174661m1647216L6709228N5356370k286769p5669162q8496388j9397620
34829e5256896O3555944O4675930j8395469q1085706n4630482j9231j86819k5580224
$$ plain form
34821 -106922953 -104899505 -42819632 20527942 18347976 -28152364 -56957027 -62810035
34814 -62810035 -83129225 -116972046 -121737315 -78345325 -12603982 37201980 40743376
34807 40743376 -12961894 -89021358 -120599479 -90305334 -65998291 -106901293 -166336680
34800 -166336680 -150170028 -51932306 37504917 50376391 11000329 -19778388 -16519437
34793 -16519437 3472371 4665409 -38178241 -102616758 -118600815 -46109649 60107300
34786 60107300 111522897 98673832 86201264 105335221 120824042 109403023 98353083
34779 98353083 104024426 95531226 49627640 -10084240 -56074495 -90434622 -110810647
34772 -110810647 -95069431 -50872669 -30171284 -57425054 -87469235 -71386778 -21842736
$$ packed form
34821a06922953K023448O2079873O3347574k179966m6500340k8804663n853008
34814f2810035k0319190l3842821m765269M3391990O5741343M9805962L541396
34807D0743376n3705270p6059464l1578121L0294145K4307043m0903002n9435387
34800a66336680J6166652R8237722Q9437223J2871474l9376062l0778717L258951
34793a6519437J9991808J193038m2843650o4438517j5984057P2491166J06216949
34786F0107300N1415597j2849065j2472568J9133957J5488821j1421019j1049940
34779I8353083N671343q493200m5903586n9711880m5990255l4360127k0376025
34772a10810647J5741216M4196762K0701385k7253770l0044181J6082457M9544042
$$ plain form
34765 -21842736 23910747 61203163 94887739 102084820 69304970 33242323 32929908
34758 32929908 48227975 35158160 -1854597 -20923188 -3827879 37879390 92824313
34751 92824313 141724733 149110456 111548323 80962876 86343512 73624401 -5658712
34744 -5658712 -87023093 -68794845 28686000 86444289 64489784 41380117 60806782
34737 60806782 60565173 1374444 -46135429 -16063839 42823875 55524634 42575280
34730 42575280 59867583 79265247 35290367 -48656806 -88174778 -71233928 -60106562
34723 -60106562 -69566161 -49638398 2323313 18261858 -23537945 -54325998 -30351153
34716 -30351153 -5065459 -29794766 -60581290 -37895932 1042953 -23023274 -97930643
$$ packed form
34765b1842736M5753483L7292416L3684576P197081l2779850l6062647l12415
34758C2929908J5298067j3069815l7012757j9068591J7095309M1707269N4944923
34751I2824313M8900420P385723l7562133l0585447N380636j2719111p9283113
34744e658712q1364381J8228248R7480845N7758289k1954505k3109667J9426665
34737F0806782k41609n9190729m7509873L0071590N8887714J2700759j2949354
34730D2575280J7292303J9397664m3974880q3947173l9517972J6940850J1127366
34723f0106562r459599J9927763N1961711J5938545m1799803l0788053K3974845
34716c0351153K5285694k4729307l0786524K2685358L8938885k4066227p4907369
$$ plain form
34709 -97930643 -129291992 -75581580 2030205 32446464 14847255 -8330385 -7041589
34702 -7041589 25619176 75737934 103985912 76755976 19093190 -1645832 34159670
34695 34159670 63864203 28194552 -43726930 -76094149 -49299188 -13212342 -5275879
34688 -5275879 -2106794 37373298 113126290 181973592 195464361 135527611 33240088
34681 33240088 -45555157 -57578022 -29714853 -25200927 -60810092 -91869426 -87664351
34674 -87664351 -77381188 -94646085 -117953818 -109179145 -80883134 -72728135 -79049763
34667 -79049763 -58599811 -11953630 11822921 -4275347 -16050711 8887668 41277485
34660 41277485 42683038 20596298 -3433892 -34654427 -70157413 -66648541 -1906004
$$ packed form
34709i7930643l1361349N3710412P7611785L0416259j7599209k3177640J288796
34702g041589L2660765N0118758K8247978k7229936n7662786k0739022L5805502
34695C4159670K9704533l5669651p1921482l2367219K6794961L6086846P936463
34688e275879L169085L9480092P5752992O8847302J3490769n9936750j02287523
34681C3240088p8795245j2022865K7863169M513926l5609165l1059334M205075
34674h7664351J0283163j7264897k3307733Q774673K8296011Q154999o321628
34667g9049763K0449952M6646181K3776551j6098268j1775364K4938379L2389817
34660D1277485J405553k2086740k4030190l1220535l5502986L508872O4742537
$$ plain form
34653 -1906004 62648076 49242578 -20323038 -46514327 7708448 66354184 48864422
34646 48864422 -29155991 -93910216 -107777659 -91156247 -79740218 -91683933 -120192992
34639 -120192992 -138187253 -123693232 -87857628 -58051285 -35974415 -7985795 6004591
34632 6004591 -30170186 -90061166 -89905116 -8723490 61821607 43528766 -10373746
34625 -10373746 1215587 70235498 99845487 61117314 26347783 38092677 45642480
34618 45642480 7453093 -30381644 -14160549 24784658 22501450 -17620707 -42107664
34611 -42107664 -33756194 -17310112 1411826 38676575 81091955 88551178 54455974
34604 54455974 16404371 -430538 -8866993 -20002391 -18988703 2948443 25523966
$$ packed form
34653a906004O4554080j3405498o9565616k6191289N4222775N8645736j7489762
34646D8864422p8020413o4754225j3867443J6621412J1416029j1943715k8509059
34639a20192992j7994261J4494021L5835604K9806343K2076870K7988620J3990386
34632F004591l6174777n9890980J56050Q1181626P0545097j8292841n3902512
34625a0373746J1589333O9019911K9609989l8728173l4769531J1744894P549803
34618D5642480l8189387l7834737J6221095L8945207k283208m0122157k4486957
34611d2107664Q351470J6446082J8721938L7264749M2415380P459223l4095204
34604E4455974l8051603j6834909q436455j1135398J013688K1937146K2575523
$$ plain form
34597 25523966 28376347 19298126 16370694 20965886 23535017 21585560 21038133 31543929
34589 31543929 62842185 107434789 126950509 84898574 2294358 -49992536 -32699478
34582 -32699478 14346762 28312248 2016328 -23348926 -25980982 -27493316 -53335222
34575 -53335222 -100958791 -151478537 -188699558 -199933188 -177015802 -125865001 -65014160
34568 -65014160 -11326682 24376808 30758345 1791800 -46990144 -83087711 -87483167
34561 -87483167 -73105595 -64684117 -64020558 -44957172 11449377 80258085 104790267
34554 104790267 57044229 -22708256 -66118577 -53193253 -23976604 -14403374 -16417961
34547 -16417961 -14817814 -23246102 -53017807 -79413024 -77982262 -66524887 -65964312 -46872832
$$ packed form
34597B5523966K852381r078221k927432M595192K569131j949457n47427J0505796
34589C1543929L1298256M4592604J9515720m2051935q2604216n2286894J7293058
34582c2699478M7046240J3965486k6295920k5365254k632056j512334k5841906
34575e3335222m7623569n0519746l7221021j1233630K2917386N1150801O0850841
34568f5014160N3687478L5703490O381537k8966545m8781944l6097567m395456
34561h7483167J4377572Q421478O63559J9063386N6406549O8808708K4532182
34554A04790267m7746038p9752485m3410321J2925324K9216649R573230k014587
34547a6417961J600147q428288k9771705k6395217J430762J1457375N60575J9091480
$$ plain form
34539 -46872832 25171869 107655327 115919050 42021975 -30473060 -42032516 -18001598
34532 -18001598 2725684 20262568 20929587 -42676139 -157225488 -209486000 -125601003
34525 -125601003 5409556 40653657 -24291804 -74078366 -57015723 -31591649 -31437052
34518 -31437052 -11535849 35338041 26545383 -77561575 -179775543 -168375264 -69771556
34511 -69771556 3970872 10914879 -3889405 -12212560 -30519863 -54958251 -52375652
34504 -52375652 -21351105 5477515 24182373 60745793 105770716 115670721 89809683
34497 89809683 77107603 87255327 69093062 10873498 -12524820 50937938 133700127
34490 133700127 133044874 53455368 -11679805 -18835261 -14402251 -36654294 -55804097
$$ packed form
34539d6872832P2044701Q2483458Q263723p3897075p2495035j1559456K4030918
34532a8001598K0727282J7536884O67019o3605726j14549349n2260512Q3884997
34525a25601003J31010559L5244101o4945461m9786562J7062643K5424074J54597
34518c1437052J9901203M6873890q792658j04106958j02213968J1400279R8603708
34511f9771556P3742428O944007j4804284q323155j8307303k4438388K582599
34504e2375652L1024547K6828620J8704858L6563420M5024923R900005k5861038
34497H9809683j2702080J0147724j8162265n8219564k3398318O3462758Q2762189
34490A33700127o55253p9589506o5135173p155456M433010k2252043j9149803
$$ plain form
34483 -55804097 -35307695 8823909 44607188 73552732 104124134 110972295 67256355
34476 67256355 -430369 -35631580 -28304270 -27366800 -67320159 -115385135 -113970387 -56547907
34468 -56547907 7118219 37600447 48602707 70880073 97419762 93443956 52689701
34461 52689701 9694830 -8869804 -10721269 -3394811 26320569 71071761 84478614
34454 84478614 52392246 45213355 128242483 240605779 252406064 147400302 51624822
34447 51624822 47331349 57919646 -14458818 -123169072 -148569375 -81353214 -24618416
34440 -24618416 -36416924 -75626102 -98126959 -103871174 -81577479 -9677703 66660167
34433 66660167 61269291 -15853110 -48092834 11904613 58165258 -3792126 -102385884
$$ packed form
34483e5804097K0496402M4131604L5783279K8945544L0571402O848161m3715940
34476F7256355o7686724l5201211P327310R37470l9953359m8064976J414748N7422480
34468e6547907O3666126L0482228J1002260K2277366K6539689l975806m0754255
34461E2689701m2994871j8564634j851465P326458K9715380M4751192J3406853
34454H4478614l2086368p178891Q3029128J12363296J1800285j05005762r5775480
34447E1624822m293473J0588297p2378464j08710254k5400303O7216161N6734798
34440b4618416j1798508l9209178k2500857n744215K2293695P1899776P6337870
34433F6660167n390876p7122401l2239724N9997447M6260645o1957384r8593758
$$ plain form
34426 -102385884 -110418656 -39235568 -5431896 -44300860 -78067548 -59532007 -31904729
34419 -31904729 -29939657 -21629377 17689238 52192405 47000906 22799010 10639236
34412 10639236 1345429 -21324692 -35815647 -11424809 39892110 71536513 52574835
34405 52574835 -5045122 -61132273 -85338269 -88502998 -106329431 -140904224 -146372787
34398 -146372787 -101261255 -59541553 -79116138 -129007421 -132741333 -82342133 -32710305
34391 -32710305 3156410 61623659 128142597 129580197 54630443 -9282617 364022
34384 364022 41772420 54844878 44721052 30223266 -7605798 -63014929 -70098738
34377 -70098738 -3216628 56991588 36391655 -19499373 -29335588 -7017842 -10085531
$$ packed form
34426a02385884q032772P1183088L3803672l8868964l3766688J8535541K7627278
34419c1904729J965072Q310280L9318615L4503167n191499k4201896j2159774
34412A0639236r293807k2670121j4490955K4390838N1316919L1644403j8961678
34405E2574835n7619957n6087151k4205996l164729j7826433l4574793n468563
34398a46372787M5111532M1719702j9574585m9891283l733912N0399200M9631828
34391c2710305L5866715N8467249O6518938J437600p4949754o3913060R646639
34384C64022M1408398J3072458j0123826j4497786l7829064n5409131p083809
34377g0098738O6882110O0208216k0599933n5891028r836215K2317746l067689
$$ plain form
34370 -10085531 -16578373 29036520 87377806 69329320 -6913266 -30557119 27260112
34363 27260112 74485593 51212472 7449979 -2874179 -319309 -11089161 -13548907
34356 -13548907 786481 -2471751 -23453901 -4175523 67074008 108660814 63375500
34349 63375500 -10708945 -32962521 -14698702 -8491687 -8605395 12396180 21648778 -22138029
34341 -22138029 -69939585 -37303884 55664615 97114019 41560422 -32714293 -42731744
34334 -42731744 283584 40430548 59325771 67720013 62276115 35961847 7621691
34327 7621691 6770803 39152868 84518890 117744892 125659985 118654899 126375620 160076378
34319 160076378 182554390 149227651 81314782 53904680 92979478 128199113 84331622
$$ packed form
34370a0085531o492842M5614893N8341286j8048486p6242586k3643853N7817231
34363B7260112M7225481k3273121m3762493j0324158K554870j0769852k459746
34356a3548907J4335388l258232k0982150J9278378P1249531M1586806m5285314
34349F3375500p4084445k2253576J8263819O207015j13708K1001575R252598m3786807
34341b2138029m7801556L2635701R2968499M1449404n5553597p4274715j0017451
34334d2731744M3015328M0146964J8895223Q394242n443898k6314268k8340156
34327G621691q50888L2382065M5366022L3226002P915093p005086P720721L3700758
34319A60076378K2478012l3326739o7912869k7410102L9074798L5219635m3867491
$$ plain form
34312 84331622 -11429991 -59550770 -12991882 71865749 109818727 74488129 2645903
34305 2645903 -55555902 -72106951 -50235636 -20270131 -13846901 -24834286 -8969484
34298 -8969484 57445345 131574117 146491504 96925420 49972819 61132375 109373017
34291 109373017 133822578 110046773 64080879 27854022 11211560 11986736 25790075
34284 25790075 43126717 54109377 55339468 41639032 4744451 -41081867 -52745800
34277 -52745800 -11991927 30243102 10075681 -53289236 -73215762 -18494713 37580761
34270 37580761 21074056 -41499254 -72828976 -57552532 -46401327 -64315059 -74456140
34263 -74456140 -40475786 20673998 64025146 65501637 33023790 -7397230 -24284747
$$ packed form
34312H4331622r5761613m8120779M6558888Q4857631L7952978l5330598p1842226
34305B645903n8201805j6551049K1871315K9965505O423230j0987385J5864802
34298h969484O6414829P4128772J4917387m9566084m6952601J1159556M8240642
34291A09373017K4449561k3775805m5965894l6226857j6642462P75176J3803339
34284B5790075J7336642J0982660J230091j3700436l6894581m5826318j1663933
34277e2745800M0753873M2235029k0167421o3364917j9926526N4721049N6075474
34270C7580761j6506705o2573310l1329722J5276444J1151205j7913732j0141081
34263g4456140L3980354O1149784M3351148J476491l2477847m0421020j6887517
$$ plain form
34256 -24284747 449490 50081626 82459812 73864154 47347908 47116657 85658230
34249 85658230 123185893 105851937 27781228 -51959896 -68939598 -29067500 -2529644
34242 -2529644 -33261850 -81464302 -81194070 -34259742 -7280260 -37613480 -83009959
34235 -83009959 -82232772 -36303545 681179 385419 -4452486 24567859 65596285 58534364
34227 58534364 -6953087 -61927880 -42825005 20202413 43670819 10144824 -9144217
34220 -9144217 35087692 95054021 100429728 61749093 43039394 59285874 65930687
34213 65930687 43277083 28465841 52571333 96143919 122889022 116815023 74189100
34206 74189100 1347853 -65077769 -79980738 -50242203 -28838254 -29641134 -3172907
$$ packed form
34256b4284747K4734237M9632136L2378186q595658k6516246k31251L8541573
34249H5658230L7527663j7333956p8070709p9741124j6979702L9872098K6537856
34242b529644l0732206m8202452K70232M6934328K6979482l0333220m5396479
34235h3009959P77187M5929227L6984724k95760m837905K9020345M1028426p061921
34227E8534364o5487451n4974793J9102875O3027418K3468406l3525995j9289041
34220i144217M4231909N9966329N375707l8680635j8709699J6246480O644813
34213F5930687k2653604j4811242K4105492M3572586K6745103o073999m2625923
34206G4189100p2841247o6425622j4902969K9738535K1403949q02880K6468227
$$ plain form
34199 -3172907 70380233 125847312 107051744 61801672 64835215 84493756 25491674
34192 25491674 -104574954 -179738763 -133193089 -50811635 -32226170 -43749798 6614538
34185 6614538 105016434 145092040 88220584 13560924 -4521473 13876242 19266080
34178 19266080 18930280 46172553 86126591 90089426 48778622 3696059 -14393979
34171 -14393979 -21955022 -48199124 -87772011 -103665437 -71953595 -13980375 23065012
34164 23065012 21111065 17025044 57065043 130032539 171605054 142768423 78899251
34157 78899251 43992473 54722953 70968411 51620185 379881 -41996658 -41162054
34150 -41162054 -7495781 7925257 -33539521 -109117456 -156465311 -146071941 -108217620
$$ packed form
34199c172907P3553140N5467079j8795568m5250072L033543J9658541n9002082
34192B5491674j30066628p5163809M6545674Q2381454J8585465j1523628N0364336
34185F614538R8401896M0075606n6871456p4659660j8082397J8397715N389838
34178A9266080l35800K7242273L9954038L962835m1310804m5082563j8090038
34171a4393979p561043k6244102l9572887j5893426L1711842N7973220L7045387
34164B3065012j953947m086021M0039999P2967496M1572515k8836631o3869172
34157G8899251l4906778J0730480J6245458j9348226n1240304m2376539Q34604
34150d1162054L3666273J5421038m1464778p5577935m7347855J0393370L7854321
$$ plain form
34143 -108217620 -81958386 -66336132 -38516373 3600387 37586619 42428983 18642927
34136 18642927 -3982711 16808869 82243872 124259541 79873030 -8093196 -33642452
34129 -33642452 15126216 28417596 -52899969 -131225525 -98652328 -8951174 8003411
34122 8003411 -49372524 -65122830 -2443986 43091294 4893752 -56186129 -56000044
34115 -56000044 -296366 51360240 67107010 50334718 19790217 6264682 20354855
34108 20354855 19896489 -29494083 -72839334 -34320551 38802873 18878223 -97262035
34101 -97262035 -158715109 -84469242 16861825 28267943 -3201752 17799126 58459138
34094 58459138 30949141 -37736111 -51255049 -10312144 2214610 -27393475 -35937058
$$ packed form
34143a08217620K6259234J5622254K7819759M2116760L3986232M842364k3786056
34136A8642927k2625638K0791580O5435003M2015669m4386511q7966226k5549256
34129c3642452M8768668J3291380q1317565p8325556L2573197Q9701154J6954585
34122H003411n7375935j5750306O2678844M5535280l8197542o1079881J86085
34115e6000044N5703678N1656606J5746770j6772292l0544501j3525535J4090173
34108B0354855m58366m9390572m3345251L8518783P3123424j9924650j16140258
34101i7262035o1453074P4245867J01331067J1406118l1469695K1000878M0660012
34094E8459138k7509997o8685252j3518938M0942905J2526754k9608085q543583
$$ plain form
34087 -35937058 -11157828 -6028045 -28368002 -26004975 15026434 54861182 80165924
34080 80165924 104759544 98034898 18127068 -85519215 -115582673 -81125333 -90065228
34073 -90065228 -165585016 -194846447 -108660315 4219615 33906347 4129541 3960784
34066 3960784 37408128 38048716 -5367975 -30400145 -2853706 32154603 17199519
34059 17199519 -37653320 -64994077 -24142185 41018894 50275802 -5774613 -48786153
34052 -48786153 -26723568 10024946 -1361258 -27637304 -2615775 49849358 60990894
34045 60990894 49195344 80622255 117003189 51563633 -91760615 -152535690 -69847297
34038 -69847297 29894568 45421059 44661544 101545004 139245490 69341701 -33765323
$$ packed form
34087c5937058K4779230N129783k2339957K363027M1031409L9834748K5304742
34080H0165924K4593620o724646p9907830j03646283l0063458L4457340q939895
34073i0065228p5519788k9261431Q6186132J12879930K9686732k9776806j68757
34066C960784L3447344O40588m3416691k5032170K7546439L5008309j4955084
34059A7199519n4852839k7340757M0851892O5161079R256908n6050415m3011540
34052d8786153K2062585L6748514j1386204k6276046K5021529N2465133J1141536
34045F0990894j1795550L1426911L6380934o5439556j43324248o0775075Q2688393
34038f9847297R9741865J5526491p59515N6883460L7700486o9903789j03107024
$$ plain form
34031 -33765323 -48811355 -5719389 -11084033 -49966549 -30817840 21336246 -5114581
34024 -5114581 -101730933 -136695144 -69679270 -9097812 -23368614 -45199270 -15459353
34017 -15459353 13251856 -13423887 -51785745 -48014671 -31857658 -42015461 -38274781
34010 -38274781 24772966 97501001 97412335 32324656 -17095674 -9946537 29272787 73407955
34002 73407955 110870781 113695814 55039937 -36927877 -94316214 -87326040 -48993238
33995 -48993238 -19177898 -1909850 13678204 25622642 30095898 36955058 54956407
33988 54956407 72976500 72506411 55762447 48424695 69067278 100467768 99550970 40851595
33980 40851595 -51680170 -120738610 -126105436 -81729010 -44060474 -57271912 -103428979
$$ packed form
34031c3765323j5046032M3091966n364644l8882516J9148709N2154086k6450827
34024e114581r6616352l4964211O7015874O0581458j4270802k1830656K9739917
34017a5459353K8711209k6675743l8361858L771074J6157013j0157803L740680
34010c8274781O3047747P2728035q8666o5087679m9420330P149137L9219324M4135168
34002G3407955L7462826K825033n8655877r1967814n7388337O990174L8332802
33995d8993238K9815340J7268048J5588054J1944438M473256O859160J8001349
33988E4956407J8020093m70089j6743964p337752K0642583L1400490r16798n8699375
33980D0851595r2531765o9058440n366826M4376426L7668536j3211438m6157067
$$ plain form
33973 -103428979 -116650359 -60589650 21314110 58477574 42231819 19677666 5566816
33966 5566816 -36311816 -107616341 -142312587 -102253202 -43117981 -25956969 -19655274
33959 -19655274 32774526 97992361 95689681 30263243 -19630979 -29774539 -45669319
33952 -45669319 -71201709 -54843853 -6280954 -11783404 -89798994 -138347930 -88846498
33945 -88846498 -16992209 -22986045 -82594958 -106508898 -83297457 -67165925 -69857242
33938 -69857242 -61496510 -48800062 -60425353 -73702727 -41310044 23302199 66918125
33931 66918125 85992043 110165311 112330413 34896860 -91151041 -154934980 -115849881
33924 -115849881 -53212281 -36385296 -37041445 -15082120 -3296302 -39434114 -81795939
$$ packed form
33973a03428979j3221380N6060709Q1903760L7163464j6245755k2554153j4110850
33966E566816m1878632p1304525l4696246M0059385N9135221J7161012O301695
33959a9655274N2429800O5217835k302680o5426438m9894222j0143560j5894780
33952d5669319k5532390J6357856M8562899n502450p8015590m8548936M9501432
33945h8846498P1854289n993836n9608913k3913940K3211441J6131532k691317
33938f9857242Q360732J2696448j1625291j3277374L2392683O4612243M3615926
33931F6918125J9073918K4173268K165102p7433553j26047901o3783939L9085099
33924a15849881O2637600J6826985o56149K1959325J1785818l6137812m2361825
$$ plain form
33917 -81795939 -68417581 -15297155 15642969 13056431 12335106 20972471 17160738 9242944
33909 9242944 29269914 68036116 76394299 39462201 -772306 -8577880 2899795
33902 2899795 5376132 -7336728 -33122361 -77955129 -133560002 -160922279 -123245096
33895 -123245096 -31179044 58386013 88988851 49724567 -19713772 -67781453 -76765017
33888 -76765017 -64646100 -44249791 -4000224 58627640 112106425 126787397 115545310
33881 115545310 106434196 92846022 50206234 -10949864 -54222201 -73249183 -89256284
33874 -89256284 -94573548 -56766402 7970295 25233489 -41869874 -133034080 -163303303
33867 -163303303 -120917687 -59004374 -22102018 -18208083 -37352065 -58682825 -56024782
$$ packed form
33917h1795939J3378358N3120426L0940124k586538p21325Q637365l811733p917794
33909I242944K0026970L8766202Q358183l6932098m0234507p805574J1477675
33902B899795K476337j2712860k5785633m4832768n5604873k7362277L7677183
33895a23245096R2066052Q9565057L0602838l9264284o9438339m8067681q983564
33888g6765017J2118917K0396309M0249567O2627864N3478785J4680972j1242087
33881A15545310r111114j3588174m2639788o1156098m3272337j9026982j6007101
33874h9256284n317264L7807146O4736697J7263194o7103363r1164206l0269223
33867a63303303M2385616O1913313L6902356L893935j9143982k1330760K658043
$$ plain form
33860 -56024782 -28130992 -7227468 -12822492 -20637274 -3802210 24045425 38188068
33853 38188068 43534730 48759858 33726038 -11809941 -49930248 -47778632 -37033005
33846 -37033005 -59362320 -85499189 -65792662 -35793222 -75421073 -166701163 -194781085
33839 -194781085 -110953773 1864147 60052792 81176680 105819321 109858749 67809053
33832 67809053 28536701 40071971 53190111 -5652665 -99262010 -114868041 -24443708
33825 -24443708 78104729 106506252 73577246 37408937 21379432 15406786 11557958
33818 11557958 10157190 14204436 29305643 49624517 47289914 3761242 -53279456
33811 -53279456 -75793501 -53192300 -13290737 24166540 56657700 71114020 52931548
$$ packed form
33860e6024782K7893790K0903524n595024p814782J6835064K7847635J4142643
33853C8188068N346662N225128j5033820m5535979l8120307K151616J0745627
33846c7033005k2329315k6136869J9706527K9999440l9627851r1280090k8079922
33839a94781085Q3827312J12817920N8188645K1123888K4642641M039428m2049696
33832F7809053l9272352J1535270J3118140n8842776r3609345j5606031R0424333
33825b4443708J02548437K8401523l2929006l6168309j6029505n972646l848828
33818A1557958j400768M047246J5101207K0318874k334603m3528672n7040698
33811e3279456k2514045K2601201L9901563L7457277L2491160J4456320j8182472
$$ plain form
33804 52931548 21618845 13704070 29151374 36747625 30621449 33397199 42827546 29710267
33796 29710267 -2973552 -14595491 5086916 18650694 12199540 25947856 82385141
33789 82385141 136935210 140004508 104495320 70964590 45113838 12354487 -21377020
33782 -21377020 -47216791 -78069178 -110751695 -99467664 -22478653 54304651 44954383
33775 44954383 -40373300 -109125508 -107108453 -62336819 -11914733 43922072 100125630
33768 100125630 125387775 112969569 101308900 109833205 99026265 35695524 -36892200
33761 -36892200 -42968809 27432388 106302819 128611739 92135319 38311328 3555064
33754 3555064 -3990699 972543 603366 -5963424 -3802442 12797589 27541361 23878642
$$ packed form
33804E2931548l1312703p914775J5447304P596251o126176K775750R430347j3117279
33796B9710267l2683819j1621939J9682407J3563778o451154J3748316N6437285
33789H2385141N4550069L069298l5509188l3530730k5850752l2759351l3731507
33782b1377020k5839771l0852387l2682517J1284031P6989011P6783304r350268
33775D4954383q5327683o8752208K017055M4771634N0422086N5836805N6203558
33768A00125630K5262145j2418206j1660669Q524305j0806940o3330741p2587724
33761c6892200o076609P0401197P8870431K2308920l6476420n3823991l4756264
33754C555064p545763M963242l69177o566790K160982J6600031J4743772l662719
$$ plain form
33746 23878642 6887556 -9443151 -22483794 -31452528 -23723074 4030304 23219770
33739 23219770 3850633 -37327004 -53954318 -36041944 -19505220 -21003896 -9851131
33732 -9851131 27175396 37455738 -27777528 -117378912 -119164751 -4196695 123735962
33725 123735962 152238970 91880333 41011314 47033632 61655545 36123668 1245489
33718 1245489 15284165 66674514 82295652 30371697 -34030616 -46263237 -16454651
33711 -16454651 -500623 -10869511 -5575396 35505699 73437548 69532348 43432293
33704 43432293 40142543 63186428 75135305 52586939 9558454 -28071322 -45318187
33697 -45318187 -39840316 -23861871 -19242715 -30811015 -34933590 -16234290 1721387
$$ packed form
33746B3878642j6991086j6330707j3040643q968734P729454K7753378J9189466
33739B3219770j9369137m1177637j6627314J7912374J6536724j498676J1152765
33732i851131L7026527J0280342o5233266q9601384j785839J14968056J27932657
33725A23735962K8503008o0358637n0869019O022318J4621913k5531877l4878179
33718A245489J4038676N1390349J5621138n1923955o4402313j2232621K9808586
33711a6454651J5954028j0368888N294115M1081095L7931849l905200k6100055
33704D3432293l289750K3043885J1948877k2548366m3028485l7629776j7246865
33697d5318187N477871J5978445M619156j1568300m122575J8699300J7955677
$$ plain form
33690 1721387 -5875754 -14795333 16088857 71630489 90906619 52747368 -404613
33683 -404613 -30946130 -43452159 -39301157 4966480 81534158 126219520 92934014
33676 92934014 16061077 -40070216 -58840284 -60967555 -54498347 -40571820 -37274603
33669 -37274603 -50517781 -48636451 -12599534 16584749 -8915404 -69450275 -109967791
33662 -109967791 -119786032 -121321256 -106639268 -57992885 -13705033 -29999433 -78111209
33655 -78111209 -65471520 23852039 91540419 60294213 -23705133 -65682042 -41624206
33648 -41624206 4581039 37454752 51621685 45186281 17520253 -17095622 -39057281
33641 -39057281 -35334953 4054194 71148829 115636592 82617981 -3839730 -43700599
$$ packed form
33690A721387p597141q919579L0884190N5541632J9276130l8159251n3151981
33683d04613l0541517j2506029M151002M4267637P6567678M4685362l3285506
33676I2934014p6872937n6131293j8770068k127271O469208J3926527L297217
33669c7274603j3243178J881330L6036917K9184283k5500153o0534871m0517516
33662a09967791r818241j535224J4681988M8646383M4287852j6294400m8111776
33655g8111209J2639689Q9323559O7688380l1246206q3999346m1976909K4057836
33648d1624206M6205245L2873713J4166933o435404k7666028l4615875k1961659
33641c9057281L722328L9389147O7094635M4487763l3018611q6457711l9860869
$$ plain form
33634 -43700599 17805473 114072010 143430478 95007658 39500231 21054452 15191636
33627 15191636 -9982330 -38407937 -26455994 41556987 127741536 169967550 143571952
33620 143571952 88060944 52573352 27280883 -28828836 -98402332 -109340075 -46031737
33613 -46031737 12142367 2579625 -34698053 -36351844 -19367290 -32147889 -50243130
33606 -50243130 -11307194 68135374 101489836 57453557 -2669223 -22279680 -12972455
33599 -12972455 -5184591 -1129989 -1474029 -24235314 -68562452 -99927215 -92763734 -54769066
33591 -54769066 -1047502 54339095 77627366 42841332 -5390227 20240668 127271212
33584 127271212 207490196 168659226 54101084 -22115143 -20171669 7869325 20711097
$$ packed form
33634d3700599O1506072R6266537K9358468m8422820n5507427j8445779n862816
33627A5191636k5173966k8425607J1951943O8012981Q6184549M2226014k6395598
33620A43571952n5511008l5487592k5292469n6109719o9573496j0937743O3308338
33613d6031737N8174104r562742l7277678j653791J6984554j2780599j8095241
33606e0243130L8935936P9442568L3354462m4036279o0122780j9610457R307225
33599a2972455P787864M054602l44040k2761285m4327138l1364763P163481L7994668
33591e4769066N3721564N5386597K3288271l4786034m8231559K5630895J07030544
33584A27271212Q0218984l8830970j14558142p6216227J943474K8040994J2841772
$$ plain form
33577 20711097 36060344 71397195 95985273 69211676 -2257902 -67913930 -83019411
33570 -83019411 -46875048 -847298 9747438 -20007474 -49927699 -40001154 8432268
33563 8432268 65077093 108776321 134428268 133742268 96539478 33927777 -19602326
33556 -19602326 -35589400 -16335220 9395452 9747819 -23855905 -62952068 -62340126 -8374643
33548 -8374643 58752659 85432982 61163924 19181850 -10180763 -23403825 -26226522
33541 -26226522 -22224918 -23505462 -42416710 -59705731 -30981068 50603659 121472425
33534 121472425 112195787 36283943 -20525891 -2758784 53901708 74758761 32256445
33527 32256445 -37565983 -83565693 -80978318 -37420415 16078502 42332731 28405350
$$ packed form
33577B0711097J5349247L5336851K4588078k6773597p1469578o5656028j5105481
33570h3019411L6144363M6027750J0594736k9754912k9920225R926545M8433422
33563H432268N6644825M3699228K5651947o86000l7202790o2611701n3530103
33556a9602326j5987074J9254180K5730672L52367l3603724l9096163O11942N3965483
33548h374643O7127302K6680323k4269058m1982074k9362613j3223062k822697
33541b6226522M001604j280544j8911248j7289021K8724663Q1584727P0868766
33534A21472425r276638p5911844n6809834J7767107N6660492K0857053m2502316
33527C2256445o9822428m5999710K587375M3557903N3498917K6254229j3927381
$$ plain form
33520 28405350 2006880 2162607 32231059 56807417 45845941 6293261 -30075899
33513 -30075899 -32273627 15007209 94700402 148248812 115777852 8931712 -80730006
33506 -80730006 -77456001 -10106078 29522287 7253694 -18860209 8988853 66764307
33499 66764307 87251422 49526242 -7127339 -43495939 -55843159 -52699413 -33285563
33492 -33285563 -1429548 25280001 35666398 35778699 28999899 9501599 -9333663
33485 -9333663 8076771 62280237 88181164 32842065 -52312156 -63333375 7574969
33478 7574969 50216400 -5438114 -83920484 -78810368 -11582051 12883760 -24863636
33471 -24863636 -39662485 9073823 55558042 47483097 32442396 65679184 107074468
$$ packed form
33520B8405350k6398470J55727L0068452K4576358j0961476l9552680l6369160
33513c0075899k197728M7280836P9693193N3548410l2470960j06846140q9661718
33506h0730006L274005O7349923L9628365k2268593k6113903K7849062N7775454
33499F6764307K0487115l7725180n6653581l6368600j2347220L143746J9413850
33492c3285563L1856015K6709549J0386397J12301o778800j9498300j8835262
33485i333663J7410434N4203466K5900927n5339099q5154221j1021219P0908344
33478G574969M2641431n5654514p8482370N110116O7228317K4465811l7747396
33471b4863636j4798849M8736308M6484219q074945j5040701L3236788M1395284
$$ plain form
33464 107074468 87297291 26519766 3470288 32186267 50825403 25770051 -8958287
33457 -8958287 -24195737 -39263039 -69944365 -86956650 -59694391 -7945893 20002944
33450 20002944 2403309 -41059123 -73476585 -68014231 -26045444 24089172 57752407
33443 57752407 79713319 101083563 103514483 63588456 8391173 -3018160 33921478
33436 33921478 52985140 16351331 -18636052 18874306 98253987 118445779 47860977
33429 47860977 -29519060 -26639930 37281451 75548145 52258738 17084834 27658737
33422 27658737 79170261 127446309 153135104 171715460 188842043 182086744 140670163
33415 140670163 95278813 79094454 73119019 28408312 -54025880 -106169401 -79481480
$$ packed form
33464A07074468j9777177o0777525k3049478K8715979J8639136k5055352l4728338
33457h958287j5237450j5067302l0681326j7012285K7262259N1748498K7948837
33450B0002944j7599635m3462432l2417462N462354M1968787N0134616L3663235
33443E7752407K1960912K1370244K430920l9926027n5197283j1409333L6939638
33436C3921478J9063662l6633809l4987383L7510358P9379681K0191792p0584802
33429D7860977p7380037K879130O3921381L8266694k3289407l5173904J0573903
33422B7658737N1511524M8276048K5688795J8580356J7126583o755299m1416581
33415A40670163m5391350j6184359n975435m4710707q2434192n2143521K6687921
$$ plain form
33408 -79481480 -16425404 3820187 -26080334 -37082415 10259747 69314843 82458401
33401 82458401 64860409 65672551 77582844 49206739 -20357568 -68033974 -62628381
33394 -62628381 -49819415 -69688299 -89121044 -65689900 -27981413 -26540036 -41256723
33387 -41256723 -15303196 37570181 44461564 -6337830 -39432435 -5720453 53065846
33380 53065846 80457867 75932857 56813080 19872487 -16110584 1829187 75307167
33373 75307167 119120452 75104100 4741029 -4281323 28571382 22372092 -28300512
33366 -28300512 -59550188 -55561512 -56608948 -59151091 -14281642 65063751 99109837
33359 99109837 68570275 49618575 84727448 112118784 76135718 22219598 14146721
$$ packed form
33408g9481480O3056076K0245591k9900521j1002081M7342162N9055096J3143558
33401H2458401j7597992Q12142J1910293k8376105o9564307m7676406N405593
33394f2628381J2808966j9868884j9432745K3431144L7708487J441377j4716687
33387d1256723K5953527N2873377O891383n0799394l3094605L3711982N8786299
33380E3065846K7392021m525010j9119777l6940593l5983071J7939771P3477980
33373G5307167M3813285m4016352p0363071r022352L2852705o199290n0672604
33366b8300512l1249676L988676j047436k542143M4869449P9345393L4046086
33359I9109837l0539562j8951700L5108873K7391336l5983066n3916120q072877
$$ plain form
33352 14146721 28633181 11703782 -15931963 1608145 45784025 44583707 -9271838
33345 -9271838 -44752044 -21758593 19063011 32277830 31165368 47597911 75220356
33338 75220356 86074581 75927188 64889526 68848776 88800317 115857918 134828725
33331 134828725 135152842 125006326 119055164 109218550 73368900 23798930 13835307 66311046
33323 66311046 121020389 99813390 17132154 -27266824 20300571 95335925 108751754
33316 108751754 67299890 45023556 64098428 76680514 60768835 56754912 88367179
33309 88367179 117977081 116601720 114851855 136637453 140681680 89618728 29261055
33302 29261055 27593277 70070060 90071065 75337566 64008207 55569664 14266406
$$ packed form
33352A4146721J4486460j6929399k7635745J7540108M4175880j200318n3855545
33345i271838l5480206K2993451M0821604J3214819j112462J6432543K7622445
33338G5220356J0854225j0147393j1037662L959250J9951541K7057601J8970807
33331A34828725L24117j0146516n951162r836614l5849650m9569970r963623N2475739
33323F6311046N4709343k1206999q2681236m4398978M7567395P5035354J3415829
33316A08751754m1451864k2276334J9074872J2582086j5911679m013923L1612267
33309H8367179K9609902j375361j749865K1785598M044227n1062952o0357673
33302B9261055j667778M2476783K0001005j4733499j1329359q438543m1303258
$$ plain form
33295 14266406 -45385286 -65720882 -43167357 -31929249 -40736037 -15670093 54106167
33288 54106167 104063097 98684734 81291170 82857806 69495492 27889919 14006639
33281 14006639 54433566 81308648 38885720 -18833357 -18589717 10765182 -333778
33274 -333778 -34724283 -24352281 24742763 48016968 42051220 67071417 135854126
33267 135854126 193141982 208856118 207757077 200424298 165409158 111696670 83724891
33260 83724891 88232692 83712723 56822280 42225870 50521714 44858249 13035644 -470943
33252 -470943 35851492 92190480 126089315 131547760 116298628 79340041 37212327
33245 37212327 27140543 57081324 91554351 106156810 112922397 115084968 89583735
$$ packed form
33295A4266406n9651692k0335596K2553525J1238108q806788K5065944O9776260
33288E4106167M9956930n378363j7393564J566636j3362314m1605573j3883280
33281A4006639M0426927K6875082m2422928n7719077K43640K9354899j1098960
33274c33778l4390505J0372002M9095044K3274205n965748K5020197O8782709
33267A35854126N7287856J5714136j099041p332779l5015140n3712488k7971779
33260H3724891M507801m519969k6890443j4596410Q295844n663465l1822605j3506587
33252d70943L6322435N6338988L3898835N458445j5249132l6958587m2127714
33245C7212327j0071784K9940781L4473027J4602459O765587K162571k5501233
$$ plain form
33238 89583735 41125306 21447101 58495222 109311790 119945558 95499039 77087058
33231 77087058 84011680 109691657 139561172 144758420 99337720 35275236 32140833
33224 32140833 108444700 171168377 132606567 39896481 16142992 89901538 158824724
33217 158824724 131968353 45668578 8365885 65727666 153809642 179609636 128101117
33210 128101117 75077476 89432169 144580748 160196018 118492708 82028187 89095610
33203 89095610 100699049 81733134 63375855 73999100 78124146 54518057 66716106
33196 66716106 158738129 236874807 181125826 46325304 9044441 107667936 185047199
33189 185047199 132919145 45365415 44961047 87859169 65592786 4426217 14879562
$$ packed form
33238H9583735m8458429j9678205L7048121N0816568J0633768k4446519j8411981
33231G7087058O924622K5679977K9869515N197248m5420700o4062484l134403
33224C2140833P6303867O2723677l8561810r2710086k3753489P3758546O8923186
33217A58824724k6856371q6299775l7302693N7361781Q8081976K5799994n1508519
33210A28101117n3023641J4354693N5148579J5615270m1703310l6464521P067423
33203H9095610J1603439j8965915j8357279J0623245M125046k3606089J2198049
33196F6716106R2022023P8136678n5748981j34800522l7280863R8623495P7379263
33189A85047199n2128054q7553730m04368M2898122k2266383o1166569J0453345
$$ plain form
33182 14879562 93807807 128229925 85581273 60235078 112054211 181163686 200277579
33175 200277579 186053838 170947744 138123263 83533473 62267324 103920809 145771174
33168 145771174 122073565 68067864 61765566 105642430 143987826 164080803 195859036
33161 195859036 229135462 216245332 156496522 102118459 73327513 37383904 -16440602
33154 -16440602 -49414383 -40540904 -18615981 -2826625 29108648 82482600 111100031
33147 111100031 82343093 34028124 25060074 61911152 109322501 141809745 149079865
33140 149079865 121813070 71692759 41037283 55078916 85485777 94637887 92633428
33133 92633428 113155760 152589022 172081977 148510613 93335863 35006376 6791871
$$ packed form
33182A4879562P8928245L4422118m2648652k5346195N1819133O9109475J9113893
33175B00277579j4223741j5106094l2824481n4589790k1266149M1653485M1850365
33168A45771174k3697609n4005701o302298M3876864L8345396K0092977L1778233
33161A95859036L3276426j2890130n9748810n4378063k8790946l5943609n3824506
33154a6440602l2973781Q873479K1924923J5789356L1935273N3373952K8617431
33147A11100031k8756938m8314969q968050L6851078M7411349L2487244P270120
33140A49079865k7266795n0120311l0655476J4041633L0406861R152110k004459
33133I2633428K0522332L9433262J9492955k3571364n5174750n8329487k8214505
$$ plain form
33126 6791871 28542477 72880759 79135370 34501262 6107454 47929111 113766615
33119 113766615 124534544 92051373 98858751 167277137 230857553 241379654 222369274
33112 222369274 194976748 131318768 25312977 -55815217 -50332829 8295490 38094745
33105 38094745 20382060 10821502 49597562 109450139 138061627 119084012 82415016
33098 82415016 72929737 112842640 180580730 223953923 204258528 131361103 54708955
33091 54708955 23469154 53770732 122215522 184075355 205259043 184971265 149028465
33084 149028465 124645471 124103195 142861034 162552078 162859102 141826417 117745955
33077 117745955 103009247 90057851 73545049 64543520 64894273 54506156 32427445
$$ packed form
33126F791871K1750606M4338282O254611m4634108k8393808M1821657O5837504
33119A13766615J0767929l2483171O807378O8418386O3580416J0522101j9010380
33112B22369274k7392526o3657980j06005791q1128194N482388N8628319K9799255
33105C8094745j7712685r560558L8776060N9852577K8611488j8977615l6668996
33098H2415016r485279L9912903O7738090M3373193j9695395p2897425p6652148
33091E4708955l1239801L0301578O8444790O1859833K1183688k0287778l5942800
33084A49028465k4382994n42276J8757839J9691044L07024k1032685k4080462
33077A17745955j4736708j2951396j6512802r001529L50753j0388117k2078711
$$ plain form
33070 32427445 41351002 109325735 190897453 217805945 191889781 169965053 167523512
33063 167523512 145544953 95186908 62520179 69192611 75548671 53623220 38196341
33056 38196341 67534016 121441816 155687394 157418387 134897854 94988827 62026407
33049 62026407 73230972 121603144 151288071 144691481 157542196 221306721 273806352
33042 273806352 255550541 221979626 272621238 398512365 489294447 481093097 414687260
33035 414687260 348784880 297506606 266120912 273750079 314211468 349834149 365390006
33028 365390006 380110112 393215617 371967696 312346579 257726507 233476602 214126043
33021 214126043 182465688 169735086 200730215 243154474 252608762 232600555 210238206
$$ packed form
33070C2427445Q923557O7974733Q1571718K6908492k5916164k1924728k441541
33063A67523512k1978559n0358045l2666729O672432O356060k1925451j5426879
33056C8196341K9337675N3907800L4245578J730993k2520533l9909027l2962420
33049F2026407J1204565M8372172K9684927o596590J2850715O3764525N2499631
33042B73806352j8255811l3570915N0641612J25891127R0782082q201350o6405837
33035D14687260o5902380n1278274l1385694P629167M0461389L5622681J5555857
33028C65390006J4720106J3105505k1247921n9621117n4620072k4249905j9350559
33021B14126043l1660355j2730602L0995129M2424259R454288k0008207k2362349
$$ plain form
33014 210238206 186243707 153378462 134352481 149185564 164152422 128790068 57621511
33007 57621511 21541803 52305296 103589539 120835569 106308521 91943241 85505846
33000 85505846 78468798 82719162 118300540 172328406 207565899 213452941 213170840 211574324
32992 211574324 175633873 92858009 16945598 13532976 75247976 133613286 148644215
32985 148644215 139125885 123301931 88585560 42281534 33983110 82733934 126727497
32978 126727497 102719583 44757637 38061471 89764061 116833209 67399944 -12750390
32971 -12750390 -54254018 -46043624 -14372539 27795460 69970065 81984597 49492476
32964 49492476 9485719 9254802 44774079 76410750 92212520 115014009 150876115
$$ packed form
33014B10238206k3994499l2865245j9025981J4833083J4966858l5362354p1168557
33007E7621511l6079708L0763493N1284243J7246030j4527048j4365280o437395
33000H5505846p037048M250364L5581378N4027866L5237493N887042k82101j596516
32992B11574324l5940451q2775864p5912411l412622O1715000N8365310J5030929
32985A48644215r518330j5823954l4716371m6304026q298424M8750824M3993563
32978A26727497k4007914n7961946o696166N1702590K7069148m9433265q0150334
32971a2750390m1503628Q210394L1671085M2167999M2174605J2014532l2492121
32964D9492476m0006757k30917L5519277L1636671J5801770K2801489L5862106
$$ plain form
32957 150876115 170886208 153736156 117584873 95768173 97529152 103116876 87523495
32950 87523495 43536406 -10724414 -44626236 -41544672 -12119969 22829961 54929007
32943 54929007 85316699 110424731 127409479 146452791 177519446 208216827 216379073
32936 216379073 203560061 191141990 180999570 151854396 108244372 98647292 152686531
32929 152686531 222962077 232600399 175610391 126543209 142636933 198437470 236902854
32922 236902854 243854871 235220091 203154271 128899341 38834959 -8312911 982768
32915 982768 19089728 16400271 28563070 92018894 172737882 206710472 188389142
32908 188389142 167575904 166966038 155262608 109879487 59836337 45136945 66441177
$$ packed form
32957A50876115K0010093j7150052l6151283k1816700J760979N587724j5593381
32950H7523495m3987089n4260820l3901822L081564K9424703L4949930L2099046
32943E4929007L0387692K5108032J6984748J9043312L1066655L0697381Q162246
32936B16379073j2819012j2418071j0142420k9145174m3610024r597080N4039239
32929A52686531P0275546R638322n6990008m9067182J6093724N5800537L8465384
32922B36902854O952017q634780l2065820p4254930r0064382m7147870R295679
32915I82768J8106960k689457J2162799O3455824Q0718988L3972590j8321330
32908A88389142k0813238o09866j1703430m5383121n0043150j4699392K1304232
$$ plain form
32901 66441177 98295394 126855302 149539701 157510641 147787306 142193146 165173707
32894 165173707 203664550 213531469 172285726 109335470 76531583 97457250 148199324
32887 148199324 179207648 156318430 92994236 44278310 54716534 108165281 145877002
32880 145877002 140758469 129695252 153907145 193190904 196169133 161245952 138658393
32873 138658393 150034307 159621152 144580607 139141914 170064041 195768835 165133330
32866 165133330 103165346 75244737 89800564 106027689 121278536 167526695 221828441
32859 221828441 213895502 146505124 117100931 175297133 242535189 233305623 179670909
32852 179670909 157869850 155241880 105187759 14917450 -39424024 -27772966 10547979
$$ packed form
32901F6441177L1854217K8559908K2684399P970940r723335n594160K2980561
32894A65173707L8490843R866919m1245743o2950256l2803887K0925667N0742074
32887A48199324L1008324k2889218o3324194m8715926J0438224N3448747L7711721
32880A45877002n118533j1063217K4211893L9283759K978229l4923181k2587559
32873A38658393J1375914R586845j5040545n438693L0922127K5704794l0635505
32866A65133330o1967984k7920609J4555827J6227125J5250847M6248159N4301746
32859B21828441p932939o7390378k9404193N8196202O7238056r229566n3634714
32852A79670909k1801059k627970n0054121r0270309n4341474J1651058L8320945
$$ plain form
32845 10547979 46430758 79546544 86085018 37417900 -25846061 -26330016 32080052
32838 32080052 65498958 47349644 52641143 129720152 214793573 227345522 179756566
32831 179756566 133672178 106883880 85846744 82440000 112903561 152387176 166465050
32824 166465050 161252096 156350884 141254104 107516596 88759901 111502413 136066357
32817 136066357 108895300 52210952 36893249 78285802 123023442 136154191 139287342
32810 139287342 155205013 170033446 166439071 152668121 143983000 146651328 166724127
32803 166724127 203635139 232327012 224052244 187395480 157925236 148700302 144550888
32796 144550888 140607746 144698774 142049749 105238867 47504469 18987710 35658131
$$ packed form
32845A0547979L5882779L3115786O538474m8667118o3263961m83955N8410068
32838C2080052L3418906j8149314N291499P7079009Q5073421J2551949m7588956
32831A79756566m6084388k6788298k1037136l406744L0463561L9483615J4077874
32824A66465050n212954m901212j5096780l3737508j8756695K2742512K4563944
32817A36066357k7171057n6684348j5317703M1392553M4737640J3130749L133151
32810A39287342J5917671J4828433l594375j3770950q685121K668328K0072799
32803A66724127L6911012K8691873q274768l6656764k9470244r224934m149414
32796A44550888l943142M091028k649025l6810882n7734398k8516759J6670421
$$ plain form
32789 35658131 58147319 59715026 65661963 94813506 109439647 70473920 10464865
32782 10464865 -2509192 39924982 78217485 72161645 51243674 64595066 114312197
32775 114312197 159210440 165314285 132765188 83318539 40257371 19055310 22442245
32768 22442245 38230928 48734172 48559226 49968504 65392065 88839266 104301191
32761 104301191 110720030 124003844 149811726 170367777 169398786 155850747 147220722
32754 147220722 142080062 129697355 117041763 120077882 131342559 124350436 95323206
32747 95323206 75841201 94263467 142644634 187827106 196417253 147559931 52302948
32740 52302948 -27266215 -13870513 98967979 219347194 250653468 199301648 152390549
$$ packed form
32789C5658131K2489188J567707N946937K9151543J4626141l8965727o0009055
32782A0464865j2974057M2434174L8292503o055840k0917971J3351392M9717131
32775A14312197M4898243O103845l2549097m9446649m3061168k1202061L386935
32768B2442245J5788683J0503244j74946J409278J5423561K3447201J5461925
32761A04301191O418839J3283814K5807882K0556051r68991j3548039q630025
32754A47220722n140660j2382707j2655592L036119J1264677o992123k9027230
32747I5323206j9482005J8422266M8381167M5182472Q590147m8857322r5256983
32740E2302948p9569163J3395702J12838492J20379215L1306274n1351820m6911099
$$ plain form
32733 152390549 157977847 175147149 150458907 95052454 56625261 50119267 56719989
32726 56719989 72375192 112185163 168645273 206265591 206960320 188106634 164683747
32719 164683747 127739709 79286392 54240645 75979377 115241864 129657043 124092577
32712 124092577 129139232 135820932 107614042 56680584 45213003 89882298 123072090
32705 123072090 88310389 27470254 21132378 74153040 119160471 116864757 91539080
32698 91539080 69226061 42890425 14752426 19333576 74279039 145131124 188602003
32691 188602003 202311731 204923601 196985722 176056726 165874409 187404965 213631708
32684 213631708 198038490 146342895 115800830 134705532 164242247 159019343 129021531
$$ packed form
32733A52390549N587298J7169302k4688242n5406453l8427193o505994O600722
32726E6719989J5655203L9809971N6460110L7620318O94729j8853686k3422887
32719A64683747l6944038m8453317k5045747K1738732L9262487J4415179n564466
32712A24092577N046655O681700k8206890n0933458j1467581M4669295L3189792
32705A23072090l4761701o0840135o337876N3020662M5007431k295714k5325677
32698I1539080k2313019k6335636k8137999M581150N4945463P0852085M3470879
32691A88602003J3709728K611870p937879k0928996j0182317K1530556K6226743
32684B13631708j5593218n1695595l0542065J8904702K9536715n222904k9997812
$$ plain form
32677 129021531 114055111 125817753 148793753 176892437 210681342 231529317 219758777
32670 219758777 193278993 186532456 192225416 171336965 128746405 125276554 188823602
32663 188823602 260808831 268627768 214905971 155017131 119333556 103430368 106216242
32656 106216242 125037684 133561235 117012612 109651814 140826501 165790407 120975286
32649 120975286 34821857 1364514 42125296 81271305 72468581 58312899 72660978
32642 72660978 78056142 52341654 50521676 110388859 169106582 152576606 88351965
32635 88351965 48554025 36064829 18362475 25133929 104341935 208896869 238890850
32628 238890850 190540708 158318012 184718730 211874413 199957016 190258862 212510409
$$ packed form
32677A29021531j4966420J1762642K2976000K8098684L3788905K0847975j1770540
32670B19758777k6479784o746537N692960k0888451m2590560l469851O3547048
32663A88823602P1985229P818937n3721797n9888840l5683575j5903188K785874
32656A06216242J8821442Q523551j6548623p360798L1174687K4963906m4815121
32649A20975286q6153429l3457343M0760782L9146009q802724j4155682J4348079
32642G2660978N395164k5714488j819978N9867183N8717723j6529976o4224641
32635H8351965l9797940j2489196j7702354O771454P9208006J04554934K9993981
32628B38890850m8350142l2222696K6400718K7155683j1917397r698154K2251547
$$ plain form
32621 212510409 220494635 174163542 117073149 115092497 165811079 216690033 235412500
32614 235412500 223080381 190476713 153750291 126782740 99147214 53660585 14656277
32607 14656277 33043446 110746891 190880087 236613825 261688409 267410887 222351042
32600 222351042 137735700 89576554 116445329 158806105 153272063 125828235 131287145
32593 131287145 160018512 176354391 197185099 251279949 301165030 290430025 238952869
32586 238952869 207157469 192366216 151223470 104257068 114621257 164747040 161916255
32579 161916255 87545345 39008775 82445636 155026439 170536079 145179761 146170922
32572 146170922 171559373 164551350 121323915 105930926 155680558 229094767 261766228
$$ packed form
32621B12510409P984226m6331093n7090393j980652N0718582N0878954J8722467
32614B35412500j2332119l2603668l6726422k6967551k7635526m5486629l9004308
32607A4656277J8387169P7703445Q0133196M5733738K5074584N722478m5059845
32600B22351042q4615342m8159146K6868775M2360776n534042k7443828N458910
32593A31287145K8731367J6335879K0830708N4094850M9885081j0735005n1477156
32586B38952869l1795400j4791253m1142746m6966402J0364189N0125783k830785
32579A61916255p4370910m8536570M3436861P2580803J5509640k5356318R91161
32572A46170922K5388451p008023m3227435j5392989M9749632P3414209L2671461
$$ plain form
32565 261766228 238118081 194699888 173649840 182249356 189965766 166471991 124982661
32558 124982661 111724995 142875186 176028719 166810723 131905208 122154484 146424719
32551 146424719 163701037 151547778 140067954 161241196 198921755 216923940 214862494
32544 214862494 223815017 255848590 288790280 300570245 291166091 266997764 230980512
32537 230980512 196609550 184306229 189258726 179713592 146455193 124734253 138018065
32530 138018065 149851139 116905104 69932699 83600322 166590422 240593342 243063963
32523 243063963 196628575 152458844 117686938 78449487 52979474 70930733 120721856
32516 120721856 160939042 172846426 169161504 164937811 170256112 195247636 230099077
$$ packed form
32565B61766228k3648147m3418193k1050048Q599516P716410k3493775m1489330
32558A24982661j3257666L1150191L3153533r217996l4905515r750724K4270235
32551A46424719J7276318j2153259j1479824K1173242L7680559J8002185k061446
32544B14862494Q952523L2033573L2941690J1779965r404154k4168327l6017252
32537B30980512l4370962j2303321M952497r545134l3258399k1720940J3283812
32530A38018065J1833074l2946035m6972405J3667623Q2990100P4002920K470621
32523B43063963m6435388m4169731l4771906l9237451k5470013J7951259M9791123
32516A20721856M0217186J1907384l684922m223693N318301K4991524L4851441
$$ plain form
32509 230099077 236742044 194762302 139274918 116391593 118200866 105743782 82382275
32502 82382275 89749628 130207250 149077693 112321887 58056952 44123265 73673711
32495 73673711 100041844 89424215 56730014 44743981 78386138 136967590 173113053
32488 173113053 166948633 152776148 173938052 218611089 227698261 170078004 85008107
32481 85008107 38125285 52116629 94904595 127572575 147161818 174577515 208448467
32474 208448467 215085332 180422548 147596965 162528636 195324719 175304326 108365206
32467 108365206 83959782 134627270 171564573 124423701 69548057 120678652 242575387
32460 242575387 293149400 234318661 176453092 198637976 243728923 234140728 188683581
$$ packed form
32509B30099077O642967m1979742n5487384k2883325J809273j2457084k3361507
32502H2382275P367353M0457622J8870443l6755806n4264935j3933687K9550446
32495G3673711K6368133j0617629l2694201j1986033L3642157N8581452L6145463
32488A73113053o164420j4172485K1161904M4673037R087172n7620257q5069897
32481H5008107m6882822J3991344M2787966L2667980J9589243K7415697L3870952
32474B08448467O636865l4662784l2825583J4931671L2796083k0020393o6939120
32467A08365206k4405424N0667488L6937303m7140872n4875644N1130595J21896735
32460B42575387N0574013n8830739n7865569K2184884M5090947r588195m5457147
$$ plain form
32453 188683581 163873900 161048022 156526847 156891686 161272979 131518479 66153664 42276827
32445 42276827 106142064 176856345 150576190 61083858 35916427 112938165 204155589
32438 204155589 239402647 239755671 229483235 181770658 100437015 63611597 113509993
32431 113509993 170500827 141680870 67622849 62282392 127877493 142145257 50781188
32424 50781188 -36033579 -5351843 82889449 82406865 -19480648 -86609210 -41844180
32417 -41844180 29320785 31380404 9499073 57113170 145128760 160306945 87267158
32410 87267158 35566271 77189806 160033552 209888630 225697364 231921469 219518397
32403 219518397 189530222 185402804 219643036 227601689 161168559 76918634 58637436
$$ packed form
32453A88683581k4809681k825878m521175L64839M381293k9754500o5364815k3876837
32445D2276827O3865237P0714281k6280155q9492332k5167431P7021738R1217424
32438B04155589L5247058L53024j0272436m7712577q1333643l6825418M9898396
32431A13509993N6990834k8819957p4058021n340457O5595101J4267764r1364069
32424E0781188q6814767L0681736Q8241292m82584j01887513o7128562M4765030
32417d1844180P1164965K059619k1881331M7614097Q8015590J5178185p3039787
32410H7267158n1700887M1623535Q2843746M9855078J5808734O224105j2403072
32403B19518397k9988175m127418L4240232P958653o6433130q4249925j8281198
$$ plain form
32396 58637436 96324390 120094273 115354807 115486763 109207984 58668328 2748341 33169242
32388 33169242 146728453 221654596 182897392 104725954 93690624 143056684 171842956
32381 171842956 151399558 114862559 77609292 30999171 1387256 37004978 127735728
32374 127735728 198875120 199935024 153681453 107004231 79904624 76518528 98025652
32367 98025652 120773245 103878406 47573472 7571855 20821838 53121069 57251068
32360 57251068 46822793 62799148 95394387 100809688 82233642 89148651 134761402
32353 134761402 175891255 183912717 175067920 156879325 110710291 52668428 42854687
32346 42854687 93324504 131431284 106669321 72295543 95123026 140734818 131342651
$$ packed form
32396E8637436L7686954K3769883m739466J31956o278779n0539656n5919987L0420901
32388C3169242J13559211P4926143l8757204p8171438j1035330M9366060K8786272
32381A71842956k0443398l6536999l7253267m6610121k9611915L5617722R0730750
32374A27735728P1139392J059904m6253571m6677222k7099607l386096K1507124
32367I8025652K2747593j6894839n6304934m0001617J3249983L2299231M129999
32360E7251068j0428275J5976355L2595239N415301j8576046O915009M5612751
32353A34761402M1129853Q021462q844797j8188595m6169034n8041863r813741
32346D2854687N0469817L8106780k4761963l4373778K2827483M5611792r392167
$$ plain form
32339 131342651 75922660 49076898 65136468 71982759 61768465 86094500 149284401
32332 149284401 181825272 147396916 95026062 75010195 77886943 86845213 114617077
32325 114617077 151127568 147553474 95382260 52705215 47615297 27280806 -42573977
32318 -42573977 -98366139 -68091481 17331311 75911010 91789768 106000869 127489736
32311 127489736 130154254 114677784 103721988 93465080 70761939 57629414 78100461
32304 78100461 102316377 86436361 49108078 44072470 73309986 94070458 99880774
32297 99880774 124424989 167648447 185980859 163450782 134102496 123332168 116980436
32290 116980436 99841102 83510333 85944081 112547809 156925971 196815553 203823383
$$ packed form
32339A31342651n5419991k6845762J6059570O846291j0214294K4326035O3189901
32332A49284401L2540871l4428356n2370854k0015867K876748Q958270K7771864
32325A14617077L6510491l574094n2171214m2677045n089918k0334491o9854783
32318d2573977n5792162L0274658Q5422792N8579699J5878758J4211101K1488867
32311A27489736K664518j5476470j0955796j0256908k2703141j3132525K0471047
32304G8100461K4215916j5880016l7328283n035608K9237516K0760472N810316
32297I9880774K4544215M3223458J8332412k2530077k9348286j0770328o351732
32290A16980436j7139334j6330769K433748K6603728M4378162L9889582P007830
$$ plain form
32283 203823383 182292566 171082743 176900908 149727911 71495771 16667916 52547943
32276 52547943 124566313 130733044 77262181 57233394 92235228 107593563 67837105
32269 67837105 25479032 16386251 12607020 7602985 44750167 121894216 167433970
32262 167433970 160255777 176391371 255629266 315564853 277214004 195847230 173616463
32255 173616463 202039686 192774134 129992796 90711399 119048439 164963871 162981719
32248 162981719 114262739 71224966 72495711 104667744 116976276 79920321 31339147
32241 31339147 36152022 93681705 129697277 100303041 51858768 44055246 67006272
32234 67006272 82864803 99801530 140967116 176638408 159150389 106219026 79750695
$$ packed form
32283B03823383k1530817j1209823N818165k7172997p8232140n4827855L5880027
32276E2547943P2018370O166731n3470863k0028787L5001834J5358335l9756458
32269F7837105m2358073r092781l779231n004035L7147182P7144049M5539754
32262A67433970p178193J6135594P9237895N9935587l8350849q1366774k2230767
32255A73616463K8423223r265552o2781338l9281397K8337040M5915432j982152
32248A62981719m8718980m3037773J270745L2172033J2308532l7055955m8581174
32241C1339147M812875N7529683L6015572k9394236m8444273p803522K2951026
32234F7006272J5858531J6936727M1165586L5671292j7488019n2931363k6468331
$$ plain form
32227 79750695 88166737 75360726 12256955 -58013027 -80967769 -52605301 -5038271
32220 -5038271 34008471 51136814 44247799 26952468 21015828 34384455 55126434
32213 55126434 67623996 65231265 50229420 31917312 21636280 22083231 25766071 26145940
32205 26145940 21158939 8120625 -7745026 -3966843 32965558 73533051 72801828 36356825
32197 36356825 17185647 36156838 53340672 39718713 26678519 47688597 74261592
32190 74261592 57213495 2975209 -36914140 -33876789 -1560820 36460912 64568706
32183 64568706 76067860 84509937 116069686 166153337 188037480 152837083 95893110
32176 95893110 73581663 97122643 136420882 163789907 167517842 150870254 142910855
$$ packed form
32227G9750695Q416042j2806011o3103771p0269982k2954742K8362468M7567030
32220e038271L9046742J7128343o889015j7295331n936640J3368627K0741979
32213E5126434J2497562k392731j5001845j8312108j0281032M46951L682840L79869
32205B6145940m987001j3038314j5865651L778183L6932401M0567493p31223l6445003
32197C6356825j9171178J8971191J7183834j3621959j3040194K1010078K6572995
32190G4261592j7048097n4238286l9889349L037351L2315969L8021732K8107794
32183F4568706J1499154Q442077L1559749N0083651K1884143l5200397n6943973
32176I5893110k2311447K3540980L9298239K7369025L727935j6647588p959399
$$ plain form
32169 142910855 176864804 234343181 254941311 227850673 214964280 240539998 226751447
32162 226751447 110455555 -32442715 -69759898 13220428 113405255 161924580 182314242
32155 182314242 202499576 203266998 172045226 133565371 105395655 78775379 53673577
32148 53673577 39902154 22442375 -16597792 -45239625 -17939228 37242252 45474669
32141 45474669 7262793 9115088 87522887 165017627 164259389 115298223 95804530
32134 95804530 118079141 132017890 105645982 53581372 7110114 -8797906 12720341
32127 12720341 48603326 67152573 73611586 103102213 157307949 189928016 173596488
32120 173596488 138515268 121169633 116083793 104586197 91092240 82014276 66600662
$$ packed form
32169A42910855L3953949N7478377K0598130k7090638j2886393K5575718j3788551
32162B26751447j16295892j42898270l7317183Q2980326J00184827M8519325K0389662
32155A82314242K0185334P67422l1221772l8479855k8169716k6620276k5101802
32148E3673577j3771423j7459779l9040167k8641833K7300397N5181480Q232417
32141D5474669l8211876J852295P8407799P7494740p58238m8961166j9493693
32134I5804530K2274611J3938749k6371908n2064610m6471258j5908020K1518247
32127A2720341L5882985J8549247O459013K9490627N4205736L2620067j6331528
32120A73596488l5081220j7345635n085840j1497596j3493957r077964j5413614
$$ plain form
32113 66600662 48013659 55770751 95576430 122662325 99703643 51225461 28800559
32106 28800559 49684719 95637895 140489059 154583947 120596259 72600082 75531057
32099 75531057 132995416 165972138 127253685 82372852 112552707 182798367 188236247
32092 188236247 107459405 24671512 4315788 24588933 44234386 59423565 72573099
32085 72573099 71494376 68985029 104336849 171059328 197699581 143906107 68508255
32078 68508255 50657601 82413074 101054766 98932420 123122098 168151273 152054967
32071 152054967 34423129 -101806264 -139057433 -62708079 40276843 97525620 109452748
32064 109452748 99838494 73313500 42249312 43708840 90871545 136242892 120939402
$$ packed form
32113F6600662j8587003P757092L9805679K7085895k2958682m8478182k2424902
32106B8800559K0884160M5953176M4851164J4094888l3987688m7996177K930975
32099G5531057N7464359L2976722l8718453m4880833L0179855P0245660N437880
32092A88236247q0776842q2787893k0355724K0273145J9645453J5189179J3149534
32085G2573099j078723k509347L5351820O6722479K6640253n3793474p5397852
32078F8508255j7850654L1755473J8641692k122346K4189678M5029175j6096306
32071A52054967j17631838j36229393l7251169P6349354J02984922N7248777J1927128
32064A09452748r614254k6524994l1064188J459528M7162705M5371347j5303490
$$ plain form
32057 120939402 47796087 -21820075 -33316522 19647790 102742088 164561444 165783562
32050 165783562 112309475 53484941 28421056 25690459 14375704 -5101773 -9685665
32043 -9685665 3619783 17436136 26252137 37104771 46373480 46559804 48400657 66432274
32035 66432274 89900505 95025297 76524069 44389572 8940333 -6506639 28584964
32028 28584964 95822666 117727276 58892238 -2876092 19998454 85754342 82528290
32021 82528290 6829175 -29572080 22371957 80477401 73018445 38896923 33903112
32014 33903112 35934018 11567482 -6335119 17534259 48642319 48156222 47392876 81045392
32006 81045392 107554917 80550807 45574649 72761225 135034683 149520515 110513190
$$ packed form
32057A20939402p3143315o9616162j1496447N2964312Q3094298O1819356J222118
32050A65783562n3474087n8824534k5063885k730597j1314755j9477477m583892
32043i685665J3305448J3816353Q816001J0852634R268709J86324J840853J8031617
32035F6432274K3468231N124792j8501228l2134497l5449239j5446972L5091603
32028B8584964O7237702K1904610n8835038o1768330K2874546O5755888l226052
32021H2528290p5699115l6401255N1944037N8105444p458956l4121522m993811
32014C3903112K030906k4366536j7902601K3869378L1108060m86097p63346L3652516
32006H1045392K6509525k7004110l4976158K7186576O2273458J4485832l9007325
$$ plain form
31999 110513190 85820850 101429534 123700806 141786151 172617571 190976696 152023809
31992 152023809 87412082 82756926 144461784 181388713 143231344 87925608 76254452
31985 76254452 83633623 66251547 43936706 56972612 90231763 98767751 77468673
31978 77468673 57786103 57721983 71104194 86831119 92484679 79643264 64051773 75180322
31970 75180322 111580950 137230234 133921821 119649748 103271350 69192113 27741119
31963 27741119 26812494 78338612 121933815 105019475 57321953 38850697 52118307
31956 52118307 58975063 51976452 49339822 41827836 7851271 -29407637 -21489882 29074319
31948 29074319 67534637 67041561 58544877 70993837 90704453 97237849 96930042 98717037
$$ packed form
31999A10513190k4692340J5608684K2271272J8085345L0831420J8359125l8952887
31992A52023809o4611727m655156O1704858L6926929l8157369n5305736j1671156
31985G6254452P379171j7382076k2314841J3035906L3259151Q535988k1299078
31978G7468673j9682570o4120J3382211J5726925N653560j2841415j5591491J1128549
31970G5180322L6400628K5649284l308413j4272073j6378398l4079237m1450994
31963B7741119r28625N1526118M3595203j6914340m7697522j8471256J3267610
31956E2118307O856756o998611k636630p511986l3976565l7258908P917755N0564201
31948B9074319L8460318m93076q496684J2448960J9710616O533396l07807J786995
$$ plain form
31940 98717037 91411631 68817134 50542632 55357286 74119604 86878285 88073325
31933 88073325 79980949 60672171 33966215 14765931 12670388 27015718 62927502
31926 62927502 123396532 174841913 160000339 74431231 -3133441 1721074 63068137
31919 63068137 91988208 56546508 12329465 13284744 46615763 73519438 86327862
31912 86327862 93634602 84462312 47545976 7554496 3535720 37133893 73014422
31905 73014422 88662943 95713769 108833579 118309116 103549660 59151946 280318
31898 280318 -47007405 -56565143 -16445173 56466444 119881939 134189245 94188218
31891 94188218 35008766 1673613 6629044 22604272 26411502 36664709 81012127
$$ packed form
31940I8717037p305406k2594497j8274502M814654J8762318J2758681J195040
31933H8073325q092376j9308778k6705956j9200284k095543J4345330L5911784
31926F2927502O0469030N1445381j4841574q5569108p7564672M854515O1347063
31919F3068137K8920071l5441700m4217043R55279L3331019K6903675J2808424
31912H6327862P306740r172290l6916336l9991480m018776L3598173L5880529
31905G3014422J5648521P050826J3119810R475537j4759456m4397714n8871628
31898B80318m7287723r557738M0119970P2911617O3415495J4307306m0001027
31891I4188218n9179452l3335153M955431J5975228L807230J0253207M4347418
$$ plain form
31884 81012127 132428323 123723495 43339779 -28509549 -17773588 45135492 77536203
31877 77536203 69413928 85768884 145043128 172481008 108794539 7223035 -30227568
31870 -30227568 18284706 82095435 100866049 88186401 86273662 99071031 95296319
31863 95296319 60448706 20590184 10728501 31194154 46950409 32675883 8370618
31856 8370618 17018382 68543781 121656680 129191265 91969598 56574492 60954596 91583486
31848 91583486 102004347 71843896 33060326 25863108 42599614 42486821 16828859
31841 16828859 1677640 18172539 43753899 62761410 97537453 152425087 174486556
31834 174486556 126433408 61585270 56036295 89378163 72899189 -8743655 -67004127
$$ packed form
31884H1012127N1416196q704828q0383716p1849328J0735961O2909080L2400711
31877G7536203q122275J6354956N9274244K7437880o3686469j01571504l7450603
31870c0227568M8512274O3810729J8770614j2679648j912739J2797369l774712
31863I5296319l4847613l9858522r861683K0465653J5756255j4274526k4305265
31856H370618Q647764N1525399N3112899P534585l7221667l5395106M380104L0628890
31848I1583486J0420861l0160451l8783570p197218J6736506j12793k5657962
31841A6828859j5151219J6494899K5581360J9007511L4776043N4887634K2061469
31834A74486556m8053148o4848138n548975L3341868j6478974q1642844n8260472
$$ plain form
31827 -67004127 -35455876 46799392 102436009 104804681 74778533 46035766 57135599
31820 57135599 121280413 181582968 158534177 67303166 17198785 58209117 105130924
31813 105130924 70460325 -584418 -6558276 52770926 86472504 52763056 1670762
31806 1670762 -17074838 -12440480 -7741614 2641326 30893278 64494208 74372858 42981192
31798 42981192 -12817374 -42252724 -6706627 64779743 99079884 71568371 31489733
31791 31489733 17115161 5534918 -18289991 -11657862 46310899 87002471 44289800
31784 44289800 -30046068 -30256376 51745859 125073785 132570440 99616350 60477905
31777 60477905 22607470 6418862 38732068 94464882 115386473 97419431 91256897
$$ packed form
31827f7004127L1548251Q2255268N5636617K368672l0026148k8742767J1099833
31820E7135599O4144814O0302555k3048791r1231011n0104381M1010332M6921807
31813A05130924l4670599p1044743n973858N9329202L3701578l3709448n1092294
31806A670762j8745600M634358M698866J0382940K8251952L3600930R878650l1391666
31798D2981192n5798566k9435350L5546097P1486370L4300141k7511513m0078638
31791C1489733j4374572j1580243k3824909O632129N7968761M0691572m2712671
31784D4289800p4335868k10308Q2002235P3327926P496655l2954090l9138445
31777F0477905l7870435j6188608L2313206N5732814K0921591j7967042o162534
$$ plain form
31770 91256897 106510561 88905205 15686679 -52723000 -50218000 13154342 75348337
31763 75348337 92368493 63994694 19006709 -11807156 -26200038 -47673776 -73202852
31756 -73202852 -55029387 24530233 98149247 95588681 47357578 31506914 49470212
31749 49470212 48638615 43891569 100052623 193007649 212835227 133190809 60104494
31742 60104494 67290798 94392346 70584691 35775116 56956328 106585991 115255257
31735 115255257 87281154 77152337 92019017 95823365 80807739 67568328 57879599
31728 57879599 43500577 37587569 49690328 58105383 50550020 57208752 97614817 132952483
31720 132952483 121642338 85190409 65502440 53340742 17488391 -27947211 -48521104
$$ packed form
31770I1256897J5253664j7605356p3218526o8409679K505000O3372342O2193995
31763G5348337J7020156k8373799m4987985l0813865j4392882k1473738k5529076
31756g3202852J8173465P9559620P3619014k560566m8231103j5850664J7963298
31749D9470212q31597m747046N6161054R2955026J9827578p9644418p3086315
31742F0104494P186304K7101548k3807655l4809575K1181212M9629663Q669266
31735A15255257k7974103j0128817J4866680L804348j5015626j3239411r688729
31728E7879599j4379022n913008J2102759Q415055p555363O658732M0406065L5337666
31720A32952483j1310145l6451929j9687969j2161698l5852351m5435602k0573893
$$ plain form
31713 -48521104 -55940829 -84479438 -117250001 -99695537 -22214304 63947420 113091594
31706 113091594 125329896 122810849 120765731 119405154 101243642 49202803 -14693318
31699 -14693318 -35653438 5065563 59615048 77589461 61636450 31071036 -17076981
31692 -17076981 -66274242 -57117499 28008789 102963741 78717016 -5622883 -35406676
31685 -35406676 15721851 61447120 38467505 -18130661 -48329237 -42710985 -21170621
31678 -21170621 5928091 29863608 39776741 45507016 69093944 104000434 118653760
31671 118653760 106164431 92518562 89939430 81594890 60916367 48230503 56339002
31664 56339002 70784588 74674731 67098116 50481871 23301251 -10157620 -40490144
$$ packed form
31713d8521104p419725k8538609l2770563J7554464P7481233Q6161724M9144174
31706A13091594J2238302k519047k045118j360577j8161512n2040839o3896121
31699a4693318k0960120M0719001N4549485J7974413j5953011l0565414m8148017
31692a7076981m9197261R156743Q5126288P4954952k4246725q4339899k9783793
31685c5406676N1128527M5725269k2979615n6598166l0198576N618252K1540364
31678b1170621K7098712K3935517R913133N730275K3586928L4906490J4653326
31671A18653760j2489329j3645869k579132q344540k0678523j2685864Q108499
31664E6339002J4445586L890143p576615j6616245k7180620l3458871l0332524
$$ plain form
31657 -40490144 -60581736 -58223253 -17968484 47394122 89470246 79926902 52565621
31650 52565621 55096235 82492570 99079477 101269391 107318457 105549992 71017097 21994015
31642 21994015 1987745 11288449 10317821 -14608953 -40252325 -51017591 -41493912 8895729
31634 8895729 101125228 174110578 170719830 131217355 136164992 169376778 143356388
31627 143356388 63635877 42232928 112168339 156783652 94042822 15111997 38394470
31620 38394470 118432811 125552591 57693324 37002553 114067467 204543047 235227835
31613 235227835 241352535 278373364 323865840 323263921 278134827 234996467 217672608
31606 217672608 213249873 204567183 182590525 141484633 90172799 58221864 65419489
$$ packed form
31657d0490144k0091592K358483M0254769O5362606M2076124r543344k7361281
31650E2565621K530614K7396335J6586907K189914O049066j768465l4532895m9023082
31642B1994015k0006270R300704r70628k4926774k5643372j0765266R523679N0389641
31634H895729R2229499P2985350l390748l9502475M947637L3211786k6020390
31627A43356388p9720511k1402949O9935411M4615313o2740830p8930825K3282473
31620C8394470Q0038341P119780o7859267k0690771P7064914R0475580L0684788
31613B35227835O124700L7020829M5492476o01919m5129094m3138360j7323859
31606B17672608m422735q682690k1976658m1105892n1311834l1950935P197625
$$ plain form
31599 65419489 92654315 104499280 94407275 84556790 83562952 72047824 39835305
31592 39835305 12573892 18772515 44891402 53137074 41009692 48516800 93878984
31585 93878984 134070114 115634695 44391797 -23837066 -47512823 -26419110 20408384
31578 20408384 68829060 90671133 78453232 66748481 93305281 141519390 161037460
31571 161037460 144490110 136293900 156756229 167667696 133684552 72570482 18522709
31564 18522709 -22031281 -47669289 -37651844 8702136 43156997 25976500 -13434963
31557 -13434963 -20796753 899494 8066890 -198364 19823446 72779996 104692885
31550 104692885 89916704 79092410 119007000 168913821 153903411 80916551 38883335
$$ packed form
31599F5419489K7234826J1844965j0092005r850485r93838j1515128l2212519
31592C9835305k7261413O198623K6118887Q245672j2127382P507108M5362184
31585I3878984M0191130j8435419p1242898o8228863k3675757K1093713M6827494
31578B0408384M8420676K1842073j2217901j1704751K6556800M8214109J9518070
31571A61037460j6547350q196210K0462329J0911467l3983144o1114070n4047773
31564A8522709m0553990k5638008J0017445M6353980L4454861j7180497l9411463
31557a3434963p361790K1696247P167396q265254K0021810N2956550L1912889
31550A04692885j4776181j0824294L9914590M9906821j5010410p2986860m2033216
$$ plain form
31543 38883335 77610317 142623239 157347258 125573861 106495563 113464835 97756945
31536 97756945 37777168 -12159466 5832719 67779698 95807526 55817951 -10274823
31529 -10274823 -44824584 -33870036 -3927405 13707996 7782614 -7873437 -10171224
31522 -10171224 4929853 17770976 17287523 18705551 31399882 35019192 17688409 9468958
31514 9468958 32001426 40502835 -19006143 -106050597 -118510237 -40378593 26339884
31507 26339884 12261888 -18027842 22008004 94631259 95337119 25274568 4739404
31500 4739404 100425656 220400322 224972353 96952850 -45493861 -88048203 -32221783
31493 -32221783 33603586 43635194 11020695 -17325378 -27507679 -34744655 -33802053
$$ packed form
31543C8883335L8726982O5012922J4724019l1773397j9078298O969272j5707890
31536I7756945n9979777m9936634J7992185O1946979K8027828l9989575o6092774
31529a0274823l4549761J0954548K9942631J7635401n925382j5656051k297787
31522a0171224J5101077J2841123m83453J418028J2694331L619310j7330783q219451
31514I468958K2532468Q501409n9508978q7044454j2459640P8131644O6718477
31507B6339884j4077996l0289730M0035846P2623255P05860p0062551k0535164
31500D739404R5686252J19974666M572031j28019503j42446711m2554342N5826420
31493c2221783O5825369J0031608l2614499k8346073j0182301p236976R42602
$$ plain form
31486 -33802053 -228493 54730796 80075783 60147798 48687541 87917179 132212174
31479 132212174 110898021 46366364 38822664 124909831 215579773 206740484 106739457
31472 106739457 12022373 -15618625 1560658 21690469 43511674 79231155 102749939
31465 102749939 70138490 -8818841 -59601575 -27083769 52730908 97415060 83072862
31458 83072862 65388938 93258323 143356418 160801265 131754457 87052268 56774267
31451 56774267 50624765 64879734 77428478 50753108 -25209386 -100992845 -112893740
31444 -112893740 -58594870 3089480 26418563 20555593 15717896 21665659 29760907
31437 29760907 28921786 9420134 -26164753 -50778409 -39196428 -11298129 -13607674
$$ packed form
31486c3802053L3573560N4959289K5344987j9927985j1460257L9229638M4294995
31479A32212174k1314153o4531657p543700Q6087167R0669942q839289j00001027
31472A06739457r4717084k7640998J7179283K0129811K1821205L5719481K3518784
31465A02749939l2611449p8957331n0782734L2517806P9814677M4684152j4342198
31458H3072862j7683924K7869385N0098095J7444847k9046808m4702189l0278001
31451E6774267o149502J4254969J2548744k6675370p5962494p5783459j1900895
31444a12893740N4298870O1684350K3329083n862970m837697N947763Q095248
31437B9760907q39121j9501652l5584887k4613656J1581981K7898299k309545
$$ plain form
31430 -13607674 -45277325 -43504674 30146525 125784069 166868420 148322847 125393781
31423 125393781 121640596 104774102 56156006 8310229 -8361838 -11849466 -29432441
31416 -29432441 -44001651 -17643682 48027309 111544917 144563574 152519519 144418522
31409 144418522 115664200 70616651 35992179 34199148 55655039 70960038 64467515
31402 64467515 47373373 41330290 54366624 72452857 75929774 65007736 60643240
31395 60643240 74492743 91166629 93430855 89996712 96136372 100343479 82858513 60594179
31387 60594179 72073470 111036808 118656666 64313910 -1504373 -7486747 47487062
31380 47487062 96675654 87800866 34906871 -7714569 -1917745 43609348 86688386
$$ packed form
31430a3607674l1669651J772651P3651199R5637544M1084351j8545573k2929066
31423A25393781l753185j6866494m8618096m7845777j6672067l487628j7582975
31416b9432441j4569210K6357969O5670991O3517608L3018657P955945q100997
31409A44418522k8754322m5047549l4624472j793031K1455891J5304999o492523
31402F4467515j7094142o043083J3036334J8086233L476917j0922038m364496
31395F0643240J3849503J6673886K264226l434143O139660M207107j7484966k2264334
31387F0594179J1479291L8963338P619858n4342756o5818283n982374N4973809
31380D7487062M9188592q874788n2893995m2621440N796824M5527093M3079038
$$ plain form
31373 86688386 96199483 83629215 79681839 85602109 75200239 45694873 27315363
31366 27315363 28370716 12522398 -42332115 -99675361 -113298089 -90239395 -68817677
31359 -68817677 -61113897 -55002849 -48444212 -43181675 -28262333 -7838295 -17347480 -68827614
31351 -68827614 -110678552 -93809378 -48435138 -33343605 -34163847 13336041 109515700
31344 109515700 178219254 172435297 122777412 72654737 34491748 23749541 64743731
31337 64743731 135033553 164895173 124448543 62899137 35033838 36291814 36278437 28859227
31329 28859227 18861950 -55454 -25448729 -38290359 -36636423 -42982572 -62725825
31322 -62725825 -73852419 -71428571 -78670492 -97604382 -93359043 -46279224 20682809
$$ packed form
31373H6688386R511097j2570268l947376N920270j0401870k9505366j8379510
31366B7315363J055353j5848318n4854513n7343246j3622728K3058694K1421718
31359f8817677P703780O111048O558637N262537J4919342K0424038r509185n1480134
31351f8827614m1850938J6869174M5374240J5091533q20242M7499888R6179659
31344A09515700O8703554n783957m9657885n0122675l8162989j0742207M0994190
31337F4743731P0289822K9861620m0446630o1549406k7865299J257976j3377p419210
31329B8859227r997277j8917404k5393275j2841630J653936o346149j9743253
31322f2725825j1126594K423848p241921j8933890M245339M7079819O6962033
$$ plain form
31315 20682809 79220293 118105447 123755254 91338206 60318542 77257004 116544988
31308 116544988 109721266 63657285 63637521 134525121 190680754 164162600 93677861
31301 93677861 38306101 -5576247 -42682184 -28416023 44584021 96102121 78621927
31294 78621927 65380830 124980565 189999167 162474601 80099604 50502188 72393115
31287 72393115 57715857 -246916 -19375126 20464277 48906259 32624816 14537031
31280 14537031 16372845 12711167 14172448 66904230 149482269 175243563 123354993
31273 123354993 69847381 61516100 55629421 16721478 -20769100 -25189404 -18493408
31266 -18493408 -18002043 -7533283 1848466 -33314009 -99887853 -121447974 -77176898
$$ packed form
31315B0682809N8537484L8885154N649807l2417048l1019664J6938462L9287984
31308A16544988o823722m6063981j9764P0887600N6155633k6518154p0484739
31301I3677861n5371760m3882348l7105937J4266161P3000044N1518100j7480194
31294G8621927j3241097N9599735O5018602k7524566q2374997k9597416K1890927
31287G2393115j4677258n7962773j9128210L9839403K8441982j6281443j8087785
31280A4537031J835814l661678J461281N2731782Q2578039K5761294n1888570
31273A23354993n3507612q331281n886679l8907943l7490578m420304O695996
31266a8493408M91365J0468760R381749l5162475o6573844k1560121M4271076
$$ plain form
31259 -77176898 -36482091 -34511576 -13799687 53655308 89511491 33743526 -43224880
31252 -43224880 -45526723 3122143 16504558 -9880779 -12532908 22211119 49911377
31245 49911377 50696676 35570949 -3757197 -69392911 -107109983 -66005918 11971108
31238 11971108 45627799 37359971 51659208 87020306 75586611 16398362 -1559332
31231 -1559332 56561560 103708896 64230284 -4549285 2188600 81293122 130540510
31224 130540510 91629636 14952118 -19422144 6647511 48705265 55919963 13929535
31217 13929535 -46908249 -74721998 -41683188 26035730 75005428 84717710 85117217
31210 85117217 106277410 131329431 121924643 77129578 33596399 8178151 -19193295
$$ packed form
31259g7176898M0694807J970515K0711889O7454995L5856183n5767965p6968406
31252d3224880k301843M8648866J3382415k6385337k652129L4744027K7700258
31245D9911377P85299j5125727l9328146o5635714l7717072M1104065P7977026
31238A1971108L3656691q267828J4299237L5361098j1433695n9188249j7957694
31231a559332N8120892M7147336l9478612o8779569O737885P9104522M9247388
31224A30540510l8910874p6677518l4374262K6069655M2057754P214698m1990428
31217A3929535o0837784k7813749L3038810O7718918M8969698R712282L99507
31210H5117217K1160193K5052021r404788m4795065m3533179k5418248k7371446
$$ plain form
31203 -19193295 -51165490 -46474459 14902198 75242196 62076680 -9203104 -53860975
31196 -53860975 -33839694 6326040 25080257 37487938 59148740 61649598 27807272
31189 27807272 527505 23270648 67157937 72537908 39726054 23110876 46665289
31182 46665289 77389211 81676502 63278897 40124517 20890688 13868676 29250780
31175 29250780 60279819 81340143 73763001 41814105 1875257 -30891113 -44433863
31168 -44433863 -32565594 -2624871 23493251 20675086 -19430506 -73014654 -98947953
31161 -98947953 -84761972 -65590245 -71505316 -70784099 -9933272 93962397 158037365
31154 158037365 144422011 107685730 104824451 117781005 108661542 95695296 112101571
$$ packed form
31203a9193295l1972195M691031O1376657O0339998j3165516p1279784m4657871
31196e3860975K0021281M0165734J8754217J2407681K1660802K500858l3842326
31189B7807272k7279767K2743143M3887289N379971l2811854j6615178K3554413
31182D6665289L0723922M287291j8397605k3154380j9233829p022012J5382104
31175B9250780L1029039K1060324p577142l1948896l9938848l2766370j3542750
31168d4433863J1868269K9940723K6118122k818165m0105592n3584148k5933299
31161i8947953J4185981J9171727n915071P21217O0850827J03895669O4074968
31154A58037365j3615354l6736281k861279J2956554r119463j2966246J6406275
$$ plain form
31147 112101571 129805794 95280211 20071820 -32576638 -41197744 -41419893 -50220808
31140 -50220808 -38659760 9027154 62839809 91084978 97301510 99049708 101636389
31133 101636389 101759872 91231340 58675761 15874591 9497244 62945203 116758099
31126 116758099 84484527 -28395558 -120810865 -124691080 -76154473 -34228899 6423313
31119 6423313 74276041 143869669 164162009 139192756 119428374 120844064 108649570
31112 108649570 66506696 31162061 38308657 71360387 90134481 83894757 66122475
31105 66122475 35772558 -17828273 -75061646 -90671431 -50647225 8217071 53233713
31098 53233713 94895525 140967623 150260964 88488599 8140836 119922 63857646
$$ packed form
31147A12101571J7704223l4525583p5208391n2648458q621106k22149q800915
31140e0220808J1561048M7686914N3812655K8245169O216532J748198K586681
31133A01636389J23483j0528532l2555579m2801170o377347N3447959N3812896
31126A16758099l2273572j12880085r2415307l880215M8536607M1925574M0652212
31119F423313O7852728O9593628K0292340k4969253j9764382J415690j2194494
31112A08649570m2142874l5344635P146596L3051730J8774094o239724j7772282
31105F6122475l0349917n3600831n7233373j5609785M0024206N8864296M5016642
31098E3233713M1661812M6072098R293341o1772365q0347763q020914O3737724
$$ plain form
31091 63857646 100846585 57424854 -2799961 -6724794 25020685 40882955 52061566
31084 52061566 82020733 82394103 3947653 -84165251 -64562086 44657645 96619127
31077 96619127 28875164 -44899338 -7815420 94298881 135375824 86747912 26531537
31070 26531537 11699743 23228625 26178550 18786136 18053154 37061367 76836199 115755989
31062 115755989 118989286 82267855 48072351 53117194 81923279 100293386 107908046
31055 107908046 120548022 124089852 92878476 42829510 21434109 45686783 85514824
31048 85514824 108545612 110220051 100241005 87813582 80066324 71107377 38083868 -26180255
31040 -26180255 -85599202 -97480500 -69400610 -42619840 -22999427 25457829 108290140
$$ packed form
31091F3857646L6988939m3421731o0224815l924833L1745479J5862270J1178611
31084E2061566K9959167L73370p8446450q8112904J9603165J09219731N1961482
31077I6619127o7743963p3774502L7083918J02114301M1076943m8627912o0216375
31070B6531537j4831794J1528882K949925p392414p32982J9008213L9774832L8919790
31062A15755989L233297l6721431l4195504N044843K8806085J8370107P614660
31055A07908046J2639976L541830l1211376n0048966k1395401K4252674L9828041
31048H5514824K3030788J674439r979046j2427423p747258q958947l3023509o4264123
31040b6180255n9418947j1881298K8079890K6780770J9620413M8457256Q2832311
$$ plain form
31033 108290140 168394095 154353297 89372072 38518104 25977878 20311124 -3941221
31026 -3941221 -25759964 -11537850 32261116 62245579 51131650 20115403 9719772
31019 9719772 28680507 47470156 41820928 25222478 28748677 59986289 94588226
31012 94588226 103689742 79957348 40035322 9309924 1394357 6313973 1398031 -22874119
31004 -22874119 -52158211 -64307883 -49264392 -14696380 15590538 11255552 -34977769
30997 -34977769 -83421386 -80116164 -26851801 8673680 -25148793 -95989990 -131113359
30990 -131113359 -108523505 -67291450 -39127085 -14778205 16325305 33434619 12228150
30983 12228150 -35967092 -70402743 -59120814 -8455297 35329696 20276591 -55027921
$$ packed form
31033A08290140O0103955j4040798o4981225n0853968j2540226n666754k4252345
31026c941221k1818743J4222114M3798966K9984463j1113929l1016247j0395631
31019I719772J8960735J8789649n649228j6598450L526199L1237612L4601937
31012I4588226R101516k3732394l9922026l0725398p915567M919616m915942k4272150
31004b2874119k9284092j2149672J5043491L4568012L0286918m334986m6233321
30997c4977769m8443617L305222N3264363L5525481l3822473p0841197l5123369
30990a31113359K2589854M1232055K8164365K4348880L1103510J7109314k1206469
30983A2228150m8195242l4435651J1281929N0665517M3784993j5053105p5304512
$$ plain form
30976 -55027921 -124630627 -121038832 -55023385 2172294 14935949 17150060 37430354
30969 37430354 42407293 -6009639 -73306639 -86348263 -32925912 21637505 19336553
30962 19336553 -29775465 -78679077 -97305668 -80503850 -34393562 22470620 63429411
30955 63429411 77112640 72238580 50800170 2739303 -56323503 -75273016 -31152934
30948 -31152934 19883930 1788995 -78370089 -135201569 -117727186 -66819396 -39999998
30941 -39999998 -27996523 12571894 75458499 105301124 73621870 11619866 -34557724
30934 -34557724 -47283448 -32795777 -5656193 11132273 -5587647 -57124821 -119518240
30927 -119518240 -162959561 -164371512 -113768239 -34233615 15177160 -5291273 -57921770
$$ packed form
30976e5027921o9602706L591795O6015447N7195679J2763655K214111K0280294
30969C7430354M976939m8416932o7297000j3041624N3422351N4563417k300952
30962A9336553m9112018m8903612j8626591J6801818M6110288N6864182M0958791
30955F3429411J3683229m874060k1438410m8060867n9062806j8949513M4120082
30948c1152934N1036864j8094935q0159084n6831480J7474383N0907790K6819398
30941c9999998J2003475M0568417O2886605K9842625l1679254o2002004m6177590
30934c4557724j2725724J4487671K7139584J6788466j6719920n1537174o2393419
30927a19518240m3441321j411951N0603273P9534624M9410775k0468433n2630497
$$ plain form
30920 -57921770 -64841121 -9315528 44475519 46499203 25938661 31069513 49118052
30913 49118052 33354435 -16033049 -47256251 -24432217 37780794 101318081 135986762
30906 135986762 130846250 102900389 87997480 99215355 105853453 78367678 36676761
30899 36676761 21458170 34068726 44396863 46871021 64943138 103401352 137641748
30892 137641748 150280275 140636096 101451405 29500606 -41114516 -63616937 -42462609
30885 -42462609 -26929696 -34335591 -29464555 8126851 50104711 72316014 87779488
30878 87779488 99478656 74899017 7723996 -42136466 -19094386 50865321 98771119
30871 98771119 98700339 70729938 28671235 -21829636 -53373815 -39487611 1152631
$$ packed form
30920e7921770o919351N5525593N3791047K023684k0560542N130852J8048539
30913D9118052j5763617m9387484l1223202K2824034O2213011O3537287L4668681
30906A35986762n140512k7945861j4902909J1217875O638098k7485775m1690917
30899C6676761j5218591J2610556J0328137K474158J8072117L8458214L4240396
30892A37641748J2638527r644179l9184691p1950799p0615122k2502421K1154328
30885d2462609J5532913p405895M871036L7591406M1977860K2211303J5463474
30878H7779488J1699168k4579639o7175021m9860462K3042080O9959707M7905798
30871I8771119p0780k7970401m2058703n0500871l1544179J3886204M0640242
$$ plain form
30864 1152631 27739063 34950185 46134793 62676163 66927699 64817168 74574526 77463530
30856 77463530 32008391 -58235341 -136950558 -161186483 -136098093 -85070993 -30751007
30849 -30751007 -5398275 -27274041 -58796220 -40681665 20612238 54094117 28766784
$$ packed form
30864A152631K6586432P211122J1184608J6541370M251536k110531R757358K889004
30856G7463530m5455139r0243732p8715217k4235925K5088390N1027100N4319986
30849c0751007K5352732k1875766l1522179J8114555O1293903L3481879k5327333
$$ [...]
##END NTUPLES=NMR SPECTRUM
##END=
