##TITLE=31Pdec_AT-54
 CDCl3, 1024 sc
 1.11.2022
##JCAMPDX= 6.0         $$ Bruker NMR JCAMP-DX V2.0
##DATA TYPE= NMR SPECTRUM
##DATA CLASS= NTUPLES
##ORIGIN= UXNMR, Bruker Analytische Messtechnik GmbH
##OWNER= root
$$ XWIN-NMR		Version 3.5
$$ Fri Dec  2 13:38:58 2022 Russian Standard Time (UT+4h)  she@DPX200
##.OBSERVE FREQUENCY= 81.013821
##.OBSERVE NUCLEUS= ^31P
##.ACQUISITION MODE= SIMULTANEOUS
##.ACQUISITION SCHEME= undefined
##.AVERAGES= 37000
##.DIGITISER RES= 16
##SPECTROMETER/DATA SYSTEM= spect
##.PULSE SEQUENCE= zgpg30
##.SOLVENT NAME= CDCl3
##.SHIFT REFERENCE= (INTERNAL, CDCl3, 0, 248.564)
##AUDIT TRAIL= $$ (NUMBER, WHEN, WHO, WHERE, WHAT)
$$ ##TITLE= Audit trail, XWIN-NMR		Version 3.5
$$ ##JCAMPDX= 5.01
$$ ##ORIGIN= Bruker BioSpin GmbH
$$ ##OWNER= she
$$ F:/spectra/data/she/nmr/P31/1/pdata/1/auditp.txt
$$ ##AUDIT TRAIL=  $$ (NUMBER, WHEN, WHO, WHERE, WHAT)
(   1,<2022-12-02 07:45:37.20 +0400>,<she>,<DPX200>,
      <created by zg, POWCHK disabled, PULCHK disabled
       configuration hash MD5:
       00 E9 B6 7A A2 85 ED C7 34 08 36 98 17 FE 4E 26
       data hash MD5: 32K
       08 65 E5 31 1D CF D8 54 01 6B F6 6A 08 CD 99 18>)
(   2,<2022-12-02 13:37:19.67 +0400>,<she>,<DPX200>,
      <Start of raw data processing
       efp BC_mod = 2 LB = 1 FT_mod = 6 PKNL = 1 PHC0 = -10583.6 PHC1 = 25.05548 SI = 64K 
       data hash MD5: 64K
       AF 26 F4 32 5E B4 AB 51 D2 F4 AB 25 13 30 DD 85>)
(   3,<2022-12-02 13:37:54.75 +0400>,<she>,<DPX200>,
      <pk PHC0 = -87.57069 PHC1 = 186.4 
       data hash MD5: 64K
       EF 9B 5B E8 F3 D9 DE A2 29 CE D1 41 C0 8B BA 22>)
(   4,<2022-12-02 13:37:58.10 +0400>,<she>,<DPX200>,
      <abs ABSG = 5 
       data hash MD5: 64K
       A0 B0 CD 47 6E DB F6 5B 14 93 F8 AE C7 73 EC 21>)
$$ ##END=
$$ 
$$ hash MD5
$$ DB B7 6F 63 AF 40 7D CE CA C6 34 F6 2D 50 81 12
##$RELAX= 
##$RELAX= 
##$RELAX= 
##$RELAX= 
##$RELAX= 
##$RELAX= 
##$RELAX= 
##$RELAX= 
##$RELAX= 
$$ Bruker specific parameters
$$ --------------------------
##$DU= <F:/spectra>
##$EXPNO= 1
##$NAME= <P31>
##$PROCNO= 1
##$TYPE= <nmr>
##$USER= <she>
##$AMP= (0..31)
100 100 100 100 100 100 100 100 100 100 100 100 100 100 100 100 100 100 
100 100 100 100 100 100 100 100 100 100 100 100 100 100 
##$AQSEQ= 0
##$AQ_mod= 1
##$AUNM= <au_zg>
##$AUTOPOS= <>
##$BF1= 81.014009
##$BF2= 200.13
##$BF3= 200.13
##$BF4= 200.13
##$BF5= 200.13
##$BF6= 200.13
##$BF7= 200.13
##$BF8= 200.13
##$BYTORDA= 1
##$CFDGTYP= 0
##$CFRGTYP= 5
##$CHEMSTR= <none>
##$CNST= (0..31)
1 1 145 1 1 1 1 1 1 1 1 1 1 1 1 1 1 1 1 1 1 1 1 1 1 1 1 1 1 1 1 1 
##$CPDPRG= <waltz16>
##$CPDPRG1= <>
##$CPDPRG2= <waltz16>
##$CPDPRG3= <>
##$CPDPRG4= <mlev>
##$CPDPRG5= <mlev>
##$CPDPRG6= <mlev>
##$CPDPRG7= <mlev>
##$CPDPRG8= <mlev>
##$CPDPRGB= <>
##$CPDPRGT= <>
##$D= (0..31)
0 1 0 0 0 0 0 0 0 0 0 0.03 2e-05 3e-06 0 0 0 0 0 0 0 0 0 0 0 0 0 0 0 0 
0 0 
##$DATE= 1669898550
##$DBL= (0..7)
120 120 120 11 120 120 24 19 
##$DBP= (0..7)
150 150 150 150 150 150 150 150 
##$DBP07= 0
##$DBPNAM0= <>
##$DBPNAM1= <>
$$ [...]
##$SUBNAM3= <"">
##$SUBNAM4= <"">
##$SUBNAM5= <"">
##$SUBNAM6= <"">
##$SUBNAM7= <"">
##$SUBNAM8= <"">
##$SUBNAM9= <"">
##$SW= 501.771253377433
##$SWIBOX= (0..15)
0 1 3 0 0 0 0 0 0 0 0 0 0 0 0 0 
##$SW_h= 40650.406504065
##$TD= 32768
##$TD0= 1
##$TE= 0
##$TE2= 300
##$TE3= 300
##$TEG= 300
##$TL= (0..7)
0 120 53 12 22 120 120 120 
##$TP= (0..7)
150 150 150 150 150 150 150 150 
##$TP07= 0
##$TPNAME0= <>
##$TPNAME1= <>
##$TPNAME2= <>
##$TPNAME3= <>
##$TPNAME4= <>
##$TPNAME5= <>
##$TPNAME6= <>
##$TPNAME7= <>
##$TPOAL= (0..7)
0.5 0.5 0.5 0.5 0.5 0.5 0.5 0.5 
##$TPOFFS= (0..7)
0 0 0 0 0 0 0 0 
##$TUNHIN= 0
##$TUNHOUT= 0
##$TUNXOUT= 0
##$USERA1= <user>
##$USERA2= <user>
##$USERA3= <user>
##$USERA4= <user>
##$USERA5= <user>
##$V9= 5
##$VALIST= <valist>
##$VCLIST= <CCCCCCCCCCCCCCC>
##$VD= 0
##$VDLIST= <DDDDDDDDDDDDDDD>
##$VPLIST= <PPPPPPPPPPPPPPP>
##$VTLIST= <TTTTTTTTTTTTTTT>
##$WBST= 1024
##$WBSW= 4
##$XGAIN= (0..3)
0 0 0 0 
##$XL= 0
##$YL= 0
##$YMAX_a= 1709613
##$YMIN_a= -3283087
##$ZGOPTNS= <>
##$ZL1= 120
##$ZL2= 120
##$ZL3= 120
##$ZL4= 120
##$ABSF1= 248.5645
##$ABSF2= -253.2056
##$ABSG= 5
##$ABSL= 3
##$ALPHA= 0
##$AQORDER= 0
##$ASSFAC= 0
##$ASSFACI= 0
##$ASSFACX= 0
##$ASSWID= 0
##$AUNMP= <proc_1d>
##$AZFE= 0.1
##$AZFW= 0.5
##$BCFW= 0
##$BC_mod= 2
##$BYTORDP= 0
##$COROFFS= 0
##$CY= -3
##$DATMOD= 1
##$DC= 0
##$DFILT= <>
##$DTYPP= 0
##$F1P= 0
##$F2P= 0
##$FCOR= 1
##$FTSIZE= 65536
##$FT_mod= 6
##$GAMMA= 0
##$GB= 0
##$INTBC= 1
##$INTSCL= 6.047779e-11
##$ISEN= 30
##$LB= 1
##$LEV0= 0
##$LPBIN= 0
##$MAXI= 10000
##$MC2= 0
##$MEAN= 0
##$ME_mod= 0
##$MI= 50
##$NCOEF= 0
##$NC_proc= 2
##$NLEV= 6
##$NOISF1= 182.463
##$NOISF2= 159.3651
##$NSP= 0
##$NTH_PI= 0
##$NZP= 0
##$OFFSET= 248.5645
##$PC= 4
##$PHC0= -10671.17
##$PHC1= 211.4555
##$PH_mod= 1
##$PKNL= yes
##$PPARMOD= 0
##$PSCAL= 0
##$PSIGN= 0
##$REVERSE= no
##$SF= 81.0140089999694
##$SI= 65536
##$SIGF1= 159.3651
##$SIGF2= -187.1042
##$SINO= 113.3802
##$SIOLD= 16384
##$SREGLST= <1H.CDCl3>
##$SSB= 0
##$STSI= 65536
##$STSR= 0
##$SW_p= 40650.406504065
##$SYMM= 0
##$S_DEV= 0
##$TDeff= 32768
##$TDoff= 0
##$TI= <>
##$TILT= no
##$TM1= 0
##$TM2= 0
##$TOPLEV= 0
##$USERP1= <user>
##$USERP2= <user>
##$USERP3= <user>
##$USERP4= <user>
##$USERP5= <user>
##$WDW= 1
##$XDIM= 65536
##$YMAX_p= 348754018
##$YMIN_p= -6307948
$$ End of Bruker specific parameters
$$ ---------------------------------
##NTUPLES= NMR SPECTRUM
##VAR_NAME=  FREQUENCY,     SPECTRUM/REAL,   SPECTRUM/IMAG
##SYMBOL=    X,             R,               I
##VAR_TYPE=  INDEPENDENT,   DEPENDENT,       DEPENDENT
##VAR_FORM=  AFFN,          ASDF,            ASDF
##VAR_DIM=   65536,         65536,           65536
##UNITS=     HZ,            ARBITRARY UNITS, ARBITRARY UNITS
##FACTOR=    0.620285442955139, 1,           1
##FIRST=     20137.2065510682, 0,            0
##LAST=      -20513.1999529968, 0,           0
##MIN=       -20513.1999529968, -6307948,    0
##MAX=       20137.2065510682, 348754018,    0
$$ Real data points
##PAGE= N=1
##DATA TABLE= (X++(R..R)), XYDATA
$$ [...]
41074 172482 191595 -31392 -270010 -397798 -429304 -356598 -188159 -45224 -6543 25730
41064 25730 113394 101828 -113028 -311344 -232292 8090 95330 7799 -7328 107052 133175
41053 133175 -30846 -211506 -258263 -240958 -265517 -306668 -314511 -318327 -337394 -311707 -188184
41042 -188184 7307 208137 343201 345668 212057 42063 -50234 -39550 39775 150840
41032 150840 221340 156347 -25827 -165648 -155314 -57503 33429 100158 92901 -92221 -392016
41021 -392016 -535534 -400240 -217845 -227368 -319226 -262717 -102569 -44302 -86485 -68790 9191
41010 9191 9552 -68349 -104526 -99317 -149082 -231869 -246728 -204951 -168908 -94724 39723 76249
40998 76249 -90951 -255327 -171286 35581 65605 -58599 -68604 53848 65491 -75705
40988 -75705 -144654 -67817 -16429 -39636 9981 126092 112460 -21432 -18470 165120 246831
40977 246831 101036 -36393 -15721 -29479 -194652 -255644 162 338511 408837 238559
40967 238559 89210 23871 -68580 -176065 -198144 -172136 -191392 -183218 -19554 219143 323553
40956 323553 247127 111833 -18867 -161744 -253379 -188094 -17637 72505 5012 -119967
40946 -119967 -206348 -265977 -313763 -293704 -171576 -16020 77663 105001 143716 233980 302476
40935 302476 240439 61689 -71462 -32660 101348 147503 51561 -67941 -93702 -22140 94907
40924 94907 211587 278954 271883 235604 221386 190764 84443 -42018 -81237 -52277 -68771
40913 -68771 -140362 -170131 -151925 -187582 -278554 -287920 -169841 -62899 -75990 -135604 -132551 -85025
40901 -85025 -67973 -93848 -136863 -174606 -157735 -48344 82013 122571 110267 184245 328298
40890 328298 359744 236810 154221 217535 240883 42548 -237862 -327822 -202727 -61080
40880 -61080 1399 68962 177275 216197 110167 -47243 -110909 -57959 17360 43865 52292
40869 52292 106620 192324 224100 171254 103258 62098 -27544 -223279 -413973 -447074 -367064
40858 -367064 -361301 -472490 -538737 -450200 -295019 -185322 -92146 47961 175722 172966 34606
40847 34606 -101909 -90837 70558 209485 137800 -108464 -269077 -191603 -59712 -130293
40837 -130293 -333898 -362768 -123719 141789 211553 125386 24389 -32383 -16271 102575
40827 102575 242310 241482 93694 -13562 24673 87102 51170 -11974 9922 67532 38200
40816 38200 -76976 -160160 -125993 2083 116631 111335 4389 -50761 28192 101324 9326
40805 9326 -154646 -186655 -111422 -106232 -130735 26407 304228 346412 43325 -248611 -211428
40794 -211428 14084 125772 104439 108412 143723 112487 44004 32775 48199 6806 -55423
40783 -55423 -48715 18787 82082 110114 61728 -104426 -281030 -254136 -13296 173495 130832
40772 130832 15513 27352 101480 90059 42479 65984 83300 -13337 -108078 -27203 143759
40761 143759 169138 26510 -77007 -21309 94110 121738 21818 -129874 -188048 -54791
40751 -54791 165242 230162 67255 -122723 -161567 -119374 -118521 -107662 -7710 89406 63780
40740 63780 -32424 -94951 -142287 -205151 -207112 -127175 -95903 -144850 -74972 200209 406647
40729 406647 286169 19100 -47217 77094 116340 15722 -29271 39623 73872 11652 -61789
40718 -61789 -128648 -243226 -352613 -364585 -343003 -387121 -399434 -252582 -93054 -151598 -320082
40707 -320082 -279085 -25854 97033 -66698 -278668 -302986 -197873 -117711 -96353 -119064
40697 -119064 -174541 -167813 -2563 211611 263524 167788 131655 183204 130707 -59101 -156542
40686 -156542 -42115 104679 111550 45287 7509 -53285 -180371 -278501 -286173 -280802 -289128 -198798
40674 -198798 8100 137719 54472 -108712 -161653 -118347 -99262 -119439 -124222 -115820 -112522
40663 -112522 -88899 -59920 -103087 -200455 -198666 -40047 105715 74504 -49219 -69575 31717
40652 31717 91968 2723 -174999 -308657 -324792 -256956 -206210 -231827 -276767 -249764 -164279
40641 -164279 -116471 -143386 -196810 -231184 -210398 -76212 142932 242334 56028 -257482 -362040
40630 -362040 -188795 -7264 -13945 -92650 -71017 12220 25459 -47685 -143089 -218616 -231513
40619 -231513 -155327 -83762 -149858 -281432 -239412 16061 221281 191388 79380 88434 139992
40608 139992 43659 -164066 -281588 -241654 -147661 -84640 -62808 -81113 -105401 -62752 19883
40597 19883 -15308 -207663 -328595 -167714 136235 259209 122338 -47063 -55478 46101
40587 46101 97063 24975 -106297 -154604 -29582 167464 215889 76180 -10540 132671 317096
40576 317096 248687 -19244 -165610 -86643 -2246 -49967 -73837 63504 209729 148465 -66100
40565 -66100 -191395 -126648 1420 39716 -32377 -124319 -121323 28471 236299 305900 121367
40554 121367 -204062 -423592 -398754 -212088 -56745 -48806 -132396 -146067 -5703 171377
40544 171377 181403 -4560 -179891 -166329 -48375 -32242 -143700 -229976 -239110 -297141 -448898
40533 -448898 -511402 -322650 -8138 165599 131377 53886 64264 126918 162425 146348 68274
40522 68274 -68440 -181980 -176274 -88866 -38878 -15809 106397 301767 340113 111149 -174426
40511 -174426 -253689 -142808 -44274 -42687 -66562 -64755 -42850 17520 108496 112768 -62763 -300342
40499 -300342 -378497 -252225 -85172 -20788 -60397 -146218 -214290 -172932 18855 240528 312438
40488 312438 218410 101472 45014 5503 -30772 9139 134419 224528 185962 73923 -2383
40477 -2383 -11848 9419 23521 -346 -77163 -166486 -193054 -135588 -55838 -27626 -69528 -139429
40465 -139429 -160996 -79650 67938 171854 169194 95531 -6536 -132759 -223303 -158178 51573
40454 51573 198617 138937 -6626 -59646 -50680 -81091 -63579 125493 327560 257807 -33848
40443 -33848 -183920 -53567 66580 -83543 -338868 -364933 -122327 129716 195513 130507
40433 130507 95174 144408 185227 111354 -39983 -117082 -70054 -39284 -133005 -231902 -177321
40422 -177321 -52497 -58338 -173501 -189234 -62571 28108 -927 -29582 5688 -4915 -115735
40411 -115735 -208343 -201326 -172353 -175215 -133414 -17742 57246 17040 -65151 -130387 -218873 -307195
40399 -307195 -265735 -92775 8590 -72835 -160698 -48029 192622 309141 182190 -72900
40389 -72900 -232340 -136892 149657 333832 196553 -96228 -195645 -77617 -56030 -240883
40379 -240883 -341016 -161252 55953 30587 -115145 -112302 8785 54192 50585 146397 268836
40368 268836 231140 98747 109852 269633 343802 255261 187548 256118 343167 325845 245145
40357 245145 171199 88692 -1553 -21826 55014 130797 110712 29664 -5522 48617 125798
40346 125798 115319 -20868 -182217 -221016 -115764 14764 85074 123244 147820 112288 44586
40335 44586 80477 243003 343366 244930 80397 40852 88704 74452 12641 14872 39922
40324 39922 -46634 -212538 -289679 -239023 -167909 -101622 41980 248315 390348 433987 456853
40313 456853 444964 287277 17061 -157797 -142214 -73500 -62938 -17116 150026 303238
40303 303238 262463 76326 -64040 -108003 -152327 -202037 -132452 70973 219128 171217 50284
40292 50284 65829 201669 252634 151202 64758 112329 165245 53461 -170505 -334861 -408307
40281 -408307 -465086 -466184 -304019 -47941 88363 56971 36210 125918 198226 141179 46034
40270 46034 29800 50149 34185 33289 101329 156131 116581 59984 89108 147920 126861 60122
40258 60122 56617 106938 119125 93070 102701 135791 98500 -24238 -131697 -140090 -66675 26749
40246 26749 111799 201459 305410 384431 371273 265154 156192 90773 -12447 -196485 -308061
40235 -308061 -196645 -6170 -19488 -228415 -337071 -221952 -88995 -93330 -109542 -16126
40225 -16126 76087 50300 -9281 -4105 19262 46952 177617 364515 362724 124950 -50088
40214 -50088 12574 67407 -103514 -279188 -192795 -33685 -124528 -326609 -241562 127225 375264
40203 375264 297820 76892 -100616 -232444 -316664 -311751 -276828 -277570 -212195 -1163 170456
40192 170456 117883 19132 135403 311816 202982 -108130 -216464 -73500 -27565 -165100
40182 -165100 -163293 92482 277629 195282 87749 159571 234952 143540 40316 64254 50207
40171 50207 -122109 -231030 -83387 115595 92670 -52444 -75092 -30023 -130198 -329199
40161 -329199 -402370 -342001 -343695 -456238 -534697 -512488 -467616 -431987 -357283 -272104 -281322 -391600
40149 -391600 -486178 -487366 -429682 -367232 -301288 -207793 -84733 23956 49940 -3788 -12594
40138 -12594 116102 260163 214671 7023 -122206 -85957 -59054 -137141 -149375 32394 239847
40127 239847 275841 232365 291603 370905 252722 -24411 -197496 -178497 -151262 -234009 -283786
40116 -283786 -139024 104772 190820 9230 -280602 -427025 -344498 -180068 -124334 -193542
40106 -193542 -252357 -222039 -163124 -144765 -150430 -154047 -178543 -220626 -215473 -136032 -39829 28927
40094 28927 86013 117900 67994 -33532 -57273 37354 132757 147719 155219 208303 207349 84244
40082 84244 -20033 58992 241307 305470 202406 88007 71259 100888 106423 99103 97234
40071 97234 68455 -3300 -69101 -79305 -54089 -54308 -94289 -102868 8149 218409 374613 350600
40059 350600 207307 107307 89856 54593 -26685 -43306 45881 93190 -29778 -215957 -250914
40048 -250914 -90702 112501 218383 217575 167872 114340 71378 14512 -103841 -281733 -432313
40037 -432313 -468131 -396452 -289265 -190926 -103827 -38620 -23310 -62038 -115338 -132466 -107830
40026 -107830 -102696 -176083 -280041 -291006 -194276 -145525 -243702 -331789 -191911 105449 247417
40015 247417 89117 -169678 -264112 -147772 60941 241061 292857 163017 -41441 -95870
40005 -95870 71743 261930 256476 81853 -83122 -152355 -160232 -130559 -53928 42554 104748
39994 104748 109545 58130 -43827 -156655 -220106 -238008 -280425 -366247 -422798 -394901 -309797
39983 -309797 -212879 -139369 -157919 -305366 -457095 -429260 -259045 -200168 -359074 -526547
39973 -526547 -488351 -316180 -194624 -131242 -37240 33171 -51755 -259083 -410579 -416246 -333621
39962 -333621 -228731 -127555 -80003 -126544 -202211 -188606 -63468 82722 160703 145220 64786
39951 64786 -1643 31556 147343 219547 177545 95176 45750 -21921 -157480 -267351 -238100
39940 -238100 -122880 -65991 -105332 -179360 -257714 -322064 -290898 -130301 16157 -12499 -142369
39929 -142369 -162921 -58145 -26031 -140935 -216289 -96997 94209 142293 48699 -1697 77876
39918 77876 174784 150795 1073 -183071 -320394 -364731 -291592 -131634 6771 20941 -68878
39907 -68878 -139305 -117785 -64007 -72583 -151474 -234999 -261927 -198900 -52264 90795 109467
39896 109467 3052 -90874 -105375 -145801 -266314 -300711 -115708 101996 82977 -85656
39886 -85656 -79666 127793 213504 46643 -89373 26486 196780 160822 21129 24153 123216
39875 123216 77478 -132725 -286409 -261800 -144494 -27007 81019 154563 148192 84232 11670
39864 11670 -78245 -164108 -109378 152672 419386 421023 199418 69004 184745 354482 338797
39853 338797 158970 7044 -30443 -45650 -153078 -338657 -467679 -427770 -262977 -138566
39843 -138566 -152205 -224145 -216060 -113236 -28285 -48251 -131614 -155090 -46397 119729 180260
39832 180260 83039 -17511 41932 183796 184719 7263 -145086 -136182 -71528 -94137 -183736
39821 -183736 -251731 -274625 -239306 -119001 -939 -60328 -287847 -421675 -290821 -53402
39811 -53402 59215 59022 83778 129281 104284 19729 -75828 -225468 -431485 -521298 -361333
39800 -361333 -97195 33100 23682 25358 54935 19840 -52358 -56713 -24187 -56805 -103352 -34650
39788 -34650 103089 143792 68653 -15716 -117153 -313864 -496524 -440614 -166786 34624
39778 34624 2856 -98230 -59817 96903 210344 184339 35659 -133958 -177261 -43074
39768 -43074 105648 52286 -189465 -393669 -418386 -332343 -259679 -264752 -375971 -540053 -562594
39757 -562594 -296109 107690 341394 346070 342206 433634 452296 291723 130907 155016 252077
39746 252077 189039 -34084 -196281 -157259 6286 134718 142702 60463 -5613 28025 117637
39735 117637 122471 -24165 -220460 -311978 -259768 -155187 -100906 -112546 -124566 -77087 5351
39724 5351 40219 -3526 -67699 -94055 -84989 -42095 68669 228851 334867 335287 310772 321793
39712 321793 277612 88687 -133690 -186862 -41178 148521 261646 302743 295010 219205 71216
39701 71216 -103094 -225618 -200621 16903 308037 445630 347763 169324 58423 -32202
39691 -32202 -172417 -260878 -178855 -2826 115065 152152 132461 -1840 -234634 -360141
39681 -360141 -259300 -124839 -149946 -178036 17011 280403 298850 140292 126506 239907
39671 239907 145713 -182494 -361427 -227401 -90564 -176596 -248183 -42325 269172 355724
39661 355724 210801 78577 81548 161228 245259 273317 180990 20225 -24646 125438 311927
39650 311927 348907 231117 48241 -142399 -260013 -193562 25620 191149 170679 54478
39640 54478 -24227 -63208 -103171 -121890 -101322 -62737 14391 151838 229317 87216 -190458
39629 -190458 -327180 -244884 -159271 -211994 -266695 -170020 36949 267499 486232 561045 322886
39618 322886 -87707 -251528 -34526 185495 71331 -199957 -276036 -154177 -57468 -26171
39608 -26171 32651 70751 5120 -40155 90662 281921 309434 201238 154598 190207 170025
39597 170025 80574 26310 3422 -66066 -135676 -112261 -68268 -136161 -252517 -246165 -126288
39586 -126288 -50639 -59433 -64967 -50241 -60855 -65180 -35168 -74530 -234424 -315375 -131133 135799
39574 135799 163502 -6345 -55660 62686 66055 -140862 -299596 -253804 -185049 -225812 -194040
39563 -194040 49528 274348 197802 -72927 -203683 -107561 11989 14993 -29757 -35047 -18929
39552 -18929 -12644 -1263 4643 -51800 -184258 -325529 -406672 -424653 -417303 -411104 -405390 -379361
39540 -379361 -304911 -173411 -25491 51505 -18568 -213162 -386196 -385027 -220865 -72722
39530 -72722 -78742 -176050 -210136 -150530 -103297 -133858 -184612 -182858 -140003 -106350 -91192 -71858
39518 -71858 -44757 -27747 -24683 -11125 41386 125020 180807 144707 22677 -98510 -135075
39507 -135075 -92827 -58975 -108450 -211618 -237840 -92911 128003 198862 41472 -134214
39497 -134214 -87818 117117 201611 64540 -111144 -162557 -142086 -138222 -112191 -36127 -13650
39486 -13650 -110494 -207747 -178232 -85156 -50548 -44211 27118 121719 133296 84448 80125 130466
39474 130466 174680 209724 237412 168492 -36310 -207973 -163592 -3500 16099 -120834 -170868
39463 -170868 -23099 142907 159870 100804 91866 97205 41988 316 84928 232725 267677
39452 267677 153256 44900 72400 167113 157635 -1180 -152553 -116291 81464 219122
39442 219122 142589 -51670 -158306 -124751 -69009 -69414 -67146 -1424 72908 66636 -17872 -109715
39430 -109715 -172057 -213717 -224549 -173237 -76506 -7616 -3757 -13927 10038 15342 -68744 -169239
39418 -169239 -123476 67844 188889 106930 -20920 7326 116631 94336 -40496 -78855
39408 -78855 -3679 -27764 -205546 -308514 -196631 -35132 6937 9723 68410 58610 -124697
39397 -124697 -303019 -258628 -83000 -8491 -26720 34438 152472 138137 -18349 -118168 -69700
39386 -69700 21490 83715 155512 212275 154477 11880 -54519 -5166 17180 -71339 -178000
39375 -178000 -210546 -198216 -178671 -125897 -49114 -14591 -17352 24857 108501 130160 80253 81280
39363 81280 163868 174785 11766 -194441 -256948 -185400 -136748 -184175 -251537 -244154 -154055
39352 -154055 -41869 34777 72832 110847 153073 137641 29451 -94911 -135837 -111652 -111001
39341 -111001 -131944 -94654 -11080 -2945 -117965 -250477 -293216 -263100 -222680 -170914 -77307
39330 -77307 43224 147789 210742 215479 150999 49463 -16538 -2655 72657 171915 278083
39319 278083 378801 442870 427346 309591 135856 33615 108983 305868 440261 408607
39309 408607 275134 120931 -57002 -219379 -219983 -15834 190810 202335 112126 141180 279712
39298 279712 324023 214722 88330 9758 -89372 -184849 -129620 83268 257723 284920 288511
39287 288511 373591 427155 312128 109558 12180 70158 170383 202319 144437 39349 -37829
39276 -37829 -24023 71417 180483 251420 259319 178172 37449 -37895 22262 86572 -465
39265 -465 -131255 -55926 199510 303245 90315 -192379 -255486 -151416 -103501 -143875 -144687
39254 -144687 -78616 -25035 1293 29917 11880 -93045 -166651 -69700 104204 115125 -78816
39243 -78816 -253449 -232584 -104073 -56251 -129662 -215375 -214704 -122784 -1844 73905 77639 63344
39231 63344 106603 197284 238425 175340 76368 45268 89284 123993 91972 22959 -25866 -32610
39219 -32610 11921 129313 288781 356586 218219 -35571 -158809 -45399 128381 147342
39209 147342 45584 11326 70302 53641 -107074 -237474 -157096 70753 231595 222734 123051
39198 123051 50058 43732 74589 89745 50263 -23499 -43086 64368 254197 385528 367356
39187 367356 258506 190681 206342 224091 176202 110945 98521 96272 13813 -115962 -163612
39176 -163612 -107484 -64374 -77110 -33083 120683 238878 183993 41025 -24482 -14904 -41397
39165 -41397 -105241 -119621 -90606 -96824 -126442 -102997 -41691 -17162 -9293 51828 120476 91205
39153 91205 -4999 -39831 -2400 5693 -35224 -66854 -122070 -267677 -392944 -307353 -71118
39142 -71118 32675 -89817 -220883 -201637 -151500 -185476 -173808 20698 266424 339057 236918
39131 236918 126227 78290 40073 -16590 -80163 -171888 -294562 -363093 -303531 -167964 -53832
39120 -53832 25100 93914 117916 52321 -68964 -183646 -281701 -360370 -370012 -288043 -184774
39109 -184774 -139551 -145112 -149726 -129622 -76540 8461 72933 56082 -275 1694 36704 -25100
39097 -25100 -178279 -238792 -119627 31606 76554 82503 136296 145256 10892 -144206 -134450
39086 -134450 -481 63272 9888 -17719 84278 259222 374620 323035 91736 -178462
39076 -178462 -291271 -241559 -236492 -361859 -406036 -195866 77009 125818 21347 56688 238288
39065 238288 270614 64002 -94364 16806 237562 311434 244670 191644 163924 68299 -67382
39054 -67382 -107624 -20245 71167 47916 -79884 -211296 -264088 -249335 -251069 -307099 -328639
39043 -328639 -214428 -34636 19933 -95316 -194792 -124351 11671 4254 -162542 -308549
39033 -308549 -312311 -225043 -131459 -38652 51578 79664 22351 -28460 17475 92517 40416 -158609
39021 -158609 -336791 -347266 -230747 -111392 -9806 134860 299969 363452 267253 97148
39011 97148 -31503 -86390 -85815 -39421 27506 62856 61003 87000 165520 206100 121403 -20041
38999 -20041 -52567 81921 267006 360134 341564 286525 236889 154527 6085 -146823 -194021
38988 -194021 -122255 -51973 -72973 -100347 -189 168966 192413 13442 -149100 -102601 35816
38977 35816 20675 -144335 -217759 -97693 29542 -10002 -117106 -101093 9755 29497 -70007
38966 -70007 -110901 1306 131351 142107 103778 134251 157538 18401 -218581 -301614 -142313
38955 -142313 61442 114381 60461 39067 64712 79092 98305 160544 207996 156986 30941
38944 30941 -84795 -160135 -198621 -178718 -116105 -95272 -138633 -152260 -106791 -124887 -245634
38933 -245634 -277619 -94885 92340 34791 -133654 -103263 81034 83567 -147932 -280661
38923 -280661 -137379 50463 66676 32769 113055 198573 116303 -71927 -195953 -222443 -192847
38912 -192847 -92802 48402 104355 58192 78758 228925 301701 141511 -68252 -67448 95355
38901 95355 180265 128421 76799 95062 128243 134570 101313 187 -123244 -126622 11864
38890 11864 94213 -7758 -123599 -48692 126690 190151 149697 129814 71840 -138983 -347156
38879 -347156 -279072 11982 189097 125110 32646 70331 135658 125226 111583 152606 170940
38868 170940 135043 141896 210496 199071 45123 -100344 -101336 -30140 -7660 -7515 43768 102974
38856 102974 90270 37425 25927 45762 23753 -61261 -175767 -292396 -385067 -413468 -368808
38845 -368808 -292426 -219253 -159217 -145438 -211919 -300781 -299445 -216237 -206716 -348084 -481968
38834 -481968 -384413 -42339 326581 501402 440561 268707 151346 174893 295208 387750
38824 387750 362917 236403 96334 24331 42788 103195 118462 37418 -100296 -202345 -222417
38813 -222417 -205803 -231377 -312365 -357541 -252298 -5333 213262 243215 129640 61785 116980
38802 116980 181371 158059 118684 160423 225141 183373 31903 -104256 -123607 -16250 163928
38791 163928 310148 308594 164256 21621 -20596 -33453 -105076 -171620 -135434 -52871 -32901
38780 -32901 -22661 106155 291479 316795 137070 -24640 24100 196418 262051 134386
38770 134386 -59068 -140980 -63475 58753 81942 5610 -26342 79552 242984 337726 356386
38759 356386 356914 328164 228562 95966 -6808 -104868 -244740 -365742 -369733 -276893 -183691
38748 -183691 -112851 -37176 4491 -33187 -76770 -30378 46127 23300 -77549 -133221 -146316
38737 -146316 -215515 -300513 -246293 -56461 84388 99948 112692 188628 213811 114304 -4319
38726 -4319 -45684 -70203 -139712 -182427 -138377 -87306 -96278 -76066 62042 216379 216108 58006
38714 58006 -114338 -209620 -243316 -239931 -199586 -142918 -102544 -84139 -86849 -121729 -162004 -133064
38702 -133064 -12050 116123 159433 120022 42121 -69563 -204290 -283532 -244624 -156727 -159807
38691 -159807 -287142 -415240 -400656 -227519 -16992 83938 29532 -85607 -118259 -17066
38681 -17066 138000 232857 226654 156792 74222 1903 -54840 -82953 -66134 -23461 -20327 -95647
38669 -95647 -184042 -179863 -98276 -90310 -246181 -459373 -556777 -498793 -373384 -258993 -188980
38658 -188980 -193196 -259950 -288488 -187246 -2764 136548 176107 149688 85449 4060 -29749
38647 -29749 26677 101016 93532 32126 22100 68490 79803 30984 -19461 -71470 -188041 -329341
38635 -329341 -332233 -130333 106750 141445 -62927 -295551 -317980 -119673 65210 37961
38625 37961 -99252 -80112 120382 214813 31321 -204441 -204487 -47638 -12753 -118542 -140246
38614 -140246 -21662 54385 11614 -11922 49116 78490 36074 56388 178999 223519 75133
38603 75133 -102022 -82967 135104 383232 520287 495638 353972 253066 330541 493393
38593 493393 506710 342638 232261 292173 340257 218483 60937 45460 81182 -18723 -200789
38582 -200789 -262250 -188385 -149005 -193735 -181766 -33476 132084 157686 23069 -170493 -293395
38571 -293395 -249014 -38237 200095 277056 127130 -119623 -253291 -177998 -2459 73305
38561 73305 -18992 -138879 -122575 14531 143301 217565 265255 238177 71887 -104138 -50422
38550 -50422 210466 326391 63351 -353278 -520355 -353539 -112694 -12521 -10805 27115
38540 27115 128116 221856 246180 193477 105660 48984 61538 114698 145939 130849 111881
38529 111881 156857 283608 416851 439123 305987 91495 -90544 -165677 -95647 104334
38519 104334 297900 299215 110538 -26154 60444 225888 230593 83600 -36449 -96700 -195407
38508 -195407 -296964 -257098 -98644 2137 7943 36397 77087 -17443 -215174 -277109 -133316
38497 -133316 -10684 -80039 -232717 -315395 -331630 -296736 -155503 21469 16627 -210452 -419552
38486 -419552 -447647 -408992 -392284 -259768 39470 241025 117233 -166240 -303041 -250747
38476 -250747 -136549 23202 229612 325585 215300 95681 172599 301784 218961 -18688
38466 -18688 -147049 -124670 -106975 -95792 21869 149140 66597 -168233 -261876 -142432 -42632
38455 -42632 -93848 -167910 -182672 -237528 -343700 -323574 -115925 80593 116206 107985 190294
38444 190294 260140 160581 -41743 -155783 -138053 -93890 -76463 -37669 51656 151029 212793
38433 212793 221774 183057 119216 68195 54348 70647 94298 103632 91775 85323 119077 162648
38421 162648 122651 -33326 -210801 -303563 -308644 -262068 -151931 2662 79334 2847 -95819
38410 -95819 -30708 160587 248820 120819 -86132 -171482 -80276 82001 151518 37163 -165285
38399 -165285 -231697 -76929 106857 106303 -3605 15342 193663 326170 295111 191841 95683
38388 95683 -36057 -192022 -237931 -130303 -23400 -48355 -131714 -142245 -80071 -7046 76149
38377 76149 154164 122182 -61527 -243754 -256369 -157926 -132720 -201987 -218439 -133873 -76714
38366 -76714 -117433 -133774 -10850 155716 187505 72450 -52055 -118119 -178043 -241199 -219606
38355 -219606 -88260 34159 47089 2144 -16678 -39630 -117344 -178843 -140736 -86625 -154793
38344 -154793 -289388 -305694 -190034 -113815 -130651 -104571 -7499 -26881 -235571 -392905 -278613
38333 -278613 -34353 68607 56962 170720 425105 552736 405173 162831 66231 123626
38323 123626 180055 140485 26469 -95991 -157111 -112511 -2032 63455 29315 -26596 -2443
38312 -2443 69366 47015 -122421 -299308 -311672 -182293 -94882 -129650 -164064 -99906 -44915
38301 -44915 -132343 -278172 -305147 -227536 -196726 -216856 -160473 -45026 -19035 -56335 37952
38290 37952 256355 338900 202329 94187 157006 173068 -21725 -188327 -64215 168100
38280 168100 158616 -53208 -148380 -74283 -79755 -244786 -353360 -267742 -113044 -31634 -13658
38269 -13658 -21125 -50975 -38664 84612 213577 163764 -29948 -124404 -9166 169293 252313
38258 252313 230876 135323 -18597 -127890 -60485 124033 210862 142997 92129 154835 202748
38247 202748 135031 59602 78469 81193 -70503 -289060 -375454 -300595 -202488 -152973 -87504
38236 -87504 37371 148053 152984 63721 -26264 -54426 -42747 -33687 -9623 69892 159411 146474
38224 146474 17856 -87839 -66703 4397 10458 -4521 71667 192394 189518 30381 -124660
38213 -124660 -151206 -110434 -116110 -156509 -123288 27122 195181 227118 85234 -85304 -112016
38202 -112016 -11118 45790 -8215 -46319 27994 125379 136979 98958 60547 -52095 -267487
38191 -267487 -409762 -319543 -126426 -82196 -206820 -320360 -349185 -362412 -361603 -285832 -198758
38180 -198758 -224927 -311244 -292287 -185318 -165052 -232433 -179582 59439 281103 324010 274312
38169 274312 252877 215221 102217 9505 47060 153475 194854 162987 151802 195173 232935
38158 232935 214262 167693 165876 227271 250671 105623 -161836 -301903 -149567 135796 263939
38147 263939 183736 83304 61520 14592 -124016 -230909 -166072 30800 197336 223198
38137 223198 122152 -10253 -87808 -116449 -164476 -223656 -180499 12067 236329 367565
38127 367565 409273 371911 180846 -137200 -346263 -294995 -173192 -232168 -383336 -356753
38117 -356753 -153112 -24538 -64511 -129743 -143573 -176153 -231224 -235245 -225586 -277326 -283359 -107182
38105 -107182 96682 58359 -149107 -207767 -92783 -84535 -218342 -196846 41595 146681
38095 146681 -64591 -300266 -301968 -238606 -305887 -328852 -116737 115339 69274 -138002 -181589
38084 -181589 -46391 26050 -35275 -99435 -120349 -142866 -117715 -1937 50886 -106628 -307806
38073 -307806 -267515 -22975 127751 93248 76476 178172 224950 83321 -110893 -167525
38063 -167525 -101785 -44678 -22939 37888 160024 276158 327023 321709 292601 236411 137229
38052 137229 37873 24645 99518 136040 52363 -35436 27265 166086 162075 4976 -65371
38041 -65371 63254 188345 115070 -40974 -57233 50940 102098 55301 20744 22367 -29135
38030 -29135 -132646 -164938 -88995 -32151 -95211 -208052 -247180 -200066 -128927 -46919 58283
38019 58283 112935 8423 -201102 -287146 -137597 48193 18034 -153817 -174887 -8313
38009 -8313 49140 -150015 -339736 -244611 15197 173780 242589 368887 451484 268585 -99981
37998 -99981 -335708 -328434 -239134 -162935 -67161 -28583 -163845 -320969 -214934 95922 244778
37987 244778 121789 16657 107574 205496 149521 76324 108534 116621 -410 -96745 -45234
37976 -45234 50765 93054 162330 280802 286876 135788 39545 107929 139123 -17321 -183313
37965 -183313 -180015 -145680 -253162 -373839 -319992 -194326 -196735 -279032 -283405 -243749 -261779
37954 -261779 -251253 -93545 99622 154029 123920 152934 191179 124906 50608 130380 280595
37943 280595 287701 155796 76525 114223 158191 134711 57628 -71393 -221845 -263489 -118075
37932 -118075 85490 164085 107885 22616 -43610 -83521 -70658 -43750 -101609 -198179 -137260
37921 -137260 93725 216522 62839 -160246 -211026 -165990 -187275 -191614 -48759 106930
37911 106930 81254 -41855 -72929 -53401 -108755 -140189 -317 169884 124139 -83665 -200747
37900 -200747 -170597 -115591 -50852 58447 80544 -95287 -265354 -160279 112873 238231
37890 238231 201796 243440 370462 337168 99232 -106825 -159746 -167088 -161216 -41477 135971
37879 135971 155015 -6434 -126651 -103061 -72300 -115228 -133005 -82545 -65991 -121479 -169010
37868 -169010 -203585 -295092 -372919 -277126 -58361 41817 -43968 -121469 -57524 63769 152399
37857 152399 225174 254615 152812 -33090 -135037 -118258 -103543 -120222 -81789 -23948 -94978
37846 -94978 -266806 -328115 -223615 -131586 -137709 -109403 11836 64870 -54869 -203497 -204110
37835 -204110 -63820 124230 303208 388363 285829 81673 20863 184985 362385 344237
37825 344237 184094 56012 12717 4330 6985 12528 -19690 -106920 -200335 -247334 -237373 -175668
37813 -175668 -87689 -44099 -95818 -196741 -264255 -274159 -226481 -107417 19670 9743 -146355
37802 -146355 -241613 -149143 -32114 -57826 -92724 52226 257606 304096 281899 408217 560691
37791 560691 428959 70405 -141693 -117797 -131149 -256426 -223509 38469 185172 -66
37781 -66 -251612 -257722 -106579 -33485 -18060 84460 232288 279047 208405 88967 -53846
37770 -53846 -167169 -142238 -732 62417 -46885 -181703 -202566 -169562 -166478 -141718 -60623
37759 -60623 -15830 -46943 -43188 43298 87090 24038 -11529 75550 175708 192017 205191 260105
37747 260105 213212 -9556 -206154 -168834 6736 97863 89726 113974 179769 192319 155936
37736 155936 155615 189554 183424 124928 57772 -1688 -42538 -30520 14022 7477 -45990 -13714
37724 -13714 159753 326215 315852 137531 -87512 -269456 -346330 -279241 -149434 -122346
37714 -122346 -218280 -264351 -172868 -100532 -199334 -366188 -398481 -274887 -126316 -28649 32208
37703 32208 74237 122930 222139 343406 378731 308775 255855 271843 218812 1239 -212957
37692 -212957 -183296 62211 245517 176639 -53088 -213883 -188555 -71660 -48422 -170637
37682 -170637 -281613 -222639 -62893 -1756 -76361 -129590 -67056 33613 96456 149788 207341
37671 207341 215768 175963 162912 181476 154676 78945 22837 -35153 -165555 -279585 -204412
37660 -204412 6189 106216 52518 64698 203076 220701 -1980 -197199 -114714 84804
37650 84804 102118 -54622 -163955 -152099 -95010 -5792 121757 172835 55771 -109113 -160735
37639 -160735 -156614 -245215 -377591 -378152 -238540 -122137 -115134 -165544 -236056 -336982 -422762
37628 -422762 -408467 -286984 -128237 6907 74840 40546 -58515 -125286 -153205 -247614 -415635
37617 -415635 -483755 -343451 -130024 -16112 26772 101166 162050 111405 1299 -48467 -47322
37606 -47322 -74138 -108659 -91999 -63350 -64261 -6412 173261 318217 229894 -19197 -164346
37595 -164346 -107506 4722 41463 25789 7625 -17373 -32366 7670 74630 75376 -18507 -139198
37583 -139198 -211280 -185415 -27172 207807 327747 185176 -97023 -220530 -56036 222920
37573 222920 372151 328571 193665 74825 13488 3862 6677 -33542 -130992 -221936 -223949
37562 -223949 -138446 -59281 -54767 -74713 -28220 68239 105480 46223 -31476 -77386 -121001 -133215
37550 -133215 -12347 188981 225261 23890 -110473 88397 401960 422594 171249 30982
37540 30982 113666 124513 -88318 -271772 -203081 -25274 39216 4067 -43761 -140621 -273046
37529 -273046 -262944 -46600 149818 125102 -9903 -66376 -95251 -238734 -430761 -481786
37519 -481786 -349898 -140149 55789 167389 125530 -16493 -73835 30803 162406 205150
37509 205150 207255 193262 74011 -116393 -163974 -40358 -39726 -309154 -525497 -351376 30088
37498 30088 192995 88265 -1484 11095 -46458 -193622 -223912 -84658 9858 -70907 -178569
37487 -178569 -135604 29328 183121 261079 263059 202424 119960 66989 48162 34101 10774
37476 10774 -33652 -112432 -170413 -97872 104482 271085 277114 197672 158886 140567 52827
37465 52827 -84738 -170284 -157168 -64552 73172 188040 201369 131485 73181 30097 -79954
37454 -79954 -210427 -182703 17788 162317 116187 37372 95342 206075 210432 115982 -1370
37443 -1370 -134808 -226079 -127854 136031 293801 190386 -2323 -115064 -239665 -436704
37433 -436704 -496266 -292273 -91862 -160264 -306205 -205565 41751 104611 1303 32325
37423 32325 227293 305140 158645 -25189 -129030 -220583 -292530 -234771 -95027 -49472 -84509
37412 -84509 -9785 179225 245588 70890 -186279 -339798 -357075 -265680 -101620 26080
37402 26080 20105 -51393 -64799 -58067 -131581 -206678 -140757 -24411 -71332 -237235 -258191 -87246
37390 -87246 13946 -113785 -298537 -317195 -178771 -26431 62068 82922 55481 32461 55856
37379 55856 76093 12367 -114886 -212461 -241715 -215459 -130911 -21739 6852 -71342 -113337
37368 -113337 -13430 109510 97406 10929 14854 112271 189025 224760 264955 277174 219474
37357 219474 150877 108174 7285 -165705 -241452 -138023 -39695 -81416 -88042 98384 278087
37346 278087 212457 48099 44416 102583 -1577 -116695 54333 362390 382029 110429
37336 110429 -33272 97222 201265 104032 10634 83967 202670 252387 275527 248039 81566
37325 81566 -91037 -20821 209174 242508 14471 -163042 -148146 -146056 -240398 -227694 -76282
37314 -76282 -72137 -293658 -397255 -186337 32189 -39260 -206528 -152616 41367 104280 39541
37303 39541 23912 46373 -11681 -87524 -36019 97493 168514 192607 269781 342362 263572
37292 263572 53864 -106777 -110808 -6402 107753 159741 125988 59874 47393 91521 119921
37281 119921 124910 173604 252553 247979 131655 31860 61928 187723 299830 317613 218724
37270 218724 69795 3243 55611 94036 28655 -18578 66818 152810 85472 867 103356
37259 103356 270076 244433 109945 144033 275589 174715 -128296 -237621 -68763 6067
37249 6067 -174135 -284961 -128281 -627 -150867 -332725 -254557 -79551 -91176 -192590
37239 -192590 -142885 -22158 -52074 -159576 -119548 15652 11148 -116453 -111132 103518 304170
37228 304170 278772 58734 -162608 -214407 -80450 72136 62057 -72899 -136820 -79719
37218 -79719 -34061 -16284 129871 394273 505722 341989 152890 171173 262804 197298 28663
37207 28663 -51470 -42882 -58228 -75156 -10291 89395 132128 123677 63629 -113192 -320847 -286075
37195 -286075 41236 283287 131786 -164443 -152485 148635 309036 140808 -98459 -158516
37185 -158516 -101171 -75752 -73475 -27846 33371 58788 83591 180368 352778 511614 530750
37174 530750 354307 87315 -77654 -76501 -40005 -82069 -124586 -37909 134281 229495 203330
37163 203330 176730 240604 317922 270730 103281 -9190 63616 206579 193256 30705 -13700
37152 -13700 170052 304827 124917 -185165 -250373 -69268 40229 -13046 -3992 145427
37142 145427 226704 152932 117314 210731 241836 103179 -19912 5587 21615 -104747 -216997
37131 -216997 -151260 -25517 -11300 -44585 -495 45949 -30337 -160263 -199074 -147150 -78686
37120 -78686 1760 80887 76196 -8083 -36831 21527 14367 -114974 -187281 -76451 80575
37109 80575 120961 87956 68174 19493 -70526 -78094 24480 47017 -118601 -280812 -221917
37098 -221917 -4442 169395 222830 175736 45676 -72388 -24685 164500 272268 198895
37088 198895 79847 -5670 -143462 -298623 -267074 -64995 -3467 -183754 -294722 -141559
37078 -141559 16714 -61301 -182833 -113216 -13752 -99841 -196472 -64067 114714 23591 -236785
37067 -236785 -328625 -223980 -147318 -130518 -40655 78549 88374 66717 172573 312847 292565
37056 292565 174483 147156 170508 101248 25561 97367 183973 61311 -157637 -187375 -62348
37045 -62348 -61217 -213130 -280209 -187120 -86394 -27715 74054 168813 119658 -4736 -20652
37034 -20652 25824 -58975 -234293 -276985 -182356 -154206 -211378 -167190 -9857 50494 -52502
37023 -52502 -155151 -175836 -201374 -229989 -137400 54789 167171 166218 205218 318231 345169
37012 345169 222323 100396 105524 189209 261115 288481 248550 154442 112444 184268 245841
37001 245841 168151 51237 54586 91685 -37277 -279995 -385910 -283669 -129373 -16563
36991 -16563 83200 122364 9667 -162412 -188759 -53383 77504 141731 215335 287433 253941
36980 253941 125229 13329 -60217 -133580 -148475 -51391 35667 -11624 -81987 -24833 52749
36969 52749 -4526 -42805 167637 457278 448081 162260 -7511 74425 146880 73366 35383
36958 35383 108029 96026 -50242 -73138 134793 282306 127879 -129646 -161737 25576
36948 25576 176982 159700 43746 -57605 -70105 10958 73234 -13802 -198272 -291543 -251235
36937 -251235 -235215 -321141 -370377 -254165 -40873 126964 192155 153715 26590 -105780
36927 -105780 -129952 -44234 47048 91625 120464 131957 84944 -626 -64059 -93649 -75643
36916 -75643 63003 299800 411470 238987 -34359 -113906 -20878 -15184 -154468 -235769 -157874
36905 -157874 -35898 59955 185278 303313 265856 76099 -70129 -63621 7534 54031 80353
36894 80353 70717 -3662 -57408 15547 135083 145286 95660 152974 264169 203553 -38108
36883 -38108 -208863 -173976 -63152 -5481 13068 -5654 -98831 -174625 -80219 123682 210303
36872 210303 133156 66828 92460 121377 140374 230609 323405 258656 120272 173928 415915
36861 415915 541376 447466 395938 545104 700442 729281 868505 1345821 1976404 2460579
36851 2460579 2912635 3756507 5095663 6396583 6891662 6313578 5257863 4725816 5147043
36842 5147043 5903151 6008263 5208212 4172538 3658634 3814743 4333815 4916089 5378724
36833 5378724 5544825 5264164 4512756 3430435 2324581 1560521 1259094 1143550 885370
36824 885370 537153 381978 437929 438932 284873 160882 172059 192536 146023 127942 170383
36813 170383 172812 135717 177985 261096 196493 373 -66693 91736 255370 244503 146974
36802 146974 87804 50312 29608 95173 202292 202720 125331 174258 372974 499974 458902
36791 458902 408622 432491 393444 234322 116964 135724 180560 195595 273821 387431 347618
36780 347618 161082 97649 256237 391082 327297 214071 187145 124029 -47036 -121755
36770 -121755 45844 269633 338554 326937 352391 301563 85719 -72449 69240 359803
36760 359803 437766 218964 -55191 -174012 -137929 -37096 67029 157298 259080 392111
36750 392111 500752 517577 483392 471318 436072 328094 286674 445793 606324 460532
36740 460532 139164 116676 495013 821159 776630 616958 687398 897832 990333 1009812
36730 1009812 1168515 1476006 1825403 2268036 2907390 3676126 4532386 5798565 7972767
36721 7972767 11063346 14199046 16071070 15999126 14678006 13624945 13605360 13819242 13025744
36712 13025744 11221726 9604696 9012689 9181494 9616124 10308757 11194102 11649645 11153362
36703 11153362 9966312 8623936 7168722 5436690 3728149 2564049 1976778 1580959
36695 1580959 1197500 934752 796012 664626 576782 613706 639372 509487 391242 498038
36685 498038 666665 602206 394018 354906 463436 419703 190586 48111 77533 76323 -25980
36674 -25980 -44562 95342 217906 207340 162256 161933 148386 116681 169583 296080 322791
36663 322791 185196 57049 107469 280151 410543 444242 441328 435851 385737 263377 150052
36652 150052 182947 371142 529050 498369 380925 386976 490632 463401 258072 91479
36642 91479 79106 68603 -42101 -98454 25182 177760 168224 46619 -39265 -74021 -78292
36631 -78292 18663 211112 305090 178072 -11670 -59412 9627 73285 136776 232372 274897
36620 274897 216363 174491 216013 195342 16256 -130685 -27797 227121 374315 361747
36610 361747 336870 374097 420969 443660 462210 503861 616026 816475 974172 923991 775645
36599 775645 874595 1337830 1884460 2303185 2854836 3983157 5752616 7713073 9208834
36590 9208834 9797369 9580326 9142011 8895812 8523194 7459751 5926000 4898657 4886433
36581 4886433 5327668 5504838 5463689 5580777 5764112 5679028 5378761 5085370 4614622 3644345
36571 3644345 2397841 1480467 1106308 971537 817894 661495 525555 384247 337254
36562 337254 462819 564260 423587 202989 207437 359499 335569 139895 88827 251482
36552 251482 353442 266452 184208 243812 326760 311541 222212 71955 -158791 -344291 -286888
36541 -286888 -27945 146539 65840 -143336 -255144 -169849 41594 181651 77770 -179921
36531 -179921 -269932 -58285 178233 139729 -76272 -187477 -168719 -180005 -212769 -145626 -48185
36520 -48185 -96819 -251848 -321840 -293248 -308381 -366237 -324484 -166143 -16257 71243 129074
36509 129074 142076 98542 87639 150991 157220 28220 -59825 64587 263363 298978 200047
36498 200047 148214 144776 73024 -34097 -67365 -66902 -117983 -151288 -94460 -67943 -173352 -262283
36486 -262283 -190435 -108703 -193958 -284727 -131764 154777 268976 184987 119340 136981 131482
36475 131482 87982 50927 -50095 -243078 -328043 -151898 92745 146416 70368 41194 -10216
36464 -10216 -187549 -293955 -127866 95386 55357 -137092 -166444 -72689 -95025 -149255 -741
36453 -741 197609 115522 -116233 -74842 204565 258649 -18747 -224670 -148969 -51881 -116724
36442 -116724 -156700 -34518 89643 101212 116386 175986 132632 -25693 -103780 -71539 -150859
36431 -150859 -404413 -577362 -485768 -264134 -107859 -40483 -29801 -79037 -127438 -87991 -14374
36420 -14374 -12706 -18953 84191 195964 141286 9794 11378 65344 -79527 -354509 -415385
36409 -415385 -190237 18823 25547 -28856 -15809 -12344 -71301 -111078 -107897 -130835 -156568 -105261
36397 -105261 -43899 -83957 -128847 -24554 105793 15764 -232513 -342800 -247324 -145499
36387 -145499 -129336 -123643 -141140 -231933 -247025 -37495 183087 86277 -226008 -352580 -211820
36376 -211820 -80358 -61766 588 89087 -14329 -273417 -375806 -231688 -79946 -53515
36366 -53515 -45069 -32449 -124312 -252744 -223971 -91290 -80644 -159919 -101456 58389 73421
36355 73421 -32966 -22482 56500 -57695 -274050 -212586 122290 285032 88967 -162484
36345 -162484 -231549 -215441 -173861 -12614 160147 83617 -145034 -134671 121220 177881 -119594
36334 -119594 -386847 -356075 -232055 -201717 -122616 81568 214935 211963 267188 374071 235355
36323 235355 -162522 -396255 -260711 -85463 -152694 -278858 -235636 -129970 -99741 -56692
36313 -56692 27234 -3283 -115185 -38082 210893 236108 -73825 -292360 -128828 143227
36303 143227 225322 258825 407251 457597 242557 44641 154133 362852 305973 33525
36293 33525 -125764 -43516 167835 378823 463101 314503 37928 -108328 -89526 -127025
36283 -127025 -264482 -275380 -119104 -60740 -174411 -178404 30723 140759 -31642 -209926
36273 -209926 -155142 -67193 -179173 -344075 -346465 -274568 -277863 -278879 -199127 -151800 -168936 -74081
36261 -74081 152172 246200 119247 45715 163934 214196 40033 -83227 70843 280560
36251 280560 282663 194562 207752 230485 155517 120945 194082 166131 -30681 -94549 128025
36240 128025 302277 153901 -38130 86177 358084 387281 183094 28305 -23098 -100937
36230 -100937 -172930 -133142 -72344 -121306 -175315 -66051 144241 285013 324398 289029 141914
36219 141914 -63135 -126262 10640 140508 107796 5423 -62054 -121147 -128391 35793 260390
36208 260390 263860 72082 19178 158866 164400 -28920 -38038 263028 420752 130787 -233139
36197 -233139 -221072 28419 151176 162406 245416 293370 121537 -130084 -201867 -98817
36187 -98817 30790 146429 196200 50782 -205425 -249739 -12983 166927 93617 2689
36177 2689 81780 152323 78421 20027 17542 -167750 -511760 -572588 -213257 79617 -22241
36166 -22241 -160764 25742 272509 241416 152584 305852 471806 346897 164594 254410
36156 254410 405080 275826 65718 152947 392370 383222 160447 41683 36883 -44360 -135584
36145 -135584 -78204 -11018 -117348 -227242 -123754 20238 -47557 -196909 -197147 -155951 -245961
36134 -245961 -320565 -234475 -194332 -350159 -423926 -208378 -17830 -137528 -263000 -49513
36124 -49513 218376 127763 -107676 -66428 84540 -68403 -367281 -357017 -135637 -179277
36114 -179277 -480242 -575311 -335823 -80560 23309 87381 115633 27063 -38417 74788
36104 74788 177404 48236 -106473 -1618 173451 94839 -66749 43659 268113 193021
36094 193021 -89982 -140861 50821 97402 -66268 -116380 52310 215591 272665 303734
36084 303734 253236 42280 -109456 43749 305237 313953 134028 79946 133537 57638 -76027
36073 -76027 -10390 186186 246851 196656 219858 218912 24810 -145613 5677 273227 234514
36062 234514 -33947 -94543 129848 325150 355361 329896 226929 -28701 -232250 -137787
36052 -137787 104969 208227 243308 410560 560451 463358 301795 346244 408884 202565
36042 202565 -37831 69488 323600 273326 49475 138564 492643 599739 348063 128137
36032 128137 132289 186848 219313 303648 327054 161022 22874 130907 222923 2755 -217125
36021 -217125 -1768 355723 243607 -226819 -408980 -196812 -70611 -156440 -93449 163192
36011 163192 226499 28692 -56708 76759 116874 -44098 -163183 -161832 -196876 -223621 -65064
36000 -65064 133131 91876 -57592 -8739 100319 -51718 -271421 -129827 225678 292004
35990 292004 89462 33192 79319 -145482 -468631 -333628 182410 406747 159864 -56758
35980 -56758 -9005 -995 -114463 -32673 244852 315967 135505 94582 236291 162096 -175264
35969 -175264 -350579 -237257 -149999 -153324 -3327 178687 6246 -339437 -253689 217267
35959 217267 356401 -22609 -288159 -117701 29615 -135939 -220512 41084 289992 262411
35949 262411 247282 429592 485544 227175 -2225 58358 194562 250864 426639 728234
35939 728234 761231 401697 76031 56220 61759 -131340 -269826 -136887 52513 85857
35929 85857 99633 224796 338851 378323 451140 494806 294340 -58727 -222110 -175702 -206649
35918 -206649 -302389 -154852 202428 393073 369526 441516 613548 572542 352643 302193
35908 302193 378632 224818 -52688 8162 323452 336469 41377 19042 354425 472921
35898 472921 215172 100881 300921 329046 44538 -11482 365832 624376 445001 263663
35888 263663 393619 481613 272617 108936 233643 353665 291859 328065 530725 511482
35878 511482 193827 52480 255683 369599 237718 301477 692408 889740 680888 570282
35868 570282 797165 852627 466116 178475 385566 663811 617326 571052 823558 998071
35858 998071 757411 439221 387383 355167 137523 76407 353978 492089 159664 -191870
35848 -191870 -91240 200990 271978 244078 319543 277127 -3536 -122366 177801 500792
35838 500792 457619 260916 198824 130583 -38131 -15587 282707 441723 279008 198604
35828 198604 401632 473343 197761 18059 201962 322737 88218 -84528 138096 398359
35818 398359 371150 334841 486729 478040 181673 106708 465951 669776 372768 163778
35808 163778 519863 922689 784960 460811 521590 753452 700139 542570 629454 737844
35798 737844 569142 405008 550875 702721 544519 377406 499543 588246 352787 153460
35788 153460 314683 486615 348331 259495 539664 796048 651575 440164 501555 518256
35778 518256 244345 124517 457904 725717 509696 283894 497395 684544 349695 -57128
35768 -57128 40702 305298 189444 -37870 94368 315438 217392 120729 400833 627201
35758 627201 322022 -84374 -635 282966 238553 113250 340134 607985 485512 304735
35748 304735 463774 557275 191556 -78196 316002 820300 676828 263372 354524 727751
35738 727751 714011 504286 673138 979472 872008 642275 854447 1165384 935486 480054
35728 480054 478607 676459 439780 73697 276918 769651 787446 489646 558142 841207
35718 841207 733983 470709 667732 991264 680701 32532 -41094 400747 574147 466345
35708 466345 671019 1044258 961320 641028 791139 1200131 1101610 660821 656833 977336
35698 977336 908200 615900 800919 1173954 891838 247264 252074 769378 794882 393514
35688 393514 526374 1086860 1034211 458191 529188 1295930 1540205 1030433 895476 1441240
35678 1441240 1631968 1176274 1102564 1711156 1938635 1389233 1063221 1402137 1538213 1173531
35668 1173531 1230361 1884078 1980307 1250994 1032702 1835116 2323713 1783443 1405639 1922680
35658 1922680 2219229 1669595 1535225 2459221 2942200 2110270 1578226 2522786 3404826
35649 3404826 2934885 2694372 4077472 5332208 4882707 4821297 7225857 9850647 10244360
35640 10244360 11336115 16894069 23967503 27833608 33273841 50676791 78458303 99453231
35632 99453231 100681239 88642892 77619616 69870680 57431230 39209239 24417612
35625 24417612 18696194 17050357 13429115 9155339 7784479 8057596 6919223 5117396
35617 5117396 5024870 5879790 5413592 4053106 3781270 4424480 4349782 3626659 3599189 4233290
35607 4233290 4387874 4013969 3993453 4397703 4611950 4627682 4900300 5497407 6261142 7147091
35597 7147091 8034238 9088296 11105852 14231356 17246670 20059907 25104925 33153851
35589 33153851 40673654 47159307 62078790 94371501 134202077 156683164 148963136
35582 148963136 123893028 100526941 81619869 60235549 38814076 26943496 24538052
35575 24538052 21830064 15413682 11441432 12239804 12025711 8204820 5782392 7233367
35567 7233367 7932230 5361613 3718877 5372797 6266248 4016953 2550099 4306741
35559 4306741 5497410 3607125 2259313 3970279 5197201 3398450 2090560 3909629
35551 3909629 5380079 3704800 2182263 3624182 4860787 3188909 1877062 3675995
35543 3675995 5191598 3477844 1936183 3694100 5385114 3714963 1975622 3574623
35535 3574623 5282173 3619358 1804004 3389473 5135182 3413721 1562818 3371994
35527 3371994 5417007 3666876 1533059 3245218 5460334 3899869 1995304 4090146
35519 4090146 6485428 4545720 2163727 4361811 7159898 5165426 2416680 4663413
35511 4663413 7825730 5865042 3020279 5675800 9348599 7224924 4144811 7558370
35503 7558370 12298387 10167847 6717025 11153736 17786271 16687647 14321400 22034387
35495 22034387 32802094 34076825 34956499 51708286 74752269 85498728 100633824
35488 100633824 155747080 240185214 294465937 287730818 254549377 234234582 217421850
35481 217421850 182704287 145654629 132234301 135916310 143662805 175906678 250920672
35474 250920672 329291539 348754018 307359198 260362800 235564339 204674290 147308001
35467 147308001 91214505 66522072 61158982 49259422 32976095 27875802 30022324
35460 30022324 25477330 16736252 15071888 17982713 15494505 9742657 9454842 12504310
35452 12504310 10834637 6318837 6377940 9357519 8331349 4643252 4676377 7342921 6819693
35443 6819693 4044691 4300384 6611545 5988755 3348933 3469462 5645485 5469938 3546183
35434 3546183 3886879 5815568 5517946 3660364 3876570 5536754 5192119 3441394 3547287
35425 3547287 4915567 4454732 2806205 2990364 4389453 4056106 2549307 2717664 4056237
35416 4056237 3814860 2427418 2502999 3626831 3305087 1955651 2014675 3124011 2950371
35407 2950371 1806149 1899891 2923881 2768923 1749683 1911511 2960403 2908458 1976552
35398 1976552 2010587 2802822 2687153 2004790 2398111 3415002 3277679 2321740 2347361 3215946
35388 3215946 3279214 2577524 2564636 3190127 3116637 2372314 2171721 2554049 2560988 2264070
35378 2264070 2475670 2984860 2981713 2632188 2597736 2728499 2644096 2722569 3287829 3820434
35368 3820434 3973350 4230875 4823419 5310460 5708898 6519373 7486425 8088195 9003240
35359 9003240 10997357 13084910 14385298 16551459 21101527 26266670 30922521 39381825
35351 39381825 56522440 80457390 106530909 134365043 160612891 169427206 147706413
35344 147706413 111631622 98007996 119212787 143510194 134301373 95281753 59400097
35337 59400097 43864694 37556850 28333546 19763806 17267261 16324266 12142298 8261826
35329 8261826 8316503 8864505 6573149 4426491 5286359 6334161 4889272 3435159 4293797
35320 4293797 5076173 3678465 2453952 3408880 4236792 2928045 1633361 2323489 3048615
35311 3048615 1987487 990429 1746265 2452633 1519055 714250 1532926 2189551 1232233
35302 1232233 471524 1366295 2103935 1193940 417954 1291492 2083946 1291225 632143
35293 632143 1604695 2431847 1493005 530550 1330046 2370274 1928821 1427797 2451963
35284 2451963 3460784 2850446 2395437 4094415 6266782 6453621 5775360 6653039 8339127
35275 8339127 8516133 7553720 7469273 8129872 7979851 7240003 7112357 7059595 5986130 4860449
35265 4860449 5162987 6052616 6021214 5894407 7144005 8810289 9368132 9996262 12414406
35256 12414406 15198378 16428877 18527497 25615003 36914791 47983136 57951816 69140969
35248 69140969 78544410 77298910 63247489 48465831 47370093 59163814 68295611 62578488
35240 62578488 45620598 29802324 21781322 18661352 15610684 12045066 9710784 8620028
35232 8620028 7408161 5965149 5270258 5232289 4734765 3672079 3124989 3385339 3472748
35223 3472748 2932866 2544339 2756751 2908070 2602003 2459446 2796059 2892131 2365125 1986387
35213 1986387 2277809 2538969 2195403 1894010 2228589 2549486 2188404 1783192 2135895
35204 2135895 2723093 2670796 2368693 2719651 3482491 3809998 3901272 4638643 5942351 7007028
35194 7007028 8059024 10411319 14690361 20411822 27432186 35947915 44043653 47078113
35186 47078113 42102701 32875147 27831235 31262851 37867212 38371058 30099624 19334202
35178 19334202 12951789 11017372 9438403 6819405 5103759 4984094 4743068 3657292
35170 3657292 3081848 3513936 3545582 2617423 2127460 2746270 3130633 2507907 2154774 2930262
35160 2930262 3605245 3201631 2862418 3681911 4689123 4880961 5366162 7353600 9696691
35151 9696691 10818300 11703173 14386218 18375199 21195489 22068060 22582444 23741869 24576980
35142 24576980 24052115 22520696 20720714 18669959 16123011 13225516 10342814 7831535
35134 7831535 6043029 5026246 4345309 3657745 3174932 3100080 3100337 2882330 2735182 2902640
35124 2902640 3010846 2745814 2467260 2508531 2545082 2317904 2249712 2636163 2984840 2895047
35114 2895047 2808294 3122373 3383923 3168257 2918568 3070330 3206427 2952922 2817852 3226137
35104 3226137 3639109 3578976 3578202 4141415 4780281 5092880 5686231 6927748 8033850 8696943
35094 8696943 10297468 13962019 18700266 23080526 27164327 30632694 30789345 25828532
35086 25828532 19344295 17708255 22226873 27062151 26242725 20185085 13717725 9926613
35078 9926613 8170808 6813199 5435889 4392043 3807144 3502595 3251459 2903839 2517940
35069 2517940 2301558 2287296 2270001 2140232 2000511 1913584 1836872 1791627 1792445 1704409 1495172
35058 1495172 1439649 1690263 1902478 1746799 1491932 1540966 1710435 1592575 1322908 1298484
35048 1298484 1415332 1318186 1149904 1278589 1505942 1358837 991083 967792 1279241 1390315
35038 1390315 1183559 1050754 1109735 1110671 1070707 1247962 1540103 1634025 1653427 1921110 2236609
35027 2236609 2205342 2115602 2571458 3391739 3919855 4409327 5941028 8721149 11533404
35018 11533404 13295462 14238695 15058123 15714426 15701776 14929222 13728848 12318353 10696312
35009 10696312 8861291 6893815 5022378 3660218 3049968 2859407 2531331 2030333 1778702
35000 1778702 1870028 1916810 1743457 1627212 1692971 1651226 1367982 1160076 1243270 1361101
34990 1361101 1265199 1134018 1182675 1244773 1122726 1038574 1309148 1777187 2005170 1950193
34980 1950193 2020403 2428251 2896701 3189956 3585900 4475248 5717418 6865654 7934701
34971 7934701 9326634 10898985 11868852 12043020 12344572 13381944 14239254 13787317 12633503
34962 12633503 12312634 12739496 12147801 9868662 7548116 6896842 7626240 8486354 9034565
34953 9034565 9252335 8563487 6655738 4561881 3570956 3510451 3264608 2548836 1997121
34944 1997121 1848886 1740854 1607600 1703498 1855457 1670423 1358397 1432791 1740960 1696720
34934 1696720 1325806 1167001 1257028 1128567 747356 573384 721609 866814 927017 1072458
34924 1072458 1155782 915770 631776 775887 1135379 1103901 728084 608162 846785 976975
34914 976975 889178 939571 1128323 1046073 697809 548688 672908 654016 414251 362079
34904 362079 606723 763092 650303 500788 400481 192696 -13718 84679 371001 426464
34894 426464 267737 288622 486055 467160 229644 190991 403158 473706 324541 305244
34884 305244 483030 529159 386449 359496 473748 428603 250164 307690 610336 748649
34874 748649 595834 432848 360633 235281 169326 414138 763349 771161 531900 525062 739886
34863 739886 722018 448646 353106 496107 527445 458694 639992 984801 1081624 1050579 1370670
34852 1370670 1884045 1985465 1830434 2260796 3399409 4450089 5128123 6129731 7792762
34843 7792762 9390282 10263559 10696124 11160970 11601285 11952137 12500695 13225064 13611656
34834 13611656 13589865 13751168 14131325 13736265 11963510 9665400 8097509 7563104 7753837
34825 7753837 8569225 9708007 10153101 9104792 7076450 5247459 4050951 3123806 2288833
34816 2288833 1766403 1583534 1482445 1358817 1277035 1162165 918658 711328 729272 826511
34806 826511 750059 548206 429886 408751 384348 383713 456034 517019 511199 521947 565650 531076
34794 531076 438520 444061 491778 349363 91184 83981 346150 435027 185440 26790 270009
34783 270009 585594 551585 281892 130535 140146 146002 118566 90826 21114 -35194 86758
34772 86758 318727 347041 113905 -43522 75265 257120 293031 258355 216829 81906
34762 81906 -67401 12062 256667 304106 112353 47674 210330 253588 58064 -34164 108444
34751 108444 142508 -58992 -102150 198437 422098 265094 58562 151040 347659 382108
34741 382108 383823 455064 353896 35591 -68654 227707 457281 297291 163370 447533
34731 447533 770229 641247 322466 325628 513302 432431 165000 117492 263776 292777
34721 292777 255363 404515 626228 671553 733965 1153106 1743874 2075544 2253132 2737356
34711 2737356 3472125 3877035 3743531 3530327 3649996 3959817 4119495 4075581 4014443 4053149
34701 4053149 4083278 3838879 3180142 2389859 2007322 2230071 2692569 2970793 3012791 2896076
34691 2896076 2536986 1945014 1435036 1233501 1139731 903809 664350 668242 822323 883007
34681 883007 854641 855563 818800 660504 522507 532929 555176 463493 400866 469569 469961 273732
34669 273732 137838 281352 461872 369475 147908 106619 188225 155221 57795 76808 124492
34658 124492 37078 -39922 110686 344931 384474 296482 329368 440187 407613 269279 235246
34647 235246 290154 267590 200025 226260 271537 178390 40995 65746 208526 271691 247120
34636 247120 260366 297946 278505 262438 320711 344944 241730 138003 144431 128525 -9208
34625 -9208 -70673 124847 384951 417886 258791 126337 64478 15598 29094 112407 105154
34614 105154 -29869 -57599 114941 190266 -36714 -278099 -202024 32784 85984 -17459
34604 -17459 -58791 -62149 -139218 -161262 -4597 131517 56536 -37635 55322 123493 -72945
34593 -72945 -291710 -193543 52768 86406 3926 118632 311413 238999 13115 42718 310034
34582 310034 416068 283567 222306 314903 302440 106877 -40303 -28105 22860 88658 255636
34571 255636 413748 351725 145848 61772 107816 75686 -39559 -69536 -50021 -142938 -251900
34560 -251900 -157546 25628 -13689 -233744 -294690 -142115 -60941 -134198 -118292 83859 258059
34549 258059 268099 229652 224387 185546 123201 145995 225527 229089 175408 168475 136231 -40192
34537 -40192 -214132 -155062 25962 23158 -143004 -160523 45284 234345 302700 392755 521061
34526 521061 503695 325971 223444 309551 432159 457995 412957 311318 130239 -30672
34516 -30672 -39402 25584 -6631 -75978 18130 238727 331707 206691 14226 -123920 -192269
34505 -192269 -153608 -16476 60788 10487 59545 372381 662239 554779 184485 -24483
34495 -24483 -46563 -208678 -512320 -554962 -192939 207215 297913 125701 -118720 -343440
34485 -343440 -450351 -342278 -136472 -64106 -98768 6016 276003 445774 376986 223233
34475 223233 124496 48098 -13768 12103 82654 54529 -65942 -131004 -104070 -65314 -17649
34464 -17649 53712 20747 -186330 -329069 -164234 108672 98911 -162128 -288462 -164996
34454 -164996 -52205 -79496 -92101 -34522 -51498 -153487 -182183 -147300 -202785 -270798 -114157
34443 -114157 184937 260729 38008 -165070 -176850 -171091 -238065 -212779 -65655 -30235 -173240
34432 -173240 -232074 -58289 133939 131456 6892 -105634 -199483 -229779 -82302 158952
34422 158952 223454 56170 -93796 -88030 -83487 -194740 -293060 -264304 -169622 -47707 145711
34411 145711 320524 291283 113598 56444 166304 205336 97507 54702 151384 168477 12125
34400 12125 -90133 9281 129945 103517 36196 47172 57915 25636 81820 251865 332148
34389 332148 232244 147387 200102 206779 18913 -179681 -159311 3286 98108 112546 157618
34378 157618 219931 206710 135890 107150 148831 203772 212511 164602 127482 200276 346728
34367 346728 359995 144772 -85872 -107964 -42695 -137753 -332231 -385741 -326993 -372504 -473028
34356 -473028 -379126 -130126 -23354 -85375 -33376 194743 330558 257988 154809 90611
34346 90611 -47912 -168024 -21053 259572 215083 -192638 -448860 -299025 -121588 -223463
34336 -223463 -339979 -194278 -20226 -94335 -206419 -68794 130386 69004 -124873 -111967
34326 -111967 78384 163937 113019 109067 166889 166975 135007 145205 96535 -79535 -151323 111482
34314 111482 502006 613096 419247 257151 273544 253654 29671 -243448 -312123 -134255
34304 -134255 109782 212307 119443 -26631 -47433 56174 136500 147867 198643 318793
34294 318793 378887 322359 271516 293054 261417 87253 -103477 -154489 -80133 29449 132735
34283 132735 170408 66921 -100518 -132390 -118 104576 98277 130328 268386 337515 229082
34272 229082 103671 106746 136596 89168 83482 223654 364280 344249 252114 232873 225672
34261 225672 126146 25553 44243 88652 20203 -73305 -21182 127424 181532 108352 42005
34250 42005 51113 81162 84750 61809 8897 -65426 -123677 -162665 -214678 -248008 -186822 -64428
34238 -64428 -4376 -12811 27806 115717 102206 -17629 -28056 166176 343073 267248 11567
34227 11567 -183385 -226547 -210658 -243737 -353884 -468264 -441592 -224861 -4721 -2197 -146538
34216 -146538 -172704 -32891 65389 47771 79501 213792 261601 135512 22175 66109 153661
34205 153661 155893 127692 123712 66307 -64475 -145086 -131426 -133014 -174840 -145072 -57541 -71208
34193 -71208 -163525 -110965 99642 189184 49235 -68781 12703 127626 108383 51440 55042
34182 55042 36582 -886 120289 371620 419474 134214 -168364 -229756 -210904 -293306 -319202
34171 -319202 -145961 14131 -43955 -149201 -88935 12499 -7157 195 174023 295515
34161 295515 148826 -60087 -43236 89251 92586 55191 173510 314329 254967 138518
34151 138518 226299 388050 311561 64276 -28722 53888 62302 -16273 44935 234079 264902
34140 264902 51394 -157120 -164851 -46718 58742 113143 110342 50750 -20527 -94829 -237371
34129 -237371 -409079 -412069 -187691 25914 40606 2959 93980 188887 110299 -11346 37702
34118 37702 172097 187688 134744 168761 213296 121982 -2391 -2852 5213 -133391 -255295
34107 -255295 -148636 17256 -36461 -182430 -111629 86871 77398 -105911 -123691 47260
34097 47260 91247 -51045 -87373 75598 179826 104119 49928 124819 159211 70340 26804
34086 26804 109813 158064 91601 70243 182808 262915 158289 -55898 -244224 -369828 -403868
34075 -403868 -296134 -108619 20370 82154 168335 243400 189888 72982 81269 186944 159686
34064 159686 -33300 -137479 -5335 191800 251355 196064 127649 39203 -95772 -208955
34054 -208955 -227287 -169705 -93193 -35989 -24911 -38092 10732 133296 178775 39658 -135412
34043 -135412 -131999 -3681 10746 -138713 -256525 -206294 -56090 75618 123674 44661 -122105
34032 -122105 -185373 6646 321840 476937 389936 224011 124681 100013 115274 117779 16119
34021 16119 -185247 -298628 -186055 6376 49235 -30634 -34656 76145 174467 210614 221059
34010 221059 170257 27078 -76700 -5940 140890 192057 194916 286493 387115 323755 167958
33999 167958 137014 226784 253423 197626 190748 212695 127871 -14878 -34303 63180 118995
33988 118995 131335 214719 304155 234936 76440 44172 117106 97357 11798 65381 206185
33977 206185 151124 -115699 -274827 -176954 -34610 -13383 373 100331 168870 130558 104380
33966 104380 163818 198171 126203 15237 -92723 -236627 -357396 -311298 -122061 20846
33956 20846 57029 101079 172063 153189 57284 50703 162865 238408 214533 179204 139197 20845
33944 20845 -89228 -22091 137916 133502 -24819 -62957 69350 115090 2693 4885 246927
33933 246927 446990 359046 138951 41439 42615 -3125 -76082 -88300 -72530 -84176 -82357
33922 -82357 -50098 -58097 -99773 -61891 39512 17005 -176224 -313921 -213507 7599 120082
33911 120082 57605 -98658 -248693 -306956 -255670 -201784 -228040 -213532 -15068 220220 206706
33900 206706 -35835 -203491 -168449 -77763 7970 181370 353205 282380 43897 29924
33890 29924 329412 541544 409422 206155 227207 312975 210326 51065 86317 219439
33880 219439 195436 54894 23762 94375 70885 -54310 -86115 48777 215321 284517 238545
33869 238545 94881 -108377 -278561 -342625 -322919 -270125 -195797 -124777 -106399 -118466 -78976
33858 -78976 3655 28635 -15847 -26232 29880 69534 60694 51305 24059 -69469 -129772 -8530
33846 -8530 205197 267888 165481 117118 174060 153798 27045 3472 136700 216787 179072
33835 179072 235698 444344 540069 393786 249282 276107 279904 128547 69046 276708 448432
33824 448432 252950 -97582 -157950 73986 219180 121856 -13743 -28190 7798 7001 -9232
33813 -9232 -8570 15319 78262 151357 151892 90954 96247 190172 232134 195863 268638 512315 672112
33800 672112 530038 226185 19653 -46508 -33217 90992 288159 337349 157093 14349
33790 14349 128605 297003 226960 23702 -5176 145609 230521 172510 85092 -2470 -100934
33779 -100934 -58526 239399 552291 524034 195073 -56327 -48186 52582 89295 105328 155168
33768 155168 203769 246738 308978 323869 213869 54168 -41290 -114693 -216937 -182930 136922
33757 136922 498289 477340 70936 -261486 -214941 21115 137502 120269 129389 193691 223145
33746 223145 194326 157937 128513 85402 50006 80012 186495 291098 288816 176604 93505
33735 93505 154932 263682 219334 26850 -86063 -18003 51867 -24978 -119734 -67428 42963
33724 42963 40223 -28472 -9174 73929 89446 50301 51395 50170 -38624 -110890 -5926 180844
33712 180844 194076 10149 -136386 -128094 -100457 -151559 -164531 -23816 181618 296018 313511
33701 313511 339429 400649 394033 227905 -23825 -150812 -30978 205585 329574 304335
33691 304335 276386 281204 180567 -38868 -150551 -20274 164194 182581 104907 108376 149819
33680 149819 76758 -65674 -104666 -34040 4971 -23730 -38610 -24792 -26241 -10823 64483
33669 64483 119602 71601 12094 69637 179293 196781 155148 179408 222335 135653 -40057
33658 -40057 -104349 -649 130547 188258 192128 146984 40222 -32906 49710 223060 291554
33647 291554 207621 116830 118306 151279 137843 88973 46681 34231 65481 118371 132599 102160
33635 102160 89377 78695 -43025 -257649 -351393 -237519 -140917 -240968 -333116 -139502
33625 -139502 205209 322892 151661 -15702 -11077 37753 21688 10183 45905 56497 29284
33614 29284 40658 76311 43286 -23872 4653 107884 131415 54951 5298 2386 -55409 -146858
33602 -146858 -136483 -48830 -59676 -175856 -203588 -93401 -35745 -132338 -244569 -266415 -284325
33591 -284325 -351926 -359322 -257841 -181196 -207075 -216597 -122527 -18202 35912 144192 336321
33580 336321 426029 301138 142594 137639 173043 68325 -58806 29035 243876 241068 -63894
33569 -63894 -347916 -326795 -106160 34140 17285 -26838 -15766 2533 -14651 -30424 -7650
33558 -7650 31533 52113 46475 10677 -51961 -82543 -3531 151162 228441 150380 34474 24144
33546 24144 82233 84524 43219 59013 91840 -7769 -223296 -337487 -230453 -30822 92612
33535 92612 114784 68767 -36563 -132786 -104717 29307 119441 124627 148846 186011 89824
33524 89824 -109084 -154118 14319 90069 -130654 -399430 -395718 -199538 -91609 -108089 -107737
33513 -107737 -85085 -91450 -18051 209720 379131 271028 48825 16753 127448 107350 -40767
33502 -40767 -63845 79681 180005 161181 125501 45343 -191839 -432263 -356701 12994 277574
33491 277574 205203 -16019 -130680 -97058 46808 273635 438750 356442 87933 -105556
33481 -105556 -136142 -143463 -171501 -116641 -21089 -58921 -171144 -88053 189050 307930 108832
33470 108832 -114383 -76188 109297 202783 205992 228072 237526 172312 97147 61107 -17791
33459 -17791 -166177 -239780 -141293 25252 139728 215639 260954 207057 93226 99057 266874
33448 266874 407854 400338 352973 356607 322624 198680 92202 42757 -63452 -210141 -177581
33437 -177581 69078 224646 98917 -74225 -42982 45664 -45084 -185236 -113668 68460
33427 68460 56570 -118533 -128346 102537 268261 153752 -87235 -217011 -216580 -184177 -124929
33416 -124929 16351 207049 318535 252293 52594 -105514 -82818 55879 122322 75612
33406 75612 78744 221136 349083 301682 167653 132427 181107 153785 30763 -43590 -7568
33395 -7568 31903 -14347 -90758 -102348 -44940 19684 56804 82311 115490 137978 120104 93446
33383 93446 145599 284753 368219 280224 142220 186304 415202 566652 466389 245424
33373 245424 123979 134592 166866 159381 129499 101959 101877 142494 157734 42115 -184174 -355809
33361 -355809 -366360 -283315 -210835 -166112 -148825 -190165 -255748 -237164 -121735 -36344 -45446
33350 -45446 -53309 6237 42603 -20128 -98579 -99296 -66746 -54061 5468 148919 244075 169534
33338 169534 25264 -6180 80848 158168 187083 231218 300369 336048 318976 266742 166431
33327 166431 22368 -80886 -77577 -33006 -47189 -97417 -85800 5671 115594 212361 296758
33316 296758 336859 304088 243490 219809 227080 227328 230911 257218 267424 224876 174908 173240
33304 173240 179459 122137 40338 54626 196859 355110 405628 338996 232768 144219 73134
33293 73134 25323 61671 227086 443672 561309 540763 489300 468590 397964 242759 148513
33282 148513 224409 323973 254514 103312 103266 239051 268633 118041 -35187 -90263 -142703
33271 -142703 -225354 -218796 -102370 -22199 -17804 46613 179961 187946 33799 -27091 137721
33260 137721 268571 98263 -222141 -339959 -177003 46502 129855 26931 -209680 -427151
33250 -427151 -430840 -213828 -12878 2324 -55340 -26982 26514 -20116 -109263 -117686 -78955
33239 -78955 -90695 -130305 -141419 -161984 -199690 -151357 -21366 -11917 -182137 -248235 2112
33228 2112 318879 346479 178143 165167 315928 325229 143200 55947 159974 187976 -19239
33217 -19239 -239390 -238664 -110349 -52478 -57324 -28437 -11631 -95785 -215647 -246401 -205306 -192897
33205 -192897 -202054 -143966 -26043 46306 48041 86377 230619 381218 387267 257364 160961
33194 160961 203696 294282 301218 253008 254059 259980 123068 -131442 -278757 -213033 -99434
33183 -99434 -99136 -130300 -61112 24620 -35089 -182673 -202330 -35986 154700 225254 181309
33172 181309 85105 -14376 -52021 13493 112026 127771 65065 42400 105186 148896 71362
33161 71362 -70834 -116765 3508 164561 169175 -9460 -160725 -84548 131704 200907 -4592
33150 -4592 -313303 -492159 -481783 -354352 -187285 -57669 -41997 -134861 -244560 -307198 -318945
33139 -318945 -261739 -133811 -44174 -96311 -174703 -62644 204473 349232 262227 129428
33129 129428 75659 -10708 -168175 -199612 -15627 153100 112524 -502 -21573 -71704 -276131
33118 -276131 -439705 -349622 -181216 -230210 -417608 -445976 -306362 -227837 -224913 -116102 50053
33107 50053 7935 -260308 -452396 -404007 -284900 -255420 -233886 -119148 12129 57614 47342
33096 47342 47289 50441 26210 -41453 -177821 -356714 -445354 -356655 -211278 -183894 -246087 -243182
33084 -243182 -155134 -73043 9164 142306 228168 141347 -3724 12375 142926 135621 -42759
33073 -42759 -153167 -81370 23875 63392 125152 222368 201765 40535 -50206 25002 54993
33062 54993 -130186 -346202 -311621 -56386 150232 180348 154773 216574 357839 464177
33052 464177 432220 249890 15157 -141675 -175429 -135721 -74541 -15592 -2556 -79627 -211519
33041 -211519 -303820 -305786 -221660 -50019 183675 358019 345126 176237 16554 -24089 34529
33030 34529 133010 226406 263974 223031 154546 109051 52352 -53198 -141197 -132667 -82450 -106367
33018 -106367 -205399 -285412 -305044 -282644 -211018 -90197 12459 53284 90861 161561 184774
33007 184774 125802 115340 228622 289523 121841 -127510 -176124 -23551 92852 89443 93178
32996 93178 143016 128858 36160 -12928 17245 45187 69036 164839 291493 325061 277566
32985 277566 257531 244723 148564 48581 102367 248491 295259 272155 363489 509770 452318
32974 452318 212203 128287 312995 451068 301042 49889 -31861 18728 39037 53140
32964 53140 150930 249751 220338 120741 102099 177140 241829 246736 223406 207426 215581 236145
32952 236145 214714 132905 79906 118584 131667 -11290 -183968 -145193 67157 159579 20782
32941 20782 -144812 -166760 -108720 -53492 29531 117169 104551 34429 90606 281100 401413
32930 401413 387960 405775 498402 487369 344453 310472 469732 551552 369019 128860 63546
32919 63546 65893 -39671 -152617 -123193 -66225 -131748 -189052 -68542 82240 33914 -98659
32908 -98659 -37443 160213 166803 -78835 -252525 -111886 193981 363513 293653 109764
32898 109764 -23092 -43937 -8413 4944 -10591 -31087 -102228 -269102 -416506 -367466 -174033
32887 -174033 -93704 -204657 -276691 -134542 87029 193492 203997 205332 155738 31077 -33407
32876 -33407 48608 147105 149487 162898 271017 301054 97370 -150664 -146681 72764 218938
32865 218938 176178 73994 5305 -59785 -108966 -70585 40900 137151 193658 236136 241469
32854 241469 186606 133472 143553 181133 198891 215501 223351 164535 86379 130346 256953
32843 256953 213986 -67838 -298546 -245237 -69322 -12952 -10911 96173 206624 151478 39278
32832 39278 59602 125537 69660 14288 152556 325302 252025 54979 81949 287355 290193
32821 290193 32946 -124315 -14506 129304 173694 293468 512720 518387 189270 -102790
32811 -102790 -31647 180910 142639 -94653 -169652 1598 136600 34736 -177740 -270135
32801 -270135 -177543 -15178 63003 5655 -84383 -68694 40367 99136 59611 42422 123168
32790 123168 192335 130909 -820 -75127 -97509 -157832 -247846 -268837 -198425 -129945 -135569
32779 -135569 -174192 -161631 -87402 -34135 -87430 -236328 -376217 -413057 -336194 -179548 27085
32768 27085 220146 282572 155949 -52018 -157863 -94732 46846 148361 164520 114685
32758 114685 45079 -3951 -36846 -89932 -154637 -168949 -122018 -90214 -115223 -134174 -98031
32747 -98031 -59583 -61214 -48471 -1474 -28920 -186308 -309997 -210047 42260 193823 127991
32736 127991 -54800 -222112 -308982 -272673 -115580 61755 161807 209916 261562 272047
32726 272047 199933 138075 161003 144126 -45947 -270066 -282164 -119565 -50893 -157811 -260657
32715 -260657 -273505 -325570 -459885 -507619 -387362 -272167 -301849 -343859 -217891 7936
32705 7936 127188 84752 -10040 -80709 -144628 -215364 -258583 -241317 -175012 -125049 -179643 -354112
32693 -354112 -530053 -564819 -459169 -339736 -293224 -307979 -347816 -370036 -301581 -126522 33484
32682 33484 65035 47576 126814 247377 218062 28318 -126983 -153642 -154040 -177643 -124266
32671 -124266 20579 92765 14051 -58815 13203 133206 148630 87638 63512 80092 80450
32660 80450 72953 74809 39876 -35740 -51433 35205 107648 80259 55444 137042 213896 119706
32648 119706 -80829 -169764 -94788 -13152 -23146 -34972 52566 192421 273987 276336 267317 291160
32636 291160 312838 278651 206085 169443 168944 76129 -188929 -454531 -425004 -55903 338902
32625 338902 439072 260459 49295 -51862 -94148 -149831 -204552 -217495 -182135 -118802 -70415
32614 -70415 -88730 -166174 -213697 -173705 -117609 -147839 -230326 -224529 -85052 59629 66994 -43306
32602 -43306 -121552 -64666 86358 216192 253869 203501 101007 -5314 -50750 -7747 46563
32591 46563 3527 -103191 -99552 82799 267136 251231 81526 -31638 -10210 39289 33164
32580 33164 1070 -24162 -48204 -44653 5887 14548 -108508 -254647 -226062 -54712 20774
32569 20774 -56655 -57096 146357 341504 304729 140363 73690 86922 15348 -120976 -153542
32558 -153542 -68878 -15070 -20836 51031 243665 406886 409275 284669 122905 -30666 -115803
32547 -115803 -48489 148484 316442 334194 233413 94016 -66204 -225162 -284221 -173700
32537 -173700 22364 148432 161431 149875 184021 231378 233596 196680 167609 161549 152125 114978
32525 114978 45723 -55013 -173686 -255338 -225335 -68253 139595 303708 392048 411158
32515 411158 342334 172448 -22915 -112148 -52729 56969 102567 72946 16733 -54418 -146478
32504 -146478 -206874 -159556 -20007 102523 144959 168523 249567 343874 338992 228713 141786
32493 141786 160599 195981 125719 3595 11851 206871 428516 496757 396885 224460 55770
32482 55770 -52618 -40766 69072 139182 79722 -20146 -34913 5268 11518 45763 228163
32471 228163 460722 475596 208448 -83794 -165348 -96533 -53119 -47112 7218 78642 65853
32460 65853 -4492 -9809 58759 80500 4591 -76726 -79342 -29933 16693 53540 70211 26128
32448 26128 -65586 -114067 -82133 -65726 -151188 -251859 -204745 -11884 141476 138904 87211
32437 87211 145039 283567 328800 207804 36515 -51328 -62936 -84936 -132064 -130009 -33440
32426 -33440 90801 114441 -24326 -244815 -386899 -362903 -229977 -98039 -9180 49371
32416 49371 66629 26650 -23697 -21559 12115 18276 26379 109812 218678 208532 65896 -52252
32404 -52252 -60975 -67399 -159811 -236313 -173983 -39832 16679 -11664 -18077 36161 101294 141335
32392 141335 141113 79105 3386 48287 246893 415204 371095 190103 85437 108314 143619
32381 143619 140292 147709 155132 97169 19184 50010 192294 308829 335654 341260 348761 275589
32369 275589 109206 -13740 9577 99444 113494 37629 -18334 27982 140464 215955 208860
32358 208860 188475 234493 295850 258405 161242 179634 322333 345607 121993 -95723 -6568
32347 -6568 286231 422525 294349 126721 96770 157622 238882 348221 438698 417087 328673
32336 328673 320611 392051 390429 273742 156265 78412 -33069 -152870 -154651 -58466 -27808
32325 -27808 -74195 -29305 128609 198689 92502 -31512 -66045 -100877 -154659 -69378 160082
32314 160082 253679 64276 -140115 -64846 172354 266190 191344 144601 163695 117187 429
32303 429 -48052 -6751 -4971 -86816 -134744 -50999 122206 267749 279934 120636 -112653
32292 -112653 -225768 -133340 31332 96973 61510 23694 13274 16828 74532 196728 254272
32281 254272 113784 -153648 -342554 -371564 -344824 -365047 -402433 -368235 -242694 -106553
32271 -106553 -70042 -162396 -289489 -336688 -299089 -244322 -176874 -54046 78327 113971 62899
32260 62899 42973 67496 14796 -136116 -216287 -98991 126701 293655 332254 250508 91126
32249 91126 -31155 -4260 116805 177638 176528 245336 362484 349493 207575 157303 245117
32238 245117 234700 37387 -90239 13974 118151 4163 -141553 -68685 84514 50149
32228 50149 -81597 -28993 189115 319345 314391 327669 353435 243188 32202 -88941 -88011
32217 -88011 -71730 -29216 81977 91672 -160861 -431245 -322641 79578 271353 76483
32207 76483 -121065 -9620 223552 295422 263652 291825 293614 122537 -96538 -127796 14182
32196 14182 124290 139000 170338 252655 272462 168112 40012 8970 58884 88388 87507
32185 87507 181500 439068 684869 647153 330244 69450 97989 228843 155753 -81773
32175 -81773 -197664 -127269 -84967 -168027 -216781 -132798 -57833 -121690 -233217 -249210 -181346
32164 -181346 -121602 -98795 -100219 -119116 -120213 -72603 -45317 -133941 -275571 -298033 -173944
32153 -173944 -47300 17677 108956 237911 258200 109016 -53560 -77379 -679 76483 134969
32142 134969 151073 48917 -137233 -218838 -109014 23103 -7943 -144673 -207113 -146983
32132 -146983 -37345 77262 172499 187248 122889 110977 236943 377036 356761 199889
32122 199889 72130 39657 37023 26714 29320 17701 -58942 -138050 -78384 129378 306370
32111 306370 298955 162396 64317 65723 84363 60781 63994 172974 311406 315886 181872
32100 181872 110288 224159 358620 285823 67705 -23211 80390 138665 -14027 -205927
32090 -205927 -191508 -14375 83725 23290 -48979 -37760 -44612 -170079 -305199 -240401 53701
32079 53701 354827 422889 244249 -1053 -160973 -211626 -164604 -17903 151058 183482
32069 183482 41651 -90685 -39902 117410 196386 193250 231537 278536 164357 -98198 -252787
32058 -252787 -136287 117808 297373 351603 316591 184140 -15188 -140323 -103250 -5637
32048 -5637 19832 12387 93992 256563 376660 388837 321871 213395 109166 96018 197410
32037 197410 264911 123684 -161415 -304591 -140945 150379 244889 43057 -237220 -325743
32027 -325743 -185791 -8900 23565 -88068 -213908 -241403 -145567 14494 114901 45096
32017 45096 -157197 -294539 -219361 -21815 83203 27548 -61135 -72295 -50816 -87933 -169725
32006 -169725 -191958 -82819 118000 279927 290472 176198 86374 116223 195931 207504 136755
31995 136755 27403 -123603 -296515 -356618 -201996 40011 139803 65863 -18044 -32153
31985 -32153 -48693 -72359 15544 221946 353660 271024 76255 -47815 -50655 20772 132629
31974 132629 241785 278137 238560 198833 173550 90973 -31130 -41007 114779 260066 217732
31963 217732 52222 -46660 -20989 46632 93292 103898 41883 -109773 -266656 -310263 -221589
31952 -221589 -80446 27599 44989 -50536 -191896 -233717 -107425 67626 100187 -65493
31942 -65493 -295285 -382544 -209421 133938 374934 307187 48534 -70419 73670 237483
31932 237483 169022 -31058 -75601 84410 209085 123174 -70608 -177985 -170004 -164073 -220628
31921 -220628 -256618 -168334 15325 149094 135861 21304 -98826 -193764 -252445 -202378 -7015
31910 -7015 191814 191515 5774 -128264 -58964 112497 229247 285938 344543 381835 347694
31899 347694 280884 244915 217396 152271 92172 109727 178282 202652 158636 120431 156790
31888 156790 255748 346909 367500 316705 251003 205390 142325 27051 -88222 -142452 -184926
31877 -184926 -290302 -384657 -320429 -128970 -14422 -50978 -70485 66196 255282 316541
31867 316541 230012 88145 -62321 -199948 -250521 -168035 -39628 -3031 -90834 -214908
31857 -214908 -260198 -168822 -3584 68326 -34198 -136367 8183 341407 513950 351121
31847 351121 97248 65971 232583 340140 265015 97614 -38494 -80193 -6033 137895
31837 137895 241040 245792 196303 120817 -14890 -174241 -220704 -113381 13973 57339 64803
31826 64803 70171 5095 -106263 -87368 96668 208134 93003 -53714 -8699 111737 84163
31815 84163 -13307 47790 222034 261198 132977 39578 59315 80857 73371 120587 187518
31804 187518 143934 34636 46663 181499 233901 137807 64358 114198 169593 136792 100567
31793 100567 135645 164351 103936 -7621 -110282 -196976 -238262 -184201 -80060 -29594 -26919
31782 -26919 12360 63037 37030 5957 121866 293617 235812 -73208 -275853 -125588 168682
31771 168682 274445 185265 121399 161122 208940 215517 208302 171663 80299 2538 21814 104217
31759 104217 163829 192616 212816 185969 93750 19913 19247 3930 -84436 -96408 121557 410261
31747 410261 432468 135586 -156372 -184370 -75637 -91551 -221673 -226491 -18803 199112
31737 199112 214394 73295 -17773 22104 79362 48412 -15400 -2789 67059 69798 -35908
31726 -35908 -142253 -144373 -81754 -67101 -120128 -151832 -109237 -53774 -53214 -56555 36734 193801
31714 193801 239576 82617 -133380 -193706 -74283 67835 126567 134650 131503 102949 83301
31703 83301 154137 276549 287738 159116 88783 199070 307810 199058 -8986 -18135 190539
31692 190539 323559 216179 48576 36835 127241 139521 59206 16602 51925 63902 -14898
31681 -14898 -114599 -136769 -94417 -84234 -137126 -156288 -37493 184780 370349 434918 400041
31670 400041 287186 76700 -186527 -362358 -372938 -305385 -275343 -269023 -208102 -94106 4912
31659 4912 44375 3419 -116712 -215655 -133469 121470 306586 244465 66246 -2648 31992
31648 31992 25662 -6743 56551 160404 120031 -54730 -146166 -68734 24414 27932 39427 138070
31636 138070 215945 151110 -830 -95804 -73809 25026 112106 78956 -104696 -285920 -250241
31625 -250241 11784 279044 365856 289548 165061 81708 99344 204711 248857 97464
31615 97464 -135125 -193882 -58809 6697 -144762 -324427 -309255 -160081 -78851 -109472 -152952
31604 -152952 -162554 -157143 -119434 -26054 71226 100987 62464 -9114 -99013 -176374 -188378 -152188
31592 -152188 -158435 -221942 -232929 -126981 -315 22837 -50594 -122469 -119694 -26356 104013
31581 104013 140071 413 -181229 -169797 48437 228169 212629 129130 142870 211092 217698
31570 217698 177528 150787 105610 24620 6905 101708 180060 144245 121762 248381 386957
31559 386957 301634 32602 -143883 -92576 64056 184408 243222 220549 69972 -142655
31549 -142655 -231670 -97006 162779 374654 433091 312900 67424 -145532 -148442 70045
31539 70045 307637 342000 150400 -87528 -187027 -137104 -76290 -97483 -126726 -50783 83481
31528 83481 113603 805 -109783 -99597 -13300 64304 128829 183218 181022 128850 115883
31517 115883 154647 132839 19779 -39302 38311 106171 24909 -88760 -48738 90768 133184
31506 133184 55591 718 17118 34076 56427 157349 286485 301399 208181 177739 287752
31495 287752 412076 405749 268945 104137 21487 84191 238414 319677 239155 116841 106316
31484 106316 160782 132845 27995 -40931 -87138 -205143 -329970 -293470 -117472 3494
31474 3494 23521 77790 159725 69790 -212947 -401850 -305401 -106143 -50635 -87303 -35575
31463 -35575 71009 68446 -27581 -46699 55807 159007 189750 189402 177478 115013 15683 -39952
31451 -39952 -18788 36802 98532 177144 254210 272247 206999 96805 -775 -49469 -54313 -67489
31439 -67489 -131538 -193695 -146598 8727 128388 111899 28737 -16212 -39101 -92203 -121607
31428 -121607 -52713 49853 64203 14467 31581 122497 142576 26227 -99155 -88653 33093
31417 33093 117954 57929 -133052 -337428 -410148 -298028 -100940 36569 82512 96134 85233
31406 85233 13026 -55129 24883 244630 385185 300026 139493 151444 329205 414384 234494
31395 234494 -102536 -372726 -478200 -471836 -421146 -327313 -168607 21442 146324 135865
31385 135865 41942 1649 76021 170355 164033 74156 15392 29578 51932 39365 24711 20439
31373 20439 -23370 -108056 -126638 -3221 166352 211895 105036 -12568 -20039 45724 74938
31362 74938 44984 33898 85468 121361 33355 -151719 -266592 -202944 -61673 -26092 -117503
31351 -117503 -186613 -150341 -103932 -140941 -186465 -115047 51724 184465 225227 209707 159620
31340 159620 86086 70338 192075 373071 437131 355210 292175 357817 446100 408291 273735
31329 273735 180961 157411 96171 -59936 -214993 -229820 -84578 95452 162840 88311 -24843
31318 -24843 -70768 -60311 -72321 -110727 -88927 26172 131818 106438 -30388 -131237 -89537
31307 -89537 36722 81484 -48651 -262345 -386601 -380512 -369832 -430331 -443393 -278118 -30335
31296 -30335 86313 46279 15393 48820 9473 -142262 -198863 3442 304815 413455 277242
31285 277242 89338 -9767 -56525 -113210 -156625 -142587 -73324 20411 95700 108091 75653
31274 75653 100951 241303 385208 359488 150456 -74899 -163393 -103640 30652 163452
31264 163452 229714 200432 127494 96768 112880 92221 -7122 -110596 -119753 -39849 24037
31253 24037 -11347 -108347 -139748 -33769 118686 146331 919 -178786 -238908 -183508 -126621
31242 -126621 -137578 -203166 -282126 -311540 -214679 -7896 140304 77536 -119459 -219386 -126981
31231 -126981 18672 54245 -19742 -105201 -151036 -159352 -127731 -68881 -41786 -87232 -154138
31220 -154138 -151067 -61985 37090 74762 58493 46197 74113 130087 182210 207842 191682 124891
31208 124891 31592 -27225 -19611 1516 -34880 -103409 -112965 -60703 -53744 -134738 -197495 -160547
31196 -160547 -116580 -175104 -237559 -113312 155995 286842 130644 -107730 -145775 1889
31186 1889 81013 -25913 -158478 -144342 -52826 -71304 -210380 -282554 -180986 -40276 -42851
31175 -42851 -163772 -225961 -159253 -71950 -71830 -144028 -224555 -270497 -225236 -49033 155077
31164 155077 183334 -4130 -181259 -137233 47481 147322 119460 108398 177687 235785 233158
31153 233158 246117 311551 332557 231436 83391 5478 -9461 -52105 -132577 -151987 -44398
31142 -44398 116337 190964 141726 82773 137473 277168 360051 314560 199713 82200 -29668
31131 -29668 -92150 -6970 204985 330549 203495 -62520 -220066 -200326 -131190 -102783 -88368
31120 -88368 -74493 -97636 -145627 -169315 -190962 -257323 -300015 -210589 -49121 11159 -39391
31109 -39391 -33797 67428 88872 -50887 -170548 -118598 -40666 -153028 -380309 -437861 -218448
31098 -218448 90872 260908 243218 146801 105915 169166 244692 183101 -25833 -204139 -208193
31087 -208193 -112751 -68571 -74423 -40251 1175 -64993 -210601 -268173 -171525 -25874 82480
31076 82480 178059 259785 246626 135275 60068 99230 147798 85397 -41046 -109870 -102329
31065 -102329 -78821 -66349 -77013 -145678 -232930 -193472 14540 189480 132307 -56702 -138416
31054 -138416 -113710 -169727 -275668 -165667 191311 427853 268087 -77211 -231348 -155670
31044 -155670 -72444 -53112 11567 119998 141475 67824 21769 19677 -30914 -100010 -50841
31033 -50841 97689 172390 136367 122067 133638 -3477 -310644 -549348 -566780 -488496 -432706
31022 -432706 -306436 -67058 82613 3313 -99460 23808 258919 305400 130055 -44220
31012 -44220 -110426 -154752 -215536 -230133 -198258 -166755 -79308 136579 365164 414046 308242
31001 308242 243323 259578 203531 25634 -121450 -124451 -42193 45143 125496 154241 57424
30990 57424 -110044 -182154 -108977 -10390 28848 51084 80245 60010 -12927 -56751 -57009 -98662
30978 -98662 -198798 -256091 -214374 -138050 -85418 -37774 20673 79245 157402 250078 249302 92229
30966 92229 -59961 -13732 123063 72286 -152333 -228710 -27745 196385 231031 196324 238916
30955 238916 238192 56335 -158672 -182794 -58013 17701 5810 7825 44565 64359 79464
30944 79464 111839 93811 -12910 -97903 -58576 30175 55279 53138 92821 99208 -17702 -166875
30932 -166875 -206187 -174019 -195011 -240350 -186028 -46667 45433 50588 37333 33524 21692 31724
30920 31724 88374 126645 99613 88524 159464 214574 155700 85124 148123 281861 333345
30909 333345 321580 346542 341717 191451 14542 27095 166714 172837 31153 1 155926
30898 155926 256551 153453 19402 23321 74344 66592 109105 291146 441647 375668 219957
30887 219957 231746 394649 452015 301641 120637 79108 123998 113945 39677 21452 134580
30876 134580 299771 358149 249217 89916 40560 113986 186494 185234 161055 154953 108242
30865 108242 -30086 -195760 -283813 -265922 -170697 -18430 145214 210384 99537 -108843
30855 -108843 -228040 -144918 79649 283674 348383 281229 184279 145528 160885 165470 119604
30844 119604 39821 -29202 -37791 41987 163648 212472 122400 -43850 -184355 -271988 -307493
30833 -307493 -244013 -86769 6325 -96960 -260370 -221840 18192 179181 119074 24675
30823 24675 70438 126397 -2719 -232077 -323299 -238355 -132072 -68080 15509 91392 43654
30812 43654 -93908 -128131 892 116184 77979 -22762 -57460 -71480 -140720 -157257 26771
30801 26771 305849 398479 229605 32320 8254 75211 67090 18809 66967 166036 131012
30790 131012 -46500 -147875 -57647 52358 -9174 -162653 -206589 -144124 -149428 -252478 -281965
30779 -281965 -155076 -23796 -41002 -134871 -139789 -48349 4407 -39882 -84450 -20815 127482
30768 127482 221651 143554 -71607 -233300 -179116 24306 144682 86118 19167 120616
30758 120616 292950 300206 125355 -763 60881 181113 201148 174818 232050 322668 284834
30747 284834 127346 51876 160128 297771 271416 104708 -28242 -49223 -36007 -67825
30737 -67825 -124576 -145641 -101570 5412 137462 206563 142856 152 -82182 -51320 3304
30726 3304 4314 7847 99811 241014 307168 245282 106026 -53285 -212862 -347329 -416374
30715 -416374 -406554 -333586 -213907 -81487 -1199 7445 33043 164131 325463 331305 129721
30704 129721 -104336 -170645 -61288 79969 146514 141870 110445 83477 86147 124713 151686
30693 151686 100747 -12851 -68546 30271 212711 286911 159036 -46215 -144215 -126658 -133526
30682 -133526 -196994 -167239 27295 189812 91557 -174603 -278012 -95342 120098 87492
30672 87492 -139978 -281763 -193866 9251 143088 131609 7923 -145728 -226166 -157270
30662 -157270 32726 204589 218948 68373 -103294 -130295 5381 145723 131467 -10727
30652 -10727 -116031 -112462 -113031 -235095 -411872 -465843 -324610 -82403 127718 245129 278960
30641 278960 271960 273251 288933 259239 140403 3006 -21884 96037 249239 337001 376158
30630 376158 429388 487286 482508 387469 244145 114628 40717 30562 46026 23943 -50611
30619 -50611 -112857 -100438 -40791 -3587 8236 43553 83852 32814 -133933 -282436 -256477
30608 -256477 -70667 99058 115632 17791 -59443 -59298 -52215 -108759 -173786 -129024 22401
30597 22401 121283 61107 -41568 6923 199021 330247 285604 171785 116399 87605 9666
30586 9666 -72377 -71807 -5801 70409 184356 352438 449663 353754 163693 79631 99208 48158
30574 48158 -93563 -137813 -9063 115594 83621 -24317 -81377 -113363 -162653 -134961 31089
30563 31089 182178 140203 -26832 -120044 -109729 -111851 -130809 -60343 72693 99277 -16611
30552 -16611 -100891 -45313 17631 -68028 -220602 -221587 -20327 191392 211482 46600 -133020
30541 -133020 -206298 -207257 -217799 -232780 -206578 -181623 -234657 -291625 -166786 137741 341471
30530 341471 239665 10817 -23255 148558 242523 118095 -43606 -43996 61299 91644 -9614
30519 -9614 -159951 -265567 -273245 -174405 -33423 50102 59949 80899 162110 243736 263533 249258
30507 249258 245386 228546 168439 106352 92614 94275 48498 -19393 -14207 89820 192754 181108
30495 181108 67445 -16985 24281 132569 161216 52622 -106414 -209985 -232664 -172552
30485 -172552 -1403 240632 391601 336102 171735 78863 78244 73318 88126 251915 520440
30474 520440 627237 419300 86452 -72271 -5612 92323 65495 -56586 -166656 -215388
30464 -215388 -213821 -166033 -49333 127191 262346 223192 12938 -179051 -181114 -49784 29613
30453 29613 9332 337 46845 61046 14231 10663 97705 168976 153212 142508 211487 256809
30441 256809 171029 51988 53169 109751 22134 -212391 -353450 -238580 9520 162448
30431 162448 157235 110500 135986 228988 306700 305747 234106 147876 88216 48878 3486 -58085
30419 -58085 -131136 -210650 -287884 -347430 -375433 -359373 -293169 -209375 -177047 -211605 -216579 -104212
30407 -104212 39161 26793 -164806 -330202 -296997 -143221 -58578 -73890 -51101 89463
30397 89463 245211 254154 82962 -130668 -211072 -120490 9014 42105 2098 -348 40225
30386 40225 26511 -48317 -60257 42512 136643 104895 -305 -67621 -91928 -125187 -157384
30375 -157384 -151624 -114671 -41957 104726 265485 258339 31157 -182834 -141501 70106 179458
30364 179458 120714 54869 43573 -25769 -165941 -208799 -89655 14986 -38454 -137660 -113244
30353 -113244 -2404 54429 54745 81566 93409 -24754 -223066 -300896 -196697 -91797 -141906
30342 -141906 -241066 -182556 19019 119723 -31350 -289607 -400289 -300705 -139346 -39289
30332 -39289 25797 98085 109070 -16003 -199360 -275089 -195329 -67778 16410 84096 169569
30321 169569 202125 96201 -88522 -177550 -88759 60742 98974 8634 -71682 -46042 20652
30310 20652 23181 -19474 -11415 44761 38878 -67980 -172870 -186716 -153557 -144297 -133512 -79076
30298 -79076 -33388 -50738 -55683 47859 182989 183986 59370 -13315 19859 -2539 -176020
30287 -176020 -340860 -313845 -170173 -121545 -203454 -271657 -261947 -250190 -248608 -149936 53804
30276 53804 179176 106874 -4195 76438 306833 419550 298616 125873 98711 160496
30266 160496 127335 -14064 -80308 52931 284918 411517 348157 194185 102326 111868 116405
30255 116405 1461 -199618 -330463 -300112 -182320 -87680 -8950 123215 279583 341036
30245 341036 267272 155599 107373 119845 144159 173294 218718 251820 226727 139809 29115
30234 29115 -69774 -141539 -178350 -173186 -130484 -81176 -72601 -111939 -127075 -51873 32468 -52233
30222 -52233 -312738 -476772 -299225 93326 345138 331914 271776 347327 439224 350177 117948
30211 117948 -59383 -106506 -115418 -157993 -201141 -202614 -180607 -169901 -172197 -162994 -119761 -48816
30199 -48816 10555 37439 74304 161144 236830 197492 54956 -73061 -142574 -218304 -296324
30188 -296324 -253100 -56212 118651 96436 -78838 -232774 -256220 -120719 159700 452659
30178 452659 532005 343405 135389 157299 333218 419817 378321 360104 395919 358645 225536
30167 225536 137341 168093 240305 295803 352445 361904 221235 -15350 -134664 -53210 70335
30156 70335 91434 68600 94755 112694 34695 -85736 -138658 -116033 -70725 -13414 39810
30145 39810 14873 -105091 -194883 -134895 28937 176380 273208 319615 241839 6579 -220787
30134 -220787 -225778 -41216 84528 29894 -63393 -39631 55814 98555 79208 54511 9183
30123 9183 -92239 -177294 -137060 -5876 71838 64978 104524 257237 379723 298766 53869
30112 53869 -153203 -203445 -146438 -75750 -38958 -61663 -136778 -176475 -95418 32448 27024
30101 27024 -143725 -294391 -271915 -134892 9948 194019 449006 609305 477868 150555
30091 150555 -44593 41893 211406 205870 7676 -214724 -323154 -287748 -157244 -38863
30081 -38863 -27380 -82911 -58042 88053 196113 118521 -60061 -133882 -53752 41776 53365
30070 53365 30455 18673 -62687 -285646 -534224 -595447 -427874 -223088 -158961 -191447 -168485
30059 -168485 -65148 20905 65755 152366 288649 350252 277666 194266 220358 281359 234358
30048 234358 99476 10487 -10478 -60701 -157323 -199266 -150650 -111425 -155908 -224543 -235221
30037 -235221 -200654 -172403 -149785 -106523 -50188 -9739 -9074 -68582 -170591 -219307 -127609 34386
30025 34386 83887 -30447 -128683 -20935 246861 452612 449397 275077 54657 -111151
30015 -111151 -168312 -108387 18897 126681 155130 115611 65249 31691 -33220 -196414 -424102
30004 -424102 -563166 -494948 -281776 -98494 -37017 -49106 -64652 -69911 -56054 11105 123478
29993 123478 203284 193259 125848 65703 32556 18829 34032 79974 110225 63881 -61999
29982 -61999 -196618 -254508 -211371 -126866 -80113 -78307 -65598 -37198 -75950 -216752 -340343
29971 -340343 -298931 -112242 61263 123505 102250 39677 -59656 -164364 -219476 -235569 -272710
29960 -272710 -325623 -333605 -306370 -307116 -298972 -168927 49951 150508 35194 -121509 -107269
29949 -107269 55950 192029 208334 124752 -25932 -175870 -190012 -26098 132715 79813
29939 79813 -117168 -202971 -106911 -30482 -127331 -289114 -341254 -290813 -248747 -224434 -157284
29928 -157284 -85528 -107890 -184513 -149378 24378 123291 -28888 -298194 -399248 -277559
29918 -277559 -153810 -173235 -206451 -101195 33733 -21374 -247514 -394115 -332455 -214249
29908 -214249 -226101 -340803 -399831 -330392 -183921 -38564 42527 15642 -85579 -133508 -35805
29897 -35805 137325 230307 193300 121509 104928 117991 88336 12798 -51121 -77757 -87527 -67292
29885 -67292 42180 228021 345933 282571 143043 138199 273106 309565 108862 -154466
29875 -154466 -253584 -234026 -282032 -376056 -321242 -104887 43564 246 -73794 -2689 141710
29864 141710 180562 94858 8005 -16142 -31820 -106427 -237208 -343165 -310516 -110599 110119
29853 110119 158100 42195 -25692 70241 189949 165229 47968 -3931 17778 -4957 -92317
$$ [...]
##END NTUPLES=NMR SPECTRUM
##END=
