##TITLE=31Pdec_AT-54-1
 CDCl3, 224 sc
 14.11.2022
##JCAMPDX= 6.0         $$ Bruker NMR JCAMP-DX V2.0
##DATA TYPE= NMR SPECTRUM
##DATA CLASS= NTUPLES
##ORIGIN= UXNMR, Bruker Analytische Messtechnik GmbH
##OWNER= root
$$ XWIN-NMR		Version 3.5
$$ Mon Nov 14 14:26:28 2022 Russian Standard Time (UT+4h)  she@DPX200
##.OBSERVE FREQUENCY= 81.013821
##.OBSERVE NUCLEUS= ^31P
##.ACQUISITION MODE= SIMULTANEOUS
##.ACQUISITION SCHEME= undefined
##.AVERAGES= 224
##.DIGITISER RES= 16
##SPECTROMETER/DATA SYSTEM= spect
##.PULSE SEQUENCE= zgpg30
##.SOLVENT NAME= CDCl3
##.SHIFT REFERENCE= (INTERNAL, CDCl3, 0, 248.564)
##AUDIT TRAIL= $$ (NUMBER, WHEN, WHO, WHERE, WHAT)
$$ ##TITLE= Audit trail, XWIN-NMR		Version 3.5
$$ ##JCAMPDX= 5.01
$$ ##ORIGIN= Bruker BioSpin GmbH
$$ ##OWNER= she
$$ F:/spectra/data/she/nmr/P31/1/pdata/1/auditp.txt
$$ ##AUDIT TRAIL=  $$ (NUMBER, WHEN, WHO, WHERE, WHAT)
(   1,<2022-11-14 14:24:16.25 +0400>,<she>,<DPX200>,
      <continue with go, POWCHK disabled, PULCHK disabled
       configuration hash MD5:
       00 E9 B6 7A A2 85 ED C7 34 08 36 98 17 FE 4E 26
       data hash MD5: 32K
       05 A4 34 51 98 AA 5D 4B 1B 4E D9 A8 A9 BE B0 A2>)
(   2,<2022-11-14 14:24:19.17 +0400>,<she>,<DPX200>,
      <Start of raw data processing
       efp BC_mod = 2 LB = 1 FT_mod = 6 PKNL = 1 PHC0 = -10338.26 PHC1 = 263.2559 SI = 64K 
       data hash MD5: 64K
       9C C0 3C 71 AD A4 F0 45 21 65 38 15 9A 7D F3 BC>)
(   3,<2022-11-14 14:24:46.46 +0400>,<she>,<DPX200>,
      <pk PHC0 = 7.920223 PHC1 = 0 
       data hash MD5: 64K
       1D 93 EB BB 82 9F D3 79 D3 23 63 88 BA FF CC 50>)
(   4,<2022-11-14 14:25:16.26 +0400>,<she>,<DPX200>,
      <pk PHC0 = -5.599995 PHC1 = 0 
       data hash MD5: 64K
       92 47 21 B3 4C E0 C6 A9 E7 CA 85 86 D7 EE 9E 5F>)
(   5,<2022-11-14 14:25:46.82 +0400>,<she>,<DPX200>,
      <pk PHC0 = 97.75525 PHC1 = -212.6 
       data hash MD5: 64K
       AE 95 24 56 C7 69 4D 8A 54 13 05 53 48 70 A9 EA>)
(   6,<2022-11-14 14:26:01.53 +0400>,<she>,<DPX200>,
      <abs ABSG = 5 
       data hash MD5: 64K
       93 37 53 16 82 88 BA 86 C8 7A 3A 6A 22 3D 7B 2D>)
$$ ##END=
$$ 
$$ hash MD5
$$ AC C2 12 7C 84 82 82 C8 AF 24 D3 11 BD 47 BA 82
##$RELAX= 
##$RELAX= 
##$RELAX= 
##$RELAX= 
##$RELAX= 
##$RELAX= 
##$RELAX= 
##$RELAX= 
##$RELAX= 
$$ Bruker specific parameters
$$ --------------------------
##$DU= <F:/spectra>
##$EXPNO= 1
##$NAME= <P31>
##$PROCNO= 1
##$TYPE= <nmr>
##$USER= <she>
##$AMP= (0..31)
100 100 100 100 100 100 100 100 100 100 100 100 100 100 100 100 100 100 
100 100 100 100 100 100 100 100 100 100 100 100 100 100 
##$AQSEQ= 0
##$AQ_mod= 1
##$AUNM= <au_zg>
##$AUTOPOS= <>
##$BF1= 81.014009
##$BF2= 200.13
##$BF3= 200.13
##$BF4= 200.13
##$BF5= 200.13
##$BF6= 200.13
##$BF7= 200.13
##$BF8= 200.13
##$BYTORDA= 1
##$CFDGTYP= 0
##$CFRGTYP= 5
##$CHEMSTR= <none>
##$CNST= (0..31)
1 1 145 1 1 1 1 1 1 1 1 1 1 1 1 1 1 1 1 1 1 1 1 1 1 1 1 1 1 1 1 1 
##$CPDPRG= <waltz16>
##$CPDPRG1= <>
##$CPDPRG2= <waltz16>
##$CPDPRG3= <>
##$CPDPRG4= <mlev>
$$ [...]
##$SUBNAM3= <"">
##$SUBNAM4= <"">
##$SUBNAM5= <"">
##$SUBNAM6= <"">
##$SUBNAM7= <"">
##$SUBNAM8= <"">
##$SUBNAM9= <"">
##$SW= 501.771253377433
##$SWIBOX= (0..15)
0 1 3 0 0 0 0 0 0 0 0 0 0 0 0 0 
##$SW_h= 40650.406504065
##$TD= 32768
##$TD0= 1
##$TE= 0
##$TE2= 300
##$TE3= 300
##$TEG= 300
##$TL= (0..7)
0 120 53 12 22 120 120 120 
##$TP= (0..7)
150 150 150 150 150 150 150 150 
##$TP07= 0
##$TPNAME0= <>
##$TPNAME1= <>
##$TPNAME2= <>
##$TPNAME3= <>
##$TPNAME4= <>
##$TPNAME5= <>
##$TPNAME6= <>
##$TPNAME7= <>
##$TPOAL= (0..7)
0.5 0.5 0.5 0.5 0.5 0.5 0.5 0.5 
##$TPOFFS= (0..7)
0 0 0 0 0 0 0 0 
##$TUNHIN= 0
##$TUNHOUT= 0
##$TUNXOUT= 0
##$USERA1= <user>
##$USERA2= <user>
##$USERA3= <user>
##$USERA4= <user>
##$USERA5= <user>
##$V9= 5
##$VALIST= <valist>
##$VCLIST= <CCCCCCCCCCCCCCC>
##$VD= 0
##$VDLIST= <DDDDDDDDDDDDDDD>
##$VPLIST= <PPPPPPPPPPPPPPP>
##$VTLIST= <TTTTTTTTTTTTTTT>
##$WBST= 1024
##$WBSW= 4
##$XGAIN= (0..3)
0 0 0 0 
##$XL= 0
##$YL= 0
##$YMAX_a= 20326
##$YMIN_a= -25789
##$ZGOPTNS= <>
##$ZL1= 120
##$ZL2= 120
##$ZL3= 120
##$ZL4= 120
##$ABSF1= 248.5645
##$ABSF2= -253.2056
##$ABSG= 5
##$ABSL= 3
##$ALPHA= 0
##$AQORDER= 0
##$ASSFAC= 0
##$ASSFACI= 0
##$ASSFACX= 0
##$ASSWID= 0
##$AUNMP= <proc_1d>
##$AZFE= 0.1
##$AZFW= 0.5
##$BCFW= 0
##$BC_mod= 2
##$BYTORDP= 0
##$COROFFS= 0
##$CY= -3
##$DATMOD= 1
##$DC= 0
##$DFILT= <>
##$DTYPP= 0
##$F1P= 0
##$F2P= 0
##$FCOR= 1
##$FTSIZE= 65536
##$FT_mod= 6
##$GAMMA= 0
##$GB= 0
##$INTBC= 1
##$INTSCL= 6.047779e-11
##$ISEN= 30
##$LB= 1
##$LEV0= 0
##$LPBIN= 0
##$MAXI= 10000
##$MC2= 0
##$MEAN= 0
##$ME_mod= 0
##$MI= 50
##$NCOEF= 0
##$NC_proc= -6
##$NLEV= 6
##$NOISF1= 182.463
##$NOISF2= 159.3651
##$NSP= 0
##$NTH_PI= 0
##$NZP= 0
##$OFFSET= 248.5645
##$PC= 4
##$PHC0= -10238.19
##$PHC1= 50.65588
##$PH_mod= 1
##$PKNL= yes
##$PPARMOD= 0
##$PSCAL= 0
##$PSIGN= 0
##$REVERSE= no
##$SF= 81.0140089999694
##$SI= 65536
##$SIGF1= 159.3651
##$SIGF2= -187.1042
##$SINO= 113.3802
##$SIOLD= 16384
##$SREGLST= <1H.CDCl3>
##$SSB= 0
##$STSI= 65536
##$STSR= 0
##$SW_p= 40650.406504065
##$SYMM= 0
##$S_DEV= 0
##$TDeff= 32768
##$TDoff= 0
##$TI= <>
##$TILT= no
##$TM1= 0
##$TM2= 0
##$TOPLEV= 0
##$USERP1= <user>
##$USERP2= <user>
##$USERP3= <user>
##$USERP4= <user>
##$USERP5= <user>
##$WDW= 1
##$XDIM= 65536
##$YMAX_p= 361990170
##$YMIN_p= -77250867
$$ End of Bruker specific parameters
$$ ---------------------------------
##NTUPLES= NMR SPECTRUM
##VAR_NAME=  FREQUENCY,     SPECTRUM/REAL,   SPECTRUM/IMAG
##SYMBOL=    X,             R,               I
##VAR_TYPE=  INDEPENDENT,   DEPENDENT,       DEPENDENT
##VAR_FORM=  AFFN,          ASDF,            ASDF
##VAR_DIM=   65536,         65536,           65536
##UNITS=     HZ,            ARBITRARY UNITS, ARBITRARY UNITS
##FACTOR=    0.620285442955139, 1,           1
##FIRST=     20137.2065510682, 0,            0
##LAST=      -20513.1999529968, 0,           0
##MIN=       -20513.1999529968, -77250867,   0
##MAX=       20137.2065510682, 361990170,    0
$$ Real data points
##PAGE= N=1
##DATA TABLE= (X++(R..R)), XYDATA
$$ [...]
37977D052156n10699q77434L16080N18427j213419k401124j396506j47247p60681
37968b420447j963960j380766N04007J157303j74493j630116j481256j36164Q03050
37959f722842O60779M41341J281948K322173J374860j468047k739262k86075K639150
37950b495975J502503k219421k509043J914322M882672J691778l775105m629550
37942e637819n00162K986523K520217M11977j04637R96948J881005J613360M43818
37933D611230j141777k709439l741358l507632j301426K275627M389839K370028
37925A245092k213231m219149j271722K864559L464008J221107L59290J825014
37917C274968K125984j024466n106932n884775k298767K533630M370431J902658
$$ plain form
37977 4052156 3541457 2664023 2980103 3498530 2285111 -116013 -1512519 -1659766 -2420447
37968 -2420447 -4384407 -5765173 -5261166 -4103863 -4278356 -5908472 -7389728 -7525892 -6722842
37959 -6722842 -6062063 -5620722 -4338774 -2016601 -641741 -2109788 -4849050 -5135125 -2495975
37950 -2495975 -993472 -3212893 -5721936 -3807614 1075058 2766836 -1008269 -5637819
37942 -5637819 -6137981 -3151458 -631241 -219264 -323901 673047 2554052 4167412 4611230
37933 4611230 3469453 760014 -2981344 -6488976 -7790402 -5514775 -1124936 1245092
37925 1245092 -968139 -5187288 -6459010 -3594451 -130443 1090664 1449954 3274968
37917 3274968 5400952 4376486 -730446 -6615221 -8913988 -6380358 -2009927 -107269
37909a07269j644248j733016J963979M793070L131098q65114k748911k050101
37901G39488j781510k881242l009128r34266J388999J980134J335312P85338N12051
37892a864824J30567l91208r69652j240307k60490K009455L447720K208025j02685
37883B966601m57982P21917K08526k261173k908766p5259K509522J319630j315375
37874G07641p54904K745569M308820J369719l091359m662979k307487J624053
37866f0927M183750L747416O81667k744315l920268k366019l08048j22062j520203
37857b429009k078450m82771J803764K671381K146969J709356J434269k6239k265564
37848B483706k474066L71082K850584J363915k289036k941763N83397L651339
$$ plain form
37909 -107269 -1751517 -3484533 -1520554 3272516 6403614 5538500 2789589 739488
37901 739488 -1042022 -3923264 -6932392 -7866658 -6477659 -4497525 -3162213 -2376875 -1864824
37892 -1864824 -1734257 -2125465 -3095117 -4335424 -4595914 -2586459 861261 3069286 2966601
37883 2966601 2508619 3230536 3439062 1177889 -1730877 -1806136 703386 2023016 707641
37874 707641 -47263 2698306 7007126 8376845 5285486 622507 -1684980 -60927
37866 -60927 4122823 7870239 8551906 5807591 1887323 -478696 -786744 -908806 -2429009
37857 -2429009 -4507459 -4990230 -3186466 -515085 1631884 3341240 4775509 4749270 2483706
37848 2483706 9640 380722 3231306 4595221 2306185 -635578 -52181 3599158
37840C599158K191361k190893n063250m620084k271865K64849K084146K440618
37832c565960J286847L6516O8409Q72643J129554R43098J238916J548567N96396
37823D154986j047544j358158l61577o41660l034592m320440j589665K890170
37815e308480M314805K013701p1828L02018Q42929l57214r99005J251518L781083
37806E769527K395834j966563m292063k633557J18928J519981K081250J912099
37798D905436l64851l725932m270814r54662K215144K161167Q00322L46707q19167
37789B93350l636168m289840k7306M641084L795387n42258j676531J028664K124610
37780A710992J4374j078051J90945k86015l558389m225714M77296M894989L365449
$$ plain form
37840 3599158 5790519 3599626 -1463624 -6083708 -8355573 -8090724 -6006578 -3565960
37832 -3565960 -2279113 -2242597 -2174188 -1301545 -171991 771107 2010023 3558590 4154986
37823 4154986 3107442 1749284 1387707 746047 -2288545 -6608985 -8198650 -5308480
37815 -5308480 -993675 1020026 948198 1250216 2093145 1735931 736926 1988444 5769527
37806 5769527 8165361 6198798 1906735 -726822 -607894 912087 2993337 4905436
37798 4905436 4540585 814653 -3456161 -4410823 -2195679 -34512 765810 1112517 293350
37789 293350 -3342818 -7632658 -7659964 -3018880 776507 234249 -1442282 -413618 1710992
37780 1710992 1725366 647315 838260 552245 -3006144 -7231858 -6754562 -1859573 1505876
37771A505876j057225k129611k95550m40389k683750k539422O74755K400167O70172
37762c894977m95298K142285N352319L924115j667114n634975m296292k18051
37754d787988J757977O12899n79896K37287J331158O11292n25890N06884K693762
37745A857485K540820j26179j468140K04242J562322k13781k667523k164558P2236
37736d03076K18686j545000j367517J549753L116255N58561l145686l353882j5330
37727d387236K749385K301987K60478m88900L85612Q90952j70537j730934k223282
37718b412475j609904q21146k207J316051K533809K094779j69030k150552j984772
37709c205447n64173j67619r42467m89741K353517M868427L555893n79916k570715
$$ plain form
37771 1505876 448651 -1680960 -1976510 -2416899 -5100649 -7640071 -6965316 -4565149 -3894977
37762 -3894977 -4390275 -2247990 3104329 7028444 5361330 -273645 -4569937 -4787988
37754 -4787988 -3030011 -2417112 -2997008 -2759721 -1428563 -817271 -1343161 -836277 1857485
37745 1857485 4398305 4272126 2803986 3008228 4570550 4356769 1689246 -475312 -403076
37736 -403076 -184390 -1729390 -3096907 -1547154 1569101 2127662 -1018024 -4371906 -4387236
37727 -4387236 -1637851 664136 924614 435714 821326 1712278 1541741 -189193 -2412475
37718 -2412475 -4022379 -4843525 -4845732 -3529681 -995872 1098907 929877 -1220675 -3205447
37709 -3205447 -3769620 -3937239 -4879706 -5369447 -3015930 1852497 5408390 4828474 2257759
37700B257759l20186K023090J84850l358563l073683O08333J952918k52132o00962
37691e78576K865395L996697j150858o201290l826261K259889L378042j13948
37683F29090r63351J282352J53678m229826l636001L454252P061593J143706o285835
37674a390342n578327M43643L015769J279867N27347J445602M88494j737218j160903
37665b666068J858817K824285P42691j009308j054058j294445k050251j414176
37657d062513N05691J539606J524431K015020K436557R85061j158442r85462J326711
37648D126660K698281J934321L73772j261460k710899k320797K87859J465264
37640D593001j534797m743777k544316K922471M223044j9787l422415k035205
$$ plain form
37700 2257759 1937573 3960663 4145513 786950 -2286733 -1678400 274518 22386 -578576
37691 -578576 2286819 6283516 5132658 -1068632 -4894893 -2635004 743038 629090
37683 629090 -334261 948091 1101769 -3128057 -6764058 -3309806 3751787 4895493 -1390342
37674 -1390342 -6968669 -6525026 -3509257 -2229390 -1702043 -256441 232053 -1505165 -2666068
37665 -2666068 -807251 2017034 2759725 1750417 696359 -598086 -2648337 -4062513
37657 -4062513 -3556822 -2017216 -492785 1522235 3958792 4943853 3785411 2799949 4126660
37648 4126660 6824941 8759262 9133034 7871574 5160675 2839878 3127737 4593001
37640 4593001 3058204 -1685573 -4229889 -1307418 2915626 2895839 -526576 -2561781
37632b561781Q37623J537363J156999J444004J331943J05054p02805n11788m38051
37623B198561J38542K727695M873926K308259k980301l848320Q34742L658452
37615I911556M20265l428525k626353p08428k576290n222955l401765P19225J660728
37606e252542L94416J547735L665079J282779m242114m947781J459469P244985
37598A152026N308976j583251n493182l256284J363661L142078P26655k458404
37590a097725j908340K559326N914946M045392q05433l451148k958054k511482
37582b12518l047765j813368K096456N131002M022181R3722k914684l141548j390006
37573a176528N33398J143472K88132o13688m46490j34408q57790j415838K1361
$$ plain form
37632 -2561781 -1724158 -186795 970204 2414208 3746151 3851205 3148400 2636612 2198561
37623 2198561 2337103 5064798 9938724 12246983 9266682 5418362 6253104 9911556
37615 9911556 10331821 6903296 4276943 3568515 992225 -4230730 -7632495 -6913270 -5252542
37606 -5252542 -4858126 -3310391 354688 1637467 -2604647 -7552428 -6092959 1152026
37598 1152026 6461002 4877751 -615431 -3871715 -2508054 634024 1360679 -1097725
37590 -1097725 -3006065 -446739 5468207 9513599 8708166 5257018 2298964 -212518
37582 -212518 -3260283 -5073651 -2977195 2153807 6175988 6269710 3355026 213478 -1176528
37573 -1176528 -643130 500342 788474 174786 -271704 -406112 -1263902 -2679740 -2658379
37564b658379K151071J842357p60032k009958l61245J374350P53540o76493n11717
37555h56506O17907P60944O4140r0898K19290J09114N2451R81117J960381J106039
37545D923979j380008l103003k608912j064067l48796n85074k91331J378490L215074
37536A36352L212730J186697p11423p31377J54554m3215j161321j433728p83366
37527a74097r60750k061274j725596R57430L278207K464808n70676k962328l542436
37518e296712k664832k73051L052824M551684K191082j423752j590140J790362
37510C37465L635918J012579k387406j578681K380539L830473M82030l481786
37502D231131l100339J052169L990280K506967j686828m781761n026277l389609
$$ plain form
37564 -2658379 -507308 1335049 575017 -1434941 -1796186 -421836 331704 -344789 -856506
37555 -856506 -238599 522345 586485 495587 714877 823991 876442 1857559 3817940 4923979
37545 4923979 3543971 440968 -2167944 -3232011 -3580807 -4165881 -4457212 -3078722 136352
37536 136352 3349082 4535779 3824356 3092979 3247533 3204318 2042997 609269 -174097
37527 -174097 -1134847 -3196121 -4921717 -3964287 -686080 1778728 1208052 -1754276 -5296712
37518 -5296712 -7961544 -8234595 -5181771 -630087 1560995 137243 -1452897 337465
37510 337465 3973383 4985962 2598556 1019875 3400414 7230887 7712917 4231131
37502 4231131 1130792 2182961 6173241 8680208 6993380 2211619 -2814658 -6204267
37494f204267j419569J53911J082475J233992Q38576L27746j45491l48392N12211
37485c968808K615404M080421K652932o86804k010935L64512L037473J899355
37477G983550k233124m846325l579408k37290K420015L137026J624044j543649
37469B724839m103928l788672j393427K02814M10356J449844L820914M623116
37461C945856K120937j039665j574289j39922M15175n44896j494786j709142j469271
37452a490003m17355J699834L406640K934805P25662j291527k043586j425348
37444B099122L87972J940249Q39172k521793l855504o46945L406460L434225O28332
37435E711290k97086R61649O52483j637312k317717q13634p10987k574109k198852
$$ plain form
37494 -6204267 -7623836 -7469925 -6387450 -5153458 -4314882 -3987136 -4132627 -4481019 -3968808
37485 -3968808 -1353404 2727017 5379949 4693145 2682210 3046722 6084195 7983550
37477 7983550 5750426 904101 -2675307 -2912597 -492582 2644444 4268488 2724839
37469 2724839 -1379089 -5167761 -6561188 -6358374 -5948018 -4498174 -677260 3945856
37461 3945856 6066793 5027128 3452839 3312917 3728092 3183196 1688410 -20732 -1490003
37452 -1490003 -1907358 -207524 3199116 6133921 6859583 5568056 3524470 2099122
37444 2099122 2487094 4427343 5266515 2744722 -1110782 -1757727 1648733 5082958 5711290
37435 5711290 5414204 6375853 7028336 5391024 3073307 2259673 1548686 -1025423 -3224275
37426c224275J579121L782430J484829r48695O57616L038610J310458k432303
37418E247791k760671m1822P70491j260766k173214l22934J393614Q94230m65181
37409A281538j219612j542283j248461N5115O74784j289770l646091k128239K669631
37400f393388N025380K169494j782339k106017K96046J749570J641181J965898
37392B565825L036510L001704R46887j937275l995143m362558l049338j020425
37384d813813K85231N17040R38616K487790L942400L173963P4758k813936l057771
37375G34278j198574K5558m79326m46844K128120M821649L323497j712153m240793
37366B955412j060400L308166L138178m16872k087995q37690j56349j276710j738515
$$ plain form
37426 -3224275 -1645154 2137276 3622105 2673410 3331026 6369636 7680094 5247791
37418 5247791 2487120 2445298 3215789 1955023 -218191 -541125 852489 1746719 1281538
37409 1281538 61926 -1480357 -2728818 -2673703 -1998919 -3288689 -6934780 -9063019 -6393388
37400 -6393388 -1368008 801486 -980853 -3086870 -2790824 -1041254 599927 2565825
37392 2565825 5602335 8604039 9550926 7613651 3618508 -744050 -3793388 -4813813
37384 -4813813 -4528582 -4011542 -3072926 -585136 3357264 6531227 6605985 3792049 734278
37375 734278 -464296 -438738 -918064 -1364908 763212 5584861 8908358 7196205 2955412
37366 2955412 1895012 5203178 8341356 7924484 5836489 4998799 4842450 3565740 1827225
37357A827225p41443n10227j440535r65179J271537J948745j59853j463060P15196
37348D82406L598066L195451j24646l234603m498236l591272j15338M288500N223206
37339E223534Q14414m355159m557561o04755J854203N72811j264324j077780l17223
37330c711840o00231l76725K059578M710771L959821k91270l982936l699808n48031
37321b480671J577448P16378j353230j873156l07110J793707K883005K269606
37313C225977k6857k685526l199587n43599K764346L321256J164100q17428j336897
37304A865785j665880k107544r67493J887087L606168K253058l42779j371364
37296C157038n53631P15056J603186J593578R9471j952213k194279k18156J172559
$$ plain form
37357 1827225 1085782 575555 -864980 -1830159 -558622 1390123 1230270 -232790 482406
37348 482406 4080472 7275923 7151277 3916674 -581562 -4172834 -4288172 328 5223534
37339 5223534 6037948 1682789 -2874772 -3479527 -1625324 -1052513 -2316837 -3394617 -3711840
37330 -3711840 -4312071 -4688796 -2629218 2081553 6041374 5750104 1767168 -1932640 -2480671
37321 -2480671 -903223 -186845 -1540075 -3413231 -3720341 -1926634 956371 3225977
37313 3225977 3199120 513594 -2685993 -3229592 -465246 2856010 4020110 3202682 1865785
37304 1865785 199905 -1907639 -2875132 -988045 2618123 4871181 4528402 3157038
37296 3157038 2603407 3318463 4921649 6515227 6614698 4662485 2468206 2250050 3422609
37287C422609o6833k154066k419026j134765j02325M68429J034285O61032j099882
37278a390542j940900K35027L196201K776693r85922l492110j737900J993843
37270a345610L497084J695041p88899j166391K66771O57915j383712l214540j573487
37261c355828J934874K280112j278799l264104k60150L266547J673086k938292
37253a942554m080600q66812J643026J184426Q32406K212780K473385N7456j902087
37244c88574p99116J199328J170778K1113j15744J37915o16318j272245m02644
37235a065507N10628l56331j221061P47602M094084M454310J081543j902718j434434
37226D908116O74305J083086o12380k365404k654632j342428R96589L013016K902153
$$ plain form
37287 3422609 3355776 1201710 -1217316 -2352081 -2454406 -1985977 -951692 -290660 -1390542
37278 -1390542 -3331442 -3096415 99786 2876479 1890557 -1601553 -3339453 -1345610
37270 -1345610 2151474 3846515 3057616 1891225 2157996 2815911 1432199 -1782341 -3355828
37261 -3355828 -1420954 859158 -419641 -3683745 -3943895 -677348 995738 -1942554
37253 -1942554 -6023154 -6889966 -5246940 -4062514 -3230108 -1017328 1456057 1513513 -388574
37244 -388574 -1187690 11638 1182416 1203529 1087785 1225700 609382 -662863 -1065507
37235 -1065507 -554879 -911210 -2132271 -1384669 2709415 7163725 8245268 6342550 4908116
37226 4908116 5582421 6665507 6053127 3687723 1033091 -309337 687252 3700268 6602421
37217F602421L76238k302459k694786j211486l80482j258448k126869j201887
37209d197758P38499J529393O63470k30582N3165O07535L5007j130314r32046
37200b863631J109555K859237K042008q48809l067578k814135r67162M81758P66496
37191c302261N71782O16380Q54036R05874O58357M19895P11881J566231J843737
37182D845912J59648k763154l800170j093883K743958L331007L03948k133650
37174A593616j028001J646083K483299J270431k5755p92100j572460j750180l81924
37165A443009J338218J246094m07284j291958o53068j36762p54475j391163r34744
37156a542133J8302K81653l89132j211284r58687R60184L126888L029182O79589
$$ plain form
37217 6602421 6978659 4676200 1981414 769928 389446 -869002 -2995871 -4197758
37209 -4197758 -3459259 -1929866 -1266396 -1496978 -1443813 -836278 -801271 -1931585 -2863631
37200 -2863631 -1754076 1105161 3147169 2298360 -769218 -3583353 -4550515 -4068757 -3302261
37191 -3302261 -2730479 -2114099 -1260063 -354189 304168 724063 1435944 3002175 4845912
37182 4845912 5005560 2242406 -1557764 -2651647 92311 3423318 3727266 1593616
37174 1593616 565615 2211698 4694997 5965428 5939673 5147573 3575113 1824933 1443009
37165 1443009 2781227 4027321 3620037 2328079 1675011 1538249 783774 -607389 -1542133
37156 -1542133 -1523831 -1242178 -1631310 -2842594 -3801281 -2841097 285791 3314973 3994562
37147C994562o08189P91318J561751j269505m272427k118161L245856M399030
37139E724235k60457l853692j689865J940932J267662k275050l576745j773161
37131d496141M02161J947641L263444L032254M19551j561807J89141L270104K911988
37122I378336m53222k016355m82785M17950j078074j738700P01736L134605J654707
37113I518198k618375n480019n317367l733110j827224P83513L316270L372218
37105a985896N09137j912218o68314K619112L373977N51718j863106r24395R89641
37096F89656M20274j611457j965149r41256q51498p52456J797012M569191K767651
37087D121968k325695l877116l69627J552128j622769l812140M28039O056182
$$ plain form
37147 3994562 3386373 4177691 5739442 4469937 197510 -1920651 1325205 5724235
37139 5724235 5463778 1610086 -79779 1861153 3128815 853765 -2722980 -4496141
37131 -4496141 -4093980 -2146339 1117105 4149359 4568910 3007103 3196244 6466348 9378336
37122 9378336 8925114 6908759 6425974 6843924 5765850 4027150 4728886 7863491 9518198
37113 9518198 6899823 1419804 -3897563 -7630673 -9457897 -8674384 -5358114 -1985896
37105 -1985896 -1476759 -3388977 -4057291 -1438179 1935798 2487516 624410 -299985 689656
37096 689656 1109930 -501527 -2466676 -3407932 -4259430 -5011886 -3214874 1354317 4121968
37087 4121968 1796273 -2080843 -2450470 -898342 -2521111 -6333251 -5905212 150970
37079A50970N201499l91782k721012j09322J881726N81248p55654m5611N30138
37070D322200m96671j503040j391519r19871K2032K043787L194523R39229k831071
37061C379599l563120q74920J225031R54007L80104K09007j392117l827735l562619
37052g072763j53085K431727K220870J796398K585561K132945k70969p68635K478569
37043E380618M743287J473744m111289n319905j535175J646893Q04395j497642
37035A584926j603573K67644J367769N86017m38143P3272J446902J359500q45880
37026C798434k891049k472283k34774J472493J574122M75251j123679j720106
37018a121591N85762M535334N085005J68013m426069k194407L879298M834128
$$ plain form
37079 150970 5352469 4960687 2239675 2130353 4012079 4593327 3837673 3792062 4322200
37070 4322200 3825529 2322489 930970 11099 33131 2076918 5271441 6210670 3379599
37061 3379599 -183521 -1058441 166590 1120597 1500701 1709708 317591 -3510144 -7072763
37052 -7072763 -7225848 -4794121 -2573251 -776853 1808708 3941653 3670684 2902049 5380618
37043 5380618 10123905 11597649 7486360 2166455 631280 2278173 3082568 1584926
37035 1584926 -18647 248997 1616766 2202783 1764640 1837912 3284814 4644314 3798434
37026 3798434 907385 -1564898 -1799672 -327179 1246943 1722194 598515 -1121591
37018 -1121591 -535829 3999505 9084510 9252523 4826454 2632047 6511345 11345473
37010A1345473r90911n498055l060654J930673K892248K65870j371821p23710
37002D789113K93524P37091O58245n43178k379791k311320M21469K505874J177862
36993E348889j353886j407128M74276R21672p01224j743631o87545Q41621O67206
36984B360250j099227k170184p11526J902771J896756j769408m594026k136045
36976f320639K848693L690256j16923k094091Q55964L770595K134223j115807
36968C652271j291271O47167J349181J260841K121645J992501j343812m754121
36960C634402l527419Q99214K642986n9805l053586k678233L52402L308016M065382
36951E583359J744091k169949m038106k141340P10880J245669L40371M34044Q24494
$$ plain form
37010 11345473 10354562 4856507 1795853 3726526 6618774 6884644 5512823 4789113
37002 4789113 5082637 5819728 6477973 5934795 3555004 1243684 1665153 4171027 5348889
36993 5348889 3995003 2587875 3062151 3983823 3282599 1538968 851423 1693044 2360250
36984 2360250 1261023 -909161 -1620687 282084 2178840 409432 -4184594 -6320639
36976 -6320639 -3471946 218310 101387 -1992704 -1136740 2633855 4768078 3652271
36968 3652271 2361000 3008167 4357348 5618189 7739834 9732335 8388523 3634402
36960 3634402 106983 1006197 3649183 3589378 535792 -2142441 -1790039 1517977 5583359
36951 5583359 7327450 5157501 1119395 -1021945 -311065 934604 1274975 1709019 2533513
36942B533513m17092k053660j705055l79743l17033j99872K249940M567375K428953
36933F707326k598971m453270j682077J089296J313343J594740L082635K381353
36925G434375j889589n056365k903583J907681L889510K037928n99551k058701
36917B761705k469722j794372k6853J405273J216139M08052O46435J486396J355013
36908D988066L44968k11082l28108j280280l002930l553993j684647J302886K918894
36899e06226K140117K47470p56121j47682J228820K210448K096020M53293k354337
36890D611802m078674k066132K742124N271758K201285l070182m417895j098276
36882I5810J825025J199127k54104P72580K767803K337136k6199r23962K17159
$$ plain form
36942 2533513 2116421 62761 -1642294 -2022037 -2339070 -2538942 -289002 4278373 6707326
36933 6707326 4108355 -344915 -2026992 -937696 375647 1970387 5053022 7434375
36925 7434375 5544786 488421 -2415162 -507481 3382029 5419957 4820406 2761705
36917 2761705 291983 -1502389 -1529242 -123969 1092170 1500222 2146657 3633053 4988066
36908 4988066 5333034 5121952 4793844 3513564 510634 -3043359 -4728006 -3425120 -506226
36899 -506226 1633891 1881361 1125240 977558 2206378 4416826 6512846 6966139 4611802
36890 4611802 533128 -1533004 1209120 6480878 8682163 5611981 1194086 95810
36882 95810 1920835 3119962 2865858 3638438 6406241 8743377 8717178 7793216 8010375
36873H010375L31857j850354l112465n79098L181195L095134j101289l999902
36865C975453j914732K065032K829656N83574k96938J418399K146355k65733k927607
36856G613459k536566j80640J112314R48201Q16446Q89343N95581P83146K275610
36847A2316894L448593K181648o26582k225131j933378j219186n10894J258259
36839A2690223M014527N789656M835440J255463k859791m095491m54382N002786
36831B6178431N897033M64526n125968m944517j785135k424430o703264p875396
36823C681280l388610J516762K354036J331294K051947L421447K420473o58549
36815A2730080l170800l794159k628846o4024K169537J438171j851490l335227
$$ plain form
36873 8010375 8342232 6491878 3379413 2800315 5981510 9076644 7975355 3975453
36865 3975453 2060721 4125753 6955409 7538983 7242045 8660444 10806799 10541066 7613459
36856 7613459 5076893 4896253 6008567 6956768 7773214 8662557 9258138 10041284 12316894
36847 12316894 15765487 17947135 17320553 15095422 13162044 11942858 11431964 12690223
36839 12690223 16704750 22494406 27329846 28585309 25725518 21630027 21175645 26178431
36831 26178431 32075464 32539990 27414022 22469505 20684370 18259940 11556676 3681280
36823 3681280 292670 1809432 4163468 5494762 7546709 10968156 13388629 12730080
36815 12730080 9559280 5765121 3136275 3072251 5241788 6679959 4828469 1493242
36807A493242m49694L309049L020200p60272l257910k390566p09621o34954j176731
36798a557257l69180J402859K071642R30909l05738K74405K001216J962205j251738
36789E159323m966696n079313j040511L492849N038841L537621J011605r70578
36781F183141j786343j529661j146195j362861j149019Q40270L041841K001443
36773E092616k262603m903935k455032K089702L310397P42078j214774n7942J802810
36764B143317J518165J67619O04356K672493L230709R21337j436180o35765K148908
36755A1334959K714594k72188l378983l297831j008100P29297J501325K133501
36747A0456574J651429r71312l459009k782916l12778k846j774858j695700R07466
$$ plain form
36807 1493242 1043548 4352597 7372797 6612525 3354615 964049 254428 -380526 -1557257
36798 -1557257 -1926437 -523578 1548064 2478973 2173235 2447640 4448856 6411061 5159323
36789 5159323 192627 -4886686 -5927197 -2434348 2604493 6142114 7153719 6183141
36781 6183141 4396798 2867137 1720942 358081 -790938 49332 3091173 5092616
36773 5092616 2830013 -2073922 -4528954 -2439252 871145 1613223 398449 340507 2143317
36764 2143317 3661482 3829101 4433457 7105950 10336659 11257996 9821816 9186051 11334959
36755 11334959 14049553 13777365 10398382 7100551 6092451 6821748 8323073 10456574
36747 10456574 12108003 11136691 7677682 4894766 4581988 4579142 2804284 1108584 2016050
36738B016050K117374O41153M13533L167262M249275K60181m174971k928546K107614
36729G868925M286374K368850P34318R24045Q9718k084302j900085J418769L650037
36720A7356649K910177L232236P191435J0042101O213311j665992n576759k368686
36712C7334472L495594O613772N584381J478733l994437p653145o122628j31259
36704C6605483N111728N871462L956827K704502J338683l176604r809379j3116110
36696B9486592j0083586m141032o16693m91731q84188j71951J78090j295819l535335
36687H444347m358739l037582o93871J110546J599412J088128N13168M79895P14434
36678E859738O35451K08885j71613l31887l04371l0787K68913j21817j343492
$$ plain form
36738 2016050 4133424 4774577 5188110 8355372 12604647 12864828 8689857 5761311 7868925
36729 7868925 12155299 14524149 15258467 16182512 16272230 14187928 12287843 13706612 17356649
36720 17356649 20266826 23499062 30690497 40732598 46945909 45279917 39703158 37334472
36712 37334472 40830066 47443838 53028219 54506952 50512515 42859370 36736742 36605483
36704 36605483 41717211 47588673 51545500 54250002 55588685 52412081 42602702 29486592
36696 29486592 19403006 15261974 14645281 14153550 13269362 13097411 13275501 11979682 8444347
36687 8444347 4085608 1048026 354155 1464701 3064113 4152241 4665409 5145304 5859738
36678 5859738 6495189 6704074 6532461 6200574 5896203 5865416 6134329 6012512 4669020
36669D669020k027761o74604J974352L184737J423389j530040k485601o16271
36661C917221J461496Q48122j801201k835441o05156J721274M54420k664901k423993
36652a928159J738383M047753R47495l046295j924194K906608N340142L675750
36644A1757483J167955q82922l829410n817131k693792L781487N987025J566214
36636A1036909k535157j169264R72377j718928n324368k973581K766828L572589
36628D627405q14681k378419J527477M190786J493741j384965L05498K433371
36620A0000213l83206m732263l632095J839591M091628Q58728k031730l55320
36612E655546K665281K459229j53166j569460j164375q81314j215773j014793
$$ plain form
36669 4669020 2641259 1966655 3941007 7125744 8549133 7019093 4533492 3917221
36661 3917221 5378717 6226839 4425638 1590197 985041 2706315 3160735 495834 -1928159
36652 -1928159 -189776 3857977 4805472 1759177 -165017 2741591 8081733 11757483
36644 11757483 12925438 12042516 8213106 2395975 -297817 3483670 9470695 11036909
36636 11036909 8501752 7332488 8304865 6585937 1261569 -1712012 1054816 4627405
36628 4627405 3812724 1434305 2961782 7152568 8646309 7261344 7566842 10000213
36620 10000213 9617007 4884744 1252649 3092240 7183868 8042596 6010866 5655546
36612 5655546 8320827 10780056 10626890 9057430 7893055 7011741 5795968 4781175
36604D781175k91587k68992q15608l37580J373755K216203O66064j744589k131484
36595C447357Q8088K495690K791315J612252J444453L139387M627036L514147
36587B3159725K15316k332699j943733M86238K133047J477223M4735M76933K754107
36578B6470892L456655K23028l887077l346769J936631N146507J416055m952919
36570B6463003o245532k235061J72860k166964m396644k217863J243546J089210
36562A1706555j479956k090124q24760j179177l052787k645645Q04432L430891
36554D669429K649784L06194j041209j169973o47911J82448m3228k332336m197197
36545a623999k094636K250160K886903j376081m332513j545258K990457L387998
$$ plain form
36604 4781175 4489588 4220596 3404988 3067408 4441163 6657366 7323430 5578841 3447357
36595 3447357 3535445 6031135 8822450 10434702 11879155 15018542 19645578 23159725
36587 23159725 23375041 21042342 19098609 19584847 21717894 23195117 23239852 23716785 26470892
36578 26470892 29927547 30150575 26263498 22916729 24853360 29999867 31415922 26463003
36570 26463003 20217471 17982410 18155270 15988306 11591662 9373799 10617345 11706555
36562 11706555 10226599 8136475 7311715 6132538 3079751 434106 1238538 4669429
36554 4669429 7319213 7625407 6584198 5414225 4766314 4948762 4905534 2573198 -1623999
36545 -1623999 -3718635 -1468475 1418428 42347 -4290166 -5835424 -2844967 543031
36537E43031N54012p54181n3389m42362j831627r22337K466947M399742K788913
36528F748749J11908p97500k49094Q9773j96565n44178n38192j69882q011p34446
36518C712562j552310m64030K335097L377315O60104k638445k391036M19783J726800
36509E185840Q99328O86210J499688Q03311j541346k193738K08336K672549K438212
36500A0658390M00429j453815k679294k994381j540722P79853J201974q55102
36492C517332k306399q05465J816750K451728R54088m68899m88938M29500J147728
36483F247425P05016q80515k116938j670158n55329q03576j978613j547582R55443
36474a644827K927315K579556J080372p3804j022077j719688r29602J426497L219707
$$ plain form
36537 543031 1097043 342862 289473 -152889 -1984516 -2906853 -439906 3959836 6748749
36528 6748749 6860657 6063157 5814063 5903836 5707271 5163093 4624901 4455019 4447008 3712562
36518 3712562 2160252 1696222 4031319 7408634 8068738 5430293 3039257 3459040 5185840
36509 5185840 6085168 6771378 8271066 9074377 7533031 5339293 5547629 8220178 10658390
36500 10658390 11058819 9605004 6925710 3931329 2390607 3170460 4372434 3517332
36492 3517332 1210933 405468 2222218 4673946 5628034 5159135 4670197 5099697 6247425
36483 6247425 6952441 6071926 3954988 2284830 1729501 925925 -1052688 -2600270 -1644827
36474 -1644827 1282488 3862044 4942416 4868612 3846535 2126847 1197245 2623742 5843449
36465E843449K856381J130829n44762j566610j255077O47133J921000l11035m574031
36456D147277n606184j797814J779392N01615l194063l888690j071755J226721
36448g903501J099831Q57762K639357N190696N667467K903549j412848m013644
36440E028669k944187K70905K220884J570208m1970j073086j732194k179638j824193
36431g04602j182219j507795j764120N12883M176424M558774O78424k223174n11345
36422B033250K066974Q28961j849051q03319K700073K866599p49724k280668R04247
36413E717342M013957K391563j752547l253087j264519O16470k68264k779056
36405C421859l900328k020243J446734L242470J624626j474030k543616n66171
$$ plain form
36465 5843449 8699830 9830659 9285897 7719287 6464210 7111343 9032343 8721308 4147277
36456 4147277 -1458907 -3256721 -1477329 -975714 -4169777 -8058467 -9130222 -7903501
36448 -7903501 -6803670 -5945908 -3306551 1884145 7551612 10455161 9042313 5028669
36440 5028669 2084482 2355387 4576271 6146479 6104509 5031423 3299229 1119591 -704602
36431 -704602 -1886821 -3394616 -5158736 -4645853 -469429 4089345 4767769 2544595 2033250
36422 2033250 4100224 4929185 3080134 2276815 4976888 7843487 7093763 4813095 5717342
36413 5717342 9731299 12122862 10370315 7117228 5852709 6469179 6200915 3421859
36405 3421859 -478469 -2498712 -1051978 2190492 3815118 2341088 -202528 -768699
36397g68699K174153L140810J988845o2783j801249k455810j648096K88351K178854
36388C034376K645752J237530q40797j609084n97919M17482P3936k80435R93557
36379E074398K248920P19593k196107k080256J440156L428103J151208j853913
36371G932102j909941p44871j213727j768138J05472K398131J733296o16086j090200
36362D826038j2272r1608q05919K5569Q35151j240693l739246j623083L622451
36353A796388M879258K44585m104599l646513j222444m70503l06973N20455k36300
36344b546646k941457k844287K330881O627139M031019j663174k336885J908732
36336B565322L594224J66270k732019j281609R20295J75830r88242Q20220L249992
$$ plain form
36397 -768699 1405454 4546264 6535109 6472326 4671077 2215267 567171 855522 3034376
36388 3034376 5680128 6917658 6076861 4467777 3869858 4287340 4361276 4080841 5074398
36379 5074398 7323318 8042911 5846804 3766548 5206704 8634807 9786015 7932102
36371 7932102 6022161 5277290 4063563 2295425 2400897 4799028 6532324 5916238 4826038
36362 4826038 4813766 4722158 3916239 3941808 4776959 3536266 -202980 -1826063 1796388
36353 1796388 6675646 6920231 2815632 -830881 -2053325 -2523828 -2830801 -2310346 -2546646
36344 -2546646 -5488103 -8332390 -6001509 625630 4656649 2993475 656590 2565322
36336 2565322 6159546 6325816 3593797 2312188 3232483 3408313 2420071 3240291 6490283
36327F490283K264369o58680j144826K89723p87404m371026m906547j17875M537566
36318A595583L381213j667642m622369l672282j558242R2836J916814L241107
36310a292982K261275l6436m91147J125587J720744K61617q01449n34866j230148
36301I82195l349953l651319r71983R48655j63368p76293J939149L883242K85134
36292h74541n254664m942108J640581O965383O207033K188893p07331j715765
36284C507481j622425o15826L20141m2727m16830J181696K773966O03621l667341
36275B021756l970305N16263L178195K46882l131479j480061K088476J472410
36267I42137k113711k356107J748281M561209K725896n40848j272113j35652M5312
$$ plain form
36327 6490283 8754652 8095972 6951146 7240869 6453465 2082439 -2824108 -2941983 1595583
36318 1595583 4976796 3309154 -1313215 -4985497 -6543739 -6450903 -4534089 -1292982
36310 -1292982 968293 931857 440710 1566297 3287041 3548658 2747209 2212343 982195
36301 982195 -2367758 -6019077 -6991060 -6042405 -6205773 -6982066 -5042917 -1159675 -874541
36292 -874541 -6129205 -11071313 -9430732 -2465349 3741684 5930577 5223246 3507481
36284 3507481 1885056 1269230 1589371 1546644 1129814 2311510 5085476 5689097 2021756
36275 2021756 -1948549 -1432286 1745909 1992791 -1138688 -2618749 -530273 942137
36267 942137 -1171574 -3527681 -1779400 2781809 5507705 4966857 3694744 3559092 3604404
36258C604404j108273j692599n56051J504982K797027K224462L07457j210494
36250E870915j373513j165698j761821k443790j735804j0139Q27619R9107q55852
36241b548976p04562N02105K016536L060902K771217R35683j054018j449501n75041
36232B954345m47924j575941j935648j07423K252385K620295J070387l21268p44780
36223C764428j153615j701377j110243P23766J698138M45690j424658j745807
36215e03678j007568r96097j278112K31489L347415M980057L138066n10445k914746
36206D486381k800676r04936J215558J882210M92495j251195r81553Q98873J429865
36197D467022n56168k633650k442457p62995M85578R68026J040010N08282M7275
$$ plain form
36258 3604404 2496131 803532 247481 1752463 4549490 6773952 7081409 5870915
36250 5870915 4497402 3331704 1569883 -873907 -2609711 -2619850 -1792231 -1693124 -2548976
36241 -2548976 -3253538 -2751433 -734897 2326005 5097222 6032905 4978887 3529386 2954345
36232 2954345 2506421 930480 -1005168 -1112591 1139794 3760089 4830476 4509208 3764428
36223 3764428 2610813 909436 -200807 522959 2221097 2666787 1242129 -503678
36215 -503678 -1511246 -2507343 -3785455 -3553966 -206551 4773506 7911572 7401127 4486381
36206 4486381 1685705 780769 1996327 3878537 4371032 3119837 2138284 3037157 4467022
36197 4467022 3910854 1277204 -1165253 -1928248 -1442670 -474644 565366 1073648 1120923
36188A120923J330985L755351L820119K78097l019000k537564m02635m36179j582373
36179B327724k12349K842709L130149p1138k601185k038612n97419m69772p36152
36170A573955l26578j73775q13124j110452p41589q76399j319818k70150J883480
36161b174450K062947n36156k439809j028753J446523J593503L806l40702J002052
36152d11039J651532L10478j519824j734209n6929J873012K294469J240391L96508
36143D044389N37468J32238j987257l780134k430621J048884K815541J717252
36135B097760M26305O85669J056498M00168l6657L57275j61490k265508l369698
36126h09678j345082J904007L001645J424234q11917k067649j786272J8038K099779
$$ plain form
36188 1120923 2451908 6207259 10027378 10305475 7286475 4748911 4346276 3910097 2327724
36179 2327724 2115375 4958084 8088233 8017095 5415910 3377298 2779879 2310107 1573955
36170 1573955 1247377 1073602 260478 -849974 -1591563 -2467962 -3787780 -4057930 -2174450
36161 -2174450 -111503 -647659 -3087468 -4116221 -2669698 -1076195 -1072389 -1413091 -411039
36152 -411039 1240493 1550971 31147 -1703062 -1759991 113021 2407490 3647881 4044389
36143 4044389 4581857 4714095 2726838 -1053296 -3483917 -2435033 380508 2097760
36135 2097760 2524065 3209734 4266232 4666400 4629743 4987018 4825528 2560020 -809678
36126 -809678 -2154760 -250753 2750892 4175126 3363209 1295560 -490712 -472674 1627105
36117A627105K328023L58228j488604j332390j2633Q86576J147639P59300q36646
36108C436598k667650k140302Q06100K284099k3986k693457j486373J872107K292609
36099A679745o14204k026092L82285K951397J878932j190141k000821K03735K235013
36090C499849J687145l38531j338013m99489R39191J391035K22095j954586l379034
36081B29662k130543J562373M248199K563232j877835l449779M5377L621219J758412
36072F570317l417563m944372j053353K677822J884915q86940j306836J79987
36064b96023M18798o87490m91801J541044K889317J915243J45577l3930J521388
36055F922123K653082J509168j154911k696424j932418q27039j557406k904224
$$ plain form
36117 1627105 3955128 4313356 2824752 1492362 1479729 2366305 3513944 4273244 3436598
36108 3436598 768948 -1371354 -565254 1718845 1694859 -998598 -2484971 -612864 1679745
36099 1679745 1065541 -960551 -578266 2373131 4252063 3061922 1061101 1264836 3499849
36090 3499849 5186994 4848463 3510450 3010961 3950152 5341187 5563282 3608696 229662
36081 229662 -1900881 -338508 3909691 6472923 4595088 1145309 1190686 4811905 6570317
36072 6570317 3152754 -1791618 -2844971 -167149 1717766 830826 -476010 -296023
36064 -296023 122775 -564715 -1056516 484528 3373845 5289088 5434665 5400735 6922123
36055 6922123 9575205 11084373 9929462 7233038 5300620 4473581 2916175 11951
36047A1951j899407J306134L096055J443700j355074k055219l40347J812892K744982
36038D765667K007224K38215j057511r93379p45939j822726l186605k564222m25545
36029c784821M05268o63056j094778M90867K474784L401727L545465K560699n82187
36020F753968m206586m573508j519885N96810n68323k021587p92557J630969K818249
36011a882450L183995L380817J992373j041143k678914j620496p31392j475264
36003h72474q54636K166422K786859j594284m875416r27429N622096N644523l91078
35994F704583l669730j082798J403737K2811j330064N02337K104366J56011k326227
35985B485026j162316K036315K747700M25005j639935j524438l35016L63437K29952
$$ plain form
36047 11951 -1887456 -581322 2514733 3958433 2603359 548140 207793 2020685 4765667
36038 4765667 6772891 7011106 5953595 4960216 4214277 2391551 -795054 -3359276 -3784821
36029 -3784821 -3379553 -4042609 -5137387 -4646520 -2171736 1229991 4775456 7336155 6753968
36020 6753968 2547382 -2026126 -3546011 -2949201 -3517524 -5539111 -6331668 -4700699 -1882450
36011 -1882450 1301545 4682362 6674735 5633592 2954678 1334182 602790 -872474
36003 -872474 -1727110 439312 3226171 1631887 -3243529 -4170958 1451138 7095661 6704583
35994 6704583 3034853 1952055 3355792 3378603 2048539 2550876 4655242 4811253 2485026
35985 2485026 1322710 3359025 6106725 6531730 4891795 3367357 3032341 3395778 3625730
35976C625730l65558j035646j666022k315807k437904r39880J799287L227456
35968a08344J923959J63201M89937J384472M1438j994292q31413K715798L652056
35959G436812R33106p84134P43170J424511j734819m685316k538669K294870L658036
35950F747567Q50543j385080r46992o94196k202258k559567L05181L141647J760216
35941E017061k332328l652190o29250K149574Q28622k066317j841882Q89418J386633
35932b50659j213137k283373M72426K749565O10668k596354j300502L188189M520701
35923C897524J020807k423551k284460n26942K66790O23431J156493N74491q95715
35914A408868l85177K542688L667935K48460m149132m717158k309628j042278
$$ plain form
35976 3625730 3260172 2224526 558504 -1757303 -4195207 -5135087 -3335800 -108344
35968 -108344 1815615 1978816 2468753 3853225 3894663 1900371 1068958 3784756 7436812
35959 7436812 8369918 7585784 8328954 9753465 8018646 3333330 794661 3089531 6747567
35950 6747567 7598110 6213030 5266038 4571842 2369584 -189983 115198 3256845 5017061
35941 5017061 2684733 -967457 -1596707 552867 1381489 -684828 -2526710 -1637292 -250659
35932 -250659 -1463796 -3747169 -3274743 -525178 85490 -2510864 -3811366 -623177 3897524
35923 3897524 4918331 2494780 210320 -316622 -49832 573599 1730092 2304583 1408868
35914 1408868 1023691 3566379 7234314 7482774 3333642 -1383516 -3693144 -4735422
35906d735422j347038k52662K555229L847093K217263J83941K634P35734P17096
35897C923868J72910n2540k02567n99188o97578m64631r99183k329378k338038
35888c586325J23944K525330J710213j132008j731361Q70790K694306R69267j534671
35879I09485j066808J152724J544777O54344J806075M012158K393850l120308
35871H286297n877882k411528J680651O09337k148516k8484M848583M533087j527062
35862G964483n040758j757398K529528J870335j257078j706110k3299L39380l07985
35853B611098L27520J329464O70058q4810J315240K405232m55798m606968l782306
35844b71270J849972N077408K333825j427616j123407J080255P35227j314280
$$ plain form
35906 -4735422 -6082460 -6335122 -3779893 67200 2284463 2468404 2471038 3206772 3923868
35897 3923868 4096778 4044238 3841671 3242483 2544905 2080274 1081091 -1248287 -3586325
35888 -3586325 -3462381 -937051 773162 -358846 -2090207 -1219417 1474889 2444156 909485
35879 909485 -157323 995401 2540178 3194522 5000597 9012755 11406605 8286297
35871 8286297 2408415 -3113 1677538 2286875 138359 109875 4958458 9491545 7964483
35862 7964483 2923725 1166327 3695855 5566190 4309112 2603002 2579703 2919083 2611098
35853 2611098 2938618 4268082 4938140 4853330 6168570 8573802 8118004 3511036 -271270
35844 -271270 1578702 6656110 8989935 7562319 6438912 7519167 8254394 6940114
35836F940114j368495K66489K28480j658146k157682k38655J573857J744462J605866
35827F936290J911583J201857j047179k838278k861100k456317k533685j339526
35819c026355K124224M787355K996595j808970m272245j913935K055557L230965
35811D173191J086640j298546j053343J782386M466374M076711N05551l176227
35803A0562737m133907k974013k227341k359125j500705Q40345K385755J522496
35795B116242N4368O56123K760801L161238O54855j851134r67133K437405L882821
35786A2905586J002509l159178m185615k289843j433846k766036k724640R10398
35778a740665M750555M456768Q91022j834160k307357j970452j007020J469182
$$ plain form
35836 6940114 5571619 5838108 6066588 4408442 2250760 2012105 3585962 5330424 6936290
35827 6936290 8847873 10049730 9002551 6164273 3303173 846856 -1686829 -3026355
35819 -3026355 -902131 3885224 6881819 5072849 800604 -1113331 942226 4173191
35811 4173191 5259831 3961285 2907942 4690328 9156702 13233413 13738964 10562737
35803 10562737 6428830 3454817 1227476 -1131649 -2632354 -1792009 593746 2116242
35795 2116242 2170610 2826733 5587534 8748772 9403627 7552493 6585360 9022765 12905586
35786 12905586 13908095 10748917 6563302 4273459 2839613 73577 -2651063 -1740665
35778 -1740665 3009890 7466658 8357680 6523520 4216163 2245711 1238691 2707873
35770B707873L842746L099200l23040k678069k244536r54494m78097k95640o896
35761B669047l2777K86983J843805L014960J497598j321645k004923p37499n73765
35752D641784j381292k65570J926000J187936j724859j315502K922698M685710
35744A0676905J667026j89645K433869L722190p59225n235947l308566Q61239
35736I867846K53154k257740L52629N224449L429821m101547o785904j161726
35728D820982M061505K354954j607549j512091R11914J241830L84783J263103
35720A1919431K567462J567695m45806o38192K28463k29538j126981L0780K158226
35711A6031540J521880k203080m503784j734788M039292P379126N679784J605226
$$ plain form
35770 2707873 6550619 9649819 9326779 6648710 4404174 3449680 2971583 2675943 2669047
35761 2669047 2636270 2923253 4767058 7782018 9279616 7957971 5953048 5215549 4641784
35752 4641784 3260492 2994922 4920922 6108858 4383999 3068497 5991195 10676905
35744 10676905 12343931 12154286 14588155 18310345 17551120 12315173 9006607 9867846
35736 9867846 10121000 7863260 8215889 13440338 16870159 12768612 5982708 4820982
35728 4820982 8882487 11237441 9629892 8117801 9029715 10271545 10656328 11919431
35720 11919431 14486893 16054588 15608782 14970590 15199053 14969515 13842534 13873314 16031540
35711 16031540 17553420 15350340 10846556 9111768 13151060 20530186 26209970 27815196
35703B7815196p78309q49715q86298j474945l86539L041578N358408L213183j826841
35694C3225718n202177m747936j986000M94993Q36881j296122l681526l170562
35686A4473269k17026Q71512j609925l568027j503428J833683K445224J741007
35678A4466289K692930L067334n83243m880656l469194K314316M635289J018094
35670A9261159k751215k399234l40991M90775R03244J364010J36926k183632k287943
35661A2193099l63426n07549k930156k641224J330476K799394j400677n204453
35653C275484k635771K915650M894300L649972L422334L629791P76494l634326
35645A6293928m512567j264320J945140L052319L225167K145060j346431m158029
$$ plain form
35703 27815196 27036887 26187172 25300874 23825929 23439390 26480968 31839376 35052559 33225718
35694 33225718 28023541 23275605 21289605 21784598 22621479 21325357 17643831 14473269
35686 14473269 14256243 15127755 13517830 9949803 8446375 10280058 12725282 14466289
35678 14466289 17159219 20226553 19643310 14762654 11293460 13607776 18243065 19261159
35670 19261159 16509944 14110710 13769719 14260494 15163738 16527748 16664674 14481042 12193099
35661 12193099 11829673 11322124 8391968 5750744 7081220 9880614 8479937 3275484
35653 3275484 639713 3555363 8449663 12099635 15521969 19151760 19928254 16293928
35645 16293928 11781361 10517041 12462181 15514500 18739667 20884727 19538296 15380267
35637A5380267j357138N466977R102208P897468Q805599J5241524J8886833J0835958
35629I0259696l435217r440405l517574J912317l953002j5242302j8359374j0714603
35621B7509536k279762m71465k229710k225933q58811m42037J27072J941298K169018
35612B3239206r87324l184165K13702N796541O073850N97063l305895j243773
35604B7199205K620932K374911j768693m939253m219093j377243j7744j382215
35596A8490807l079946k082628J407565M446485N348543M785176L302943J512414
35588C4131359K501113Q546069J4919049J4407427R959713J3121356K4752600
35581A22338686K8298657J2245159j0045165j6763612p989496l463197j1761923
$$ plain form
35637 15380267 14023129 19490106 28592314 36489782 45295381 60536905 79423738 90259696
35629 90259696 86824479 77384074 73866500 75778817 71825815 56583513 38224139 27509536
35621 27509536 25229774 24758309 22528599 20302666 19443855 19001818 19128890 21070188 23239206
35612 23239206 22251882 19067717 19281419 25077960 31151810 31748873 28442978 27199205
35604 27199205 29820137 32195048 30426355 25487102 21268009 19890766 19873022 18490807
35596 18490807 15410861 13328233 14735798 19182283 24530826 29316002 32618945 34131359
35588 34131359 36632472 45178541 60097590 74505017 84464730 97586086 122338686
35581 122338686 150637343 162882502 152837337 136073725 128084229 124621032 112859109
35574A12859109j8796744j0787970N945555J5361617J1334329m58423j2060193
35567A03397280j7054771j1055448L500878J5626860J4789956J259664j4614520
35560I5849899k1793548j6755250n647853R16193j829179p853565q625152m119049
35552C0142496m38148Q51540L238640O200778M532473k141340p340132p215107
35544B7831200m833920l157701r68764K010792K908047J214216M41320K126002
35536B7571192L747931L924386L981561L720686J694496j35036J545744N022137
35528E1073097N984486N199343O366901Q624551J0049544J5220693K7488127L6482299
35520A66489041K7941731N687963j1290857j4329094j1624537q433954j53284
$$ plain form
35574 112859109 94062365 83274395 89219950 104581567 115915896 115457473 103397280
35567 103397280 86342509 75287061 78787939 94414799 109204755 110464419 95849899
35560 95849899 74056351 57301101 51653248 52569441 50740262 42886697 34261545 30142496
35552 30142496 29704348 30555888 33794528 39995306 44527779 42386439 35046307 27831200
35544 27831200 22997280 19839579 18870815 20881607 23789654 25003870 25445190 27571192
35536 27571192 31319123 35243509 39225070 42945756 44640252 44505216 46050960 51073097
35528 51073097 57057583 62256926 68623827 77248378 87297922 102518615 130006742 166489041
35520 166489041 194430772 200118735 188827878 174498784 162874247 154440293 154287009
35513A54287009J0041082P094960j2463986l0320936l0985364k1564449j5820383
35506F0267933j3511408q427854l360137k994692k975946J024795L602734M96347
35498C4121772j852113J332763L428962K94199R6932O990425J0356955M490411
35490E9260306K084137J1377794J8613122J4271229J6598248M0543852O0920427
35483B23669115M2733251j711328k5221564j2987120J848461o097968k2094500
35476B00138347k5226416j7727106m326853K2596317N4775558N6995962J4523471
35469C01749280l2644797l7129058r507265m04774k6373124n1926784m6949098
35462I6814380k5395227j4342149j4171902r653102o86390J028704m178365m700243
$$ plain form
35513 154287009 164328091 171423051 158959065 128638129 97652765 76088316 60267933
35506 60267933 46756525 38328671 34968534 31973842 28997896 30022691 33625425 34121772
35498 34121772 32269659 33602422 37031384 37325583 37422515 44412940 54769895 59260306
35490 59260306 61344443 72722237 91335359 105606588 122204836 162748688 223669115
35483 223669115 266402366 264691038 239469474 226482354 228330815 222232847 200138347
35476 200138347 174911931 157184825 152857972 175454289 230229847 287225809 301749280
35469 301749280 269104483 231975425 222468160 222063386 195690262 143763478 96814380
35462 96814380 71419153 57077004 42905102 33252000 32565610 33594314 29415949 24715706
35454B4715706J357425L910110n21531l671868j218552N93664j680561j849688
35446B1634705L014647N072418l88418m760024l17322N644606L392407j905240
35438C1387779k10618M325640J655470l614320K65337R068762R011108L073695
35430E4962853O315595J6347126J6937791J2865908K7889850N9005334O7438983
35423B61763440L2509203j6199228l9858659l3858101j0370755K7233757O3523577
35416B84743234O0577439R831248l3942472j8293647K7690965L1383403j9359924
35409C42630246o4868069o1545466k5712852J2643977M3148846N0507933J2679185
35402C09483800n2882276q7895999o5743018k6708163j5267734k1208129j3731830
$$ plain form
35454 24715706 26073131 29983241 29461710 25789842 24571290 25164954 23484393 21634705
35446 21634705 24649352 29721770 29333352 24573328 24256006 29900612 33293019 31387779
35438 31387779 31177161 35502801 37158271 33543951 33809288 42878050 51889158 54962853
35430 54962853 61278448 77625574 94563365 107429273 135319123 194324457 261763440
35423 261763440 294272643 278073415 238214756 204356655 193985900 221219657 284743234
35416 284743234 345320673 355151921 321209449 302915802 330606767 361990170 342630246
35409 342630246 277762177 216216711 190503859 203147836 246296682 296804615 309483800
35402 309483800 256601524 168705525 102962507 76254344 60986610 39778481 26046651
35395B6046651K566864M273453n185302n752786J170598K66060n454707k106185
35387A5824646O036515M437694l632060m004993J457239L86444n073323l411650
35379A2020512K635374J421149m312257k467639M816858M816315k244874m404849
35371A2280589J45640K139218j72851J56738L502725L874886J774304J880921
35363B5582170K035161j336254k921873K018466N959899K123650p63185O187806
35355C8885840J3390420R357564L718564J0484077K0428880J7070165Q625600
35348A21961110J2272294J6367854k907617l0808434k4483499J7859746M2197523
35341A52458977J2674187l6903258n2188492k9473492o661577m073807q383113
$$ plain form
35395 26046651 28613515 32886968 27701666 21948880 23119478 23385538 17930831 15824646
35387 15824646 21861161 26298855 22666795 18661802 20119041 20505485 15432162 12020512
35379 12020512 14655886 16077035 11764778 9297139 14113997 18930312 16685438 12280589
35371 12280589 12426229 14565447 14392596 14549334 18052059 21926945 23701249 25582170
35363 25582170 27617331 26281077 23359204 25377670 31337569 33461219 32698034 38885840
35355 38885840 52276260 61633824 65352388 75836465 96265345 113335510 121961110
35348 121961110 134233404 150601258 147693641 116885207 92401708 110261454 152458977
35341 152458977 165133164 128229906 76041414 46567922 39906345 35832538 27449425
35334B7449425o006654j062613L21420L82277O83337j523522m998794m286820
35326A0958056M59757K878235O69154j558662o07868J049945O86482m02248N4148
35317A4186999J245476L09266l346268n968173l235247L393863O953738L868799
35309A7408453q11693p05150L094598N256942M466683L015646K054619K619352
35301C6399450O495219J0962813J0214538P952367J6661317L4022133L5594427
35294A58302264R938634j3183879K177635M1822007N2965921J4744882l5261189
35287B31506275n4671195m5615641l3981559k7294770j7700433p800857o809297
35280C7632523j0533431p526191O51173L548659P67223K31772K476288K180026
$$ plain form
35334 27449425 21442771 20380158 20701578 21083855 21767192 20243670 15244876 10958056
35326 10958056 11417813 14296048 14965202 13406540 12798672 13848617 14535099 14132851 14186999
35317 14186999 15432475 15741741 12395473 6427300 3192053 6585916 13539654 17408453
35309 17408453 16596760 15891610 18986208 24243150 28709833 31725479 33780098 36399450
35301 36399450 42894669 53857482 64072020 72024387 88685704 122707837 158302264
35294 158302264 168240898 155057019 157234654 199056661 252022582 266767464 231506275
35287 231506275 176835080 131219439 97237880 69943110 52242677 44441820 37632523
35280 37632523 27099092 19572901 20224074 23772733 24539956 24771728 27248016 29428042
35272B9428042R12501L482583N701222M52364p487940p130724Q92711O064499
35264C2315258N247964M468511N303271L505668M44450K221206P282359P982877
35256F8771564M643850M676588P301647L851747m571893n549578L261886O685096
35248H9070907m760721j7210397j1685271Q220743K0212362J1498956q296993
35241H7049586k1828439k2002742j3687702n057759j070479j785617l744314l766203
35233A4106331k235653j719606k582208k084410J363838M971511M573339K95820
35225A6688962l044655j966225J269701K135803J70763j138916k48441L65564
35217A4232556j091071k460731j189565J464918K399406J217567K83318J023129
$$ plain form
35272 29428042 30340543 33823126 39524348 39976712 32488772 25358048 26250759 32315258
35264 32315258 37563222 42031733 47335004 50840672 51285122 53506328 60788687 68771564
35256 68771564 73415414 78092002 85393649 89245396 84673503 79123925 82385811 89070907
35248 89070907 84310186 67099789 55414518 63635261 83847623 95346579 87049586
35241 87049586 65221147 43218405 29530703 24472944 23402465 21616848 17872534 14106331
35233 14106331 11870678 10151072 7568864 5484454 6848292 11819803 16393142 16688962
35225 16688962 13644307 11678082 12947783 15083586 15254349 14115433 13866992 14232556
35217 14232556 13141485 10680754 9491189 10956107 13355513 14573080 14856398 15879527
35209A5879527K326838K603347K081637K515002M578551O106411M687938K449527
35201D3228778M788335J1678648J4451515P079574k338415J12418J4376573K4043318
35193A17420744J6637156j665733j5815094j9150018j5437546j0016208n867562
35186F6105739m527045m526948j631605M438698O966224J097121p963111j1567253
35178D8391820r182711o882608p020039o529484m055304j803819o52968N18367
35170A2783254R19635j032261l117419j705614J506080J337932k059022k829307
35162E803278Q96123L566988J121533k556324j894871K192044M713844M055200
35154A7897815K652679K052518J451211O88671J214112L409283N319219N315884
$$ plain form
35209 15879527 18206365 20809712 22891349 25406351 29984902 36091313 40779251 43228778
35201 43228778 48017113 59695761 74147276 81226850 78888435 79000853 93377426 117420744
35193 117420744 134057900 132392167 116577073 97427055 81989509 71973301 66105739
35186 66105739 61578694 57051746 55420141 59858839 66825063 67922184 59959073 48391820
35178 48391820 39209109 32326501 25306462 18776978 14721674 12917855 12264887 12783254
35170 12783254 13702889 12670628 9553209 7847595 9353675 10691607 8632585 5803278
35162 5803278 6699401 10266389 11387922 8831598 6936727 9128771 13842615 17897815
35154 17897815 20550494 22603012 24054223 24742894 25957006 29366289 34685508 40001392
35146D0001392M741183O223833R438785J0411929O576142J328352P69164N749979
35138H5240759J0279432R119349L902649m22929k177983k759274k473440r96258
35130I9712305q12758n420601j3537569j8927326j7378809j1283971o098852m359535
35122B1892884m441404l694550j463046N21402K62287j855788l094008j640717
35114F487060J061363K336824J659638O57526O21539J511124K685308L156467
35106B0176849J871898q17416k754749k396861p29811M14990N83223q9009j878481
35097A4380633l637612k227289L088052P559611O264662J346519p14647J177924
35089B7237853J218293l490024p038203k754181O295279J0151543M528889m250992
$$ plain form
35146 40001392 44742575 50966408 60405193 70817122 77393264 78721616 79490780 85240759
35138 85240759 95520191 104639540 108542189 108119260 105941277 103182003 100708563 99712305
35130 99712305 98899547 93478946 79941377 61014051 43635242 32351271 26252419 21892884
35122 21892884 17451480 13756930 12293884 12815286 13077573 11221785 8127777 6487060
35114 6487060 7548423 9885247 11544885 12202411 12823950 14335074 17020382 20176849
35106 20176849 22048747 21231331 18476582 16079721 15349910 15764900 16348123 16259114 14380633
35097 14380633 10743021 8515732 11603784 19163395 25428057 26774576 26059929 27237853
35089 27237853 28456146 24966122 17927919 15173738 21469017 31620560 36149449 31898457
35081C1898457p871625n603836k777258k404469k264799k5918K533559K257173
35073A5741284p37394l588548m659856m418603k993524J57272L766045M827867
35065H094543K476810l97457r03607M32818J701463K944453M742516M961726Q15219
35056B4868484n425768o711745J15896Q288495P747670k232151j1088138r603966
35048E958777j085760L855274J398470k094795o36240L668124N885867N718829
35040B2668546N439978M641928K303196J055771L573557O535003M114357l283973
35032D7048363r291564j0142068p688325m389638j060026M71805j421036l754585
35024I772926j823515K825898L808842K57129j513925J452842M420452M264987
$$ plain form
35081 31898457 24026832 18422996 15645738 13241269 10976470 10950552 13484111 15741284
35073 15741284 15003890 11415342 6755486 2336883 -656641 -499369 3266676 8094543
35065 8094543 10571353 10173896 9270289 9703107 11404570 14349023 19091539 24053265 24868484
35056 24868484 19442716 12730971 12846867 21135362 28883032 26650881 15562743 5958777
35048 5958777 4873017 8728291 10126761 8031966 7395726 11063850 16949717 22668546
35040 22668546 28108524 32750452 35053648 36109419 39682976 46217979 50332336 47048363
35032 47048363 37756799 27614731 19926406 15536768 14476742 14948547 13527511 9772926
35024 9772926 7949411 10775309 14584151 14841280 13327355 14780197 19200649 23465636
35016B3465636M884285Q521824R705588M493191j219118o57023K283394l41318
35008E1136459o524375p323510k103002j4884n139300r968824p379840j242919
35000A1439805K97762l145042m979520j958166J977468K272944j12850j138443
34992D653958K6106J72766k302509l940352r65999M234213N403822J241901k430025
34983F093881r08313L119320M332291K272258L47226q5141l81440p06235L66542
34974A4450389K503730L332453K128315J288593L075600O201393O751818K648578
34966D2380869l166121n254661k270986Q39488m96329l757401l311804M88739
34958B5451794J859037r88488l321265j934261O92446K209021L688249M369682
$$ plain form
35016 23465636 28349921 36871745 46577333 51070524 49851406 49194383 51477777 51136459
35008 51136459 44612084 37288574 35185572 35170688 30031388 20062564 12682724 11439805
35000 11439805 11737567 8592525 3613005 1654839 3632307 5905251 5792401 4653958
34992 4653958 4680064 4852830 2550321 -1390031 -2356030 1878183 7282005 8523906 6093881
34983 6093881 5185568 8304888 12637179 14909437 15256663 15171522 14790082 14083847 14450389
34974 14450389 16954119 20286572 22414887 23703480 26779080 32980473 39732291 42380869
34966 42380869 39214748 33960087 31689101 32528589 32032260 28274859 24963055 25451794
34958 25451794 27310831 26322343 23001078 21066817 21759263 23968284 27656533 32026215
34950C2026215K78422p748734j1625305p019499n02128L57732k044210j360949
34942B361544J382187R43419j853099j959626M76804J209381M62582J856377M099124
34933H978693K396878k327427m079611j855894q34574k735720l137296p6803K356037
34924a315717J436590q8478K1762j65692j507977r60069K461670M293027J270262
34915E445378k974394l067951M59859K663355J182497j685192k797389j538970
34907b312807K66147O39709k18102k05171J399507K385150J025490q77774r56861
34898A145288k32428q12514j729200j002188J92272j01421j41022K436576N000436
34889D755799L382591n04250j120354J468991J901436j058185k817626j454742
$$ plain form
34950 32026215 32304637 24555903 12930598 5911099 5408971 5766703 3722493 2361544
34942 2361544 3743731 4687150 2834051 874425 1351229 2560610 3023192 4879569 8978693
34933 8978693 11375571 9048144 4968533 3112639 2278065 -457655 -3594951 -3671754 -1315717
34924 -1315717 120873 32395 54157 -111535 -1619512 -2579581 -117911 4175116 5445378
34915 5445378 2470984 -596967 -137108 2526247 3708744 2023552 -773837 -2312807
34907 -2312807 -2046660 -1406951 -1625053 -1830224 -430717 1954433 2979923 2102149 1145288
34898 1145288 912860 100346 -1628854 -2631042 -2438770 -2540191 -2681213 -244637 4755799
34889 4755799 8138390 7634140 6513786 7982777 9884213 8826028 6008402 4553660
34881D553660m91938j528778j202534K114693M943986M505848K230072l53836
34873A4771173l315134m560693j239458L433672K511974l137861m287000J909308
34865F085981N938315O94358o584859n395469K024617N301562J755657k187496
34857G632666k651443j884641j188018J028749L680243K953620q96693k759896
34849E914587l9260M263229O907799Q019760Q060021N880557J861675p86956k88452
34840C9792960Q29205n21288l231391l445161j55131K794047J255306l493191
34832C3825356n495337j643543L482901L162196k265253n973405m448903j478574
34824A9165438p11169K0553L146842N174370J679693m710193p379663n092166
$$ plain form
34881 4553660 4061722 2532944 1330410 3445103 8389089 12894937 15125009 14771173
34873 14771173 11456039 6895346 5655888 9089560 11601534 8463673 4176673 6085981
34865 6085981 12024296 12718654 6133795 738326 2762943 8064505 9820162 7632666
34857 7632666 4981223 3096582 1908564 2937313 6617556 9571176 8674483 5914587
34849 5914587 5875327 10138556 17046355 25066115 33126136 39006693 40868368 40081412 39792960
34840 39792960 40622165 40100877 36869486 33424325 33269194 36063241 37318547 33825356
34832 33825356 28330019 26686476 30169377 33331573 31066320 25092915 20644012 19165438
34824 19165438 18454269 18474822 21621664 26796034 28475727 23765534 16385871 11293705
34816A1293705k504007k137183j676620L58823J720028Q08516l74033K51246J548938
34807I289413J415555m9413j384938k010631k205876k190498k190259k249117
34799a575764j526012P43035L185060L030065j83620l252543k919684K72258L032725
34790H05520L418106K364599J376126L94601j168433k425724j771415L46533J250304
34781D590217l57838k152214j293925J282986J964038n31798l564839m202815
34773d266188k354496J49505J770416K040068J585297J608198K202038J812625
34765D547463n4685j002287P00271K293272K41510l348267l164916O48068K266009
34756C126438l56898k301208l98005J506843P997j435706R13189L482375J255155
$$ plain form
34816 11293705 8789698 6652515 4975895 5334718 7054746 7863262 7489229 7740475 9289413
34807 9289413 10704968 10655555 9270617 7259986 5054110 2863612 673353 -1575764
34799 -1575764 -3101776 -2358741 826319 3856384 3672764 420221 -2499463 -2227205 805520
34790 805520 4223626 6588225 7964351 8358952 7190519 4764795 2993380 3339913 4590217
34781 4590217 4232379 2080165 786240 2069226 4033264 3501466 -63373 -4266188
34773 -4266188 -6620684 -6471179 -4700763 -2660695 -1075398 532800 2734838 4547463
34765 4547463 4492778 3490491 4190762 6484034 6725544 3377277 212361 860429 3126438
34756 3126438 2769540 468332 70327 1577170 1585167 149461 1062650 4545025 5800180
34747E800180k835891k055215L071572N683504L461601Q76007N84186J73212j359509
34738A3399647j135499J255106J477624k230551n148123l323822J33153L76068
34730D803603j627200j717969L43017J531618J350766J807508K555739J119290
34722A0166372j880026k378232J009899M313973L522447k41900k894070k610998
34714I007465p21265J157484K579824L400666L251678J984153j60255k486579
34706A8013171l580729k285364J96192P20587j671718l580446j582907K429448
34698H658234L431040M04047k311477j408531J272525K479990J986259J095839
34690A5607926k44118k065709k609799r82981M64185m74848k011648j276861O80073
$$ plain form
34747 5800180 2964289 909074 3980646 9664150 13125751 14001758 14585944 14759156 13399647
34738 13399647 12264148 13519254 14996878 12766327 7618204 4294382 4427535 4803603
34730 4803603 3176403 1458434 1801451 3333069 4683835 6491343 9047082 10166372
34722 10166372 8286346 5908114 6918013 11231986 14754433 14512533 11618463 9007465
34714 9007465 8286200 9443684 12023508 15424174 18675852 20660005 20499750 18013171
34706 18013171 14432442 12147078 12343270 13063857 11392139 7811693 6228786 8658234
34698 8658234 12089274 12493321 10181844 8773313 10045838 12525828 14512087 15607926
34690 15607926 15363808 13298099 10688300 9705319 10169504 9694656 7683008 6406147 7086220
34681G086220O46750j282061k070609q61974K67872L09237K37751J82920n84347
34672C931759j128356q9093J046180J8111j539194l49454K106202J229420k431507
34663B794068l103816N80021K681429m63395m205122l182691O39688K288530J401112
34654e70176M47865o19918k590391l212369o82506J816153N63809k020681r02043
34645g770257L088187M357692J446785j161407n15613J007233P69831R8687J174647
34636B495785K917455K506151m89640l288961k925453L90211L062028K000936
34628F668512j390850k979716j771761q97170j704816j075949K609545N073184
34620D530979K221142k608938k966013J123084L633052J705494j377796k401474
$$ plain form
34681 7086220 7732970 6450909 4380300 3518326 3786198 4095435 4333186 4516106 3931759
34672 3931759 2803403 2714310 3760490 3778601 2239407 1889953 3996155 5225575 2794068
34663 2794068 -309748 270273 2951702 2488307 -1716815 -4899506 -4259818 -1971288 -570176
34654 -570176 -122311 -742229 -3332620 -6544989 -7227495 -5411342 -4847533 -6868214 -7770257
34645 -7770257 -4682070 -324378 1122407 -39000 -554613 452620 1222451 1321138 2495785
34636 2495785 5413240 7919391 7429751 4140790 1215337 1605548 4667576 6668512
34628 6668512 5277662 2297946 526185 -370985 -2075801 -3151750 -542205 4530979
34620 4530979 6752121 4143183 1177170 2300254 5933306 7638800 6261004 3859530
34612C859530j947678j142697L27933J629869O66039j855692k271807M03403K536267
34603B205167J572013j4131R42604L162613L244469Q90670j356653k215255k512343
34594E919154k620383j794318j83470O43442j73106j469467j530972j2811K183750
34585I61819M141713N080173L841372j15722m779050o356144l382351J113745
34577E05555L121308K119891J86670j678285l349671l237425l28790K255297P18464
34568C13014k575744j617801L175195M363925o61967m718658k099795K427694
34560a394137K186546l55102P89582L558382J510076l938364n035126n09765K819652
34551c68256J621550n3331K40615l55687k260374r92233L738389M954166l96012
$$ plain form
34612 3859530 1911852 769155 1097088 2726957 3392996 1537304 -734503 -331100 2205167
34603 2205167 3777180 3763049 4705653 7868266 11112735 12003405 10646752 8431497 5919154
34594 5919154 3298771 1504453 1320983 1964425 1791319 321852 -1209120 -1221931 961819
34585 961819 5103532 10183705 14025077 13909355 9130305 2774161 -608190 505555
34577 505555 3626863 5746754 5933424 4255139 905468 -2331957 -2660747 -405450 313014
34568 313014 -2262730 -3880531 -705336 3658589 2996622 -1722036 -3821831 -1394137
34560 -1394137 792409 437307 1226889 4785271 6295347 2356983 -2678143 -3187908 -368256
34551 -368256 1253294 1199963 1440578 1084891 -1175483 -2167716 1570673 6524839 6128827
34542F128827m803489j314209N054002M776015j735226n564005k987754N41785
34534I5946J93522j790447j475573M88662J138606K71669m5705O99922J047184
34525F23786M71184L28289J387644K202567J239091n19241j031665o98546j701771
34516B301338l568731k844359J166014L969136K228231q45502o63464J200579
34508B943242K34666k412676j513799K554079L296601j247591m675188k219931
34500c040597J928584J802586j214124j868001K67801J406980M75185j93993L8791
34491c96788o06620k105420k004568M08519K672307K705212J265114M1980p18783
34482A260953j672169k646016k519978p84032J151569R00627j924393m390358
$$ plain form
34542 6128827 1325338 11129 5065131 9841146 8105920 2541915 -445839 95946
34534 95946 289468 -1500979 -2976552 -2487890 -1349284 -1077615 -1123320 -423398 623786
34525 623786 1094970 1423259 2810903 5013470 6252561 5733320 4701655 4003109 2301338
34516 2301338 -1267393 -4111752 -2945738 1023398 3251629 2406127 1742663 2943242
34508 2943242 3177908 765232 -748567 1805512 5102113 3854522 -820666 -3040597
34500 -3040597 -1112013 690573 -523551 -2391552 -2123751 -716771 -241586 -435579 -396788
34491 -396788 -1003408 -3108828 -5113396 -4704877 -2032570 672642 1937756 1979736 1260953
34482 1260953 -411216 -3057232 -5577210 -6361242 -5209673 -4309046 -6233439 -10623797
34474a0623797l419780J58713K737773K830666K274424K396373K037654M06588
34466a201386r40099n37717P79218J552540J666253J477312Q57473K4193n17573
34457C160214j301447k965649l980039k289875P14474J593102N26216J101166
34449c441838L610976L846812M46111k135233r49997O11969q47176k851119k140807
34440c850302o32327q54167k16098L693366O352476K543876l732302m069518J227656
34431D62660L633972j11171l808375k561362N36552J342686R48366J149659o8261
34422A524726l819131o029283k919507K660563N012003L179298O78519k52654
34414C4534k33333p8113k6772n79279j375512n83721K026128L162118L24929l457132
$$ plain form
34474 -10623797 -14043577 -13884864 -11147091 -8316425 -6042001 -3645628 -1607974 -1201386
34466 -1201386 -2141485 -2679202 -1899984 -347444 1318809 2796121 3653594 3677787 3160214
34457 3160214 1858767 -1106882 -5086921 -7376796 -6662322 -5069220 -4543004 -3441838
34449 -3441838 169138 4015950 4462061 2326828 1376831 1988800 1141624 -1709495 -3850302
34440 -3850302 -4482629 -5336796 -5552894 -1859528 4492948 7036824 3304522 -764996 462660
34431 462660 4096632 3985461 177086 -2384276 -1847724 -505038 443328 1592987 1524726
34422 1524726 -2294405 -8323688 -11243195 -8582632 -3570629 -391331 287188 34534
34414 34534 -198799 -276912 -303684 -882963 -2258475 -2842196 -816068 2346050 2670979 -786153
34404g86153k975406J691151M897222K966086j467531l737703k800915q23138
34396c036387O51068J696604K194233J461056r6764p55843K44193J311129N44345
34387D213634j444825k201971r02584M45696l8990j429313j598328m29856L85394
34378c001143K78341N10214J680666K321435R57576j430127k092726M37023M428334
34369D089593O280226M048115l31136k999703k558677j359587j792016k836084
34361B540731j934195Q15374K512625J239709j859359m244431m181286j494805
34353f605637K197047M099925K748589j33341j738142j710879j727847k085560
34345d955845j321395O22919J644822Q14677P8449J261689L186003L282742R53990
$$ plain form
34404 -786153 -3761559 -2070408 2826814 5792900 4325369 587666 -2213249 -3036387
34396 -3036387 -2385319 -688715 1505518 2966574 2869810 2113967 2358160 3669289 4213634
34387 4213634 2768809 566838 -335746 109950 70960 -1358353 -2956681 -3386537 -3001143
34378 -3001143 -2722802 -2212588 -531922 1789513 2747089 1316962 -775764 -338741 4089593
34369 4089593 10369819 14417934 14086798 11087095 8528418 7168831 5376815 2540731
34361 2540731 606536 1421910 3934535 5174244 3314885 -929546 -5110832 -6605637
34353 -6605637 -4408590 -308665 2439924 2306583 568441 -1142438 -2870285 -4955845
34345 -4955845 -6277240 -5654321 -4009499 -3194822 -3116373 -1854684 1331319 4614061 5568051
34336E568051j879874k947147j749075l3335m5957j624106j908554O56411L384423
34327e79163K847084N8918j229465n44391o90975j935103j316513J294399J978724
34318a16485k73931j008749J981760L940558Q57641l125099k101938J805076K176429
34309D135262q92810j624884R22686J461972j679307l281143k24654L208607K545534
34300D571263j88132j050561o02237j275258k190258j234157N18875P82988K16581
34291d50896O83258J448144R33540K50356R99970J441826p89586l617842k897428
34282a998658Q73734K935816J334912q76600r98273l1410K57487j81798j214592
34273A00618k961373l644798p85097L989026N304074J466630k286991j084372
$$ plain form
34336 5568051 3688177 741030 -1008045 -1041380 -1087337 -2711443 -4619997 -3963586 -579163
34327 -579163 2267921 2326839 1097374 552983 -137992 -2073095 -3389608 -2095209 -116485
34318 -116485 -390416 -1399165 582595 4523153 5380794 2255695 153757 1958833 4135262
34309 4135262 3242452 1617568 2540254 4002226 2322919 -958224 -1182878 2025729 4571263
34300 4571263 4383131 3332570 2730333 1455075 -735183 -1969340 -1450465 -667477 -450896
34291 -450896 232362 1680506 2614046 2864402 3864372 5306198 4516612 898770 -1998658
34282 -1998658 -1124924 1810892 3145804 2269204 1270931 1239521 1497008 1315210 100618
34273 100618 -2860755 -6505553 -7290650 -3301624 2002450 3469080 1182089 97717
34265I7717K396360K162461j940950m146629j305502K977799L703174O05019k673099
34256A876350l289029j382672J103918K241705J374584l52013j031576j53987
34248C87280P77659L68734o21105m33516Q28804J045920o73117k108112q56175
34239a283628J780998K201506j39386j585744J65651K136768M89121l064792l192989
34230b492495J113233M629384L012952j642528m289990l228726n42157J691491
34222a748836K854283K583959Q00080j266764k012619j429397q39617r45701j300007
34213c304619j292421n63640J019661K702258K855519R17640j378123k066798
34205a110523j478257j138995j000978R8344J627232J541420l23065j414292j04066
$$ plain form
34265 97717 2494077 4656538 2715588 -1431041 -2736543 241256 3944430 4549449 1876350
34256 1876350 -1412679 -2795351 -1691433 550272 1924856 1572843 541267 387280
34248 387280 1164939 1533673 912568 479052 1307856 2353776 1680659 -427453 -1283628
34239 -1283628 497370 2698876 2559490 973746 1139397 3276165 3765286 700494 -2492495
34230 -2492495 -1379262 3250122 6263074 4620546 330556 -2898170 -3440327 -1748836
34222 -1748836 1105447 3689406 4489486 3222722 1210103 -219294 -1058911 -2004612 -3304619
34213 -3304619 -4597040 -5160680 -4141019 -1438761 1416758 2334398 956275 -1110523
34205 -1110523 -2588780 -3727775 -4728753 -4630409 -3003177 -1461757 -1784822 -3199114 -3303180
34196c303180J783111J634916j74962j115280m07993j188j368539l094568k704301
34187h751984J9472K695054L002777Q05058k137162l619200k352151R25635L561803
34178e850698L427676J464356M28415R36516Q30418p94319j611586K469J660825
34169D94072N56638j686763j474228Q29972J681324M11528j37209Q44264Q71342
34160B390940n69812n38148J651639K201751p13630k856277l45068L531371K772584
34151G525350k406098n997514m464058k54783K584735K667041R98593p01574j062785
34142a111093j45276P32945J108939J871273K681248J445168j849642l738678
34134I94884k280334l53441p71344j436326M69223K694443J628334p79099J7886
$$ plain form
34196 -3303180 -1520069 114847 -60115 -1175395 -1583388 -1584576 -2953115 -6047683 -8751984
34187 -8751984 -8732512 -6037458 -3034681 -2229623 -4366785 -7985985 -10338136 -9412501 -5850698
34178 -5850698 -2423022 -958666 -530251 406265 1236683 442364 -1169222 -1166753 494072
34169 494072 1050710 -636053 -2110281 -1280309 401015 812543 675334 1519598 2390940
34160 2390940 1821128 1282980 2934619 5136370 4422740 1566463 1221395 4752766 7525350
34151 7525350 5119252 -878262 -5342320 -5597103 -3012368 -345327 653266 -48308 -1111093
34142 -1111093 -1256369 -523424 585515 2456788 5138036 6583204 4733562 994884
34134 994884 -1285450 -1638891 -2410235 -3846561 -3377338 -682895 945439 166340 184226
34125A84226K898831K555978j244529k971209p50701N38151k086227m349634j727185
34116f952299L169331M603294J822634j040952j238557J8775L96563o82288j785194
34107a688693j049258J454196K996521J307735j967497l218352j927733q23303
34099d916384j069241r05059L50415P46083n33327j332224j27791J629534K449550
34090c708444L042640L785987K926934l98500l771075m429505k784420j073448
34082f409831j65379N37924J348201J898158J664357L63645j219929j263245N68087
34073b678012J652736L9840j821937o54434J714508R83386j810394j305665K875294
34064a004678M641777J167900k660722k576563j135398j545317j613341R32099
$$ plain form
34125 184226 3083057 5639035 4394506 1423297 672596 1210747 -875480 -5225114 -6952299
34116 -6952299 -3782968 820326 2642960 1602008 363451 382226 778789 96501 -1688693
34107 -1688693 -2737951 -1283755 1712766 3020501 1053004 -2165348 -4093081 -4916384
34099 -4916384 -5985625 -6890684 -6540269 -5794186 -6327513 -7659737 -7787528 -6157994 -3708444
34090 -3708444 -665804 3120183 6047117 5648617 1877542 -2551963 -5336383 -6409831
34082 -6409831 -6575210 -6037286 -4689085 -2790927 -1126570 -762925 -1982854 -3246099 -2678012
34073 -2678012 -1025276 -985436 -2807373 -3461807 -1747299 -763913 -2574307 -3879972 -1004678
34064 -1004678 3637099 4804999 2144277 -432286 -1567684 -3113001 -4726342 -3794243
34056c794243K697056L26454k708302j627791J223156N50444k311929j662137
34048g307292K465384M236046J716939p19336m41169j84946j859253k760041p22178
34039e575846J685976J227924j137077k337335j694524p79785l80645K23767J666127
34030g101418L414743M030371K426965n29011k312905j778037r38216j986747
34022d774255l564080k488764J193984L626515K120429j383835k766879m49527
34014h486412L057866L891082R75211k599581k943561J18513L288255M304570
34006A605943L859346K811875O94689j872994k690438j693609j689353l188246
33998b162787k496103J861272M988755K435866k429727l397664j000414p62907
$$ plain form
34056 -3794243 -1097187 -770733 -3479035 -5106826 -3883670 -3333226 -5645155 -7307292
34048 -7307292 -4841908 -605862 1111077 391741 -49428 -234374 -2093627 -4853668 -5575846
34039 -5575846 -3889870 -2661946 -3799023 -6136358 -7830882 -8610667 -8991312 -8767545 -7101418
34030 -7101418 -3686675 343696 2770661 2241650 -71255 -1849292 -2787508 -4774255
34022 -4774255 -8338335 -10827099 -9633115 -6006600 -3886171 -5270006 -8036885 -8486412
34014 -8486412 -5428546 -1537464 -562253 -3161834 -6105395 -5986882 -2698627 1605943
34006 1605943 5465289 8277164 8971853 7098859 4408421 2714812 1025459 -2162787
33998 -2162787 -4658890 -2797618 2191137 4627003 2197276 -1200388 -2200802 -2963709
33990b963709l478358m143337o43301L002925L323534J683000J70224j668958
33982d717980l698780l346404J71455L272055K685255J41644m22544J560732L141482
33973a213085K156247m09168j850257l84535L012571M863814K410076k771076
33965E814587n664981l417922R01237J593767k659379o549918m241761K869426
33957a1354944P083384M242398n28750l58338L005080K373739k614970m424493
33949b576894k03210L230439J039713j453574J275384M472821J349908m205555
33941B929032l559891J935151L275993j073459l716933j713952j46990j035107
33933c106156J99908M328449M947250j87755m057772j790198J566978M92201j954257
$$ plain form
33990 -2963709 -6442067 -10585404 -11228705 -8225780 -4902246 -3219246 -3049022 -4717980
33982 -4717980 -8416760 -11763164 -11591709 -8319654 -5634399 -5492755 -5915299 -4354567 -1213085
33973 -1213085 943162 533994 -1316263 -1700798 1311773 6175587 8585663 5814587
33965 5814587 149606 -3268316 -2367079 -773312 -3432691 -9982609 -14224370 -11354944
33957 -11354944 -4271560 -29162 -557912 -916250 2088830 4462569 1847599 -2576894
33949 -2576894 -2780104 450335 1490048 36474 1311858 5784679 7134587 2929032
33941 2929032 -630859 1304292 4580285 3506826 -210107 -1924059 -2071049 -3106156
33933 -3106156 -2906248 1422201 6369451 6181696 2123924 333726 1900704 2392905 438648
33924D38648j204446R4122j936096l943408j187786L043231K513157r58521l73488
33915c514587M439270O212209J573238m276310n319247j656561K513118L751636
33907C722766J433999j988740k734596j04962J942011K03184k816879k806344
33899c149561k82137J028336O27685J049586K241287J448016j270002k355333
33891f62123l75249J895757K043621J007128L69913j48525j187690k146006k117803
33882a320977p94028J613611L675789K919202p60741l091823m34059M060067L832597
33873I699638j472041m951154k476627J410245Q29227k575868k891980M96625
33865a931935K207399m18168l100999j225898L046827L764526l82181m410130
$$ plain form
33924 438648 -765798 -671676 -2607772 -6551180 -7738966 -4695735 -2182578 -3141099 -3514587
33915 -3514587 924683 7136892 8710130 4433820 -885427 -2541988 -28870 3722766
33907 3722766 5156765 3168025 433429 328467 2270478 2473662 -343217 -3149561
33899 -3149561 -3431698 -2403362 -1775677 -726091 1515196 2963212 1693210 -662123
33891 -662123 -1037372 858385 2902006 3909134 4279047 4130522 2942832 796826 -1320977
33882 -1320977 -2115005 -501394 3174395 6093597 5332856 2241033 1806974 5867041 9699638
33873 9699638 8227597 3276443 799816 2210061 3039288 463420 -2428560 -1931935
33865 -1931935 275464 -142704 -3243703 -4469601 -1422774 2341752 1959571 -2450559
33857b450559m003931p21025J279384R49729K43899J77700J85095M83582J741658
33848b114468K660122J276233j207777j509426L10814M88042k198884m012981
33840f308325k162346Q85368J725295R54762O09293J71444j155440j412620P06132
33831e986437K308828O91590j450786k73840K259774J599695j091733o87171K553134
33822g6946K781678j352979l734762n00901L748179L330911j82250j630870l08955
33813B073105O42333L22135N80760J580173J244104p96951k044925o45019J969992
33804D925707K693183J83602l494170m677984k244147M98826j38228k638733j901452
33795f793396K861794N825559K626267k844407l721065J09814K412088j4084l319398
$$ plain form
33857 -2450559 -6454490 -7175515 -5896131 -4946402 -4702503 -4524803 -4339708 -3856126 -2114468
33848 -2114468 545654 1821887 614110 -895316 -584502 -96460 -2295344 -6308325
33840 -6308325 -8470671 -7585303 -5860008 -4905246 -4295953 -4124509 -5279949 -6692569 -5986437
33831 -5986437 -3677609 -2986019 -4436805 -4710645 -2450871 -851176 -1942909 -2630080 -76946
33822 -76946 2704732 1351753 -2383009 -2883910 864269 4195180 4012930 2382060 2073105
33813 2073105 2715438 3037573 3618333 5198506 6442610 5645659 3600734 2955715 4925707
33804 4925707 7618890 7802492 4308322 -369662 -2613809 -2114983 -2253211 -4891944 -6793396
33795 -6793396 -3931602 1893957 4520224 1675817 -2045248 -1935434 476654 462570 -2856828
33786b856828k964800J29133K089105J836867J379479J756067J667106K51919
33778C288048j048945n75391Q00086O55668j333517k529982j154163O77723L2768
33769a187705j711111l96514L738508M703434o96078o650468n372916J713110
33761e859740N515989J896114l207429l130293N63289K246724J079021N40325
33753c56000J512233J376716m91489j372132l6169J261787Q00872k53258q78358
33744A564202k002636l440991k542839J428539M537800L068358j007687k850483
33736a245737j358304O16539J372782J733966J849947O69823j059971r53004J053001
33727B679042K155972J009434o30203j564932k882759m386138l105947J742894
$$ plain form
33786 -2856828 -5821628 -5692495 -3603390 -1766523 -387044 1369023 3036129 3288048
33778 3288048 2239103 1663712 2463798 3119466 1785949 -744033 -1898196 -1220473 -1187705
33769 -1187705 -2898816 -3295330 443178 5146612 4450534 -2199934 -7572850 -5859740
33761 -5859740 -343751 1552363 -1655066 -4785359 -4222070 -1975346 -896325 -356000
33753 -356000 1156233 2532949 2041460 669328 633159 1894946 2695818 2442560 1564202
33744 1564202 -438434 -3879425 -6422264 -4993725 -455925 2612433 1604746 -1245737
33736 -1245737 -2604041 -1987502 -614720 1119246 2969193 3639016 2579045 1626041 2679042
33727 2679042 4835014 5844448 5214245 3649313 766554 -3619584 -6725531 -4982637
33719d982637N506060L601577j727991m178345j798565J374788J784727M18589
33711a797k77008N9081O72057J281258J057901j310674m539244m388887O80263
33702f767050N599082M316125j624881m567827j187902L249313L091712K60028
33694B368600M1593K256749K173685j006301k608590l24626J856289k996l825242
33685I29161n036010k762012O24091L280226M019448J508786k992302m706335
33677e134947j231167L053131K978376N14671J102040M011342L329528j743463
33669F879511m978967k989453r4047n42694k119608j334766L30148n7374j313094
33660f220344q81978J34365m75687j036294J488094N541035O267605K216692k990956
$$ plain form
33719 -4982637 523423 4125000 2397009 -1781336 -3579901 -2205113 -420386 -1797
33711 -1797 -278805 -219724 452333 1733591 2791492 1480818 -3058426 -7447313 -6767050
33702 -6767050 -1167968 3148157 1523276 -3044551 -4232453 -983140 2108572 2368600
33694 2368600 2410193 4666942 6840627 5834326 3225736 2901110 4757399 4754403 929161
33685 929161 -4106849 -6868861 -6244770 -2964544 1054904 2563690 -428612 -5134947
33677 -5134947 -6366114 -3312983 -334607 180064 1282104 5293446 8622974 6879511
33669 6879511 1900544 -1088909 -1182956 -1725650 -3845258 -5180024 -4849876 -4907250 -6220344
33660 -6220344 -7102322 -6967957 -7443644 -8479938 -6991844 -1450809 4816796 7033488 4042532
33651D042532n381499m141079j062285R98682N9461k323511j814628K828352O655641
33642a38334M554805j417496m609660k513801J133915K422969J345205l37553
33634D40050j557347j582885k23698R57999J60412j666734j880148k53997P95314
33625d811034L37780K13351J417203K169801R94045o84886p51024M10854O23510
33616h0400r84555k792134k395631P97616M429466N035048J736374k452873l904910
33607f11999k230545J54959J212778N23375j501922l630447l856283j609095P08260
33598a0840919O09881o85203M2116K835533M073043J679739j834407k706126l85941
33589g212284K512724L408925J878383n29311j781679j072308O12382J695672
$$ plain form
33651 4042532 -1338967 -5480046 -6542331 -5543649 -5484188 -7807699 -9622327 -6793975 -138334
33642 -138334 4416471 2998975 -1610685 -4124486 -2990571 -567602 777603 440050
33634 440050 -1117297 -2700182 -2923880 -1965881 -1805469 -3472203 -5352351 -5606348 -4811034
33625 -4811034 -4473254 -4259903 -2842700 -672899 321146 -363740 -1114764 -703910 -80400
33616 -80400 -1064955 -3857089 -6252720 -5455104 -1025638 4009410 5745784 3292911 -611999
33607 -611999 -2842544 -2687585 -1474807 -951432 -2453354 -6083801 -9940084 -11549179 -10840919
33598 -10840919 -10231038 -10916241 -10874125 -8038592 -3965549 -2285810 -4120217 -6826343 -7212284
33589 -7212284 -4699560 -1290635 587748 58437 -1723242 -2795550 -2183168 -487496
33581d87496J409824j22318k168981l242365k062886M09634J470762L84755k77212
33572d686283J300875K913409J705118r63960j306647J138302K862164J408113
33564D371091j739995l507266k378478P59213L234620K568498n95624k593671
33556A18388j433748L80649k2779j191328j03488K391384L022269J592753N70799
33547E324899J17821j731558m315628m578158k137415M30625K309617M539270
33539d0527N487928K065353l695809n416146j603204J835156Q05153j256915l04700
33530b123711J588221J105811J68993J862479L827067J912411k223783l412857
33522B704631j317488l53092j831445k211391P7281J543917n52979l465195k845204
$$ plain form
33581 -487496 922328 800010 -1368971 -4611336 -6674222 -6264588 -4793826 -4409071 -4686283
33572 -4686283 -3385408 -471999 1233119 269159 -1037488 100814 2962978 4371091
33564 4371091 2631096 -876170 -3254648 -2495435 739185 3307683 2712059 118388
33556 118388 -1315360 -934711 -957490 -2148818 -2252306 139078 3161347 4754100 5324899
33547 5324899 5442720 3711162 -604466 -5182624 -7320039 -6889414 -4579797 -40527
33539 -40527 5447401 7512754 3816945 -1599201 -3202405 -1367249 -562096 -1819011 -2123711
33530 -2123711 -535490 570321 739314 2601793 6428860 8341271 6117488 2704631
33522 2704631 1387143 1034051 -797394 -3008785 -2931504 -1387587 -1940566 -5405761 -8250965
33513h250965J115757M161957L496715P06966p50228L29477J920068J657157j83492
33504D203412j474755j407186j145486j297794r07476K91481Q40290O6820m39781
33495a270475N17869J563732J121534J46431K51046O94951j63585j549575j209860
33486A02068Q03947J927332P54214j287596k352194k495825k823412l380079k790170
33477a1541715l3613L619037N112812K931281n91175j775142o5869J975592K764407
33468B395615K893441K198349n22044l688418l107687J573991M641094K022742
33460H407083k475090l087167q98183j011674l224663k462328J823271L817696
33452H88945O04212l057734k328548N76283R76805n95429l07142J818882J961702
$$ plain form
33513 -8250965 -7135208 -2973251 523464 1230430 480202 809679 2729747 4386904 4203412
33504 4203412 2728657 1321471 175985 -1121809 -2029285 -1737804 -897514 -830694 -1270475
33495 -1270475 -752606 811126 1932660 2079091 2330137 3025088 2861503 1311928 102068
33486 102068 906015 2833347 3587561 2299965 -52229 -2548054 -5371466 -8751545 -11541715
33477 -11541715 -11575328 -7956291 -2843479 87802 -503373 -2278515 -2344384 -368792 2395615
33468 2395615 5289056 7487405 6965361 3276943 169256 1743247 6384341 8407083
33460 8407083 5931993 2844826 1946643 934969 -2289694 -4752022 -2928751 888945
33452 888945 1493157 -1564577 -3893125 -3316842 -2340037 -2935466 -3242608 -1423726 537976
33443E37976q56724k933865j550571J220317K044482J031079P17797J815866K303305
33434D329662O04181k077029l219429j934899K15738J076263R8062j300775j391095
33425c599321j30565O50749n28467k515028k455510M49992L252439K649379o41175
33416b867507k742786j692619N01690J374020J234491J445768J463919l1870k040649
33407c355543j880340R48930L656754L617559J427887l48825l66401O16501J327443
33398E643965J264726N03998p12493j773921j787384n87320O21283M24276r90665
33389B606465k023843j864643j489773j863249k167391r55345J534926L450055
33381b772798L494517K063097M24757l49070P4212R81916J165727M13539k04322
$$ plain form
33443 537976 -318748 -3252613 -4803184 -3582867 -1538385 -507306 210491 2026357 4329662
33434 4329662 4933843 2856814 -362615 -2297514 -2081776 -1005513 -907451 -2208226 -3599321
33425 -3599321 -3729886 -3079137 -3607604 -6122632 -8578142 -8128150 -4875711 -2226332 -2867507
33416 -2867507 -5610293 -7302912 -6801222 -5427202 -4192711 -2746943 -1283024 -1314894 -3355543
33407 -3355543 -5235883 -4286953 -630199 2987360 4415247 4066422 3700021 4316522 5643965
33398 5643965 6908691 7412689 6700196 4926275 3138891 2551571 3172854 3597130 2606465
33389 2606465 582622 -1282021 -2771794 -4635043 -6802434 -7757779 -6222853 -2772798
33381 -2772798 721719 2784816 3209573 2860503 2934715 3916631 5082358 5495897 5291575
33372E291575j58527l66676j242565j400641j3946J078032p3475k144990k408229
33363a439442r66554j66277n66305o86955j67815K25534J151424L399122M568210
33354E350942J655600l031159l847607n60613O95836k745317n351751k166253
33346a0000322L105785L839649K78343k036991r72462O53774Q04321L90716K16352
33337c720835n4004j60912J22476o40033l209450m709355j817022L616527O012263
33328d560345L238029j066707k660038j148800J212894K476813J961920J76397
33320c69837j539118k215513j889778o02363J653996L088892R10499l915964n652257
33311a0531443r34423N448446O074631O25649m234856l801656J79637L618817
$$ plain form
33372 5291575 5133048 4766372 3523807 2123166 2109220 3187252 3113777 968787 -1439442
33363 -1439442 -2405996 -2572273 -3138578 -3825533 -3993348 -3767814 -2616390 782732 5350942
33354 5350942 7006542 3975383 127776 -432837 262999 -2482318 -7834069 -10000322
33346 -10000322 -6894537 -3054888 -2776545 -4813536 -5785998 -5132224 -4327903 -3937187 -3720835
33337 -3720835 -3774839 -3935751 -3813275 -4453308 -7662758 -12372113 -14189135 -10572608 -4560345
33328 -4560345 -1322316 -2389023 -5049061 -6197861 -4984967 -2508154 -546234 -369837
33320 -369837 -1908955 -4124468 -6014246 -6616609 -4962613 -1873721 -963222 -4879186 -10531443
33311 -10531443 -11465866 -6017420 57211 682860 -3551996 -7353652 -7174015 -3555198
33303c555198M526960L077771O86948n76547j90584l00435k202796l292681r54716
33294b781278K259247J812456j659952l267419j244745J598557L326916M435333
33286D479115M133214Q37530l173980l440865n04617N18448j412748j643295J234786
33277A027588J949497k354259o123024l461629K896257N922715L719936k40734
33269C336347k892801k959501K00119M435136M495717j282843o742032n387021
33261f796879M06072L142712J115241n60291J083468L115699K588868P79730j15683
33252D758937m66608j472344k736600l158215k423709q17820R65656J721730R73961
33243b655012P630J15484O18804M74075O01389K042045K944245P19496l174792
$$ plain form
33303 -3555198 971762 4049533 4736481 4159934 3969350 3668915 1466119 -1826562 -2781278
33294 -2781278 -522031 1290425 -369527 -3636946 -4881691 -3283134 43782 4479115
33286 4479115 8612329 9449859 6275879 2835014 2330397 2848845 1436097 -207198 1027588
33277 1027588 2977085 622826 -5500198 -8961827 -6065570 -142855 3577081 3336347
33269 3336347 443546 -2515955 -2315836 2119300 6615017 5332174 -1409858 -6796879
33261 -6796879 -6390807 -3248095 -2132854 -2693145 -1609677 1506022 4094890 4874620 4758937
33252 4758937 4292329 2819985 83385 -3074830 -5498539 -6316359 -5350703 -3628973 -2655012
33243 -2655012 -2647382 -2531898 -1913094 -1439019 -837630 1204415 4148660 4868156 1693364
33234A693364m135227o64578L294707L408373R7098k594125j793065J549808L989864
33225D846219L043254l40035k946242l075242k049305j534048j241250m75205
33217c771854J30431J90500P81810J968821J436556j681529l981855k294409J053804
33208f167725J591149l23788n82864J596271K801139J540152R2413l81295j494932
33199a329480l076252j969489K256913M808997K064312k793327l945895o24229
33191d608450K578450K026754r04004k086336K50334L047970J783438l143153
33183a054997n559578j532153M245180M572614M49905o45497L076484M811625
33175H363583N10047m337103l560752L01836J060394j488789l012761k207553
$$ plain form
33234 1693364 -2441863 -3106441 188266 3596639 3693737 1099612 -693453 856355 4846219
33225 4846219 7889473 7549438 4603196 1527954 -521351 -2055399 -3296649 -3771854
33217 -3771854 -3641423 -3450923 -2669113 -700292 736264 -945265 -4927120 -7221529 -6167725
33208 -6167725 -4576576 -4900364 -5483228 -3886957 -1085818 454334 546747 165452 -1329480
33199 -1329480 -4405732 -6375221 -4118308 690689 2755001 -38326 -3984221 -4608450
33191 -4608450 -2030000 -3246 -907250 -2993586 -2743252 304718 2088156 -1054997
33183 -1054997 -6614575 -8146728 -3901548 671066 1120971 475474 3551958 8363583
33175 8363583 8873630 4536527 975775 1277611 2338005 849216 -2163545 -4371098
33167d371098r54578L94332K178694K234000p37028k758994L48378N213626M794610
33158F341942q82817m631666k794207N97540J250213l8355j043696j539678j220705
33149c961429P61385K529762Q00446k929386k987838J597486M665257K317305
33141B792988j157320q54808Q13676p95337l984968l596350K24603K386480P55989
33132c415047j727015k301858j102660J047619L387139L986655J612644j351117
33124A36360j414634Q72299J886320P11962l5336O58359M31553j957606l951991
33115b662714k766524Q63177L977862M545683K396578j063003l239122k293634
33107b41697M98608J922257Q33498p06621p12783K25754M50498m20099j495212
$$ plain form
33167 -4371098 -5325676 -4931344 -2752650 -518650 -1255678 -4014672 -3666294 1547332 6341942
33158 6341942 5459125 827459 -1966748 -1369208 -118995 -157350 -1201046 -2740724 -3961429
33149 -3961429 -3200044 -670282 130164 -2799222 -5787060 -4189574 475683 2792988
33141 2792988 1635668 780860 1594536 799199 -3185769 -6782119 -6557516 -4171036 -3415047
33132 -3415047 -5142062 -7443920 -8546580 -7498961 -4111822 -125167 1487477 136360
33124 136360 -1278274 -405975 1480345 2192307 2156971 2815330 3246883 1289277 -2662714
33115 -2662714 -5429238 -4566061 -588199 3957484 6354062 5291059 2051937 -241697
33107 -241697 256911 2179168 3012666 2306045 1593262 1819016 2269514 1849415 354203
33098C54203j790120r11231M28149N41773j339259l396641k898554L82562L705971
33089d923147M315654J851537j730633l554533j984202J283968K416683K34872
33081b089801j815864n31833K233123K618326P63207p6994Q80245J524380J258451
33072D763240J329663J138170j047991l697330l311099n05563L76399j541861
33064b496372k387502o50023L62117q33327r37502J518540K696195M21958j201968
33055c507884J119595L628299J954687j033635k72028K561757K221379q47701
33047E824469j804492k57058l82822k741043l111297j26082K301021J464389o40071
33038E27014j673954j961697j827954m92908J037745L57003j716625j316994K032203
$$ plain form
33098 354203 -1435917 -2347148 -1918999 -1377226 -2716485 -6113126 -9011680 -8629118 -4923147
33089 -4923147 -607493 1244044 -486589 -4041122 -6025324 -4741356 -2324673 -2089801
33081 -2089801 -3905665 -4437498 -2204375 413951 1177158 1100164 1980409 3504789 4763240
33072 4763240 6092903 7231073 6183082 2485752 -825347 -1330910 -954511 -2496372
33064 -2496372 -4883874 -5533897 -5171780 -6005107 -6942609 -5424069 -2727874 -2305916 -3507884
33055 -3507884 -2388289 1240010 3194697 2161062 1889034 4450791 6672170 5824469
33047 5824469 4019977 3762919 3380097 639054 -2472243 -2598325 -297304 1167085 527014
33038 527014 -1146940 -3108637 -4936591 -5429499 -4391754 -4034751 -5751376 -7068370 -5036167
33029e036167L652832P18573l085262k943799K94963K078935P11190j331516j536335
33020f476586j04001J212377J336265Q05024R60906J999187K236151L73784k083701
33011B59406k411547l92783J452428J338921O6725o70879j73625J073213J765127
33002B306986P85315r72593r95615J133438K355779P39952r50268L38486K390380
32993G131860J126876k288148l217499j379846p93464j968615p85108L495538
32985A321594N554515K052105l122773m839468l353967j694004n72859N82526
32977d072331R64345J15856m52088o1946l94826j896027k001694M89158K715537
32968d594016K215066P06505N46853Q31464O5609o70091l29727k12401o03471
$$ plain form
33029 -5036167 -1383335 -664762 -3750024 -6693823 -6398860 -4319925 -3608735 -4940251 -6476586
33020 -6476586 -6580587 -5368210 -4031945 -3226921 -2266015 -266828 1969323 2343107 259406
33011 259406 -2152141 -2544924 -1092496 246425 313150 -357729 -531354 541859 2306986
33002 2306986 3092301 2119708 1124093 2257531 4613310 5353262 4402994 4741480 7131860
32993 7131860 8258736 5970588 2753089 1373243 579779 -1388836 -2173944 1321594
32985 1321594 6876109 8928214 5805441 965973 -2387994 -4081998 -4654857 -4072331
32977 -4072331 -3107986 -2992130 -3444218 -3506164 -3900990 -5797017 -7798711 -7309553 -4594016
32968 -4594016 -2378950 -1672445 -1125592 -294128 -228519 -898610 -1228337 -1440738 -2044209
32959b044209R17773M289667M560872p21421n999288n151158o97359P60477q97531
32950d982177o07020K046223K262498r20431k600523k58662K554697K675034J696084
32941A865723J536314P16152k007676m262566l352595k04958K328972K953596
32933d27038K069406N37818m05686M9210P81993P2830j284332q25152J281943
32924A850992J883510l25926k664114k448484m43348J059536J261079O57457j31555
32915F99147l27201L25499L86711j475664l344214j801874K549852M825987K460782
32906D299025j330008k508126j357576m01432k58790l66561j186406k566212k096354
32897g772440J477410M874792M022347K23700j253833J295809L676436K050972
$$ plain form
32959 -2044209 -1126436 3163231 7724103 7002682 1003394 -4147764 -4845123 -4084646 -4982177
32950 -4982177 -5589197 -3542974 -1280476 -2200907 -4801430 -5060092 -2505395 169639 1865723
32941 1865723 3402037 4118189 2110513 -2152053 -5504648 -5709606 -3380634 -427038
32933 -427038 1642368 2180186 1774500 1823710 2605703 2678533 1394201 569049 1850992
32924 1850992 3734502 3408576 744462 -1704022 -2147370 -1087834 173245 830702 699147
32915 699147 371946 697445 1084156 -391508 -3735722 -5537596 -2987744 1838243 4299025
32906 4299025 2969017 460891 -896685 -1298117 -1556907 -1923468 -3109874 -5676086 -7772440
32897 -7772440 -6295030 -1420238 2602109 2825809 1571976 2867785 6544221 8595193
32889H595193j648340k810644p86367M33921j811363m705855l580328J351773
32881d962010M575961K394336k047452l083387n8966K656766K232140R6867j905260
32872a01005l829039m948398l038324J390659L961374K473494N33062J539365
32864b018812K586342n91013n230247m548801J511969N260440K348155k192561
32856b874528j939622J957986L968468K656524J083390P35750j3901j785398k737072
$$ plain form
32889 8595193 6946853 4136209 3349842 3783763 1972400 -2733455 -6313783 -4962010
32881 -4962010 -386049 2008287 -39165 -3122552 -3181518 -524752 1707388 1804255 -101005
32872 -101005 -3930044 -8878442 -11916766 -10526107 -6564733 -4091239 -3558177 -2018812
32864 -2018812 567530 -23483 -5253730 -9802531 -8290562 -3030122 -681967 -2874528
32856 -2874528 -4814150 -2856164 1112304 3768828 4852218 5587968 5574067 3788669 1051597
$$ [...]
##END NTUPLES=NMR SPECTRUM
##END=
