##TITLE=31Pdec_AT-50pdy
 DMF-d7, 64 sc
 16.12.2022
##JCAMPDX= 6.0         $$ Bruker NMR JCAMP-DX V2.0
##DATA TYPE= NMR SPECTRUM
##DATA CLASS= NTUPLES
##ORIGIN= UXNMR, Bruker Analytische Messtechnik GmbH
##OWNER= root
$$ XWIN-NMR		Version 3.5
$$ Fri Dec 16 14:06:18 2022 Russian Standard Time (UT+4h)  she@DPX200
##.OBSERVE FREQUENCY= 81.013821
##.OBSERVE NUCLEUS= ^31P
##.ACQUISITION MODE= SIMULTANEOUS
##.ACQUISITION SCHEME= undefined
##.AVERAGES= 64
##.DIGITISER RES= 16
##SPECTROMETER/DATA SYSTEM= spect
##.PULSE SEQUENCE= zgpg30
##.SOLVENT NAME= DMF
##.SHIFT REFERENCE= (INTERNAL, DMF, 0, 248.564)
##AUDIT TRAIL= $$ (NUMBER, WHEN, WHO, WHERE, WHAT)
$$ ##TITLE= Audit trail, XWIN-NMR		Version 3.5
$$ ##JCAMPDX= 5.01
$$ ##ORIGIN= Bruker BioSpin GmbH
$$ ##OWNER= she
$$ F:/spectra/data/she/nmr/P31/1/pdata/1/auditp.txt
$$ ##AUDIT TRAIL=  $$ (NUMBER, WHEN, WHO, WHERE, WHAT)
(   1,<2022-12-16 14:05:26.81 +0400>,<she>,<DPX200>,
      <continue with go, POWCHK disabled, PULCHK disabled
       configuration hash MD5:
       00 E9 B6 7A A2 85 ED C7 34 08 36 98 17 FE 4E 26
       data hash MD5: 32K
       11 C4 B7 A5 91 81 80 E2 BD F9 BD 7F 3C 3D D6 51>)
(   2,<2022-12-16 14:05:29.64 +0400>,<she>,<DPX200>,
      <Start of raw data processing
       efp BC_mod = 2 LB = 1 FT_mod = 6 PKNL = 1 PHC0 = -10688.23 PHC1 = 278.8558 SI = 64K 
       data hash MD5: 64K
       53 0E 75 3A AF 4B C4 CD A7 62 8E 0F B3 0C FB 74>)
(   3,<2022-12-16 14:05:44.62 +0400>,<she>,<DPX200>,
      <pk PHC0 = -38.98042 PHC1 = 0 
       data hash MD5: 64K
       3E E6 D9 30 BD 0B 40 55 59 20 C5 8B 52 EF 3C 19>)
(   4,<2022-12-16 14:05:50.45 +0400>,<she>,<DPX200>,
      <abs ABSG = 5 
       data hash MD5: 64K
       1E 28 2B 4E 02 3B A9 B9 26 BF BC 01 14 BA 58 17>)
$$ ##END=
$$ 
$$ hash MD5
$$ 46 69 78 0E 4D 03 74 27 25 64 5E 71 E2 14 17 61
##$RELAX= 
##$RELAX= 
##$RELAX= 
##$RELAX= 
##$RELAX= 
##$RELAX= 
##$RELAX= 
##$RELAX= 
##$RELAX= 
$$ Bruker specific parameters
$$ --------------------------
##$DU= <F:/spectra>
##$EXPNO= 1
##$NAME= <P31>
##$PROCNO= 1
##$TYPE= <nmr>
##$USER= <she>
##$AMP= (0..31)
100 100 100 100 100 100 100 100 100 100 100 100 100 100 100 100 100 100 
100 100 100 100 100 100 100 100 100 100 100 100 100 100 
##$AQSEQ= 0
##$AQ_mod= 1
##$AUNM= <au_zg>
##$AUTOPOS= <>
##$BF1= 81.014009
##$BF2= 200.13
##$BF3= 200.13
##$BF4= 200.13
##$BF5= 200.13
##$BF6= 200.13
##$BF7= 200.13
##$BF8= 200.13
##$BYTORDA= 1
##$CFDGTYP= 0
##$CFRGTYP= 5
##$CHEMSTR= <none>
##$CNST= (0..31)
1 1 145 1 1 1 1 1 1 1 1 1 1 1 1 1 1 1 1 1 1 1 1 1 1 1 1 1 1 1 1 1 
##$CPDPRG= <waltz16>
##$CPDPRG1= <>
##$CPDPRG2= <waltz16>
##$CPDPRG3= <>
##$CPDPRG4= <mlev>
##$CPDPRG5= <mlev>
##$CPDPRG6= <mlev>
##$CPDPRG7= <mlev>
##$CPDPRG8= <mlev>
##$CPDPRGB= <>
##$CPDPRGT= <>
##$D= (0..31)
0 1 0 0 0 0 0 0 0 0 0 0.03 2e-05 3e-06 0 0 0 0 0 0 0 0 0 0 0 0 0 0 0 0 
0 0 
##$DATE= 1671185046
##$DBL= (0..7)
120 120 120 11 120 120 24 19 
##$DBP= (0..7)
150 150 150 150 150 150 150 150 
##$DBP07= 0
##$DBPNAM0= <>
##$DBPNAM1= <>
$$ [...]
##$SUBNAM3= <"">
##$SUBNAM4= <"">
##$SUBNAM5= <"">
##$SUBNAM6= <"">
##$SUBNAM7= <"">
##$SUBNAM8= <"">
##$SUBNAM9= <"">
##$SW= 501.771253377433
##$SWIBOX= (0..15)
0 1 3 0 0 0 0 0 0 0 0 0 0 0 0 0 
##$SW_h= 40650.406504065
##$TD= 32768
##$TD0= 1
##$TE= 0
##$TE2= 300
##$TE3= 300
##$TEG= 300
##$TL= (0..7)
0 120 53 12 22 120 120 120 
##$TP= (0..7)
150 150 150 150 150 150 150 150 
##$TP07= 0
##$TPNAME0= <>
##$TPNAME1= <>
##$TPNAME2= <>
##$TPNAME3= <>
##$TPNAME4= <>
##$TPNAME5= <>
##$TPNAME6= <>
##$TPNAME7= <>
##$TPOAL= (0..7)
0.5 0.5 0.5 0.5 0.5 0.5 0.5 0.5 
##$TPOFFS= (0..7)
0 0 0 0 0 0 0 0 
##$TUNHIN= 0
##$TUNHOUT= 0
##$TUNXOUT= 0
##$USERA1= <user>
##$USERA2= <user>
##$USERA3= <user>
##$USERA4= <user>
##$USERA5= <user>
##$V9= 5
##$VALIST= <valist>
##$VCLIST= <CCCCCCCCCCCCCCC>
##$VD= 0
##$VDLIST= <DDDDDDDDDDDDDDD>
##$VPLIST= <PPPPPPPPPPPPPPP>
##$VTLIST= <TTTTTTTTTTTTTTT>
##$WBST= 1024
##$WBSW= 4
##$XGAIN= (0..3)
0 0 0 0 
##$XL= 0
##$YL= 0
##$YMAX_a= 7383
##$YMIN_a= -5564
##$ZGOPTNS= <>
##$ZL1= 120
##$ZL2= 120
##$ZL3= 120
##$ZL4= 120
##$ABSF1= 248.5645
##$ABSF2= -253.2056
##$ABSG= 5
##$ABSL= 3
##$ALPHA= 0
##$AQORDER= 0
##$ASSFAC= 0
##$ASSFACI= 0
##$ASSFACX= 0
##$ASSWID= 0
##$AUNMP= <proc_1d>
##$AZFE= 0.1
##$AZFW= 0.5
##$BCFW= 0
##$BC_mod= 2
##$BYTORDP= 0
##$COROFFS= 0
##$CY= -3
##$DATMOD= 1
##$DC= 0
##$DFILT= <>
##$DTYPP= 0
##$F1P= 0
##$F2P= 0
##$FCOR= 1
##$FTSIZE= 65536
##$FT_mod= 6
##$GAMMA= 0
##$GB= 0
##$INTBC= 1
##$INTSCL= 6.047779e-11
##$ISEN= 30
##$LB= 1
##$LEV0= 0
##$LPBIN= 0
##$MAXI= 10000
##$MC2= 0
##$MEAN= 0
##$ME_mod= 0
##$MI= 50
##$NCOEF= 0
##$NC_proc= -11
##$NLEV= 6
##$NOISF1= 182.463
##$NOISF2= 159.3651
##$NSP= 0
##$NTH_PI= 0
##$NZP= 0
##$OFFSET= 248.5645
##$PC= 4
##$PHC0= -10727.21
##$PHC1= 278.8558
##$PH_mod= 1
##$PKNL= yes
##$PPARMOD= 0
##$PSCAL= 0
##$PSIGN= 0
##$REVERSE= no
##$SF= 81.0140089999694
##$SI= 65536
##$SIGF1= 159.3651
##$SIGF2= -187.1042
##$SINO= 113.3802
##$SIOLD= 16384
##$SREGLST= <1H.CDCl3>
##$SSB= 0
##$STSI= 65536
##$STSR= 0
##$SW_p= 40650.406504065
##$SYMM= 0
##$S_DEV= 0
##$TDeff= 32768
##$TDoff= 0
##$TI= <>
##$TILT= no
##$TM1= 0
##$TM2= 0
##$TOPLEV= 0
##$USERP1= <user>
##$USERP2= <user>
##$USERP3= <user>
##$USERP4= <user>
##$USERP5= <user>
##$WDW= 1
##$XDIM= 65536
##$YMAX_p= 381538392
##$YMIN_p= -286336622
$$ End of Bruker specific parameters
$$ ---------------------------------
##NTUPLES= NMR SPECTRUM
##VAR_NAME=  FREQUENCY,     SPECTRUM/REAL,   SPECTRUM/IMAG
##SYMBOL=    X,             R,               I
##VAR_TYPE=  INDEPENDENT,   DEPENDENT,       DEPENDENT
##VAR_FORM=  AFFN,          ASDF,            ASDF
##VAR_DIM=   65536,         65536,           65536
##UNITS=     HZ,            ARBITRARY UNITS, ARBITRARY UNITS
##FACTOR=    0.620285442955139, 1,           1
##FIRST=     20137.2065510682, 0,            0
##LAST=      -20513.1999529968, 0,           0
##MIN=       -20513.1999529968, -286336622,  0
##MAX=       20137.2065510682, 381538392,    0
$$ Real data points
##PAGE= N=1
##DATA TABLE= (X++(R..R)), XYDATA
$$ [...]
6574a13156842L1844237N3251973L8713651K0561887K7610529K1719122l6253853
$$ -113156842 -81312605 -28060632 10653019 31214906 58825435 80544557 44290704
6567D4290704q7903736m5560385N5003297Q5301881J5706990m3200239j9826316
$$ 44290704 -43613032 -89173417 -34170120 51131761 66838751 23638512 3812196
6560C812196J8379917j920168l7884858j9364423K7924731L5100458L474142j5948623
$$ 3812196 22192113 20271945 -17612913 -36977336 -9052605 26047853 29521995 13573372
6552A3573372r303858M086771K0419258L4019351J4855870l6159866n5265368
$$ 13573372 4269514 8356285 28775543 62794894 77650764 41490898 -13774470
6545a3774470m157205N3172984L3062225m2857157p8732962l8134130K2783680
$$ -13774470 -17931675 35241309 68303534 25446377 -53286585 -91420715 -68637035
6538f8637035M4371819K5285782k341542j3927830p883507m871366k1721442l6671015
$$ -68637035 -24265216 1020566 -1320976 -15248806 -23132313 -28003679 -49725121 -86396136
6530h6396136j2347144L7155492N2271733J8880242q068852J267367M873396k3793604
$$ -86396136 -98743280 -61587788 -9316055 9564187 1495335 2762702 7636098 -16157506
6522a6157506l8268225n075223K6225775P372612k0843782q10067M0617700M1261287
$$ -16157506 -54425731 -59500954 -33275179 -25902567 -46746349 -47556416 -6938716 34322571
6514C4322571L241158k9530009m2208012l1078035K1742553Q5941004P3626028
$$ 34322571 37563729 8033720 -34174292 -65252327 -43509774 42431230 116057258
6507A16057258k4084818q0554733j7817705N0837808j606342r1383180n3999113
$$ 116057258 91972440 11417707 -6399998 44437810 42831468 -48551712 -102550825
6500a02550825P0273087Q9833397k3628407r2372269k6349549M9720832K4585038
$$ -102550825 -32277738 57555659 33927252 -58445017 -84794566 -35073734 -10488696
6493a0488696l1213170j6100865L7626303N2495213L6961731K8085452N061481
$$ -10488696 -41701866 -57802731 -20176428 32318785 69280516 97365968 102427449
6486A02427449m5858240o8114187k5181044K3307688J7535823m121157J5691156
$$ 102427449 56569209 -11544978 -36726022 -13418334 4117489 -3668 15687488
6479A5687488M4098370J5646719n0930807p6095448l0169915M0555376P5309002
$$ 15687488 59785858 75432577 24501770 -51593678 -81763593 -41208217 34100785
6472C4100785M8400448j4236787m8311413j9618655J8957964j961794n0126737
$$ 34100785 82501233 68264446 19953033 334378 19292342 17330548 -32796189
6465c2796189l4775058L4362147M9665310j3250430n0201687q006087K9291644
$$ -32796189 -67571247 -33209100 16456210 3205780 -46995907 -55001994 -25710350
6458b5710350Q40234k2734279J8789303N6638023K4548937j3540071R538640K4349172
$$ -25710350 -24870116 -47604395 -28815092 27822931 52371868 38831797 48370437 72719609
6450G2719609m6143194j18859350p2316699M1577707P5876836K3497482K443497
$$ 72719609 26576415 -92282935 -164599634 -123021927 -47145091 -23647609 -21204112
6443b1204112M0788470M9646061J632381k8692464j3993396j3707061m2518090
$$ -21204112 19584358 69230419 70862800 42170336 28176940 14469879 -28048211
6436b8048211l7533616J2804963L4722555J689502j5949321K2078490N4963202
$$ -28048211 -65581827 -52776864 -18054309 -16364807 -32314128 -10235638 44727564
6429D4727564K6793547k6461027m5846191l0232859m956025K3942157M6622580
$$ 44727564 71521111 45060084 -786107 -31018966 -35974991 -12032834 34589746
6422C4589746L9418248Q135245j0377862p212955q573550j7432331r626875P845479
$$ 34589746 74007994 82143239 71765377 64552422 55978872 38546541 28919666 36765145
6414C6765145J745884k1487850k4951245j4252043k3122181l2325089M003434
$$ 36765145 38511029 17023179 -7928066 -22180109 -45302290 -77627379 -73623945
6407g3623945N3349166L5187154l3231235m1538179L5267699Q7977880M9485031
$$ -73623945 -20274779 14912375 -18318860 -59857039 -24589340 63388540 112873571
6400A12873571o146119p833411o886775o0018836j02999926n5978754K8711196
$$ 112873571 106727452 98894041 92007266 31988430 -71011496 -126990250 -98279054
6393i8279054M5769338K877622j3590456P359687N776145j8764152o508622L8275011
$$ -98279054 -52509716 -49632094 -63222550 -55862863 -50086718 -68850870 -75359492 -37084481
6385c7084481M0222186j7098561n8611426l8306301J598003K1408124M3139366
$$ -37084481 3137705 -13960856 -72572282 -110878583 -109280580 -87872456 -44733090
6378d4733090P5886720O6735906r656354p7284984n2286724K8712078N4750697
$$ -44733090 31153630 97889536 88233182 10948198 -41338526 -12626448 42124249
6371D2124249n12624m8287148k4441390J8055837R15415n1485426m6312372L4522685
$$ 42124249 41611625 -6675523 -31116913 -13061076 -12145661 -63631087 -109943459 -75420774
6363g5420774J00477202P8258813R039975j9860821M646482K3277676J712661
$$ -75420774 25056428 103315241 112355216 92494395 97140877 120418553 122131214
6356A22131214l2535921m5491997l6565099j7557758L922017J2080875n520338
$$ 122131214 89595293 44103296 7538197 -10019561 -6097544 5983331 462993
6349D62993k5540214q957691L5017952M7786977K762319n1709678n6376940j6266152
$$ 462993 -25077221 -34034912 983040 48770017 51532336 -177342 -56554282 -72820434
6341g2820434J5855198Q378781k1800142l6028921j1210602L7600517O5643559
$$ -72820434 -56965236 -48586455 -70386597 -106415518 -117626120 -80025603 -14382044
6334a4382044M5761156N627500p368843P292961R716691r696099j6314779K291000
$$ -14382044 31379112 37006612 29637769 36930730 46647421 36951322 20636543 22927543
6326B2927543J1184545p269887j6675934J0375727L9106449K5882731j2352826
$$ 22927543 34112088 26842201 10166267 20541994 59648443 85531174 73178348
6319G3178348k9328835k1845593k1480311l2776782k9602806o119748J2995332
$$ 73178348 43849513 22003920 523609 -32253173 -61855979 -67975727 -54980395
6312e4980395J4676839J3482277J9204457J7739864l275423k7580361k4911132
$$ -54980395 -40303556 -26821279 -7616822 10123042 6847619 -20732742 -45643874
6305d5643874Q867040L6841187J9594328k9637161n0805130j5046085K9450153
$$ -45643874 -36776834 64353 19658681 -9978480 -60783610 -75829695 -46379542
6298d6379542K3472962j5587863k2792267J3381512M2418417M0228151L4568430
$$ -46379542 -22906580 -38494443 -61286710 -47905198 -5486781 34741370 69309800
6291F9309800L3484036O524591l8995289m3716273K511981K4393105j9319866
$$ 69309800 102793836 109318427 70323138 26606865 29118846 53511951 34192085
6284C4192085n5629911q669422P2482029Q3030749J4323068n1911473p0027348
$$ 34192085 -21437826 -30107248 42374781 125405530 139728598 87817125 17789777
6277A7789777o2302587m3111961o08018M7587039N9276162L5207277J6739540
$$ 17789777 -44512810 -87624771 -88232789 -40645750 18630412 53837689 70577229
6270G0577229J3361052m094230l4921477l8399976l459745K8935932K7028618
$$ 70577229 83938281 79844051 44922574 6522598 3062853 31998785 59027403
6263E9027403M055321j6646600k8810929l0252595k1813023j6951593j6874008
$$ 59027403 63082724 46436124 17625195 -12627400 -34440423 -51392016 -68266024
6256f8266024M650580M6250284M4308601l4267334r9639407m2468465Q5643202
$$ -68266024 -63615444 -17365160 26943441 -7323893 -106963300 -149431765 -63788563
6249f3788563J18855445J7216197p3551730m6959108J5748618M646626l5797694
$$ -63788563 55066882 72283079 -1268651 -48227759 -32479141 -27832515 -63630209
6242f3630209n329276O1307830M9410402l5660547p2029560j7593468L4146736
$$ -63630209 -68959485 -7651655 41758747 6098200 -65931360 -83524828 -49378092
6235d9378092J5062213k2907359j6736337Q318458Q095436M202156K7979435M2733745
$$ -49378092 -34315879 -57223238 -73959575 -65641117 -57545681 -53343525 -25364090 17369655
6227A7369655N32900o2858189o7519435m969083N5000696O5157790M4251632J9062478
$$ 17369655 17902555 -44955634 -112475069 -117444152 -62443456 2714334 46965966 66028444
6219F6028444j2648022m5223008m8189377j5797616R629016k956716k4919493
$$ 66028444 53380422 8157414 -40031963 -55829579 -46200563 -49157279 -74076772
6212g4076772j4111441K0169008L8850861L5789163L1599852K0691793k0379102
$$ -74076772 -88188213 -68019205 -29168344 6620819 38220671 58912464 38533362
6205C8533362p2573998p8478478k1571125M5892540P3535768O6897825M8161649
$$ 38533362 -34040636 -112519114 -134090239 -88197699 -14661931 52235894 100397543
6198A00397543J2159024l9766448o4450810k8303697L1054880M7280674J4989768
$$ 100397543 112556567 72790119 8339309 -19964388 11090492 58371166 73360934
6191G3360934j2935739p762799P156785Q655065K307041p625243k8542778m7212502
$$ 73360934 60425195 52662396 59819181 68474246 70781287 63156044 34613266 -12599236
6183a2599236l1964868J3753629L9473888J4207509k6167551k5713296J7847530
$$ -12599236 -44564104 -30810475 8663413 22870922 -3296629 -29009925 -11162395
6176a1162395N2022723L2969892k6116107o6244693m0016652L3575238P8439961
$$ -11162395 40860328 73830220 47714113 -18530580 -58547232 -24971994 53467967
6169E3467967M3289154l5204480p6990515n5533444j3774864R340061K0014776
$$ 53467967 96757121 61552641 -15437874 -70971318 -84746182 -75406121 -55391345
6162e5391345L0414641K6932497r52711l4625766m8101751l0848828J5339821
$$ -55391345 -24976704 1955793 1003082 -33622684 -81724435 -112573263 -97233442
6155i7233442O8685945P9436717J9744064n4971309n6403689J0765507M3805572
$$ -97233442 -28547497 50889220 70633284 15661975 -40741714 -29976207 13829365
6148A3829365q875920o9661113n1778409J4178830M1614494J8122323l404665
$$ 13829365 4953445 -64707668 -116486077 -102307247 -60692753 -42570430 -45975095
6141d5975095j157761Q339201K7784289O3325601P4746791K2694778m9997597
$$ -45975095 -47132856 -38793655 -11009366 52316235 127063026 149757804 99760207
6134I9760207o4470437k2631212K499386j4571493k7984463j5521347r143050
$$ 99760207 35289770 12658558 15157944 586451 -27398012 -42919359 -52062409
6127e2062409j8846650j1136286J6897262K2603620n2177k263309K9389094M3791413
$$ -52062409 -70909059 -82045345 -65148083 -42544463 -42596640 -44859949 -15470855 28320558
6119B8320558J7022938p225879m527341j3187255m6577380m8840206L599734M0308108
$$ 28320558 45343496 38117617 33590276 20403021 -26174359 -75014565 -71414831 -31106723
6111c1106723Q231252l2861959r966775L7655360K9102465j7684280k1722895
$$ -31106723 -22875471 -55737430 -65704205 -28048845 1053620 -16630660 -38353555
6104c8353555K1835300M4215852K2953956j465474j5446658m0583137n8603763
$$ -38353555 -16518255 27697597 50651553 49186079 33739421 -6843716 -65447479
6097f5447479k5301327L8030561N9272561K7442683P22040j408331j6644320m0029080
$$ -65447479 -90748806 -52718245 6554316 33996999 34719039 33310708 16666388 -23362692
6089b3362692j3507574N6276209P8571178K3616472j7558779J7349349N1623050
$$ -23362692 -36870266 19405943 97977121 121593593 104034814 121384163 173007213
6082A73007213l601714r3116391r6001755j1023027M7543436K1442204k6628984
$$ 173007213 169405499 76289108 -19712647 -30735674 16807762 38249966 11620982
6075A1620982k6853202O041448K3380318K1337340K7799078M3579451L7223889
$$ 11620982 -15232220 -9190772 14189546 35526886 63325964 106905415 144129304
6068A44129304m857047m8293539m7214794p128218J4153843j4332498m5995506
$$ 144129304 139272257 90978718 43763924 36635706 50789549 36457051 -9538455
6061i538455k4513804K4665999L2783216P68589q106222J3084060L168041l9847847
$$ -9538455 -34052259 -9386260 23396956 24165545 16059323 29143383 32311424 -7536423
6053g536423l2668685M2217253P5875560N305532o3780690j9724052O5079393
$$ -7536423 -40205108 2012145 77887705 83193237 19412547 -311505 64767888
6046F4767888M9919286l8999826n6630991J2714894L6679410k8426252o2503971
$$ 64767888 114687174 75687348 19056357 31771251 68450661 40024409 -22479562
6039b2479562O403751P6364962M0880297m6880889p7360989m8344269k1317810
$$ -22479562 -16075811 60289151 101169448 54288559 -23072430 -71416699 -92734509
6032i2734509K431346N1165688Q7902092N7391083q169454l1063343j0760556
$$ -92734509 -90303163 -39137475 48764617 106155700 97986246 66922903 56162347
6025E6162347r725067l4316877k8301036J4341382K5547074k4694268p1233915
$$ 56162347 46437280 12120403 -16180633 -1839251 23707823 -986445 -72220360
6018g2220360m6764286K4519858O7254873N1044990P386241k5450528l6671779
$$ -72220360 -118984646 -94464788 -27209915 23835075 31221316 5770788 -30900991
6011c0900991l0014157q492948J9226631L4325111K5549916Q240209Q532380K3650692
$$ -30900991 -60915148 -69408096 -50181465 -15856354 9693562 17933771 26466151 50116843
6003E0116843K0162666j2198295l3164135j2147350J2333645j1388098n2062133
$$ 50116843 70279509 58081214 24917079 12769729 25103374 13715276 -38346857
5996c8346857l1542087M3210162P4055230K2581089k7257688p815315K3708077
$$ -38346857 -69888944 -26678782 47376448 69957537 42699849 34884534 58592611
5989E8592611o519588n3881382l3063632K7254822K8119553l1094617n2728992
$$ 58592611 52073023 -1808359 -34871991 -7617169 20502384 -10592233 -63321225
5982f3321225n894355K9986492N388946k8174860k2527349n917789m345911J5827891
$$ -63321225 -69215580 -39229088 -33840142 -62015002 -84542351 -90460140 -94806051 -78978160
5974g8978160O5916825P9860160J6010960n4199352m3042899J9079498L4571045
$$ -78978160 -13061335 66798825 82809785 28610433 -14432466 4647032 39218077
5967C9218077j0506984l9882368j8292672L127156j5389451l8863108k3716972
$$ 39218077 28711093 -11171275 -29463947 -26336791 -41726242 -80589350 -104306322
5960a04306322J1476262K2473933R294751O507148K0517444J7156025k2540047
$$ -104306322 -92830060 -70356127 -61061376 -54554228 -34036784 -16880759 -39420806
5953c9420806o1049445m1382266L6979876J02069046Q7290488J1907922m4147768
$$ -39420806 -100470251 -141852517 -104872641 -2803595 84486893 96394815 52247047
5946E2247047l9494936p526137R672132J5348510K3807440J8884247j3234022
$$ 52247047 12752111 5225974 14898106 30246616 54054056 72938303 59704281
5939E9704281m3354831l6575990p098496P264005M594026R027505K1476359K6783491
$$ 59704281 16349450 -20226540 -27325036 -20061031 -15467005 -6439500 15036859 41820350
5931D1820350L0341083L7636384K0365747l6378642p6034709l6855577L7064565
$$ 41820350 72161433 109797817 130163564 93784922 17750213 -19105364 17959201
5924A7959201M2563472k3122406n3572765o077274L1015350l468476l2419712
$$ 17959201 60522673 37400267 -16172498 -22249772 8765578 5297102 -27122610
5917b7122610K2692892Q9842299N1389049o0943517j07102472m5670304K7874842
$$ -27122610 -4429718 85412581 136801630 75858113 -31244359 -76914663 -49039821
5910d9039821M2856884K9359019K0138083l951321l7533686k7246753K8521322
$$ -49039821 -6182937 23176082 43314165 39362844 1829158 -25417595 3103727
5903C103727N0228201P10293m6746186k3390235K9280268L5871156J898997j9477895
$$ 3103727 53331928 54042221 7296035 -16094200 13186068 49057224 50956221 31478326
5895C1478326j8617654j4610866J218180L4293233M3633049K543084l9273799
$$ 31478326 12860672 -1750194 -532014 33761219 77394268 79937352 40663553
5888D0663553k8376020q1874j7191374n6141081m6471215N468685L0239247J5428702
$$ 40663553 12287533 12205659 -4985715 -61126796 -107598011 -102129326 -71890079 -56461377
5880e6461377J3676119L8208613M6891944K9642150J8057800Q042788l0161597
$$ -56461377 -42785258 -4576645 42315299 71957449 90015249 98058037 67896440
5873F7896440o4022101k8304867M7285883N5722778j8221029o6436763l2737270
$$ 67896440 3874339 -24430528 22855355 78578133 60357104 -6079659 -38816929
5866c8816929N664212j1190889k1714464K7217534O4548495J8215558m4532030
$$ -38816929 -33152717 -44343606 -66058070 -38840536 25707959 43923517 -608513
5859f08513k5226639L3363048J8960535n6295291p4124245j760081O5768209N7381949
$$ -608513 -25835152 7527896 26488431 -29806860 -103931105 -105691186 -39922977 17458972
5851A7458972P201188k8296889l8162016k6906220J687532J9665720M943210n857702
$$ 17458972 24660160 -3636729 -41798745 -68704965 -67017433 -47351713 -42408503 -48266205
5843d8266205L0830022P3723619M7560423k4379003m6458891j1596490j3038116
$$ -48266205 -17436183 56287436 103847859 79468856 33009965 21413475 8375359
5836H375359p0653784p7740183J9528964J11966842Q5954708o013486l8830471
$$ 8375359 -62278425 -140018608 -120489644 -8522802 77431906 71418420 32587949
5829C2587949n017617N094502l2385403n0709609j8687547J7302443K5044916
$$ 32587949 27570332 32664834 279431 -50430178 -69117725 -51815282 -26770366
5822b6770366K7641795L3988399J0326999m6039611p2527937k5660893M6660897
$$ -26770366 871429 34859828 45186827 -852784 -73380721 -99041614 -52380717
5815e2380717O3328129J2420337m5063102n6392015k4893721J5717545M0389076
$$ -52380717 10947412 23367749 -21695353 -78087368 -102981089 -87263544 -46874468
5808d6874468M1321978K3074340K425000Q0678J8494874L2607179J5526137k5860800
$$ -46874468 -5552490 17521850 19946850 20027528 38522402 71129581 86655718 60794918
5800F0794918n3088963l9358933M18577L1653071M0387793L6335358K5646007
$$ 60794918 7705955 -31652978 -31234401 418670 40806463 77141821 102787828
5793A02787828M629375j9493793k6446953j0892980O015082M566538q626535j5450273
$$ 102787828 107417203 87923410 61476457 50583477 56598559 61165097 52538562 37088289
5785C7088289j2984172j1382492j4385042j6820000j6773999j6704347j4228353
$$ 37088289 24104117 12721625 -1663417 -18483417 -35257416 -51961763 -66190116
5778f6190116m540951O525428M370207j2182682k0452395k06047L2647033L9376634
$$ -66190116 -70731067 -64205639 -59835432 -72018114 -92470509 -92676556 -60029523 -20652889
5770b0652889J3111432m256294J7577024M3287590J9622643l4492183m2731824
$$ -20652889 -7541457 -11797751 5779273 49066863 68689506 34197323 -8534501
5763h534501J3573867N6837422K3431844m1995088n3815226n382001L9710169
$$ -8534501 5039366 61876788 85308632 43313544 -10501682 -15883683 23826486
5756B3826486M7219521L5110187J3296829k6546744o1298100m7126732O187384
$$ 23826486 71046007 106156194 119453023 92906279 31608179 -15518553 -9331169
5749i331169L3083312M202556l3602212l1692756l967463J0347185M953724k364169
$$ -9331169 23752143 27954699 -5647513 -37340269 -41307732 -30960547 -26006823 -28370992
5741b8370992l605251M93028R981861J7728249J5698898J3869888K2849478K3020317
$$ -28370992 -31976243 -31483215 -21501354 -3773105 11925793 25795681 48645159 71665476
5733G1665476m737348k6245755M789679N4403706L7589124m5684356r4097651
$$ 71665476 66928128 40682373 45472052 99875758 137464882 91780526 -2317125
5726b317125n7338539q580002j1913101j8113715K6287576O1112253J6216586
$$ -2317125 -59655664 -68235666 -80148767 -98262482 -71974906 -10862653 5353933
5719E353933m1572876k810642Q6663923P5289597n0011082j22291467l7191527
$$ 5353933 -36218943 -39029585 47634338 122923935 72912853 -49378614 -86570141
5712h6570141R4324582J06492147m691171j06225330j05316976k5513646N4568814
$$ -86570141 7754441 114246588 109555417 3330087 -101986889 -127500535 -72931721
5705g2931721P4426503K6944319l4212008m2485479O15038K6840967N219448r012979
$$ -72931721 1494782 28439101 -5772907 -48258386 -47643348 -20802381 -15582933 -24595912
5697b4595912L1135689P7751246N6828108j7986590o9378782o6981086m4118010
$$ -24595912 6539777 84291023 141119131 123132541 53753759 -13227327 -57345337
5690e7345337k1839860R329723L5007565J8894497k6693518l7314501J1878834
$$ -57345337 -79185197 -69855474 -34847909 -15953412 -42646930 -79961431 -68082597
5683f8082597O4614379O2180202J7479262k0556484l4311079l1826071r376570
$$ -68082597 -3468218 58711984 76191246 55634762 21323683 -10502388 -19878958
5676a9878958L4814692O9961140N8991557P441992m4713707o8702677n7525037
$$ -19878958 14935734 84896874 143888431 151330423 106616716 37914039 -19610998
5669a9610998j2251621M3262919N4162843m828216o8258802m2937561N7903660
$$ -19610998 -31862619 11400300 65563143 60734927 -7523875 -50461436 7442224
5662G442224J10764642M3670922o1683976q3807195k6611491N127703l0752585
$$ 7442224 118206866 161877788 100193812 16386617 -10224874 -5097171 -35849756
5655c5849756o4006572l4296145K0038581L4798240J8397442K0295493M0233826
$$ -35849756 -99856328 -134152473 -114113892 -79315652 -60918210 -40622717 -388891
5648c88891L5186872L890884j104295M0920826P4064494L9266219l9749834q4693124
$$ -388891 34797981 38688865 37584570 78505396 152569890 191836109 152086275 67393151
5640F7393151o4631105k7464845k2739106l3019821j1786572L5562216N4473835
$$ 67393151 2762046 -24702799 -47441905 -80461726 -92248298 -56686082 -2212247
5633b212247K4343746p842725K606577L3249667L4119650M143432j6237365j3442115
$$ -2212247 22131499 14288774 16895351 50145018 84264668 88408100 72170735 58728620
5625E8728620j2476259k1913641j5999985J6744315M8207887N1045026L1194793
$$ 58728620 46252361 24338720 8338735 25083050 73290937 124335963 155530756
5618A55530756M895596k3958896m6922108m4711553j8683305N85859l893032j2540979
$$ 155530756 160426352 136467456 89545348 44833795 26150490 26736349 22843317 10302338
5610A0302338o712952L377372P397071J4106357J8728419n285345n0011747n6700263
$$ 10302338 3589386 6966758 14363829 28470186 47198605 41913260 -8098487 -64798750
5602f4798750j455893M9135700K8012987k7038822l1892102J0217001K2020646
$$ -64798750 -66254643 -17118943 10894044 -16144778 -48036880 -37819879 -15799233
5595a5799233j1900006k0364247K7452063O3888461L2471581k1960101k8865193
$$ -15799233 -27699239 -48063486 -20611423 43277038 75748619 53788518 24923325
5588B4923325J451444J1358340m339193j271104K9231765M1995721J0121520l2125059
$$ 24923325 26374769 37733109 33393916 32122812 61354577 103350298 113471818 81346759
5580H1346759l6271930m006650J5325630j1412971n1708811l9631595L3029084
$$ 81346759 45074829 41068179 56393809 44980838 -6727973 -46359568 -13330484
5573a3330484Q4942211M2406848n0562316p9529226j6192491M6318192L6149247
$$ -13330484 71611727 114018575 63456259 -16072967 -32265458 14052734 50201981
5566E0201981j178405L07157J2478781k2478764p0770083n3144104J5741906M2638830
$$ 50201981 49023576 49330733 61809514 39330750 -31439333 -84583437 -68841531 -26202701
5558b6202701P437725r467917K7650360M4581541j2980952p6743659n7499298
$$ -26202701 -18764976 -28232893 -582533 43999008 31018056 -45725603 -103224901
5551a03224901J6108563M5219579Q194305k4581450p827599K5261679L1585862
$$ -103224901 -87116338 -41896759 -33702454 -58283904 -66111503 -40849824 -9263962
5544i263962J5938592L799835K888263R075773J7509337J7001876J069093j2947038
$$ -9263962 6674630 10474465 13362728 22438501 39947838 56949714 58018807 45071769
5536D5071769o855334j068118k8744983o7924853n3758533K0877419P2405379
$$ 45071769 38216435 37148317 8403334 -59521519 -113280052 -92402633 -19997254
5529a9997254L6517380l2557364l2239777M1767188Q7024362L6437970n4072199
$$ -19997254 16520126 -16037238 -48277015 -6509827 80514535 116952505 62880306
5522F2880306q7473284m8235615p17381Q891855M56548J1130738L8601640M9343382
$$ 62880306 -24592978 -72828593 -73545974 -64654119 -64197571 -53066833 -14465193 34878189
5514C4878189K3951319k0504785m6465378l0342540J1029747L1546989Q590834
$$ 34878189 58829508 38324723 -8140655 -38483195 -27453448 4093541 12684375
5507A2684375k0985652m930407M4500313N5713591J14591n6825266m6403156K156224
$$ 12684375 -8301277 -13231684 31268629 86982220 87096811 30271545 -16131611 -13975387
5499a3975387J2130469j6892934j6383383K4199105L1130698k4484666o1364289
$$ -13975387 -1844918 -18737852 -35121235 -10922130 20208568 -4276098 -65640387
5492f5640387j1017920O6414782O7787330k360787n2923034m4254054j4347704
$$ -65640387 -76658307 -10243525 57543805 55183018 2259984 -41994070 -56341774
5485e6341774J2649132M6589907O3056470J6136749o2929198p7000785p315131
$$ -56341774 -43692642 2897265 65953735 82090484 19161286 -57839499 -65154630
5478f5154630M4383262O977789n1509504l3696090L9212684P1137448L5339275
$$ -65154630 -20771368 -13793579 -65303083 -98999173 -59786489 11350959 46690234
5471D6690234r655375k2129638j6525251j0799626j548925Q888454J1707145J4347290
$$ 46690234 37034859 14905221 -1620030 -12419656 -13968581 -5080127 6627018 20974308
5463B0974308K2559819J4525283k1732123m5200102j2088832M6039672N7172282
$$ 20974308 43534127 58059410 36327287 -8872815 -20961647 25078025 82250307
5456H2250307J5235466j4654000m82158J5715426q82866j9808389l021006K7292484
$$ 82250307 97485773 82831773 82349615 98065041 97182175 77373786 74352780 101645264
5448A01645264K1181516k5224820o5657108o3011745k6586745Q475035K3575774
$$ 101645264 122826780 97601960 31944852 -31066893 -57653638 -49178603 -25602829
5441b5602829L1211329M5871632N0957513J8828863l4805505n4561410k1743792
$$ -25602829 5608500 51480132 102437645 121266508 86461003 31899593 10155801
5434A0155801J4559070J3121861J039030J2774292J7587716k3773167o7860553
$$ 10155801 24714871 37836732 38875762 51650054 69237770 45464603 -22395950
5427b2395950l9653643M2617265Q2302263M1960048j9134928m9542256n9344620
$$ -22395950 -62049593 -19432328 62869935 104829983 85695055 36152799 -23191821
5420b3191821n5088524j3549257M7615623N8806182L295822l9700812o002075
$$ -23191821 -78280345 -91829602 -44213979 14592203 17888025 -21812787 -27814862
5413b7814862O1942013Q3305399M3119821j8060986o4995681p2495700k3643951
$$ -27814862 34127151 117432550 160552371 142491385 77495704 5000004 -18643947
5406a8643947M7325944O2113881m69664o0912889m9327175n322652m271911l5063707
$$ -18643947 28681997 90795878 90326214 29413325 -19913850 -25236502 -29508413 -64572120
5398f4572120l0372031J5102395M0457737J9825595p319993q081208L574036O362283
$$ -64572120 -94944151 -79841756 -39384019 -19558424 -26878417 -34959625 -31385589 -25023306
5390b5023306L358716L842433O878603R453560J0163688P216393N409426J1614143
$$ -25023306 -21664590 -17822157 -10943554 -1489994 8673694 15890087 21299513 32913656
5382C2913656J5119729j134558k1591883j0419851K3687130K7140873j0590226
$$ 32913656 48033385 46898827 25306944 14887093 38574223 65715096 55124870
5375E5124870k9708734J672088K7076953o051548n4403265m7491011J997609L0699842
$$ 55124870 25416136 27088224 54165177 48113629 -6289636 -53780647 -51783038 -21083196
5367b1083196K5887412J8218875R470481j4265370k8805630j0287053L219363
$$ -21083196 4804216 23023091 32493572 18228202 -10577428 -20864481 -17645118
5360a7645118k9318593o3163233l0640551L4439289L9907069j2231183k9469180
$$ -17645118 -46963711 -110126944 -140767495 -106328206 -66421137 -78652320 -108121500
5353a08121500J3720871L8932697M975500k7824190j4032465R14857k2574117
$$ -108121500 -94400629 -55467932 -50492432 -78316622 -92349087 -91434230 -114008347
5346a14008347l6262829J0160360O9725865O1355705r365598o0645792m3302059
$$ -114008347 -150271176 -140110816 -70384951 -9029246 -18394844 -79040636 -122342695
5339a22342695J2813484M8184525L4015354o929765k2259693J1371783M8194979
$$ -122342695 -109529211 -61344686 -27329332 -34259097 -56518790 -45147007 3047972
5332C047972K4131793m9304155q8305323m7939835J9478683M2431779K1442584
$$ 3047972 27179765 -22124390 -110429713 -158369548 -138890865 -96459086 -75016502
5325g5016502P623255K3215915M1234784K9309408j1974027m9327197m7977856
$$ -75016502 -67393247 -44177332 -2942548 26366860 14392833 -34934364 -82912220
5318h2912220r593746K8619311M4745439N7610335P5165587N5726061k5811297
$$ -82912220 -92505966 -63886655 -19141216 38469119 113634706 169360767 143549470
5311A43549470j06242313j02252208l1290766J6425965J3698668J1977422K6010181
$$ 143549470 37307157 -64945051 -96235817 -79809852 -66111184 -54133762 -28123581
5304b8123581J1000347k9069906k4255279L2469215N0690784p763936n3100284
$$ -28123581 -17123234 -46193140 -70448419 -37979204 12711580 4947644 -48152640
5297d8152640j5491910L4200594Q257537m2024912j3433664O7415624Q0434836
$$ -48152640 -63644550 -29443956 -21186419 -63211331 -76644995 -9229371 71205465
5290G1205465L658820n7595076l6294440J2748998J9997479k14598j618083Q484278
$$ 71205465 74864285 17269209 -19025231 -6276233 13721246 13506648 11888565 20372843
5282B0372843j0520051n5447434o8081949o887843Q6163632J12016245K7928832
$$ 20372843 9852792 -45594642 -113676591 -120564434 -34400802 77615443 105544275
5275A05544275q1213831r2660456o153461N4198307J9534101k8171488K222419
$$ 105544275 24330444 -68330012 -74483473 -20285166 -751065 -28922553 -26700134
5268b6700134N7969230K9514434o4414156r8517908l1679999M1213373M2335541
$$ -26700134 31269096 60783530 -3630626 -102148534 -133828533 -92615160 -50279619
5261e0279619J0723900J1721768L2880583K4744479j2132413l5609494k5173976
$$ -50279619 -39555719 -27833951 5046632 29791111 17658698 -17950796 -43124772
5254d3124772L090883K3208175J7127318j1410003k7078914K704158N1659023
$$ -43124772 -40033889 -16825714 301604 -11108399 -38187313 -35483155 16175868
5247A6175868N1824745j3098898p2226138n6119816J3585061O1296252N7546525
$$ 16175868 68000613 54901715 -17324423 -73444239 -59859178 1437074 58983599
5240E8983599L6138278K4304236P010025k8471470n3470585l3476068J4703196
$$ 58983599 95121877 119426113 126436138 97964668 44494083 11018015 25721211
5233B5721211L4723832L712169l3550106k3354156K0682960L3209791j0056039
$$ 25721211 60445043 64157212 30607106 7252950 27935910 61145701 51089662
5226E1089662n3216175l6633701J7658602L6942243J655038k9630262r226137
$$ 51089662 -2126513 -38760214 -21101612 15840631 17495669 -12134593 -21360730
5219b1360730K9537803K3827826k3240259m4254898l646580N1808659N9027601
$$ -21360730 8177073 32004899 8764640 -35490258 -39136838 12671821 71699422
5212G1699422K0875490j3033405k4865392l8575834n6540630m2824963J3110589
$$ 71699422 92574912 79541507 54676115 16100281 -40440349 -83265312 -70154723
5205g0154723O5628015P3059435M5503344O182584m2278467p6393813m1803214
$$ -70154723 -4526708 68532727 114036071 120218655 77940188 1546375 -40256839
5198d0256839N2643795R4136025Q633775j06090548j00470311P885444O5030869
$$ -40256839 12386956 106522981 115156756 9066208 -91404103 -83518659 -18487790
5191a8487790J8629536k2482585J1564928M4781764Q322375l9449897l2363308
$$ -18487790 141746 -22340839 -10775911 34005853 42328228 2878331 -29484977
5184b9484977j4420935l5909700l8635308L5833382J11407749Q2445148j1656230
$$ -29484977 -43905912 -79815612 -118450920 -82617538 28790211 111235359 99579129
5177I9579129m9934635j8459696l18356j4090444m701245K1293379m642046p1946175
$$ 99579129 49644494 31184798 30866442 16775998 12074753 33368132 28726086 -43220089
5169d3220089q5523800k4703771J7932162p497097l0500595J0533107O4493955
$$ -43220089 -128743889 -153447660 -135515498 -143012595 -173513190 -162980083 -98486128
5162i8486128N7664092P596610j9792559q845543Q974377J3663015N072681j2522362
$$ -98486128 -40822036 -33225426 -53017985 -61863528 -52889151 -39226136 -34153455 -46675817
5154d6675817k1008647J898209M0903215N0551472K2102320k279209J316060O806290
$$ -46675817 -67684464 -65786255 -24883040 25668432 47770752 45491543 46807603 53613893
5146E3613893m133556p989206Q621199J5655638o582308k5561589o084843L3529194
$$ 53613893 49480337 41491131 50112330 65767968 59185660 33624071 27539228 61068422
5138F1068422M9234540K8383634p132441l1225840k9055521n182632J3534926
$$ 61068422 110302962 138686596 131554155 100328315 71272794 66090162 79625088
5131G9625088O329327j1187443j3987097j2591034k8278876l9696682j3377512
$$ 79625088 85954415 74766972 60779875 48188841 19909965 -19786717 -33164229
5124c3164229K4549102J8735027j8660467k2818713J0799790K0854623l32058
$$ -33164229 -8615127 10119900 -8540567 -31359280 -20559490 295133 -36925
5117c6925J4101736P5140005R4343079K4774285n4303954o1688085l1461463k7437786
$$ -36925 14064811 89204816 183547895 208322180 154018226 92330141 60868678 33430892
5109C3430892k7362844J1943196M6254214Q952187o4968867q5293481m2463065
$$ 33430892 6068048 18011244 64265458 73217645 8248778 -77044703 -119507768
5102a19507768O30862K1129228M0967574M5357454K172590m9823582l7076986
$$ -119507768 -118876906 -97747678 -56780104 -11422650 -9250060 -59073642 -96150628
5095i6150628K5241651M7047363P278005j8066246R969196L3720907R414169j8078044
$$ -96150628 -70908977 -23861614 -16583609 -34649855 -24680659 9040248 18454417 376373
5087C76373m078315J4099988q834951l4677300k756926N7990567O1181084m870459
$$ 376373 -3701942 10398046 1563095 -33114205 -35871131 22119436 83300520 78430061
5079G8430061n4329648k8027129K1979270J1448264m9708124o7607977p70245
$$ 78430061 24100413 -3926716 18052554 29500818 -20207306 -87815283 -88585528
5072h8585528P2117157N9110806j2018508l6117907Q278442K9575720k1436711
$$ -88585528 -16468371 42642435 30623927 -5493980 2784462 32360182 10923471
5065A0923471o1677791q257160P7342332P7146839L03382l7175420J541556L0781316
$$ 10923471 -50754320 -59011480 18330852 95477691 95781073 58605653 60147209 90928525
5057I0928525k009019l7258355k2101377k09100j7196426k7598153J9029491O9101542
$$ 90928525 88919506 51661151 29559774 29350674 12154248 -15443905 3585586 72687128
5049G2687128L9931575m1039639p3806024m0197650j7503681l8094229l9391375
$$ 72687128 112618703 71579064 -2226960 -42424610 -59928291 -98022520 -137413895
5042a37413895J6950328O8143935M7971588p001842j7840265J5187232K7239602
$$ -137413895 -120463567 -52319632 -4348044 -11349886 -29190151 -14002919 13236683
5035A3236683J905220j0020056J4812746L5220928K3997766J4002319K7860669
$$ 13236683 15141903 5121847 19934593 55155521 79153287 93155606 121016275
5028A21016275K4514502k7563219p6236779n9566992j6149791k9066259p6955154
$$ 121016275 145530777 117967558 41730779 -17836213 -33986004 -63052263 -140007417
5021a40007417n1937775N7537653J19148861M9043555n2451182m8136489L2869315
$$ -140007417 -191945192 -134407539 -15258678 33784877 -18666305 -66802794 -33933479
5014c3933479N4609590j0230160n3255918j1261854M9062024N2867883J9532696
$$ -33933479 20676111 10445951 -42809967 -54071821 -5009797 47858086 67390782
5007F7390782q88109r851436k4929294k6022525O154999M1958084M2610275J5359864
$$ 67390782 66502673 56651237 31721943 5699418 11854417 53812501 96422776 111782640
4999A11782640q806394j9795900j9178224k571727J8185339J4103279r945813
$$ 111782640 102976246 83180346 64002122 61430395 79615734 93719013 83773200
4992H3773200q479982K6265613L2550688k5588110q2940578n7792841K6909507
$$ 83773200 75293218 101558831 134109519 108521409 25580831 -32212010 -5302503
4985e302503P8144057O1343085K0799175j0525930m3271095p4924457p3695737
$$ -5302503 72841554 134184639 154983814 144457884 101186789 26262332 -47433405
4978d7433405l2917218J2797919L5202081L1714245J642555m4193655n8609704
$$ -47433405 -80350623 -67552704 -32350623 -636378 1006177 -43187478 -101797182
4971a01797182p770880N7499061N3516861r920889l7986892R95212L0715223M096395
$$ -101797182 -109568062 -52069001 1447860 -8473029 -46459921 -45464709 -14749486 -10653091
4963a0653091j5237307K8259110P2882624L8590546l3334757m2746530J0597299
$$ -10653091 -25890398 2368712 75251336 113841882 80507125 37760595 48357894
4956D8357894L7620441P759381j9719582j1117065n064717k6415540l9881085
$$ 48357894 85978335 93737716 74018134 62901069 57836352 31420812 -8460273
4949h460273j7443804J8602622M5487394O7431976P0940280K3303696n3700541
$$ -8460273 -25904077 -7301455 38185939 105617915 176558195 199861891 146161350
4942A46161350q0283059l0509113K0003134Q334779k0763221L9720M0369268K3328549
$$ 146161350 65878291 35369178 55372312 63707091 42943870 42983590 83352858 106681407
4934A06681407l9297869n8044680n581117M1052889J4665859n3007659q3109597
$$ 106681407 67383538 9338858 3757741 44810630 59476489 6468830 -76640767
4927g6640767m3897013L0693562Q3189466P6477448K2575373k3501832k3136729
$$ -76640767 -120537780 -89844218 -6654752 69822696 92398069 68896237 45759508
4920D5759508m854772k1686167o4223898o7754062j3940248L2902195J9207211
$$ 45759508 40904736 19218569 -45005329 -112759391 -126699639 -93797444 -74590233
4913g4590233j9495305j7086731K3925735M5036863K4560306K608047J2020891
$$ -74590233 -94085538 -111172269 -87246534 -42209671 -17649365 -15041318 -3020427
4906c020427L1421496K4446290n515736k3807480j3708739M263609J552064k2999952
$$ -3020427 28401069 52847359 47331623 23524143 9815404 14079013 15631077 -7368875
4898g368875m2626064l3633176q45895K9611788L7764563K4595986L769327j1559775
$$ -7368875 -49994939 -83628115 -84474010 -54862222 -17097659 7498327 11267654 -292121
4890b92121j3395648p90015J7118866K4363647R329388k5359434o0198922o5936923
$$ -292121 -13687769 -14477784 2641082 27004729 36334117 10974683 -49224239 -115161162
4882a15161162k5580440L9787289P7510746N4793557R18028k2596769L021351
$$ -115161162 -140741602 -100954313 -23443567 31349990 32268018 9671249 12692600
4875A2692600L0841626J2107031l6492213n3368522j4458821L2553734L0379152
$$ 12692600 43534226 55641257 19149044 -34219478 -48678299 -16124565 14254587
4868A4254587j0288679k5165112J1427916M5880257K2545178k9051522l3853718
$$ 14254587 3965908 -21199204 -9771288 36108969 58654147 29602625 -4251093
4861d251093J3306977L6240686l653897m3963959j9355515L4450764M0049237
$$ -4251093 9055884 45296570 41642673 -2321286 -21676801 12773963 52823200
4854E2823200K275781p274429K6703593M1225709M163195l5382874l3813666j9902134
$$ 52823200 55098981 47824552 74528145 115753854 119917049 84534175 50720509 30818375
4846C0818375l2107968m5529942j5854413M0393728O5330438M1416600N600454
$$ 30818375 -1289593 -46819535 -62673948 -22280220 43050218 84466818 90067272
4839I0067272j1013541j7058525l1922570n1837943n3929301k3689318K2977212
$$ 90067272 79053731 61995206 30072636 -21765307 -75694608 -99383926 -76406714
4832g6406714M5915886K1705018k1467637l1714269m34972K5511266P922450l5083850
$$ -76406714 -30490828 -8785810 -30253447 -61967716 -62402688 -36891422 -28968972 -64052822
4824f4052822n8868405m1906996P371675O2165126Q1272053L8441347l1269362
$$ -64052822 -122921227 -164828223 -157456548 -95291422 -14019369 24421978 -6847384
4817f847384n3318448q492631L5324472J9872655k0387806k0666260J0326825
$$ -6847384 -60165832 -68658463 -33333991 -13461336 -33849142 -54515402 -44188577
4810d4188577J5480947p131972k056659M4249684P4254569M7204397j957755j8466027
$$ -44188577 -28707630 -35839602 -37896261 6353423 80607992 127812389 125854634 107388607
4802A07388607Q71261K1233471K3053034J2399491k428039j9428258l5649305
$$ 107388607 108259868 129493339 152546373 164945864 162517825 143089567 107440262
4795A07440262m5190474m1282543k0451927O482887J4690454n952191k9038463
$$ 107440262 62249788 20967245 515318 6998205 21688659 15736468 -13301995
4788a3301995k0191513J7849931N1339071N9113661M3617603Q914258l6328227
$$ -13301995 -33493508 -15643577 35695494 94809155 138426758 147341016 111012789
4781A11012789o0974541m1177600q594422j8085659n7635592m9522803L0429033
$$ 111012789 50038248 8860648 266226 -17819433 -75455025 -124977828 -94548795
4774i4548795R4560886N7746492l3988881o0554984N687995O8933046N3796003
$$ -94548795 12091 57758583 23769702 -36785282 -31097287 37835759 91631762
4767I1631762L495413m803388J8215734K908071n7664894r0311104n1741077R964713
$$ 91631762 95127175 90323787 108539521 111447592 53782698 -36528406 -88269483 -78304770
4759g8304770L2431593K4121927K7466897L7455430J8338611j8380899k1892504
$$ -78304770 -45873177 -21751250 5715647 43171077 61509688 43128789 21236285
4752B1236285R833715J8175512j9641445m6610764j5711412L3005237L6971864
$$ 21236285 31070000 49245512 29604067 -17006697 -32718109 287128 37258992
4745C7258992P683114l44019J4246967O517134k4992071k9717120O974141L4068369
$$ 37258992 44942106 44598087 58845054 65362188 40370117 10652997 17627138 51695507
4737E1695507J3741006k4516813l4392313j3127367J4634430L4357789L5851009
$$ 51695507 65436513 40919700 6527387 -6599980 8034450 42392239 78243248
4730G8243248N227143m7374427q0300772o8607367l5348300j1589960N507582
$$ 78243248 83470391 36095964 -44204808 -112812175 -148160475 -159750435 -154242853
4723a54242853K7444784L8790296K3552293K446262M092229J8379995J9380972
$$ -154242853 -126798069 -88007773 -64455480 -62009218 -57916989 -39536994 -20156022
4716b0156022J6335266L3434020N1058068K4755139l4760184o0472445k6858225
$$ -20156022 -3820756 29613264 80671332 105426471 70666287 10193842 -16664383
4709a6664383P258923j1599331m7296199l1266165K7847311N5916321K7070438
$$ -16664383 -9405460 -21004791 -68300990 -99567155 -71719844 -15803523 11266915
4702A1266915n22303J8994459M4525442J2338078o0439200r1393016m3776666
$$ 11266915 10744612 29739071 74264513 86602591 26163391 -65229625 -109006291
4695a09006291K8853529N9727454M7711777L3363334K8488796J0267435k5048440
$$ -109006291 -80152762 -20425308 27286469 60649803 89138599 99406034 74357594
4688G4357594m4887255k7379463M893824J7675533J1179300R136600J3811198
$$ 74357594 29470339 2090876 6984700 24660233 35839533 44976133 58787331
4681E8787331K128375l1642834n7852344m9690206j8620553O516272J8981085
$$ 58787331 60915706 29272872 -28579472 -78269678 -96890231 -90373959 -71392874
4674g1392874K9000717L1812242J2946870j5737954j8832547J3436710M6124790
$$ -71392874 -42392157 -10579915 2366955 -13370999 -32203546 -18766836 27357954
4667B7357954M3716099J1058902k1651740l0913575p021960L8502448N7975970
$$ 27357954 71074053 82132955 60481215 29567640 22545680 61048128 119024098
4660A19024098L195983r4478279j26907594m0907019P4465838R6650616L1052459
$$ 119024098 122220081 27741802 -99165792 -140072811 -65606973 31043643 62096102
4653F2096102j7354497j0254545j0433123m5556403n1654174M252341M7037022
$$ 62096102 44741605 34487060 24053937 -21502466 -73156640 -68904299 -21867277
4646b1867277J0235568m9340005l9344725K3134088M7517097J4421234j1474618
$$ -21867277 -11631709 -60971714 -100316439 -77182351 -29665254 -15244020 -26718638
4639b6718638J307000J2800693m122036k1365091j4894232l36871J0798250L1394388
$$ -26718638 -25411638 -12610945 -16732981 -38098072 -52992304 -53329175 -42530925 -11136537
4631a1136537N1891242K9921176l8814093q6199606n3115391K3844245N4406339
$$ -11136537 40754705 70675881 31861788 -54337818 -107453209 -83608964 -29202625
4624b9202625J2897648l0547804p280370N6717783P7366730L0189050j4140398
$$ -29202625 -16304977 -46852781 -54133151 2584632 79951362 110140412 96000014
4617I6000014O814381N0411627K9651705n0256599r0831459m4257116K0373585
$$ 96000014 102814395 153226022 182877727 132621128 41789669 -2467447 17906138
4610A7906138K7728211k145565j4837664j4197819k4266324j9743298K0529144
$$ 17906138 45634349 43488784 28651120 14453301 -9813023 -29556321 -9027177
4603i027177M0413531j4565229q0437452m7750968O3049530J14047920M5205763
$$ -9027177 31386354 16821125 -63616327 -111367295 -48317765 65730155 110935918
4596A10935918n2763051q4467049o4356767m5479174k7904135O278501L8446525
$$ 110935918 58172867 -26294182 -90650949 -136130123 -164034258 -157755757 -119309232
4589a19309232M8191935M7944459M2804941J2084121l3855941m0736589N415354
$$ -119309232 -71117297 -23172838 19632103 31716224 -2139717 -42876306 -37460952
4582c7460952M2989862K7315025l126004j139643J0035845j0433836m2276106
$$ -37460952 5528910 32843935 29717931 28578288 38614133 28180297 -14095809
4575a4095809m0259640q048562J9681538L1479946K7179477m910132m8543984
$$ -14095809 -54355449 -62404011 -42722473 -11242527 15936950 11026818 -37517166
4568c7517166m4961074K3572334Q0294690M9366431l2677331o8395138l1694194
$$ -37517166 -82478240 -58905906 21388784 70755215 38077884 -30317254 -62011448
4561f2011448J9072228L6225691K4686079M524668j0120144o828577N690801m292828
$$ -62011448 -42939220 -6713529 17972550 22497218 12377074 5548497 11239298 6946470
4553F946470l5663150l5553488J7264801O0125618L7999879p387389j5095546
$$ 6946470 -28716680 -64270168 -47005367 13120251 51120130 43732741 28637195
4546B8637195j3305694n2491505q2333089j9088569R1905446J16242487L1868205
$$ 28637195 15331501 -37160004 -119493093 -138581662 -46676216 69566271 101434476
4539A01434476m2862818l8955781j9838104l7354590l8965815J4637451N6762381
$$ 101434476 58571658 19615877 -222227 -37576817 -76542632 -61905181 -5142800
4532e142800K6518060k0180745n797321L7154265K9005705j8922856l2467937
$$ -5142800 21375260 1194515 -4602806 32551459 61557164 42634308 10166371
4525A0166371n782480k588355l8841857n5751308j6840075L9941306O1031556
$$ 10166371 4383891 1795536 -37046321 -92797629 -109637704 -69696398 -8664842
4518h664842L6104172j0633111m5199941l6558508J5219890O0505958M6058267
$$ -8664842 27439330 16806219 -28393722 -64952230 -49732340 10773618 56831885
4511E6831885j7889679o7316917n9704608j0131358M1951563O7881449N4731582
$$ 56831885 38942206 -28374711 -88079319 -98210677 -56259114 11622335 66353917
4504F6353917J0824685k9804042l6689340j8486847n499367k999147O757003K1062866
$$ 66353917 77178602 47374560 10685220 -7801627 -13300994 -16300141 -9543138 11519728
4496A1519728J4773384j2668354k6372060o897947J9398059J9242406m366229
$$ 11519728 26293112 13624758 -12747302 -19645249 -247190 18995216 14628987
4489A4628987k8024601m3466252n1474441l8553709O232762N5740487O1980119
$$ 14628987 -13395614 -56861866 -108336307 -146890016 -140657254 -84916767 -22936648
4482b2936648K0383448j3363371M617384L9706398K3303145m2450593p4816400
$$ -22936648 -2553200 -15916571 -11299187 28407211 51710356 9259763 -65556637
4475f5556637k4406699M8515785N4138537m659809m7874164l8101830j6328123
$$ -65556637 -89963336 -41447551 12690986 8031177 -39842987 -77944817 -94272940
4468i4272940j6174248j4497271Q637024K6108772J8502737J6601539M1581902
$$ -94272940 -110447188 -124944459 -116307435 -90198663 -71695926 -55094387 -13512485
4461a3512485N2198993R559415m4852029m1667219J2385330N0309361M6889739
$$ -13512485 38686508 48245923 3393894 -38273325 -25887995 24421366 71311105
4454G1311105L4906483K7763857l20138m9447165p6434592n9187157k3688926
$$ 71311105 106217588 133981445 133661307 84214142 7779550 -51407607 -75096533
4447g5096533O417086L2230198M0723031P080393m3870087m4769782J4322586
$$ -75096533 -68679447 -36449249 4273782 11354175 -32515912 -77285694 -62963108
4440f2963108N7254795L3192705o800109K882883L7842332L4389848j407682j3207811
$$ -62963108 -5708313 27484392 20684283 23567166 61409498 95799346 94391664 81183853
4432H1183853N295506P988619j8159621l7376188l1584627j8934313q398618M192545
$$ 81183853 86479359 94467978 76308357 38932169 7347542 -11586771 -19985389 -15792844
4424a5792844J266818k9883900m3044565J5645470R9939440R8024202k424274
$$ -15792844 -14526026 -44409926 -87454491 -71809021 28130419 126154621 123730347
4417A23730347p7795285m3015491K6418227J6623246n4140379p7523966k1550370
$$ 123730347 45935062 2919571 29337798 45961044 -8179335 -85703301 -107253671
4410a07253671M1087337N3008125L2507359J3476428K41959o334794J148462P375536
$$ -107253671 -66166334 -13158209 19349150 32825578 33067537 26732743 27881205 35256741
4402C5256741j3174874m3752417l5470474J7320687N9836396N1325859J2717879
$$ 35256741 22081867 -21670550 -57141024 -39820337 20016059 71341918 84059797
4395H4059797j7871637l4861196m7938273n1378680l5764528n396620L1259870
$$ 84059797 66188160 31326964 -16611309 -67989989 -103754517 -109151137 -77891267
4388g7891267O3668908O6726126K3438955l1238123l5143689J3839759M2935806
$$ -77891267 -14222359 52503767 75942722 44704599 9560910 23400669 66336475
4381F6336475N056391n2991279o2376087k9809372j1162187j7276116o423371
$$ 66336475 71392866 18401587 -43974500 -73783872 -84946059 -102222175 -108645546
4374a08645546L7838411P5487590O4847041J2485227m0557860n9148541l7355014
$$ -108645546 -70807135 4680455 69527496 82012723 41454863 -17693678 -55048692
4367e5048692P19993K2763741K0459321J1400332M336470j2281989l3640722k5961874
$$ -55048692 -54328699 -31564958 -11105637 294695 4631165 -7650824 -41291546 -67253420
4359f7253420J9873434N5941371L9638878k01124q309215J0281083O640105k4559274
$$ -67253420 -47379986 8561385 48200263 47999139 39689924 49971007 56611112 32051838
4351C2051838l8740078j8221193J1050296M2295646R4934139J43097602J14644193
$$ 32051838 -6688240 -24909433 -13859137 28436509 123370648 266468250 381112443
4344C81112443M25949j01752124j05113661m4695815j3419758l1081895m4252178
$$ 381112443 381538392 279786268 174672607 129976792 116557034 85475139 41222961
4337D1222961k7899937j2307425j4799292j3400841Q50394K340627j8969984l1987622
$$ 41222961 13323024 1015599 -13783693 -27184534 -26334140 -23993513 -42963497 -74951119
4329g4951119j4207946Q704530K411906k0914103j8295059K1618050N7564342
$$ -74951119 -89159065 -80454535 -78042629 -98956732 -117251791 -95633741 -38069399
4322c8069399M3388949j3027011m9763707j9728393M4205727N8414927l925407
$$ -38069399 5319550 -7707461 -57471168 -77199561 -32993834 25421093 21495686
4315B1495686o6825029m8336802K4269158N3412725J3914743j6813153J3052704
$$ 21495686 -45329343 -93666145 -69396987 -15984262 -2069519 -18882672 -5829968
4308e829968M8979279K5007101k4813086k2304081K6220671M0093511q314403
$$ -5829968 43149311 68156412 43343326 21039245 47259916 87353427 79039024
4301G9039024n6589422n2587980k0578980l303330M81571O453226M317196j1006965
$$ 79039024 22449602 -30138378 -50717358 -54020688 -53539117 -47085891 -42768695 -53775660
4293e3775660q186959L3154661P1935686N2273165j3184535n2883506k8416569
$$ -53775660 -61962619 -28807958 43127728 95400893 82216358 29332852 916283
4286I16283J9858553K7100407j8302862o0722318l7195922M6138925J05190404
$$ 916283 20774836 47875243 29572381 -31149937 -68345859 -22206934 82983470
4279H2983470O9126939k4592321o8979576k7828988K0188939L327174m2968255
$$ 82983470 152110409 127518088 58538512 30709524 50898463 54225637 11257382
4272A1257382m8450556j9198010l078424O095971L9132107O0436304J1443116
$$ 11257382 -37193174 -56391184 -59469608 -53373637 -14241530 46194774 57637890
4265E7637890o8094982p3689222J029719M6732250R158460l4649240j6101895
$$ 57637890 -10457092 -84146314 -83116595 -36384345 -27225885 -61875125 -77977020
4258g7977020J8218507P318364j5067106R19320J5550417k5699215p3145204l9878090
$$ -77977020 -59758513 -52440149 -67507255 -66587935 -51037518 -76736733 -149881937 -189760027
4250a89760027M9119102Q5008880L6642994j7671615j7676477J2939942L5154765
$$ -189760027 -140640925 -55632045 -18989051 -36660666 -54337143 -41397201 -6242436
4243f242436M3161949K9987731j6618082o4253516n4451198N337797L6780459
$$ -6242436 36919513 66907244 50289162 -13964354 -68415552 -63077755 -26297296
4236b6297296M989138k9775570j1457685K4944474J7900535j9450409k6648440
$$ -26297296 -21308158 -51083728 -62541413 -37596939 -19696404 -39146813 -65795253
4229f5795253K361686J0764902k7875305o3023727l7273888K9528502O2217691
$$ -65795253 -63433567 -52668665 -80543970 -143567697 -180841585 -151313083 -89095392
4222h9095392L0218033j2426354n899775L0304364L5998410J2849071J8386965
$$ -89095392 -58877359 -71303713 -77203488 -46899124 -10900714 1948357 20335322
4215B0335322N3954537M5492807k6332949o6348185p016589O8905327M9213176
$$ 20335322 74289859 119782666 93449717 27101532 20084943 88990270 138203446
4208A38203446k5177908k5589754M8894133O5575409k5721142j12731083r7659587
$$ 138203446 113025538 87435784 136329917 201905326 176184184 63453101 -34206486
4201c4206486k8535635P453150J3485142K9950212M0835331J7815797q730740
$$ -34206486 -62742121 -55288971 -41803829 -11853617 28981714 46797511 38066771
4194C8066771k680257Q596017q835741k2606188N858696L7073568J1024316m8890162
$$ 38066771 35386514 43982531 35146790 12540602 18399298 55472866 66497182 17607020
4186A7607020p1119386m6586440k4914287k2576592j3260645M988700Q760139
$$ 17607020 -53512366 -100098806 -125013093 -147589685 -160850330 -155861630 -147101491
4179a47101491O895980K7595432N2949110L6596077j2383243l1241644J808606
$$ -147101491 -140205511 -112610079 -59660969 -23064892 -35448135 -66689779 -64881173
4172f4881173L5792181K4935233j1991163k7571031m276488L4261425M5800506
$$ -64881173 -29088992 -4153759 -16144922 -43715953 -47992441 -13731016 32069490
4165C2069490P354005m6674012m6229205K1128729P2333909L5392143m1977766
$$ 32069490 39423495 -7250517 -53479722 -32350993 39982916 75375059 33397293
4158C3397293o1107865k0402634m219414l5689222m4291582M028313M5535043
$$ 33397293 -27710572 -48113206 -52332620 -88021842 -132313424 -128285111 -82750068
4151h2750068K7702404o650184J801808L4749103M0034952J6186100n226459j9625246
$$ -82750068 -55047664 -61697848 -59896040 -25146937 14888015 31074115 25847656 6222410
4143F222410l6186671l8940167j4329890R789286K014011j9014431j4627643J1597813
$$ 6222410 -29964261 -68904428 -83234318 -73445032 -71431021 -90445452 -105073095 -93475282
4135i3475282K5981844K0384611J2782196Q785943L728408P035518K3409039K6270611
$$ -93475282 -67493438 -47108827 -34326631 -25540688 -21812280 -14776762 8632277 34902888
4127C4902888n422545l8276770k2242154K9792439N1981882J7022578l1994441
$$ 34902888 29480343 -8796427 -31038581 -1246142 50735740 67758318 35763877
4120C5763877m9679749l9761174k1717744O986288M4843845N8304060K0097807
$$ 35763877 -13915872 -53677046 -75394790 -68408502 -23564657 34739403 54837210
4113E4837210m0952327o4992005l2439334J7687355M0778890L2141576J3403262
$$ 54837210 13884883 -51107122 -83546456 -65859101 -25080211 7061365 20464627
4106B0464627j773319j0740192o412509J5871392L8379089L3079648J325599k1411922
$$ 20464627 18691308 7951116 1538607 17409999 55789088 88868736 90194335 68782413
4098F8782413j4521259k733946j4503138l2926273k5464148o856427k0671880
$$ 68782413 54261154 51527208 37024070 4097797 -21366351 -28222778 -48894658
4091d8894658n7303524m9833051K4855158R5493193Q8519876K7801307j0009057
$$ -48894658 -106198182 -156031233 -131176075 -35682882 52836994 80638301 70629244
4084G0629244p096773p577308k6516405k9343485q170272p265382m4085395o4820628
$$ 70629244 63532471 55955163 29438758 95273 -8074999 -15340381 -59425776 -124246404
4076a24246404k3033792M1198320N4240323J4537648j1438867J1174524M6471592
$$ -124246404 -147280196 -106081876 -51841553 -37303905 -48742772 -37568248 8903344
4069H903344N4170506M2729817L4308482J9773398j5890304n0602192m8715761
$$ 8903344 63073850 105803667 140112149 159885547 143995243 93393051 44677290
4062D4677290j6844113K024571j0016599k4963131j6931713J296157O216868J906724
$$ 44677290 27833177 29857748 19841149 -5121982 -22053695 -20757538 -14540670 -12633946
4054a2633946P329589K2597487L1968675K9992961K2682559J1053566m662155
$$ -12633946 -5304357 17293130 49261805 79254766 101937325 112990891 108328736
4047A08328736j1950025r63783J3019350P907566q246086q469227M573251l487625
$$ 108328736 96378711 95414928 108434278 116341844 108095758 99626531 104199782 100712157
4039A00712157m1092324o5083556l5507747K7582291O7349784N5188514J0323036
$$ 100712157 59619833 -5463723 -40971470 -13389179 53960605 109149119 119472155
4032A19472155l2608470n1780745m1535387j1157500J8267700K9567615K2595459
$$ 119472155 86863685 35082940 -6452447 -17609947 657753 30225368 52820827
4025E2820827N933345j5904859l7425411m4830702k8374027K681350K8051440
$$ 52820827 58754172 42849313 5423902 -39406800 -67780827 -65099477 -37048037
4018c7048037L4965899K2787782j317171k3361140k8821771j5638781O945456
$$ -37048037 -2082138 20705644 19388473 -3972667 -32794438 -48433219 -41487763
4011d1487763L2744127N5870984N5915870J5117890m2848288o5320875l7095112
$$ -41487763 -8743636 47127348 103043218 118161108 75312820 9991945 -27103167
4004b7103167K77163J3626208J9812934L3819141K5475441k2591017n8235524
$$ -27103167 -26826004 -13199796 6613138 40432279 65907720 43316703 -14918821
3997a4918821k8040237K8127363K7175857k9010265n7440807k3589377J8045642
$$ -14918821 -42959058 -14831695 12344162 -16666103 -74106910 -97696287 -79650645
3990g9650645K4723599K1091307K7750284J7691415j5246866k2316558J3138654
$$ -79650645 -54927046 -33835739 -6085455 11605960 -3640906 -25957464 -12818810
3983a2818810K6805181k3219392o9112485l0510090N0537160O5106715O40982
$$ -12818810 13986371 -9233021 -78345506 -108855596 -58318436 6788279 7429261
3976G429261m8133832k7785518P069165l869759l5370779k8130200J9308178N4201008
$$ 7429261 -40704571 -68490089 -61420924 -65290683 -100661462 -128791662 -109483484 -55282476
3968e5282476M2069643L391013j6204951K099054K9706494K6311010m868659k0393814
$$ -55282476 -13212833 -9821820 -26026771 -23927717 5778777 32089787 27221128 6827314
3960F827314l380417R318426j0050044l2093688k3471534n722729r286638j0003546
$$ 6827314 3446897 12765323 2715279 -29378409 -52849943 -58572672 -67859310 -77862856
3952g7862856K2829362N2208026K7471571j6177325n346798M1694528L7676667
$$ -77862856 -55033494 -2825468 24646103 8468778 3121980 44816508 82493175
3945H2493175k3153034n0741671j2275874J7805021k918065j3183599K7070108
$$ 82493175 59340141 8598470 -3677404 14127617 11209552 -1974047 25096061
3938B5096061N2458473J0404854l6550505j8463581J9628984N354729k7854032
$$ 25096061 77554534 87959388 51408883 32945302 52574286 57929015 30074983
3931C0074983r521256K9019343R622560m3532916l9934237J8513464M4370574
$$ 30074983 20553727 49573070 59195630 15662714 -24271523 -5758059 38612515
3924C8612515J7833175L947886J7799336L977341l6043103k8867167K8615891
$$ 38612515 56445690 60393576 78192912 82170253 46127150 17259983 45875874
3917D5875874M2705901j5581059n0153555l946376M0164143O271998m0230549
$$ 45875874 88581775 73000716 22847161 18900785 59064928 65336926 25106377
3910B5106377j0670560M9332445M1997415j3877957k6051805P197895R007652
$$ 25106377 14435817 63768262 105765677 91887720 65835915 73033810 82041462
3903H2041462k7059340l3392869o687005j6643265o2858855n5339882K4087231
$$ 82041462 54982122 21589253 14902248 -1741017 -64599872 -119939754 -95852523
3896i5852523O7071055R396012n6293854k6787747M5667967M4381010k0350837
$$ -95852523 -28781468 -19385456 -75679310 -102467057 -56799090 -12418080 -32768917
3889c2768917l8813797R448405L0119989j3168278l1698545L1999570R2135965
$$ -32768917 -71582714 -62134309 -32014320 -45182598 -76881143 -44881573 47254392
3882D7254392M9921221m2463654n5844054J7290772N3607808j0867912r0642281
$$ 47254392 97175613 54711959 -1132095 16158677 69766485 58898573 -31743708
3875c1743708q6994111k2707751K1797451L7593283O8681655J02980119P6734494
$$ -31743708 -118737819 -141445570 -119648119 -82054836 -13373181 89606938 166341432
3868A66341432j1941474p7672395o2998835j5072834p016816l0719794k2193637
$$ 166341432 154399958 76727563 13728728 -1344106 -8360922 -39080716 -61274353
3861f1274353L0614015O5983306M1228048j699149M556290N2650354O4588113
$$ -61274353 -30660338 35322968 76551016 74851867 79408157 132058511 196646624
3854A96646624J484548p3793353p8334809k5125372m19857l0728158m4937697
$$ 196646624 198131172 124337819 46003010 20877638 20457781 -10270377 -55208074
3847e5208074L622585N1785241K6517439k8127113j5995132M9636267N8761611
$$ -55208074 -51585489 199752 26717191 -1409922 -17405054 32231213 90992824
3840I0992824j6385030o7913674k0331130M8154274K7295844n5600822q2494334
$$ 90992824 74607794 6694120 -13637010 34517264 61813108 6212286 -76282048
3833g6282048k1838593L9811117L7358219Q391444J2907481M1606898M4351868
$$ -76282048 -98120641 -58309524 -20951305 -12559861 347620 41954518 86306386
3826H6306386Q404158l2933501n0681199m6269107l2664837j3259837J3979962
$$ 86306386 94710544 61777043 11095844 -35173263 -67838100 -81097937 -67117975
3819f7117975L9845360M1734027Q782301l0300064k5085684L2085527P5855634
$$ -67117975 -27272615 14461412 23243713 -7056351 -32142035 -56508 75799126
3812G5799126L6346229o3028702j16674185o5183742K3385650M0510535j6484902
$$ 75799126 112145355 49116653 -67557532 -132741274 -109355624 -68845089 -85329991
3805h5329991m4435881J3086825Q0952149O5132471n054609k6708282J1037890
$$ -85329991 -129765872 -116679047 -35726898 29405573 24350964 -2357318 8680572
3798H680572J3954754n0695543q4793638j6816046O7457169M9943048l1619513
$$ 8680572 22635326 -28060217 -112853855 -129669901 -62212732 -12269684 -43889197
3791d3889197m2722971L5424277Q7761698N9502793K8468642M6674358M3701491
$$ -43889197 -86612168 -51187891 36573807 96076600 124545242 171219600 214921091
3784B14921091l6081946j10348525p6928340J9056114M8491922j1963094o1090842
$$ 214921091 178839145 68490620 -8437720 10618394 59110316 47147222 -13943620
3777a3943620l0043717L7398720O7491959M3542081l564058l5056913k4067317
$$ -13943620 -43987337 -6588617 60903342 104445423 100881365 65824452 41757135
3770D1757135J9115232L9690372k37726n7836237n7447355Q64082L8889872J4065169
$$ 41757135 60872367 100562739 100325013 42488776 -14958579 -14094497 24795375 38860544
3762C8860544k4817221j9511404J3096243J7756346j2087400k9381144m537602
$$ 38860544 14043323 -5468081 7628162 25384508 13297108 -16084036 -20621638
3755b0621638L6311013M9658889K6863646n927790k7405265l8998757m0833225
$$ -20621638 15689375 65348264 92211910 86284120 58878855 19880098 -20953127
3748b0953127j5941611L8214526Q0167958O3472559J824130m3807306m6192542
$$ -20953127 -36894738 1319788 81487746 144960305 146784435 102977129 56784587
3741E6784587l7722902m6843607n6502075m5012478k1645284L312712L7874841
$$ 56784587 19061685 -27781922 -84283997 -129296475 -150941759 -147629047 -109754206
3734a09754206O9969479N9652852N062072l4639593k4522785r422132l2473420
$$ -109754206 -39784727 19868125 24930197 -9709396 -34232181 -43654313 -76127733
3727g6127733n2713539j2946951N4996168P4032309M1806347K2271260L2080936
$$ -76127733 -128841272 -141788223 -86792055 -12759746 29046601 51317861 83398797
3720H3398797K0837724l2439649p9802551p7419631l9588337m197046J1030607
$$ 83398797 104236521 71796872 -8005679 -85425310 -125013647 -129210693 -118180086
3713a18180086R094044O294905K2588766M9188500M4310251k610937l5177217
$$ -118180086 -109086042 -102791137 -80202371 -31013871 13296380 10685443 -24491774
3706b4491774r858812K6602022Q407672l7392909l7045518j96525o83724l8283007
$$ -24491774 -34350586 -7748564 659108 -36733801 -73779319 -73975844 -74659568 -112942575
3698a12942575l2852358L1675163O9403636L0637383k3705479k9472685r130906
$$ -112942575 -145794933 -114119770 -44716134 -14078751 -37784230 -67256915 -76387821
3691g6387821k508535Q437931M3823549O4668105L3966874j4007218k6675247
$$ -76387821 -78896356 -70458425 -26634876 38033229 72000103 57992885 31317638
3684C1317638j2281057j0973197k4694265k7961697j8257951r869095j369574
$$ 31317638 19036581 8063384 -16630881 -44592578 -62850529 -72719624 -74089198
3677g4089198J4794244L1340059L8339390L2794720O436931l9785109o5345146
$$ -74089198 -59294954 -27954895 10384495 43179215 49616146 9831037 -55514109
3670e5514109k6922443M5423367P0352194K8102372j5924181j7620927o905685
$$ -55514109 -82436552 -37013185 33339009 61441381 45517200 27896273 20990588
3663B0990588r030811k95479J8827205j975758o1277919p0759099Q120823P9859927
$$ 20990588 11959777 11664298 30491503 28515745 -32762174 -103521273 -95400450 -15540523
3655a5540523N1988154k3493534m2083289p559459R253227J0697952M5182792
$$ -15540523 36447631 12954097 -29129192 -36688651 -27435424 -16737472 28445320
3648B8445320Q0329026L7444745o0473893j02736761n7922734r529104j0282184
$$ 28445320 108774346 146219091 85745198 -16991563 -74914297 -84443401 -94725585
3641i4725585j4949731J2156307L0119013Q641097q470394J6846979M5953806
$$ -94725585 -109675316 -97519009 -67399996 -58758899 -67229293 -50382314 -4428508
3634d428508L0313679p901350j8734886l725693J728110o933201n380896J3354125
$$ -4428508 25885171 17983821 -751065 -4476758 -2748648 -9681849 -15062745 -1708620
3626a708620L2808540L8481468K3981564r318046l9033818l3092739M609202K7205043
$$ -1708620 31099920 69581388 93562952 84244906 45211088 12118349 16727551 43932594
3618D3932594P456574k1366745j6883702P837193J0523854q364159p245684K4809192
$$ 43932594 51389168 30022423 13138721 20975914 31499768 23135609 15889925 40699117
3610D0699117M3624320J3604145l7496797n4252302k6290737L723540O04143k1963272
$$ 40699117 84323437 97927582 60430785 6178483 -20112254 -16388714 -15784571 -37747843
3602c7747843k7771695n282156K5042921L8299545K7356778N344949o278489j483360
$$ -37747843 -65519538 -70801694 -45758773 -7459228 19897550 25242499 18964010 17480650
3594A7480650k785939l0379699n7431824l4134471L0350913O1272928K7078909
$$ 17480650 14694711 -15684988 -73116812 -107251283 -76900370 -15627442 11451467
3587A1451467l655743K6637300N5312861n315332j04322012j04851831O136455
$$ 11451467 7795724 34433024 89745885 84430553 -19891459 -124743290 -118606835
3580a18606835Q9657609O0122321p454713k3232139j2327735k5316249k9955247
$$ -118606835 -28949226 31173095 23718382 486243 -11841492 -37157741 -67112988
3573f7112988J2203934N0406389K8838600o959910P776691L4283065R52774n9792694
$$ -67112988 -54909054 -4502665 24335935 17376025 25152716 59435781 60388555 595861
3565E95861o4310134k2845763q292089j4566633K2600678Q3400402P9176491R559002
$$ 595861 -63714273 -86560036 -94852125 -109418758 -86818080 -3417678 75758813 85317815
3557H5317815k8514743k464226J3975646j5066813k9673347r37304P750296l5289896
$$ 85317815 56803072 54338846 68314492 53247679 23574332 22637028 30387324 -4902572
3549d902572n6725823k708186N8774924M4102074j3694626k7600909N416989J8823794
$$ -4902572 -61628395 -64336581 -5561657 38540417 24845791 -2755118 2661871 21485665
3541B1485665p163807k7709841j6177796L972339O263420r825511l3416152m8231100
$$ 21485665 14321858 -13387983 -29565779 -25593440 -19330020 -29155531 -62571683 -110802783
3533a10802783l1422254K0019283O7315625O3738567J0930171l7378825l1506754
$$ -110802783 -142225037 -122205754 -54890129 8848438 19778609 -17600216 -49106970
3526d9106970J9662574N3085069K0592123m3858608n4350114J0827658O4590040
$$ -49106970 -29444396 23640673 44232796 374188 -53975926 -43148268 21441772
3519B1441772K6605319n7695180q1116162k6218602L1732975N3336927O5480695
$$ 21441772 48047091 -9648089 -90764251 -116982853 -85249878 -31912951 33567744
3512C3567744O5711375J1026572p3014171q6799240r806681M5810062K90648p1650824
$$ 33567744 99279119 110305691 37291520 -49507720 -59314401 -13504339 -13213691 -84864515
3504h4864515o5193554n747470J4864817l354541J2899009O9054527Q9725852
$$ -84864515 -150058069 -155805539 -140940722 -144295263 -131396254 -62341727 27384125
3497B7384125L9833556l0078779o1924050m4557834O188293N8163307O0490810
$$ 27384125 67217681 37138902 -24785148 -69342982 -63154689 -4991382 55499428
3490E5499428m686167p2926237o5143933j743404K0533458k8814626o8964951
$$ 55499428 50813261 -22112976 -87256909 -89000313 -68466855 -97281481 -166246432
3483a66246432k9148329N1627940Q7614687O0890260K3030603Q823521j0111k5636012
$$ -166246432 -195394761 -143766821 -56152134 4738126 27768729 36592250 36582139 10946127
3475A0946127m9294910l7000726O036145L3926196J9910945n153712K355154L1117458
$$ 10946127 -38348783 -75349509 -69313364 -35387168 -15476223 -20629935 -18274781 12842677
3467A2842677L0989565m796126k2507806Q664066M3734733K8831428j6502208
$$ 12842677 43832242 39036116 16528310 25192376 68927109 97758537 81256329
3460H1256329l2061622r643333J77287k9609899o0796532m4429095J2016070N0332192
$$ 81256329 49194707 39551374 39728661 10118762 -50677770 -95106865 -83090795 -32758603
3452c2758603K7440698l1995760n5378694n788439O2653786O3904439m524169
$$ -32758603 -5317905 -37313665 -92692359 -98480798 -35827012 28077427 23553258
3445B3553258n1247564j6395751M3408130L9396354k0900064n2253540j9330355
$$ 23553258 -27694306 -44090057 -681927 38714427 17814363 -34439177 -53769532
3438e3769532K3345340K4208305N097674J2308608M1145494M7362011J5104754
$$ -53769532 -30424192 -6215887 -1118213 11190395 52335889 99697900 114802654
3431A14802654k0277124j8468004J5257126L4819823O515975m9237910p7753080
$$ 114802654 94525530 76057526 91314652 126134475 132650450 83412540 5659460
3424E659460n1631554M80628L2942539L5488181L0924650L1116833J9191573j8857276
$$ 5659460 -45972094 -45491466 -12548927 22939254 53863904 84980737 104172310 85315034
3416H5315034o1187555o4686832j4246939N1584453P3809985L2213227l5785166
$$ 85315034 24127479 -40559353 -54806292 -3221839 70588146 102801373 67016207
3409F7016207p5323106o3584165k0735390J2525914P443760k3330648k9520969
$$ 67016207 -8306899 -71891064 -92626454 -80100540 -72656780 -95987428 -125508397
3402a25508397J6172906O4842672M3812825l3559412p3130329l5244720J1333536
$$ -125508397 -109335491 -44492819 -679994 -34239406 -107369735 -142614455 -131280919
3395a31280919J1454208J0860795N0157702O4126376k927630o0661829L471354
$$ -131280919 -119826711 -108965916 -58808214 5318162 2390532 -58271297 -54799943
3388e4799943J16768981J07109774k4238896r9485998m6759287O795447k6425706
$$ -54799943 61969038 169078812 144839916 45353918 -1405369 5390078 -21035628
3381b1035628n6375087n548407M2557519Q831871k4550137L0319223Q7852321
$$ -21035628 -77410715 -82959122 -40401603 -31569732 -56119869 -25800646 62051675
3374F2051675L1322635p1337514p1963747J4362355N0964225J2049683q371006
$$ 62051675 93374310 22036796 -49926951 -35564596 15399629 27449312 19078306
3367A9078306R461356r311384o1740083m8430533M5872976J05683158O1893915
$$ 19078306 28539662 19228278 -42511805 -90942338 -45069362 60613796 122507711
3360A22507711j1787482k6426950M907009K3451559J0751341k0311832n0668927
$$ 122507711 110720229 84293279 89200288 112651847 123403188 103091356 52422429
3353E2422429n0977827j5490850L929722k9016797n1210761J0985587R4572513
$$ 52422429 1444602 -14046248 -10116526 -39133323 -90344084 -79358497 15214016
3346A5214016P1795301l8668257q2971194j4090097L7467903j2595439o5407257
$$ 15214016 87009317 48341060 -34630134 -48720231 -11252328 -23847767 -89255024
3339h9255024j5206496P2385949P4384316L565250l5025446j4978371N59925j8854996
$$ -89255024 -104461520 -32075571 42308745 45873995 10848549 -4129822 -3569897 -22424893
3331b2424893l8577520l1134094m198167L0537584N9374918N5336179J2021967
$$ -22424893 -61002413 -92136507 -96334674 -65797090 -6422172 48914007 60935974
3324F0935974l2056267m1672687l1850701l2900167l8683619k3328440J7365795
$$ 60935974 28879707 -12792980 -44643681 -77543848 -116227467 -139555907 -122190112
3317a22190112O6176504R8093313Q2482031J3544115n3204991n0242238M795473
$$ -122190112 -56013608 42079705 124561736 138105851 84900860 34658622 39454095
3310C9454095K5684083j4773831m9727895l2744974k256093K469410K176526J1093605
$$ 39454095 65138178 50364347 636452 -32108522 -34364615 -31895205 -29718679 -18625074
3302a8625074j379150l2056025k0147842L8812789N4601710r114238n3012048
$$ -18625074 -20004224 -52060249 -72208091 -33395302 21206408 12092170 -40919878
3295d0919878l526284M9180671j666124q5420789n8441996N8048937J08404766
$$ -40919878 -44446162 4734509 3068385 -82352404 -140794400 -82745463 25659303
3288B5659303M3989532k7948541l7216101l5430137o0018073n8486578l607706
$$ 25659303 69648835 41700294 4484193 -30945944 -90964017 -149450595 -153058301
3281a53058301L5616694P359758l1417465q744567M7343991N8554522J2656495
$$ -153058301 -117441607 -110081849 -141499314 -150243881 -102899890 -44345368 -31688873
3274c1688873l3051263l4991066k677361K5257052J5220871l0591004o3123912
$$ -31688873 -64740136 -99731202 -102408563 -77151511 -61930640 -92521644 -155645556
3267a55645556l5372991K9988353O2592199M2448489K3186401L8100671M3236894
$$ -155645556 -191018547 -161030194 -98437995 -55989506 -32803105 5297566 48534460
3260D8534460n031330o6210808o7042636q819482L5282415K2271678j3084716
$$ 48534460 43503130 -22707678 -89750314 -98569796 -63287381 -41015703 -54100419
3253e4100419j9462345N098971K7651565L0064938J6728598q890192m0466977
$$ -54100419 -73562764 -68463793 -40812228 -10747290 5981308 -2908884 -43375861
3246d3375861m7282430j62480O7155095P0291161j3548341q7962752n4265482
$$ -43375861 -90658291 -90820771 -23665676 46625485 33077144 -54885608 -109151090
3239a09151090M4132992P8602275K5166072q378830L4443442O5763939O650295
$$ -109151090 -65018098 13584177 38750249 30371419 64814861 130578800 137229095
3232A37229095p1942387o0427766J3795400L8341704l331424k5304453M722179
$$ 137229095 65286708 4858942 18654342 56996046 53664622 28360169 33082348
3225C3082348K1308358j7223306o3460261o1361014j6471258L4357672O2673001
$$ 33082348 54390706 37167400 -26292861 -87653875 -104125133 -69767461 -7094460
3218g094460M9254334K606509k4366610N498364M8134502L8452592n043715j7981326
$$ -7094460 42159874 44766383 20399773 25898137 74032639 112485231 107441516 89460190
3210H9460190r132658l7020895q0241352n5952394K2694030M2499287k1948377
$$ 89460190 80327532 43306637 -36934715 -92887109 -70193079 -27693792 -49642169
3203d9642169n3114351J6579636Q8035347N7700669j9332376l3198719R163384
$$ -49642169 -102756520 -86176884 1858463 59559132 40226756 7028037 16191421
3196A6191421L0366900K3235199K5913320J8058411l4778220p9383564m2917495
$$ 16191421 46558321 69793520 95706840 113765251 78987031 -396533 -43314028
3189d3314028K9560275L2223764k6822782l9054643J9406287N1208253P761408
$$ -43314028 -13753753 18470011 -8352771 -47407414 -28001127 23207126 30968534
3182C0968534l3265755o769650L5984020K5816082j3647682k5094831j4858291
$$ 30968534 -2297221 -9066871 26917149 52733231 39085549 13990718 -867573
3175h67573j7093414j7942582Q317119L0063602K866089m3762201m0175705J4353217
$$ -867573 -17960987 -35903569 -27586450 2477152 5343241 -38418960 -78594665 -64241448
3167f4241448M8020947K4904431q324497k162063K3676633K0144385j5178196
$$ -64241448 -16220501 8683930 359433 -1802630 21874003 42018388 26840192
3160B6840192m0011984k9622015l166538J1455425J3028465J7790875L0614884
$$ 26840192 -13171792 -42793807 -45960345 -34504920 -21476455 -3685580 26929304
3153B6929304L9748646L4717154J6175470j0931003l9345254n0888359k3848299
$$ 26929304 66677950 101395104 117570574 106639571 67294317 16405958 -7442341
3146g442341L5290101P8582569N8209588j5948309p7619603p1371918r070245
$$ -7442341 27847760 106430329 164639917 148691608 71072005 -299913 -9370158
3139i370158M7288961N1217638J2291504k4328295k8648302j1200836q80284o691787
$$ -9370158 37918803 89136441 101427945 77099650 48451348 37250512 36370228 29678441
3131B9678441j0107505O611811L5499880N0341061L2002424j5499659o5017781
$$ 29678441 19570936 26182747 61682627 112023688 144026112 128526453 63508672
3124F3508672q0759727m6556052J3273249N2780763N0985597K7910881R727893
$$ 63508672 -17251055 -63807107 -50533858 2246905 53232502 81143383 90871276
3117I0871276k224809j5255933k0184152o586799R734402J689879k9764946n3115738
$$ 90871276 88646467 73390534 53206382 46619583 56353985 58043864 28278918 -24836820
3109b4836820m3164159m947837L5331140M8520146K0268871k9330248n1522326
$$ -24836820 -68000979 -72948816 -37617676 10902470 31171341 1841093 -49681233
3102d9681233j8468068L7311310N8414593L4171358P416155R302466K1991425
$$ -49681233 -68149301 -30837991 27576602 61747960 69164115 78466581 100458006
3095A00458006J7238825n82840j0844022j1908526j5989131k4247004k8985907
$$ 100458006 117696831 117113991 106269969 94361443 78372312 54125308 25139401
3088B5139401k9414206k5595943q042738K3873891M1258041J2052931m7803248
$$ 25139401 -4274805 -29870748 -37913486 -14039595 27218446 39271377 -8531871
3081h531871p5679683l2544901M0815930O1048360m04146p6220058p7435140l26915
$$ -8531871 -84211554 -116756455 -75940525 -14892165 -15296311 -91516369 -168951509 -169278424
3073a69278424O8353113N9630017M283611j9421319N959936K6400520O706041
$$ -169278424 -100925311 -41295294 -37011683 -56433002 -50473066 -24072546 -17366505
3066a7366505k2112640k1325143k508992M394719M174837J7082692L2126721K4886819
$$ -17366505 -39479145 -60804288 -63313280 -58918561 -54743724 -37661032 -5534311 19352508
3058A9352508P023596J0501091K7711158J6775170k6976033n2994746k8448377
$$ 19352508 26376104 36877195 64588353 81363523 54387490 1392744 -27055633
3051b7055633J1693334J6636749q824143k0265099k737928J3652210L438739k1279058
$$ -27055633 -15362299 1274450 -7549693 -27814792 -30552720 -16900510 -13461771 -34740829
3043c4740829l4498279k9823732j7898656m232945J4241395L2997910L6534068
$$ -34740829 -69239108 -99062840 -116961496 -121194441 -106953046 -73955136 -37421068
3036c7421068K1619438J3209698L4616966O2141616M3302256k1497818n4524317
$$ -37421068 -15801630 -2591932 32025034 94166650 137468906 115971088 61446771
3029F1446771k068240P0268279N2682228m7019735j01719569m6348605K8629540
$$ 61446771 59378531 129646810 182329038 135309303 33589734 -12758871 15870669
3022A5870669J9736440l5123572l2892506K2187235L5632434r575685k3578649
$$ 15870669 35607109 483537 -32408969 -10221734 25410700 15835015 -7743634
3015g743634L5039601Q5162593N0773772k6799126o4657936n4465593l4639514
$$ -7743634 27295967 112458560 163232332 136433206 71775270 17309677 -17329837
3008a7329837o796568L9192728N9342463O398389o9727814o3077398L6821043
$$ -17329837 -24126405 15066323 74408786 80807175 11079361 -51998037 -15176994
3001a5176994J13012321P0183877m4137860j07609134p2362006j565218K5048490
$$ -15176994 97835327 168019204 123881344 16272210 -56089796 -57655014 -32606524
2994c2606524M16849k0725225J203447M2285777M7917162N719815l4962744k7683736
$$ -32606524 -32189675 -52914900 -51711453 -9425676 38491486 44211301 9248557 -18435179
2986a8435179P693468J4031273j9714891l9643440p50527O7845167R2754952M2025191
$$ -18435179 -10741711 3289562 -16425329 -56068769 -56819296 11025871 103780823 145806014
2978A45806014l6820634o8542891l3304198J2497108O232353l9955129n2867142
$$ 145806014 108985380 40442489 7138291 19635399 25867752 -14087377 -66954519
2971f6954519K513715O9016360O7557258J81403n2804494l3853932K7877015O2139291
$$ -66954519 -64440804 4575556 72132814 72314217 19509723 -14344209 13532806 75672097
2963G5672097M0922392k434027k5344777k3898619k0042802j6606827N614254
$$ 75672097 116594489 114160462 88815685 64917066 44874264 28267437 33881691
2956C3881691L8453998L0934382l9790116j07873147q6601772R776306P7099287
$$ 33881691 72335689 103270071 63479955 -44393192 -130994964 -121218658 -44119371
2949d4119371O1887125J8746395M832788j695958l0493306m5144785j2092607
$$ -44119371 17767754 36514149 41346937 39650979 9157673 -35987112 -48079719
2942d8079719K1047057J019996k8691958M274088P0073125P6778711J7315273
$$ -48079719 -27032662 -26012666 -54704624 -50430536 19642589 96421300 113736573
2935A13736573k9859061l2941907k9695211k4399443J8031852O5374622L3047807
$$ 113736573 83877512 50935605 21240394 -3159049 14872803 80247425 113295232
2928A13295232o2658917r2859732j0144134O6630221L4171366m0566245m1275783
$$ 113295232 50636315 -42223417 -52367551 14262670 48434036 7867791 -33407992
2921c3407992J6693955L7349274Q103835l740751K0833891L5063113J7132503
$$ -33407992 -16714037 20635237 28739072 24998321 45832212 80895325 98027828
2914I8027828j1052215l9470974o6544584o0912234m392374M7757775L0305906
$$ 98027828 86975613 47504639 -19039945 -79952179 -84344553 -36586778 -6280872
2907f280872k5566792l3559579J1703788K9779942j2794261n4412944m1533301
$$ -6280872 -31847664 -65407243 -53703455 -23923513 -36717774 -91130718 -132664019
2900a32664019q46116K0865935K4361085L1505424L9911183L5952483K0068054
$$ -132664019 -133510135 -112644200 -88283115 -56777691 -16866508 19085975 39154029
2893C9154029j186936k1254867k4289008p39749K5377979J9767623j0053570k2420836
$$ 39154029 37967093 16712226 -7576782 -8316531 17061448 36829071 26775501 4354665
2885D354665k297363K2896540K9034461J9552451L495097j4194726k0948554r399975
$$ 4354665 2057302 24953842 53988303 73540754 77035851 62841125 41892571 32492596
2877C2492596K916893j37611j313106J6229746K4880085m230260l5492680j4919806
$$ 32492596 35409489 35271878 33958772 50188518 75068603 70838343 35345663 20425857
2869B0425857L1404229K6123340l1318041n4372265p430963L4404579M966869
$$ 20425857 51830086 77953426 46635385 -7736880 -15167843 19236736 24203605
2862B4203605n1246415n4501638p549484K6918557K6829323K3432094L2564986
$$ 24203605 -27042810 -81544448 -89093932 -62175375 -35346052 -11913958 20651028
2855B0651028L1006912K183459l2896071l9930483j1847925J9506170J4699781
$$ 20651028 51657940 53841399 20945328 -18985155 -30833080 -11326910 3372871
2848C372871k4383621n0479985l2816022l32589Q275654Q111882L0310617M9337457
$$ 3372871 -21010750 -71490735 -104306757 -104639346 -96363692 -88251810 -57941193 -8603736
2840h603736K1014697k4444739j6632810L0541346L0146877k6663088m2938719
$$ -8603736 12410961 -12033778 -28666588 1874758 32021635 5358547 -37580172
2833c7580172J9995656O4915196J5444169n2472228l1586808M4658280O1419207
$$ -37580172 -17584516 47330680 62774849 10302621 -21284187 23374093 84793300
2826H4793300p5272n5998459n8646976l5156594n476376L5896862O0783181K6661340
$$ 84793300 84718028 28719569 -29927407 -65084001 -70560377 -34663515 26119666 52781006
2818E2781006l7291462n1159960n057914K4230041j250381k0978958J8369898
$$ 52781006 15489544 -35670416 -40728330 -16498289 -17748670 -38727628 -20357730
2811b0357730O7907550M6563809l4876757q2538082m3521452K8180740M5401827
$$ -20357730 47549820 94113629 59236872 -23301210 -66822662 -38641922 6759905
2804F759905k77141l2923477m19960N0440500M3643297r505479k9983292k076411
$$ 6759905 6482764 -26440713 -26860673 23579827 67223124 57717645 27734353 25657942
2796B5657942J229030n0638985q1660286l3061906L3898807L9183572J3612524
$$ 25657942 26886972 -23752013 -105412299 -138474205 -104575398 -65391826 -51779302
2789e1779302K8992977O1553116M0971666j0599486j6089095J0771036n607560
$$ -51779302 -22786325 38766791 79738457 69138971 53049876 63820912 58213352
2782E8213352m5711854j9237120N0786293L6539829o6248042r4270511K1821227
$$ 58213352 12501498 -6735622 44050671 80590500 14342458 -79928053 -58106826
2775e8106826J20099325N2045635p9309564q3211524K2246702N9873620j5969557
$$ -58106826 61992499 114038134 34728570 -48482954 -26236252 33637368 17667811
2768A7667811o8422621j6700446M8713420L4551316j1920462j857760N0733400
$$ 17667811 -50754810 -67455256 -18741836 15809480 3889018 2031258 52764658
2761E2764658O5319345J8552166l8076491n3487038k0658239L2404899O0733658
$$ 52764658 118084003 136636169 98559678 45072640 24414401 56819300 117552958
2754A17552958L3849151k3618198m7148869j3078149K3868467M667874m8308977
$$ 117552958 151402109 127783911 80635042 67556893 91425360 96093234 47784257
2747D7784257o1304068j2808341L8438958L6728594J742301q295868J6711055
$$ 47784257 -13519811 -26328152 12110806 48839400 50581701 42285833 58996888
2740E8996888K6819150j1077860n9913745n9954642q913911L8403093M3859681
$$ 58996888 85816038 74738178 14824433 -45130209 -54044120 -15641027 28218654
2733B8218654K4734229J4810094J9789088K4020394J5369126r330028m0952256
$$ 28218654 52952883 67762977 87552065 111572459 126941585 117611557 76659301
2726G6659301n2960929k7727708O162589M50758l8326656m7655712l437027L7426849
$$ 76659301 23698372 -4029336 2133253 2584011 -35742645 -83398357 -86835384 -49408535
2718d9408535K5275886m418391N260400L6343731L0660315j0343996l4175219
$$ -49408535 -24132649 -28551040 -23290640 13053091 43713406 33369410 -805809
2711h05809k8252906k7038409l4395889j5199373K8502130M5429408J7195646
$$ -805809 -29058715 -56097124 -90493013 -105692386 -77190256 -31760848 -14565202
2704a4565202j1579048p612395N120200o06410r752180l142074O764911P732279
$$ -14565202 -26144250 -33756645 -28636445 -29242855 -38995035 -42137109 -35372198 -27639919
2696b7639919J1522528J8575289M144313l0808859m1183755n319015L2347817
$$ -27639919 -16117391 2457898 6602211 -24206648 -65390403 -70709418 -38361601
2689c8361601K5419083o973649j8864804q347738m435871j1316818j0840202m18575
$$ -38361601 -12942518 -19916167 -38780971 -47128709 -51564580 -62881398 -73721600 -74140175
2681g4140175R660443J7921711K0736528N372382j7837198j1424147K7057883
$$ -74140175 -64479732 -46558021 -25821493 -20449111 -38286309 -49710456 -22652573
2674b2652573M0091360p478774o1677232n0161425J4559677O1896331O2400990
$$ -22652573 17438787 9960013 -51717219 -101878644 -87318967 -25422636 36978354
2667C6978354L7492902m43723m7424147p0550586m4554018p228864o083790j3509011
$$ 36978354 74471256 74027533 26603386 -43947200 -88501218 -95730082 -101813872 -115322883
2659a15322883K1533254O3360333L6334331l1043650l1377252M1928228P0472218
$$ -115322883 -93789629 -30429296 5905035 -25138615 -56515867 -14587639 55884579
2652E5884579K047809o4399402m6143647n055300k2574256n5658701k4623031
$$ 55884579 57932388 -6467014 -52610661 -57665961 -80240217 -135898918 -160521949
2645a60521949M0714492N7272983K6901142P482315J852950j3391218l157425
$$ -160521949 -119807457 -62534474 -35633332 -28151017 -26298067 -39689285 -42846710
2638d2846710N9783849R3361069J1104496j05772437r7819405K1507737P2881794
$$ -42846710 16937139 110298208 121402704 15630267 -82189138 -60681401 12200393
2631A2200393j0356081q5241988l9796453L6508122K2847110l4067623k2569313
$$ 12200393 1844312 -83397676 -123194129 -86686007 -63838897 -97906520 -120475833
2624a20475833L6337522L9922310j2232474l0566265M44580Q866894k0365348
$$ -120475833 -84138311 -44216001 -56448475 -87014740 -86570160 -77703266 -98068614
2617i8068614j6651957M1803389P7269926L5108771l2223146n0314849k2023561
$$ -98068614 -114720571 -72917182 4352744 39461515 7238369 -43076480 -65100041
2610f5100041O286985K0314287K7998614J8037752j6758678m1237862j4766304
$$ -65100041 -58813056 -38498769 -10500155 7537597 -9221081 -50458943 -65225247
2603f5225247M4689627P5166235M6319197j1409704n1010073n3656772k8831891
$$ -65225247 -20535620 54630615 100949812 89540108 38530035 -15126737 -43958628
2596d3958628K707104J8849837J0156211p138312q036312O204483J0534215J287670
$$ -43958628 -41251524 -22401687 -12245476 -19383788 -27420100 -21215617 -10681402 -9393732
2588i393732R267699M4699558N9732306J0391092o1672493o9419408m702245M5004115
$$ -9393732 -126033 44573525 104305831 114696923 53024430 -16394978 -21097223 23906892
2580B3906892K6366005n928707P585477K5927158j4765271p2435394n2524410
$$ 23906892 50272897 44344190 51929667 77856825 63091554 -9343840 -61868250
2573f1868250L2931814P1614762K1191559l5542019l0838640k979311l793804
$$ -61868250 -28936436 42678326 63869885 28327866 -2510774 -5490085 -9283889
2566i283889j1997611J724810P787503j5801191k4722283J0244063L2699689o251051
$$ -9283889 -21281500 -19556690 -11769187 -27570378 -52292661 -42048598 -9348909 -15599960
2558a5599960m8273677j5357203N5266995O6862117J5973678j7841479j0494770
$$ -15599960 -63873637 -79230840 -23963845 42898272 58871950 41030471 30535701
2551C0535701j0738742k8319946j6220837K6240309L5819338p369845m5525076
$$ 30535701 19796959 -8522987 -24743824 1496485 37315823 29945978 -15579098
2544a5579098m0703646k3258253j7564917j678722K8163243L1945047J253920
$$ -15579098 -56282744 -79540997 -97105914 -98784636 -70621393 -38676346 -37422426
2537c7422426j3313308J1406214K9012355R921484k729563K4312853M4508105
$$ -37422426 -50735734 -39329520 -10317165 -395681 -3125244 21187609 65695714
2530F5695714Q767681m4138596m6789668j0811800L56514j9833064j6651611K6917362
$$ 65695714 74463395 30324799 -16464869 -27276669 -26920155 -46753219 -63404830 -36487468
2522c6487468N6173838K5856180l2965562n3658667j8836415K0801200J3578199
$$ -36487468 19686370 45542550 12576988 -41081679 -59918094 -39116894 -25538695
2515b5538695k2132504j7717485M5553710R0256027L8846211o5725439r9766471
$$ -25538695 -47671199 -65388684 -19834974 70421053 109267264 43541825 -56224646
2508e6224646k2274345O9076763O9344566p222770p0223000p2523900l8488087
$$ -56224646 -78498991 -9422228 59922338 52699568 -17523432 -90047332 -128535419
2501a28535419n594324J3270416K1535067K6276381L0004070K4149413M308016
$$ -128535419 -134129743 -120859327 -99324260 -73047879 -43043809 -18894396 -14586380
2494a4586380q769122Q019226L7175820L8484338J0775326q609135p499520r997278
$$ -14586380 -23355502 -15336276 21839544 60323882 71099208 62490073 54990553 44993275
2486D4993275k0702527j7735368p607454j9133639l3449852M58406O3389133P0066453
$$ 44993275 24290748 6555380 -1052074 -20185713 -53635565 -53177159 10211974 80278427
2478H0278427N972400l8697176j7139904j093381m0245346n6480299K1084301
$$ 80278427 86250827 47553651 30413747 29320366 -10924980 -67405279 -46320978
2471d6320978J08369789P8459845m0049202j04706751o2803058P649076L8964855
$$ -46320978 62048811 140508656 100459454 -4247297 -67050355 -59401279 -20436424
2464b0436424M0291773K9597887L597286j9481111j1785386Q818635N648802r157764
$$ -20436424 19855349 49453236 53050522 33569411 21784025 30602660 36251462 27093698
2456B7093698l696895O118069l510963K984542N3118359P7592472P179996q2212638
$$ 27093698 23396803 29514872 26003909 28988451 82106810 159699282 166879278 84666640
2448H4666640o3551254K8039512M0340830l9575752n8324898L7553156R7764732
$$ 84666640 21115386 49154898 89495728 49919976 -8404922 29148234 126912966
2441A26912966J4548067r7469326q7480637L197637L8233720P499766K466908
$$ 126912966 141461033 43991707 -43488930 -40291293 -2057573 5442193 7909101
2434G909101L8920401M9572787J8114571o308185r975653k2833375m0777806l4147805
$$ 7909101 46829502 96402289 114516860 108208675 98233022 75399647 34621841 474036
2426D74036j7581678k3255839k5643744J4987414N6242633K4543463m9637736
$$ 474036 -17107642 -40363481 -66007225 -51019811 5222822 29766285 -19871451
2419a9871451o0712675K548337L5093622q414063l4450448L2320367J15430943
$$ -19871451 -80584126 -78035789 -42942167 -51356230 -85806678 -53486311 61944632
2412F1944632R8664356J331040n8893602m0735632j4945142l1165878m5110876
$$ 61944632 160608988 161940028 103046426 62310794 47365652 16199774 -28911102
2405b8911102o436546N3425484O8951285L2938854q111535k7979374m2214754
$$ -28911102 -35347648 18077836 87029121 119967975 111856440 83877066 41662312
2398D1662312o1916831o8704756m4501804K076481M7818085P2068257N8679740
$$ 41662312 -20254519 -88959275 -133461079 -131384598 -83566513 -11498256 47181484
2391D7181484P368833m8708180o2864290k5299502K6323006N3465184M9534805
$$ 47181484 54550317 5842137 -57022153 -82321655 -55998649 -2533465 47001340
2384D7001340K2645995j8653706n0737382m5188978j2623705J945400j3273691
$$ 47001340 69647335 50993629 256247 -44932731 -57556436 -55611036 -68884727
2377f8884727j7535837J1617328L9238054L4600597J6057558j243048l7114788
$$ -68884727 -86420564 -74803236 -35565182 -964585 15092973 13849925 -23264863
2370b3264863p9539630o2740907K1530825P1690522K4200181k7471829K2497866
$$ -23264863 -102804493 -165545400 -144014575 -72324053 -48123872 -75595701 -53097835
2363e3097835J03641006P3605009m0643935p8885570o801443M3574053P390759
$$ -53097835 50543171 124148180 83504245 4618675 -2182768 41391285 48782044
2356D8782044k3102110J0277360K7153236k6268835o5055038j7737751M2680357
$$ 48782044 25679934 35957294 63110530 36841695 -28213343 -45951094 -3270737
2349c270737K7033161k4003100l0580546j1476451k2928412m5482160l6030475
$$ -3270737 23762424 -240676 -30821222 -42297673 -65226085 -110708245 -146738720
2342a46738720j6664381j6891959m193494L9013115N4528689J5832664J223075
$$ -146738720 -163403101 -180295060 -184488554 -145475439 -90946750 -75114086 -73891011
2335g3891011N6948558Q9118380J4808113p7080669n8546495K8545587N1027552
$$ -73891011 -16942453 72175927 86984040 9903371 -48643124 -20097537 30930015
2328C0930015K174567k1757715o959977j4790380k9263419J5427527P8681699
$$ 30930015 33104582 11346867 4386890 -10403490 -39666909 -24239382 54442317
2321E4442317N6103871l2435982o5027467k4065166j0174784m4469008l4183481
$$ 54442317 110546188 78110206 13082739 -10982427 -21157211 -65626219 -99809700
2314i9809700L8187784O5811652M697913m9346514k7202704J5785558K5519410
$$ -99809700 -61621916 4189736 8887649 -40458865 -67661569 -51876011 -26356601
2307b6356601L1857805M5563517J1667827o6407001r0090211k5902526K7716032
$$ -26356601 5501204 51064721 62732548 -3674453 -93764664 -119667190 -91951158
2300i1951158R556773l096604M7981200P8994643J3469927o4718682m0730644
$$ -91951158 -82394385 -85490989 -37509789 41484854 54954781 -9763901 -50494545
2293e0494545M1114452N3851775j2644467o1523553n1158274k2599665L986457
$$ -50494545 -9380093 44471682 31827215 -29696338 -80854612 -103454277 -99467820
2286i9467820M3995469P4258944M6885322k3043211o3781928m2898165K957218
$$ -99467820 -55472351 18786593 65671915 42628704 -21153224 -64051389 -61094171
2279f1094171K9339060K5900091N139468j3321736j7970878k2935198m3657240
$$ -61094171 -31755111 -5855020 -715552 -14037288 -32008166 -54943364 -98600604
2272i8600604n1289207n550827O0696878O7882399J8408464K265248M0631152
$$ -98600604 -149889811 -155440638 -94743760 -26861361 -8452897 -6187649 34443503
2265C4443503L8506377m5219730j01374214l9165096N7021110N8118023j0639824
$$ 34443503 72949880 27730150 -73644064 -112809160 -55788050 2329973 -8309851
2258h309851l3106806L397568J6808046j1181643k2383812l165199O174149N164992
$$ -8309851 -41416657 -38019089 -21211043 -32392686 -54776498 -57941697 -51767548 -46602556
2250d6602556K2147191K9903563j3029483n6754618j6409602P7486660J07273014
$$ -46602556 -24455365 5448198 -7581285 -64335903 -80745505 -3258845 104014169
2243A04014169M4368711k2318013l6713966l3573758l5920055j6405232J6209071
$$ 104014169 148382880 126064867 89350901 55777143 19857088 3451856 19660927
2236A9660927Q058685l1845582k5049513L8212097O1348507r420656r2991445
$$ 19660927 27719612 -4125970 -29175483 9036614 70385121 60964465 -32026980
2229c2026980q7277431j397116P5675207P9939264J3281885o4105273o7280862
$$ -32026980 -119304411 -120701527 -45026320 34912944 48194829 -15910444 -83191306
2222h3191306K2537954J00064705N3937830o1139150q3645260J3206180P7478424
$$ -83191306 -60653352 39411353 93349183 32210033 -51435227 -38229047 39249377
2215C9249377J7504003o3249953n0398644K078915o464719l7489234O212768R0137997
$$ 39249377 56753380 -6496573 -56895217 -54816302 -61281021 -98770255 -92557487 -2419490
2207b419490R1701758O3477o7987368m4821949J5893457M8306327M7799996K1797868
$$ -2419490 89282268 89345745 21358377 -23463572 -7570115 40736212 88536208 110334076
2199A10334076l3668370q2587869o1138760K2906634P4653194L7006141k7753588
$$ 110334076 76665706 -5922163 -67060923 -44154289 30498905 67505046 39751458
2192C9751458k8293459K8541877N5857624J1345100m9721012n3086141n21201
$$ 39751458 11457999 39999876 95857500 107202600 57481588 4395447 3874246
2185C874246L9387917K3517114j4750343k0039918O816829J9164208j043048k4377685
$$ 3874246 43262163 66779277 52028934 31989016 38805845 57970053 56927005 32549320
2177C2549320k9090233k5501690j5345603J9353740O4231665O3425101j441286
$$ 32549320 3459087 -22042603 -37388206 -18034466 46197199 109622300 108181014
2170A08181014o8715181p3689113k8851608J2161447K9512516L1487771J5358052
$$ 108181014 39465833 -34223280 -63074888 -50913441 -21400925 10086846 25444898
2163B5444898j3309623j7630475J9328587N2112827L6109759j936234j6076954
$$ 25444898 12135275 -5495200 13833387 65946214 102055973 100119739 84042785
2156H4042785k2962881n6355200p7773275k7645501N4989746O8964681O156812
$$ 84042785 61079904 4724704 -73048571 -100694072 -45704326 23260355 29417167
2149B9417167l6502068j4311177O359228j9662784l6391441J229309L5265364
$$ 29417167 -7084901 -21396078 -15036850 -34699634 -71091075 -69861766 -34596402
2142c4596402O242290l5126622j3215012L8636939L5999886q492881j1423852
$$ -34596402 -28354112 -63480734 -76695746 -38058807 -2058921 -10551802 -21975654
2135b1975654K6628646J6278350n8681862r3858770k3892680P0017933P8519622
$$ -21975654 4652992 20931342 -37750520 -131609290 -155501970 -85484037 -6964415
2128f964415J4663013k9608121k1053068M095569K8243000N9999402P0537869
$$ -6964415 7698598 -21909523 -42962591 -38867022 -10624022 49375380 119913249
2121A19913249J7150835o2271558o9422865J0437059O7773337K0942756o3880488
$$ 119913249 137064084 74792526 5369661 15806720 83580057 104522813 40642325
$$ [...]
##END NTUPLES=NMR SPECTRUM
##END=
