##TITLE=31Pdec_AT-48_2
 THF-d8, 3000 sc
 29.8.2022
##JCAMPDX= 6.0         $$ Bruker NMR JCAMP-DX V2.0
##DATA TYPE= NMR SPECTRUM
##DATA CLASS= NTUPLES
##ORIGIN= UXNMR, Bruker Analytische Messtechnik GmbH
##OWNER= root
$$ XWIN-NMR		Version 3.5
$$ Mon Aug 29 14:56:12 2022 Russian Standard Time (UT+4h)  she@DPX200
##.OBSERVE FREQUENCY= 81.013821
##.OBSERVE NUCLEUS= ^31P
##.ACQUISITION MODE= SIMULTANEOUS
##.ACQUISITION SCHEME= undefined
##.AVERAGES= 3000
##.DIGITISER RES= 16
##SPECTROMETER/DATA SYSTEM= spect
##.PULSE SEQUENCE= zgpg30
##.SOLVENT NAME= CDCl3
##.SHIFT REFERENCE= (INTERNAL, CDCl3, 0, 248.564)
##AUDIT TRAIL= $$ (NUMBER, WHEN, WHO, WHERE, WHAT)
$$ ##TITLE= Audit trail, XWIN-NMR		Version 3.5
$$ ##JCAMPDX= 5.01
$$ ##ORIGIN= Bruker BioSpin GmbH
$$ ##OWNER= she
$$ F:/spectra/data/she/nmr/P31/1/pdata/1/auditp.txt
$$ ##AUDIT TRAIL=  $$ (NUMBER, WHEN, WHO, WHERE, WHAT)
(   1,<2022-08-29 14:45:54.96 +0400>,<she>,<DPX200>,
      <continue with go, POWCHK disabled, PULCHK disabled
       configuration hash MD5:
       00 E9 B6 7A A2 85 ED C7 34 08 36 98 17 FE 4E 26
       data hash MD5: 32K
       F3 BA 6B 1D D6 CC 08 E4 CE 5C 07 62 56 62 60 EA>)
(   2,<2022-08-29 14:47:08.51 +0400>,<she>,<DPX200>,
      <Start of raw data processing
       efp BC_mod = 2 LB = 1 FT_mod = 6 PKNL = 1 PHC0 = -10214.21 PHC1 = -31.14336 SI = 64K 
       data hash MD5: 64K
       68 8D 06 7B 32 71 7A A2 9C 15 9F 52 1D 08 9D AE>)
(   3,<2022-08-29 14:55:02.95 +0400>,<she>,<DPX200>,
      <pk PHC0 = -77.8912 PHC1 = 180.9999 
       data hash MD5: 64K
       CF 48 AA 7E 7E 4D 3E 46 35 8E 4B B5 2E CB D9 4C>)
$$ ##END=
$$ 
$$ hash MD5
$$ E2 B2 CA 8B EB C1 DD D5 CC 69 7E 1F 44 84 F1 A3
##$RELAX= 
##$RELAX= 
##$RELAX= 
##$RELAX= 
##$RELAX= 
##$RELAX= 
##$RELAX= 
##$RELAX= 
##$RELAX= 
$$ Bruker specific parameters
$$ --------------------------
##$DU= <F:/spectra>
##$EXPNO= 1
##$NAME= <P31>
##$PROCNO= 1
##$TYPE= <nmr>
##$USER= <she>
##$AMP= (0..31)
100 100 100 100 100 100 100 100 100 100 100 100 100 100 100 100 100 100 
100 100 100 100 100 100 100 100 100 100 100 100 100 100 
##$AQSEQ= 0
##$AQ_mod= 1
##$AUNM= <au_zg>
##$AUTOPOS= <>
##$BF1= 81.014009
##$BF2= 200.13
##$BF3= 200.13
##$BF4= 200.13
##$BF5= 200.13
##$BF6= 200.13
##$BF7= 200.13
##$BF8= 200.13
##$BYTORDA= 1
##$CFDGTYP= 0
##$CFRGTYP= 5
##$CHEMSTR= <none>
##$CNST= (0..31)
1 1 145 1 1 1 1 1 1 1 1 1 1 1 1 1 1 1 1 1 1 1 1 1 1 1 1 1 1 1 1 1 
##$CPDPRG= <waltz16>
##$CPDPRG1= <>
##$CPDPRG2= <waltz16>
##$CPDPRG3= <>
##$CPDPRG4= <mlev>
##$CPDPRG5= <mlev>
##$CPDPRG6= <mlev>
##$CPDPRG7= <mlev>
##$CPDPRG8= <mlev>
##$CPDPRGB= <>
##$CPDPRGT= <>
##$D= (0..31)
0 1 0 0 0 0 0 0 0 0 0 0.03 2e-05 3e-06 0 0 0 0 0 0 0 0 0 0 0 0 0 0 0 0 
0 0 
##$DATE= 1661766833
##$DBL= (0..7)
120 120 120 11 120 120 24 19 
##$DBP= (0..7)
150 150 150 150 150 150 150 150 
##$DBP07= 0
##$DBPNAM0= <>
##$DBPNAM1= <>
##$DBPNAM2= <>
##$DBPNAM3= <>
##$DBPNAM4= <>
##$DBPNAM5= <>
##$DBPNAM6= <>
##$DBPNAM7= <>
##$DBPOAL= (0..7)
0.5 0.5 0.5 0.5 0.5 0.5 0.5 0.5 
$$ [...]
##$SUBNAM2= <"">
##$SUBNAM3= <"">
##$SUBNAM4= <"">
##$SUBNAM5= <"">
##$SUBNAM6= <"">
##$SUBNAM7= <"">
##$SUBNAM8= <"">
##$SUBNAM9= <"">
##$SW= 501.771253377433
##$SWIBOX= (0..15)
0 1 3 0 0 0 0 0 0 0 0 0 0 0 0 0 
##$SW_h= 40650.406504065
##$TD= 32768
##$TD0= 1
##$TE= 0
##$TE2= 300
##$TE3= 300
##$TEG= 300
##$TL= (0..7)
0 120 53 12 22 120 120 120 
##$TP= (0..7)
150 150 150 150 150 150 150 150 
##$TP07= 0
##$TPNAME0= <>
##$TPNAME1= <>
##$TPNAME2= <>
##$TPNAME3= <>
##$TPNAME4= <>
##$TPNAME5= <>
##$TPNAME6= <>
##$TPNAME7= <>
##$TPOAL= (0..7)
0.5 0.5 0.5 0.5 0.5 0.5 0.5 0.5 
##$TPOFFS= (0..7)
0 0 0 0 0 0 0 0 
##$TUNHIN= 0
##$TUNHOUT= 0
##$TUNXOUT= 0
##$USERA1= <user>
##$USERA2= <user>
##$USERA3= <user>
##$USERA4= <user>
##$USERA5= <user>
##$V9= 5
##$VALIST= <valist>
##$VCLIST= <CCCCCCCCCCCCCCC>
##$VD= 0
##$VDLIST= <DDDDDDDDDDDDDDD>
##$VPLIST= <PPPPPPPPPPPPPPP>
##$VTLIST= <TTTTTTTTTTTTTTT>
##$WBST= 1024
##$WBSW= 4
##$XGAIN= (0..3)
0 0 0 0 
##$XL= 0
##$YL= 0
##$YMAX_a= 143865
##$YMIN_a= -142443
##$ZGOPTNS= <>
##$ZL1= 120
##$ZL2= 120
##$ZL3= 120
##$ZL4= 120
##$ABSF1= 0
##$ABSF2= 0
##$ABSG= 0
##$ABSL= 0
##$ALPHA= 0
##$AQORDER= 0
##$ASSFAC= 0
##$ASSFACI= 0
##$ASSFACX= 0
##$ASSWID= 0
##$AUNMP= <proc_1d>
##$AZFE= 0.1
##$AZFW= 0.5
##$BCFW= 0
##$BC_mod= 2
##$BYTORDP= 0
##$COROFFS= 0
##$CY= -3
##$DATMOD= 1
##$DC= 0
##$DFILT= <>
##$DTYPP= 0
##$F1P= 0
##$F2P= 0
##$FCOR= 1
##$FTSIZE= 65536
##$FT_mod= 6
##$GAMMA= 0
##$GB= 0
##$INTBC= 1
##$INTSCL= 6.834604e-11
##$ISEN= 30
##$LB= 1
##$LEV0= 0
##$LPBIN= 0
##$MAXI= 10000
##$MC2= 0
##$MEAN= 0
##$ME_mod= 0
##$MI= 50
##$NCOEF= 0
##$NC_proc= -5
##$NLEV= 6
##$NOISF1= 182.463
##$NOISF2= 159.3651
##$NSP= 0
##$NTH_PI= 0
##$NZP= 0
##$OFFSET= 248.5645
##$PC= 4
##$PHC0= -10292.1
##$PHC1= 149.8565
##$PH_mod= 1
##$PKNL= yes
##$PPARMOD= 0
##$PSCAL= 0
##$PSIGN= 0
##$REVERSE= no
##$SF= 81.0140089999694
##$SI= 65536
##$SIGF1= 159.3651
##$SIGF2= -187.1042
##$SINO= 113.3802
##$SIOLD= 16384
##$SREGLST= <1H.CDCl3>
##$SSB= 0
##$STSI= 65536
##$STSR= 0
##$SW_p= 40650.406504065
##$SYMM= 0
##$S_DEV= 0
##$TDeff= 32768
##$TDoff= 0
##$TI= <>
##$TILT= no
##$TM1= 0
##$TM2= 0
##$TOPLEV= 0
##$USERP1= <user>
##$USERP2= <user>
##$USERP3= <user>
##$USERP4= <user>
##$USERP5= <user>
##$WDW= 1
##$XDIM= 65536
##$YMAX_p= 425849025
##$YMIN_p= -44783092
$$ End of Bruker specific parameters
$$ ---------------------------------
##NTUPLES= NMR SPECTRUM
##VAR_NAME=  FREQUENCY,     SPECTRUM/REAL,   SPECTRUM/IMAG
##SYMBOL=    X,             R,               I
##VAR_TYPE=  INDEPENDENT,   DEPENDENT,       DEPENDENT
##VAR_FORM=  AFFN,          ASDF,            ASDF
##VAR_DIM=   65536,         65536,           65536
##UNITS=     HZ,            ARBITRARY UNITS, ARBITRARY UNITS
##FACTOR=    0.620285442955139, 1,           1
##FIRST=     20137.2065510682, 0,            0
##LAST=      -20513.1999529968, 0,           0
##MIN=       -20513.1999529968, -44783092,   0
##MAX=       20137.2065510682, 425849025,    0
$$ Real data points
##PAGE= N=1
##DATA TABLE= (X++(R..R)), XYDATA
$$ [...]
$$ plain form
38555 -6651666 -2811690 4280903 11616124 15730769 16347226 14637605 10664834 5039066
38547 5039066 602820 -543998 124282 540833 1913706 6021110 9985451 8211403
38539 8211403 26679 -8306104 -10583164 -6932596 -1691359 2208203 4237532 3694324
38531 3694324 -96504 -4872550 -6191939 -3017121 -280110 -3091907 -9515510 -12419467
38523 -12419467 -8582059 -2434210 442482 17628 -359930 346159 902237 1292514 2051916
38514 2051916 1570455 -1473216 -3812632 -701225 6456277 10548249 7980469 2843298
38506 2843298 224098 -109420 -944771 -2622003 -3800186 -4082361 -3207908 -601805 1889766
38497 1889766 276505 -5628967 -9979375 -8122734 -3000193 -571066 -1782730 -3333270
$$ packed form
38555f651666L839976P092593P335221M114645O16457j709621l972771n625768
38547E039066m436246j146818O68280M16551J372873M107404L964341j774048
38539H211403q184724q332783k277060L650568N241237L899562K029329n43208
38531C694324l790828m776046j319389L174818K737011k811797o423603k903957
38523a2419467L837408O147849K876692m24854l77558P06089N56078L90277P59402
38514B051916m81461l043671k339416L111407P157502M091972k567780n137171
38506B843298k619200l33518q35351j677232j178183k82175Q74453K606103K491571
38497A889766j613261n905472m350408J856641N122541K429127j211664j550540
$$ plain form
38489 -3333270 -3831630 -4344009 -4488639 -2852199 -588282 -542946 -3321938 -7327626 -11271990
38480 -11271990 -13534217 -11559004 -6255768 -4407819 -11029327 -21012874 -24490119 -19399164
38472 -19399164 -12258795 -7380970 -3134007 530955 -425305 -5915595 -8650928 -4170187
38464 -4170187 1887330 1809331 -3550311 -7728007 -8577878 -9134665 -10584515 -10393304 -7415044
38455 -7415044 -4312354 -4018227 -6569481 -9973870 -12272208 -12419516 -10404318 -6890660
38447 -6890660 -2878211 -404992 -2568317 -10153654 -18349169 -20333875 -15153313 -8756265
38439 -8756265 -6102314 -5926914 -4833028 -2344351 567839 3873302 6291597 4655505
38431 4655505 -815413 -4252304 -1451834 3672422 4510774 774831 -2906669 -4949172
$$ packed form
38489c333270m98360n12379j44630J636440K263917M5336k778992m005688l944364
38480a1271990k262227J975213N303236J847949o621508r983547l477245N090955
38472a9399164P140369M877825M246963L664962r56260n490290k735333M480741
38464d170187O057517p7999n359642m177696q49871n56787j449850J91211K978260
38455g415044L102690K94127k551254l404389k298338j47308K015198L513658
38447f890660M012449K473219k163325p585337q195515j984706N180562O397048
38439h756265K653951J75400J093886K488677K912190L305463K418295j636092
38431D655505n470918l436891K800470N124256Q38352l735943l681500k042503
$$ plain form
38423 -4949172 -7740385 -12017773 -15768375 -18036496 -18946117 -16775377 -10103966 -2282283
38415 -2282283 1477951 1168859 848342 824816 -2723849 -9546001 -13416509 -11022608 -7071004
38406 -7071004 -7005619 -9141267 -8091657 -2931547 1965909 2550489 -1242797 -6210625 -8539020
38397 -8539020 -7098077 -4880255 -5267289 -6954288 -5939275 -2599921 -1754338 -4156375
38389 -4156375 -3736635 3063973 10443943 10920671 5844623 2147834 1415147 -882130 -6391406
38380 -6391406 -11246461 -13075280 -14106194 -15437608 -14273143 -9976200 -7436764 -9803773
38372 -9803773 -12044405 -7581948 1087189 5108605 2396094 1072907 7179388 14892642
38364 14892642 14232878 5005700 -3349672 -4787887 -2769054 -2014703 -915545 3375416
$$ packed form
38423d949172k791213m277388l750602k268121r09621K170740O671411P821683
38415b282283L760234l09092l20517k3526l548665o822152l870508K393901L951604
38406g071004O5385k135648J049610N160110M897456N84580l793286m967828k328395
38397h539020J440943K217822l87034j686999J015013L339354Q45583k402037
38389d156375M19740O800608P379970M76728n076048l696789p32687k297277n509276
38380f391406m855055j828819j030914j331414J164465M296943K539436k367009
38372i803773k240632M462457Q669137M021416k712511j323187O106481P713254
38364A4892642o59764r227178q355372j438215K018833P54351J099158M290961
$$ plain form
38356 3375416 7155431 4089436 -4708300 -10848239 -9494583 -4741832 -2499968 -2565259
38348 -2565259 -784998 3760633 7114763 5256451 -1184917 -6757802 -5793784 1301045
38340 1301045 6799031 3412482 -6728876 -14285508 -14210296 -10630470 -8996439 -8841273
38332 -8841273 -7798478 -7636639 -10533284 -12657306 -8363737 71364 3470413 -2355964
38324 -2355964 -10982705 -13713780 -9559618 -4275998 -2178118 -1931525 203394 4907850
38316 4907850 8341090 6477556 647296 -3171375 -1668734 1649412 1959818 144121
38308 144121 481809 3219050 4317811 2060753 -906422 -2234675 -1977348 45977 3854066
38299 3854066 5837884 1698268 -5582280 -7120556 -471395 5696455 3576828 -3044637
$$ packed form
38356C375416L780015l065995q797736o139939J353656M752751K241864o5291
38348b565259J780261M545631L354130j858312o441368n572885R64018P094829
38340A301045N497986l386549j0141358p556632P5212L579826J634031J55166
38332h841273J042795J61839k896645k124022M293569Q435101L399049n826377
38324b355964q626741k731075M154162N283620K097880K46593K134919M704456
38316D907850L433240j863534n830260l818671J502641L318146L10406j815697
38308A44121L37688K737241J098761k257058k967175j328253K57327K023325L808089
38299C854066J983818m139616p280548j538276O649161O167850k119627o621465
$$ plain form
38291 -3044637 -5787437 -4213288 -3995857 -6103222 -6268012 -4082066 -4297107 -8116842 -10460751
38282 -10460751 -8120109 -4580544 -3909819 -5048746 -5533287 -6351853 -8799285 -9724385 -4970218
38273 -4970218 3396133 7672849 3364446 -5019783 -8647230 -4262526 2017624 1819515
38265 1819515 -5282584 -11097924 -9062675 -1930857 3248677 4451589 4385387 3333377
38257 3333377 -1265480 -8241817 -12230932 -11419415 -10094413 -11225619 -11852051 -8753532
38249 -8753532 -3763533 -46058 2392898 3950218 2790691 -973089 -3040788 -1617583
38241 -1617583 -1894024 -8140015 -15288041 -15108718 -7959303 -1470745 330763 -565404 -2871006
38232 -2871006 -7112397 -10449847 -8543313 -3473235 -2062444 -4844057 -4718985 762186
$$ packed form
38291c044637k742800J574149K17431k107365j64790K185946k15041l819735k343909
38282a0460751K340642L539565O70725j138927m84541q18566k447432r25100M754167
38273d970218Q366351M276716m308403q384229l627447M384704O280150j98109
38265A819515p102099n815340K035249P131818N179534J202912o6202j052010
38257C333377m598857o976337l989115Q11517J325002j131206o26432L098519
38249h753532M989999L717475K438956J557320j159527l763780k067699J423205
38241a617583k76441o245991p148026J79323P149415O488558J801508q96167k305602
38232b871006m241391l337450J906534N070078J410791k781613J25072N481171
$$ plain form
38224 762186 4030937 -840364 -8154575 -8642886 -2637136 1537023 -553892 -5568246
38216 -5568246 -9160622 -10896119 -11878849 -11611316 -8911918 -4406331 -962932 -1120759 -3488806
38207 -3488806 -3105134 2090532 6497446 2983456 -6498776 -12015511 -8639455 -2458507
38199 -2458507 -1007626 -3533390 -4836825 -3754976 -2774919 -2885568 -3682389 -5733183 -8694495
38190 -8694495 -10081409 -9605030 -10830934 -14339223 -14066083 -6327695 2020241 1935673 -4365175
38181 -4365175 -6398192 -214850 7795272 11280497 10207377 6463215 953944 -3359711
38173 -3359711 -2439088 2533235 5466339 3909401 2025755 3222290 5015440 3490241
38165 3490241 -1523649 -7627253 -12294304 -13096220 -9845648 -7291666 -10665973 -17443481
$$ packed form
38224G62186L268751m871301p314211m88311O005750M174159k090915n014354
38216e568246l592376j735497r82730K67533K699398M505587L443399j57827k368047
38207c488806L83672N195666M406914l513990r482232n516735L376056O180948
38199b458507J450881k525764j303435J081849R80057j10649p96821k050794k961312
38190h694495j386914M76379j225904l508289K73140P738388Q347936q4568o300848
38181d365175k033017O183342Q010122L485225j073120l744162n509271m313655
38173c359711R20623M972323K933104j556938j883646J196535J793150j525199
38165C490241n013890o103604m667051q01916L250572K553982l374307o777508
$$ plain form
38157 -17443481 -18920330 -11677861 -2207751 1850527 -35676 -3778661 -6100792 -5111132
38149 -5111132 -653594 3252522 1166834 -6104245 -11433426 -10996096 -8344044 -6657457
38141 -6657457 -3654438 2201133 7083852 7948314 7118438 6077271 1381650 -7458104
38133 -7458104 -12871400 -9380829 -2900922 -1668561 -3353520 -749267 4239245 3543853
38125 3543853 -2413799 -4767068 -1004949 1592721 -717646 -2174881 1172539 3855583
38117 3855583 488765 -4891886 -5823511 -3911721 -4945654 -8418982 -8635308 -4711712
38109 -4711712 -2320855 -4885053 -8858655 -9785874 -8745696 -9762046 -13349216 -15990872
38101 -15990872 -15146905 -11647438 -6943643 -1221055 4157709 5356813 594042 -5608641
$$ packed form
38157a7443481j476849P242469R470110M058278j886203l742985k322131R89660
38149e111132M457538L906116k085688p271079n329181M37330K652052J686587
38141f657457L003019N855571M882719Q64462q29876j041167m695621q839754
38133g458104n413296L490571O479907J232361j684959K604253M988512o95392
38125C543853n957652k353269L762119K597670k310367j457235L347420K683044
38117C855583l366818n380651r31625J911790j033933l473328k16326L923596
38109d711712K390857k564198l973602r27219J040178j016350l587170k641656
38101a5990872Q43967L499467M703795N722588N378764J199104m762771o202683
$$ plain form
38093 -5608641 -6628422 -1789287 3553730 5657256 5606784 4639089 1697494 -2585737 -4669297
38084 -4669297 -3428171 -1964487 -1681308 51026 3383569 3441258 -1427466 -5286687 -3890959
38075 -3890959 -1694231 -3000463 -3337001 1358800 3750686 -4772396 -17511275 -19646994
38067 -19646994 -10330572 -3419741 -5380267 -7135829 -2042962 2046544 -3415810 -12632961
38059 -12632961 -13847631 -5955969 1908101 2872037 -2639522 -10610655 -16021553 -14726979
38051 -14726979 -7825894 -1715991 -539396 -2102938 -3729931 -6632108 -10780915 -11634711
38043 -11634711 -7386283 -4071243 -7257948 -13109383 -14161808 -10242361 -6987866 -6527122
38035 -6527122 -6451789 -6016632 -6778671 -8100868 -7789460 -6603650 -7153038 -8843244 -8393576
$$ packed form
38093e608641j019781M839135N343017K103526n0472r67695k941595m283231k083560
38084d669297J241126J463684K83179J732334L332543N7689m868724l859221J395728
38075c890959K196728j306232l36538M695801K391886q523082j2738879k135719
38067a9646994R316422O910831j960526j755562N092867M089506n462354r217151
38059a2632961j214670P891662P864070R63936n511559p971133n410898J294574
38051a4726979O901085O109903J176595j563542j626993k902177m148807q53796
38043a1634711M248428L315040l186705n851435j052425L919447L254495M60744
38035f527122P5333M35157p62039j322197L11408J185810n49388j690206M49668
$$ plain form
38026 -8393576 -5082199 -1794384 -1186743 -3478993 -7004727 -8772622 -6280988 -711592
38018 -711592 4087148 7052772 10283566 12507408 8441657 -1679146 -8660011 -6163006
38010 -6163006 -11511 925108 -2706986 -5163418 -6865925 -11305054 -14837657 -10912008
38002 -10912008 -2687604 -139463 -4697676 -7806646 -5899778 -5600578 -10843371 -15263792
37994 -15263792 -12642709 -6469624 -3113943 -2216114 -276464 1285169 -1565193 -7792367
37986 -7792367 -11732501 -10558734 -7510495 -7507393 -11277676 -14063342 -10481221 -1343088 6102137
37977 6102137 6549440 2461877 -1571271 -6216303 -13401391 -18702753 -16010038 -8036441
37969 -8036441 -3246407 -2961390 -1155847 2729630 1894210 -4552328 -7970159 -4619310
$$ packed form
38026h393576L311377L287815O07641k292250l525734j767895K491634N569396
38018g11592M798740K965624L230794K223842m065751j0120803o980865K497005
38010f163006O151495R36619l632094k456432j702507m439129l532603L925649
38002a0912008Q224404K548141m558213l108970J906868K99200n242793m420421
37994a5263792K621083O173085L355681Q97829J939650J561633k850362o227174
37986g792367l940134J173767L048239L102l770283k785666L582121R138133P445225
37977F102137M47303m087563m033148m645032p185088n301362K692715P973597
37969h036441M790034K85017J805543L885477q35420o446538l417831L350849
$$ plain form
37961 -4619310 -2674376 -7939030 -12714859 -8124766 524039 1330070 -6413228 -12337283
37953 -12337283 -9922204 -2161481 5698905 10837096 11562577 8570851 6403477 7661168
37945 7661168 8056593 3556549 -1035244 962883 5450320 2413767 -7008020 -9811830
37937 -9811830 -273856 10757931 11196352 3747553 -670574 735275 1612938 -1164419
37929 -1164419 -2901101 365604 5336133 6328313 2839919 -966484 -2500701 -3296989
37921 -3296989 -5289867 -7095368 -5795345 -1589551 1525787 525194 -2625851 -3191978
37913 -3191978 604982 5630032 7973262 7819055 8737188 12017401 13673169 9485884
37905 9485884 2296970 147267 5415821 10218129 6903632 -400353 -1162892 6369849
$$ packed form
37961d619310J944934n264654m775829M590093Q648805Q06031p743298n924055
37953a2337283K415079P760723P860386N138191P25481k991726k167374J257691
37945G661168L95425m500044m591793J998127M487437l036553r421787k803810
37937i811830R537974J1031787M38421p448799m418127J405849Q77663k777357
37929a164419j736682L266705M970529R92180l488394l806403j534217p96288
37921c296989j992878j805501J300023M205794L115338j000593l151045n66127
37913c191978L796960N025050K343230j54207R18133L280213J655768m187285
37905I485884p188914k149703N268554M802308l314497p303985p62539P532741
$$ plain form
37897 6369849 13120753 12813456 9436177 8231905 7158131 2658634 -2300125 -2616455
37889 -2616455 647158 2776414 3082722 3770844 3790659 663424 -3021788 -1872060 3567453
37880 3567453 6496890 3146979 -2732640 -5741849 -4883601 -2739598 -2252045 -5023050
37872 -5023050 -9590740 -11362027 -7773571 -3163947 -4159435 -10158920 -13469731 -10010896
37864 -10010896 -4591369 -2985375 -3589262 -1244096 3733547 5553224 1467470 -4203895
37856 -4203895 -5996541 -4187674 -3154801 -4412997 -4896328 -2733358 -911586 -2274480
37848 -2274480 -3785016 -490214 6171618 9670340 8037571 6009384 6159781 4714044
37840 4714044 -610501 -5328884 -5632947 -4924355 -6609568 -5972173 2536084 13595439
$$ packed form
37897F369849O750904l07297l377279j204272j073774m499497m958759l16330
37889b616455L263613K129256L06308O88122J9815l127235l685212J149728N439513
37880C567453K929437l349911n879619l009209Q58248K144003M87553k771005
37872e023050m567690j771287L588456M609624r95488n999485l310811L458835
37864a0010896N419527J605994o03887K345166M977643J819677m085754n671365
37856d203895j792646J808867J032873j258196m83331K162970J821772j362894
37848b274480j510536L294802O661832L498722j632769k028187J50397j445737
37840D714044n324545m718383l04063P08592j685213O37395Q508257J1059355
$$ plain form
37832 13595439 15784813 6893315 -3726058 -7881138 -6011683 -1733637 3247421 6980036
37824 6980036 6716220 3128161 234758 -509939 -1531533 -3680648 -4527477 -3208491 -1923165
37815 -1923165 -1419650 -98895 1178543 -1094548 -6651382 -10302662 -9589804 -8410999
37807 -8410999 -10157952 -12157137 -10600008 -7024602 -5864398 -8203323 -11483084 -13539566
37799 -13539566 -13934912 -12468331 -8823004 -3626577 942659 1792082 -2506959 -8690994
37791 -8690994 -10768822 -7531132 -5205135 -8768763 -13929584 -13502089 -8896007 -7547309
37783 -7547309 -10154859 -9177404 -954109 8824394 13759006 13511942 9803722 3095432
37775 3095432 -3785361 -5707729 -2456434 145372 -765805 -1281236 1254703 3306353
$$ packed form
37832A3595439K189374q891498j0619373m155080J869455M278046M981058L732615
37824F980036k63816l588059k893403p44697j021594k149115q46829J318986J285326
37815a923165N03515J320755J277438k273091n556834l651280P12858J178805
37807h410999j746953j999185J557129L575406J160204k338925l279761k056482
37799a3539566l95346J466581L645327N196427M569236Q49423m299041o184035
37791h690994k077828L237690K325997l563628n160821M27495M606082J348698
37783g547309k607550R77455Q223295R778503M934612k47064l708220o708290
37775C095432o880793j922368L251295K601806r11177n15431K535939K051650
$$ plain form
37767 3306353 1876410 -417673 -888169 -1062246 -1646598 234019 4818368 7420365 6272263
37758 6272263 5455635 6072101 3009255 -4316705 -7400973 -2081651 2562258 -2179287
37750 -2179287 -10274313 -10683844 -4671852 -1905739 -4456383 -6526754 -6411977 -7003523 -7093657
37741 -7093657 -3754547 -1276346 -5921115 -13113416 -12113331 -3326726 1438665 -2820392
37733 -2820392 -8128580 -8085912 -6493057 -7121837 -6092329 -621470 3786353 1679558 -3826589
37724 -3826589 -6971920 -7727521 -8651854 -8971724 -7372689 -5845429 -5573792 -3603773 1276895
37715 1276895 3887631 -402683 -7734859 -10641317 -8308276 -6346442 -7884939 -10066122
37707 -10066122 -9020659 -4388438 1213193 4739986 5019382 3966797 4447258 6015361
$$ packed form
37767C306353j429943k294083m70496j74077n84352J880617M584349K601997j148102
37758F272263q16628O16466l062846p325960l084268N319322M643909m741545
37750b179287q095026m09531O011992K766113k550644k070371J14777n91546r0134
37741g093657L339110K478201m644769p192301J000085Q786605M765391m259057
37733b820392n308188M2668J592855o28780J029508N470859M407823k106795n506147
37724c826589l145331p55601r24333l19870J599035J527260K71637J970019M880668
37715A276895K610736m290314p332176k906458K333041J961834j538497k181183
37707a0066122J045463M632221N601631L526793K79396j052585M80461J568103
$$ plain form
37699 6015361 4986180 64080 -4935022 -6182041 -5065988 -5568649 -8338292 -10244152
37691 -10244152 -8708230 -4131499 1157799 4440103 3677583 -1439905 -9508948 -18359957
37683 -18359957 -24992928 -25616588 -18946674 -9862434 -6177011 -9977971 -14971113 -14374822
37675 -14374822 -8807713 -3910201 -2501261 -2463339 -1449904 -209791 -228739 -99991 3540195
37666 3540195 10898431 16364308 13577616 3713185 -4237192 -3601467 2249484 5526666
37658 5526666 4677604 4372398 6220703 5865281 591550 -5647874 -7648851 -5652252 -3620968
37649 -3620968 -3230681 -2333093 1560711 7710687 11686763 8975484 496886 -6728249
37641 -6728249 -6976726 -2498530 459066 385290 473050 1434655 712574 -1410319 -1963352
$$ packed form
37699F015361j029181m922100m999102j247019J116053n02661k769643j905860
37691a0244152J535922M576731N289298L282304p62520n117488q069043q851009
37683a8359957o632971o23660O669914R084240L685423l800960m993142N96291
37675a4374822N567109M897512J408940L7922J013435J240113j8948J28748L640186
37666C540195P358236N465877k786692r864431p950377O35725N850951L277182
37658E526666q49062l05206J848305l55422n273731o239424k000977J996599K031284
37649c620968L90287Q97588L893804O149976L976076k711279q478598p225135
37641f728249k48477M478196K957596p3776Q7760R61605p22081k122893n53033
$$ plain form
37632 -1963352 -2369507 -7576096 -15712940 -16884801 -7084393 3888469 4722160 -2976734
37624 -2976734 -9596828 -11935329 -14106961 -16837568 -15402819 -9015964 -4349980 -6705752
37616 -6705752 -12831116 -15695758 -13140104 -8960339 -7339821 -8649721 -10256454 -10050554
37608 -10050554 -8655498 -7904797 -7553890 -5203317 -253648 3924842 3470329 -1415993
37600 -1415993 -6817455 -9056533 -7310470 -3677369 -1791407 -3873754 -7937956 -9463212
37592 -9463212 -6948174 -3938549 -4276444 -7440215 -10174036 -10627233 -9100256 -6769186
37584 -6769186 -5556634 -7156875 -10210573 -10667663 -7076039 -3071785 -2175463 -2871657 -2147741
37575 -2147741 -1307990 -3816022 -8772182 -11347339 -9764724 -7683152 -8715267 -11871038
$$ packed form
37632a963352m06155n206589q136844j171861R800408J0972862Q33691p698894
37624b976734o620094k338501k171632k730607J434749O386855M665984k355772
37616f705752o125364k864642K555654M179765J620518j309900j606733K05900
37608a0050554J395056P50701L50907K350573M949669M178490m54513m886322
37600a415993n401462k239078J746063L633101J885962k082347m064202j525256
37592i463212K515038L009625l37895l163771k733821m53197J526977K331070
37584f769186J212552j600241l053698m57090L591624M004254Q96322o96194P23916
37575b147741Q39751k508032m956160k575157J582615K081572j032115l155771
$$ plain form
37567 -11871038 -13774422 -12965664 -10505351 -7812677 -5250176 -2377982 874195 3226752
37559 3226752 2859558 -159828 -3104472 -3320002 -1135323 880079 868122 -986120 -3195223
37550 -3195223 -4000322 -2454408 450123 2271050 1433177 -1523113 -5196102 -8619298
37542 -8619298 -10960024 -11405203 -10036505 -7776016 -5432595 -4144746 -5962766 -11201002
37534 -11201002 -15608044 -14106617 -8088088 -4688750 -7039079 -9708009 -6929216 -1258399
37526 -1258399 512706 -2546381 -4585919 -1456810 4165356 6682642 3876004 -1273748
37518 -1273748 -3527799 -95973 6679976 11650141 11938276 8558284 3687104 -672535
37510 -672535 -1496211 3197516 9589146 10174170 3397337 -3435847 -4395081 -3140143 -5722025
$$ packed form
37567a1871038j903384Q08758K460313K692674K562501K872194L252177K352557
37559C226752l67194l019386k944644k15530K184679K015402j1957j854242k209103
37550c195223q05099J545914K904531J820927q37873k956290l672989l423196
37542h619298k340726m45179J368698K260489K343421J287849j818020n238236
37534a1201002m407042J501427O018529L399338k350329k668930K778793N670817
37526a258399J771105l059087k039538L129109N622166K517286k806638n149752
37518a273748k254051L431826O775949M970165K88135l379992m871180m359639
37510f72535q23676M693727O391630N85024o776833o833184r59234J254938k581882
$$ plain form
37501 -5722025 -9601688 -7198887 1506886 7583735 5086122 -1816262 -5681708 -5169329
37493 -5169329 -4769927 -7706601 -11765793 -12074361 -7308032 -2305766 -2874073 -8335119 -12583145
37484 -12583145 -13115112 -14059186 -17854048 -19800957 -15854066 -10531827 -10007477 -11246010
37476 -11246010 -6689663 2051791 4630814 -3018755 -12570991 -14868933 -10644896 -6364055
37468 -6364055 -5203015 -6193609 -8116547 -10279024 -11915912 -13308383 -15167322 -15597543
37460 -15597543 -11044858 -2077706 5160109 5693769 1470539 -1609677 -440027 2870046
37452 2870046 3591782 -991103 -7508131 -7802988 2136338 15130922 19492892 13008137
37444 13008137 4829303 2489348 3467837 2393284 101414 518229 3301582 5329470
$$ packed form
37501e722025l879663K402801Q705773O076849k497613o902384l865446N12379
37493e169329L99402k936674m059192l08568M766329N002266n68307n461046m248026
37484a2583145n31967r44074l794862j946909L946891N322239N24350j238533
37476a1246010M556347Q741454K579023p649569r552236k297942M224037M280841
37468f364055J161040r90594j922938k162477j636888j392471j858939m30221
37460a5597543M552685Q967152P237815N33660m223230l080216J169650L310073
37452B870046P21736m582885o517028k94857R939326J2994584M361970o484755
37444A3008137q178834k339955R78489j074553k291870M16815K783353K027888
$$ plain form
37436 5329470 6498913 8639822 10725120 10231253 7887180 6412533 5601336 3263071
37428 3263071 418416 777480 4601607 7312666 5556987 1541992 -197703 1826001
37420 1826001 5380656 7835774 8769681 9444408 10218622 9239067 4951640 -447343 -2756772
37411 -2756772 -1833233 -2481574 -6840704 -9469843 -4615998 3889217 5961598 -1584006
37403 -1584006 -11097051 -14853687 -14189558 -14640162 -16657330 -16171550 -11870451 -6657277 -2607651
37394 -2607651 732677 2712894 834040 -4631437 -8839994 -7717313 -2890338 913942
37386 913942 1490651 -115927 -2683028 -5490316 -6631098 -3835455 2285694 7722762
37378 7722762 8645188 4811722 -413354 -2752666 -563712 3273967 4171877 1651359
$$ packed form
37436E329470J169443K140909K085298m93867k344073j474647q11197k338265
37428C263071k844655L59064L824127K711059j755679m014995j739695K023704
37420A826001L554655K455118R33907O74727P74214r79555m287427n398983k309429
37411b756772R23539o48341m359130k629139M853845Q505215K072381p545604
37403a584006r513045l756636O64129m50604k017168M85780M301099N213174M049626
37394b607651L340328J980217j878854n465477m208557J122681M826975L804280
37386I13942N76709j606578k567101k807288j140782K795643O121149N437068
37378G722762R22426l833466n225076k339312K188954L837679Q97910k520518
$$ plain form
37370 1651359 387781 3568387 7856316 8334419 5937863 5084642 5679656 3741052 -334184
37361 -334184 -1212413 2139476 3660481 -175559 -4277154 -2904653 1598186 3130770
37353 3130770 632202 -2595146 -4728699 -5571115 -4311111 -2166721 -3586946 -9263571
37345 -9263571 -11829987 -5270453 4670707 7145477 929270 -5631319 -7750668 -8353431
37337 -8353431 -9531491 -9432868 -9096870 -13067314 -20135813 -21973928 -15125375 -6726784 -3476276
37328 -3476276 -2127773 3019024 9548427 11350938 9225121 9060403 11572686 11309771
37320 11309771 5543726 -2095130 -7430415 -10038613 -10722066 -9128244 -5711998 -2971943
37312 -2971943 -2800253 -4398855 -6049632 -7372439 -8620563 -8944743 -6826577 -2084509
$$ packed form
37370A651359j263578L180606M287929M78103k396556q53221N95014j938604m075236
37361c34184q78229L351889J521005l836040m101595J372501M502839J532584
37353C130770k498568l227348k133553q42416J260004K144390j420225n676625
37345i263571k566416O559534R941160K474770o216207o560589k119349o02763
37337h353431j178060R8623L35998l970444p068499j838115O848553Q398591L250508
37328c476276J348503N146797O529403J802511k125817j64718K512283k62915
37320A1309771n766045p638856n335285k608198o83453J593822L416246K740055
37312b971943J71690j598602j650777j322807j248124l24180K118166M742068
$$ plain form
37304 -2084509 3323255 6586061 5875722 1185018 -5746544 -11810837 -13803487 -10932195
37296 -10932195 -5935877 -2077985 711259 4275929 7109490 4993242 -1829338 -6931453
37288 -6931453 -6390885 -4551207 -6433599 -8953053 -6390679 -1149991 -588572 -4495381
37280 -4495381 -4809427 1462841 7890077 9421224 9097515 10201396 9390918 2971941 -5883746
37271 -5883746 -11675495 -13801461 -14401717 -13283414 -9910697 -6612756 -5034112 -3032140
37263 -3032140 288837 533059 -5498720 -12836020 -14009605 -9240531 -5067462 -4805584
37255 -4805584 -6188899 -6851626 -6288493 -3653971 493493 1389755 -4588174 -12257637 -12241136
37246 -12241136 -4080091 2029478 -1227402 -9075354 -12138728 -8015008 -1444886 3039503
$$ packed form
37304b084509N407764L262806p10339m690704o931562o064293j992650K871292
37296a0932195M996318L857892K789244L564670K833561k116248o822580n102115
37288f931453N40568J839678j882392k519454K562374N240688N61419l906809
37280d495381l14046O272268O427236J531147l23709J103881q10478o418977q855687
37271e883746n791749k125966o00256J118303L372717L297941J578644K001972
37263c032140L320977K44222o031779p337300j173585M769074M173069K61878
37255d805584j383315o62727N63133K634522M147464Q96262n977929p669463J6501
37246a2241136Q161045O109569l256880p847952l063374M123720O570122M484389
$$ plain form
37238 3039503 4124195 1967959 -2103245 -5426660 -7126323 -10160244 -16426921 -20920332
37230 -20920332 -16029168 -2816467 7204151 5225048 -3619167 -7378628 -3456989 -596810
37222 -596810 -4178107 -7874380 -4927687 -779445 -5610374 -17518472 -23502372 -18005270
37214 -18005270 -10549057 -10846603 -14892052 -12804010 -4625296 257532 -2836149 -8340314
37206 -8340314 -9271431 -5440819 -1390159 -701712 -4221424 -10583009 -16423592 -18207999
37198 -18207999 -15684986 -12410609 -11649108 -12614316 -11900743 -8282788 -4784601 -4979320 -7707331
37189 -7707331 -7647561 -2433303 3123062 3061045 -966705 -1565760 3654547 8383612 6666565
37180 6666565 1054318 -1643609 674440 4531395 6673414 6817038 5632304 3230964
$$ packed form
37238C039503J084692k156236m071204l323415j699663l033921o266677m493411
37230b0920332M891164J3212701J0020618j979103q844215l759461L921639K860179
37222e96810l581297l696273K946693M148242m830929j1908098n983900N497102
37214a8005270P456213k97546m045449K088042Q178714M882828l093681n504165
37206h340314r31117L830612M050660O88447l519712o361585n840583j784407
37198a8207999K523013L274377P61501r65208P13573L617955L498187j94719k728011
37189g707331N9770N214258N556365o2017m027750n99055N220307M729065j717047
37180F666565n612247k697927K318049L856955K142019J43624j184734k401340
$$ plain form
37172 3230964 -388263 -4956940 -9310523 -10537508 -5953249 2668339 9107237 8715540
37164 8715540 2665521 -4620878 -9424175 -9195012 -3245312 4560158 7549979 3696688
37156 3696688 -1906974 -4592444 -5931658 -8509303 -9708409 -6275480 -1439010 -819762
37148 -819762 -3277315 -2725474 1513678 3037632 -1751703 -7947970 -8981908 -5229381
37140 -5229381 -2786518 -5612924 -11314341 -14404416 -12548312 -8720747 -6538185 -4729069
37132 -4729069 739490 9148389 14129315 12046283 6762453 3221032 972114 -1876587
37124 -1876587 -3028889 -124233 3084613 1344896 -3488683 -5204678 -3340329 -3644548
37116 -3644548 -8486643 -13282174 -13467640 -9551714 -4100078 1290032 4647551 3805113
$$ packed form
37172C230964l619227m568677m353583j226985M584259Q621588O438898l91697
37164H715540o050019p286399m803297K29163N949700P805470K989821l853291
37156C696688n603662k685470j339214k577645j199106L432929M836470O19248
37148h19762k457553N51841M239152J523954m789335o196267j033938L752527
37140e229381K442863k826406n701417l090075J856104L827565K182562J809116
37132d729069N468559Q408899M980926k083032n283830l541421k248918k848701
37124a876587j152302K904656L208846j739717m833579j715995J864349l04219
37116c644548m842095m795531j85466L915926N451636N390110L357519q42438
$$ plain form
37108 3805113 -384367 -4501652 -7236881 -10209517 -13506251 -14239441 -10874503 -5908208
37100 -5908208 -2867963 -2665257 -3377452 -2046287 2533652 6967867 5326328 -2748446
37092 -2748446 -8578567 -4098215 6602199 11170064 4164095 -7268960 -13353719 -11934589
37084 -11934589 -7544693 -5015984 -5930569 -8214912 -8126439 -4835182 -2251845 -3447008
37076 -3447008 -5514599 -4661881 -3834607 -8430057 -15896957 -17933415 -13440825 -10572351
37068 -10572351 -13707152 -16873012 -13961723 -7877069 -4534084 -4194479 -4294426 -5378438
37060 -5378438 -8170723 -9163237 -5459959 -837105 -832435 -4058544 -4402395 -597212 2141490
37051 2141490 -32423 -4995574 -8704735 -10027393 -10075406 -9216481 -6687996 -2771247 -221497
$$ packed form
37108C805113m189480m117285k735229k972636l296734p33190L364938M966295
37100e908208L040245K02706p12195J331165M579939M434215j641539q074774
37092b748446n830121M480352J0700414M567865p005969j1433055o084759J419130
37084a1934589M389896K528709r14585k284343Q8473L291257K583337j195163
37076c447008k067591Q52718Q27274m595450p466900k036458M492590K868474
37068a0572351l134801l165860K911289O084654L342985L39605r9947j084012
37060e378438k792285r92514L703278M622854M670l226109l43851L805183K738702
37051B141490k173913m963151l709161j322658m8013Q58925K528485L916749K549750
$$ plain form
37042 -221497 -2202270 -7855532 -11378865 -8120874 -919407 2943547 947724 -2406403
37034 -2406403 -2888301 -1427381 -197353 1472372 4495505 7150885 7867728 7839392 8167226
37025 8167226 7490239 5160723 3490724 3739430 3133606 -505507 -4224950 -4268571 -2502002
37016 -2502002 -3795918 -8403291 -11604439 -10556453 -7410823 -5387817 -5142446 -5580895
37008 -5580895 -5605736 -4451568 -2345245 -1226049 -3036203 -6924322 -9604850 -8898561 -5898650
36999 -5898650 -3320415 -2355035 -1512325 1276654 5303226 6785844 3366627 -1794339
36991 -1794339 -2910051 1110997 4803393 2781875 -3802510 -8845779 -7815369 -1516359
36983 -1516359 5283348 7892901 5511443 1896518 1379912 3972293 5560519 2883408
$$ packed form
37042b21497j980773n653262l523333L257991P201467L862954j995823l354127
37034b406403m81898J460920J230028J669725L023133K655380P16843k8336L27834
37025H167226o76987k329516j669999K48706o05824l639113l719443m3621J766569
37016b502002j293916m607373l201148J047986L145630K023006K45371m38449
37008e580895k4841J154168K106323J119196j810154l888119k680528P06289K999911
36999e898650K578235R65380Q42710K788979M026572J482618l419217n160966
36991a794339j115712M021048L692396k021518o584385n043269J030410O299010
36983a516359O799707K609553k381458l614925n16606K592381J588226k677111
$$ plain form
36975 2883408 -3142511 -8755673 -10264582 -6267167 605737 4567562 2128383 -3315107
36967 -3315107 -5032401 -938980 4933781 8632987 10227147 11124778 11173616 9667940 6587595
36958 6587595 2212869 -2184944 -3746734 -1183010 2263551 2621402 761621 -157887
36950 -157887 -943726 -3970187 -6066473 -1837562 5795321 7303640 690677 -5110838
36942 -5110838 -4192091 -1757672 -3389074 -5333237 -2412341 2258339 3612298 4209997
36934 4209997 8630264 13447640 12149092 6412713 3330419 4091465 4465548 4393460 7437179
36925 7437179 11390335 9267820 1034004 -4300430 -994735 5935074 8534159 5606469
36917 5606469 1548925 -128794 779287 2268803 1687747 -1679092 -5040648 -5292652 -3153838
$$ packed form
36975B883408o025919n613162j508909L997415O872904L961825k439179n443490
36967c315107j717294M093421N872761L699206J594160Q97631M8838j505676l080345
36958F587595m374726m397813j561790K563724L446561L57851j859781r19508
36950a57887p85839l026461k096286M228911P632883J508319o612963n801515
36942e110838R18747K434419j631402j944163K920896M670680J353959N97699
36934D209997M420267M817376j298548n736379l082294P61046L74083p2088L043719
36925G437179L953156k122515q233816n334434L305695O929809K599085k927690
36917E606469m057544j677719R08081J489516n81056l366839l361556k52004K138814
$$ plain form
36908 -3153838 -1222967 766788 4628232 8675298 8970429 5504559 2212896 561981
36900 561981 -1792710 -5141519 -5803521 -2085455 2201916 2672615 -329745 -3347404 -4063266
36891 -4063266 -2375086 316449 1602693 99556 -2183841 -1916112 559676 1210897
36883 1210897 -1713190 -4670782 -3525970 942967 4156104 3156972 -550547 -3163687
36875 -3163687 -2832808 -1530066 -2261166 -4940615 -7053627 -8332260 -11039483 -14222820
36867 -14222820 -12623785 -5105772 559508 -2655526 -9965075 -10616809 -2880887 4893086
36859 4893086 7724409 9492029 13045183 13710739 7520143 -730206 -3601612 -972912
36851 -972912 1557667 1087744 -994485 -3568630 -6694302 -8880875 -7942610 -4566467 -1691119
$$ packed form
36908c153838J930871J989755L861444M047066K95131l465870l291663j650915
36900E61981k354691l348809o62002L718066M287371M70699l002360l017659p15862
36891d063266J688180K691535J286244j503137k283397K67729K475788O51221
36883A210897k924087k957592J144812M468937L213137r99132l707519k613140
36875c163687L30879J302742p31100k679449k113012j278633k707223l183337
36867a4222820J599035P518013N665280l215034p309549o51734P735922P773973
36859D893086K831323J767620L553154O65556o190596q250349k871406K628700
36851i72912K530579m69923k082229k574145l125672k186573R38265L376143K875348
$$ plain form
36842 -1691119 -433426 434731 1120812 82454 -2669878 -4247545 -2415272 1065665
36834 1065665 2301946 11157 -3051518 -3769043 -2579308 -2405970 -4167847 -5461188
36826 -5461188 -4437928 -2746399 -2638200 -2901784 -619058 3727519 6081696 4097886
36818 4097886 -82076 -3024065 -3518527 -1928276 1471250 5527751 7162951 3846845
36810 3846845 -2675967 -6748145 -4060079 3502171 9108669 7801611 1592172 -3351584
36802 -3351584 -4074977 -3245132 -3962928 -5134125 -3980441 -999546 400308 -1513232 -4754736
36793 -4754736 -5882587 -2934922 3202938 9050671 10913924 8288724 4460021 3305415
36785 3305415 6402792 12793234 19152382 20437959 14193517 5098093 1078841 3503047
$$ packed form
36842a691119J257693Q68157O86081j038358k752332j577667J832273L480937
36834A065665J236281k290789l062675p17525J189735J73338j761877j293341
36826e461188J023260J691529J08199k63584K282726M346577K354177j983810
36818D097886m179962k941989m94462J590251L399526M056501J635200l316106
36810C846845o522812m072178K688066P562250N606498j307058o209439m943756
36802c351584p23393Q29845p17796j171197J153684K980895J399854j913540l241504
36793d754736j127851K947665O137860N847733J863253k625200l828703j154606
36785C305415L097377O390442O359148J285577o244442r095424m019252K424206
$$ plain form
36777 3503047 6071088 5416129 6457539 12893951 18730483 16256438 7986226 2686282
36769 2686282 2404160 2024443 401614 2730487 10505911 17088228 16432346 10748237 6552272
36760 6552272 7069616 10723623 13931185 13809373 10588806 7906920 8573326 10879536 11772384
36751 11772384 11741544 12707888 13381854 11795003 10308768 12080504 14299455 11722912 5643831
36742 5643831 1916447 1027792 -1423712 -4524601 -1924549 6383564 11749930 9788107
36734 9788107 6910052 9536522 14639267 16198329 14226323 11823389 9041173 5155507
36726 5155507 2253156 1773612 1878319 2009041 4844792 9960725 11566004 7159414 2433031
36717 2433031 2441257 3901040 1963884 -1366596 -2041597 -1487658 -2269272 -1669430 2589029
$$ packed form
36777C503047K568041o54959J041410O436412N836532k474045q270212n299944
36769B686282k82122l79717j622829K328873P775424O582317o55882n684109m195965
36760F552272N17344L654007L207562j21812l220567k681886O66406K306210Q92848
36751A1772384l0840R66344O73966j586851j486235J771736K218951k576543o079081
36742E643831l727384q88655k451504l100889K600052Q308113N366366j961823
36734I788107k878055K626470N102745J559062j972006k402934k782216l885666
36726E155507k902351m79544J04707J30722K835751N115933J605279m406590m726383
36717B433031Q226J459783j937156l330480o75001N53939p81614N99842M258459
$$ plain form
36708 2589029 5296717 1330521 -3890893 -1400295 6533207 8996514 3025441 -2504647
36700 -2504647 -529386 5918959 11361207 15553396 19779484 21815364 19142573 13684425
36692 13684425 10078803 11115945 16060486 21457296 23483342 21732225 19929728 20498070
36684 20498070 20470877 16531934 11660558 11403694 15119211 16946090 14735629 11807930
36676 11807930 10119460 8340771 7146996 9334327 13130851 12452856 6554650 2884910
36668 2884910 6723421 13893911 18087348 19930752 23238905 26552346 25099229 19318017
36660 19318017 15235081 16245934 19187941 19482035 16823614 14478094 14933823 17416995
36652 17416995 18883467 16900043 11661999 5145553 -1096370 -6063886 -7905412 -5006400
$$ packed form
36708B589029K707688l966196n221414K490598P933502K463307n971073n530088
36700b504647J975261O448345N442248M192189M226088K035880k672791n458148
36692A3684425l605622J037142M944541N396810K026046j751117j802497N68342
36684B0498070k7193l938943m871376k56864L715517J826879k210461k927699
36676A1807930j688470j778689j193775K187331L796524o77995n898206l669740
36668B884910L838511P170490M193437J843404L308153L313441j453117n781212
36660A9318017m082936J010853K942007K94094k658421k345520M55729K483172
36652A7416995J466472j983424n238044o516446o241923m967516j841526K899012
$$ plain form
36644 -5006400 947763 5678664 7387433 8594473 11215894 12591304 9348091 3265828
36636 3265828 -280989 1070315 5007273 9130385 13437107 17533288 19226740 18162467
36628 18162467 18025436 22079104 28181657 31335284 30007985 26487715 21915825 15686732
36620 15686732 10236509 10777047 17323198 21977807 18955892 13495155 14663157 21860439
36612 21860439 25921258 22976843 19058386 19287306 20509216 18586838 16140610 17466948
36604 17466948 20779779 21456806 19366581 17247423 14938049 11228940 8967371 11958953
36596 11958953 18274909 22732691 24868943 28135711 31942806 31617032 27079619 24732362
36588 24732362 28425385 34075460 35812813 32846566 28014621 24262796 25082651 33371259
$$ packed form
36644e006400N954163M730901J708769J207040K621421J375410l243213o082263
36636C265828l546817J351304L936958M123112M306722M096181J693452j064273
36628A8162467j37031M053668O102553L153627j327299l520270m571890o229093
36620A5686732n450223N40538O546151M654609l021915n460737J168002P197282
36612B1860439M060819k944415l918457K28920J221910j922378k446228J326338
36604A7466948L312831O77027k090225k119158k309374l709109k261569K991582
36596A1958953O315956M457782K136252L266768L807095l25774m537413k347257
36588B4732362L693023N650075J737353k966247m831945l751825Q19855Q288608
$$ plain form
36580 33371259 45986616 53601024 50643999 42637444 39233011 42343172 46202820 47736129
36572 47736129 50788024 58786129 68117752 72197370 69990152 67287530 69757543 76950480
36564 76950480 83778993 86457278 85749045 84830849 85225903 85277574 82126401 74935915 66371232
36555 66371232 60621299 59461003 60777307 61661441 61704702 61486238 59372474 53488348 46639037
36546 46639037 44761433 49056088 53939042 55083776 55032456 57244460 58882088 54928900
36538 54928900 46817422 41016562 40108324 40801121 40482047 40294053 41030615 40850963 38562737
36529 38562737 35553312 33343488 32260033 32922634 35716057 38607661 39215291 39238679 42533393
36520 42533393 48090128 49658230 44055001 35508364 29548367 26737992 25373397 26574960
$$ packed form
36580C3371259J2615357P614408k957025q006555l404433L110161L859648J533309
36572D7736129L051895P998105R331623M079618k207218k702622K470013P192937
36564G6950480O828513K678285p08233r18196L95054N1671l151173p190486q564683
36555F6371232n749933j160296J316304Q84134M3261k18464k113764n884126o849311
36546D6639037j877604M294655M882954J144734n1320K212004J637628l953188
36538E4928900q111478n800860r08238O92797l19074j87994P36562j79652k288226
36529C8562737l009425k209824j083455O62601K793423K891604O07630K3388L294714
36520D2533393N556735J568102n603229q546637n959997k810375j364595J201563
$$ plain form
36512 26574960 32428599 40918849 46732592 47120480 44627505 43653023 45369525 46414602
36504 46414602 42862612 35650676 30596787 31571378 35503516 36902042 35550865 35691306
36496 35691306 38684285 41490067 42485489 43541388 45221494 44949615 41822534 38795674
36488 38795674 38095733 38637828 39783789 43015710 47590517 49367065 46911334 44128174
36480 44128174 43576469 42080688 37121978 32773501 33961166 38726584 42006698 43852900
36472 43852900 47448658 51389018 51319030 48751735 51050586 61094657 72581627 77842950
36464 77842950 76111578 71840627 68453983 66658103 66814666 70003716 76663381 85205353
36456 85205353 92381584 95729096 96205081 97345132 100836739 104274981 104667465 102559795
$$ packed form
36512B6574960N853639Q490250N813743L87888k492975r74482J716502J045077
36504D6414602l551990p211936n053889R74591L932138J398526j351177J40441
36496C5691306K992979K805782R95422J055899J680106k71879l127081l026860
36488C8795674o99941N42095J145961L231921M574807J776548k455731k783160
36480D4128174n51705j495781m958710m348477J187665M765418L280114J846202
36472D3852900L595758L940360o9988k567295K298851J0044071J1486970N261323
36464G7842950j731372m270951l386644j795880J56563L189050O659665Q541972
36456H5205353P176231L347512M75985J140051L491607L438242L92484k107670
$$ plain form
36448 102559795 100731687 100262183 100255534 100358749 100977159 101526105 100694518 98206806 94862147
36439 94862147 91612670 89858998 91138605 94754517 97283696 96376116 93380325 90279764
36431 90279764 86324056 80524908 75404132 74598677 77620863 80011433 78147733 71918978
36423 71918978 64115262 59190777 60391525 65549332 68210203 65660026 62636322 63752806
36415 63752806 66361100 65863072 63956435 64873752 66623678 63929555 58067116 55310736
36407 55310736 56187382 55000579 50625247 49031603 53287761 59222605 63194694 66082261
36399 66082261 67155701 62764851 54760541 51447408 55309166 58134408 53938087 48339819
36391 48339819 48242242 50368676 48638734 45791753 47594125 50893935 48327731 41521026
$$ packed form
36448A02559795j828108m69504o649J03215O18410N48946q31587k487712l344659
36439I4862147l249477j753672J279607L615912K529179r07580k995791l100561
36431I0279764l955708n799148n120776q05455L022186K390570j863700o228755
36423G1918978p803716m924485J200748N157807K660871k550177l023704J116484
36415F3752806K608294m98028j906637R17317J749926k694123n862439k756380
36407E5310736Q76646j186803m375332j593644M256158N934844L972089K887567
36399F6082261J073440m390850q004310l313133L861758K825242m196321n598268
36391D8339819r7577K126434j729942k846981J802372L299810k566204o806705
$$ plain form
36383 41521026 38818077 41694873 43787369 42798810 43434679 47816313 51744673 51705569 48296676
36374 48296676 42502108 35920041 34019933 40530973 48851013 48681566 41754889 40345444
36366 40345444 48277244 54884402 51913510 45212686 43556381 46079094 48230457 50922931
36358 50922931 55031905 54879297 47008074 38939301 39042667 43280245 42901506 40533040
36350 40533040 45931138 57846723 63406433 56986568 48155007 47353267 52987224 56894301
36342 56894301 55044403 48478949 39921179 33917520 35365865 43589486 51357146 52892300
36334 52892300 49678346 46253932 44201298 42845121 42215653 42421611 42782380 43619608 46218704
36325 46218704 49663526 50972081 49679263 48639399 48943789 48231642 45838596 45064245
$$ packed form
36383D1521026k702949K876796K092496r88559O35869M381634L928360l9104l408893
36374D8296676n794568o582067j900108O511040Q320040j69447o926677j409445
36366D0345444P931800O607158k970892o700824j656305K522713K151363K692474
36358E0922931M108974j52608p871223q068773J03366M237578l78739k368466
36350D0533040N398098J1915585N559710o419865q831561q01740N633957L907077
36342E6894301j849898o565454q557770o003659J448345Q223621P767660J535154
36334E2892300l213954l424414k052634j356177o29468K05958L60769Q37228K599096
36325D6218704L444822J308555j292818j039864L04390p12147k393046p74351
$$ plain form
36317 45064245 47653469 50212642 49217884 45911091 43212081 41474479 40467505 41645963
36309 41645963 44675067 45536268 42633186 41370186 47253421 56838159 61418350 58646003
36301 58646003 54647445 54285533 54737615 50812348 42984034 37270275 38309942 44435312
36293 44435312 49779918 50633896 48790293 48005815 48696039 48586223 47534354 47809018 49553623
36284 49553623 50415596 50417765 52251571 55438133 55913662 53544937 53480042 56618439 56106377
36275 56106377 48697083 42101083 43392810 46997557 44147158 38713358 41382712 51116795
36267 51116795 56039147 52846122 51457488 57174172 61492702 56970076 49697983 48211330
36259 48211330 49028447 43838626 35372501 34842831 45266358 56960180 60636184 57909890
$$ packed form
36317D5064245K589224K559173r94758l306793k699010j737602j006974J178458
36309D1645963L029104Q61201k903082j263000N883235R584738M580191k772347
36301E8646003l998558l61912M52082l925267p828314n713759J039667O125370
36293D4435312N344606Q53978j843603p84478O90224j09816j051869K74664J744605
36284D9553623Q61973K169J833806L186562M75529k368725o4895L138397n12062
36275E6106377p409294o596000J291727L604747k850399n433800K669354R734083
36267E1116795M922352l193025j388634N716684M318530m522626p272093j486653
36259D8211330Q17117n189821q466125n29670J0423527J1693822L676004k726294
$$ plain form
36251 57909890 56608357 60262085 64977504 65066010 60135097 55889779 56987468 60472986
36243 60472986 59958999 55838280 55518204 61858421 68053418 68114944 66179786 69155226 75037338
36234 75037338 76339541 72319009 69545940 71021521 72586936 71335896 70904143 75823603
36226 75823603 85389320 95817935 105180052 113775837 121685942 127861744 131093529 131739706
36218 131739706 132732427 137134136 143782780 148584171 152229915 161948629 180964190 200863486
36210 200863486 211674034 216381762 226641932 245512095 264436465 278029376 290999864
36203 290999864 306819915 319975449 326086057 331283829 343071521 357618328 364960185
36196 364960185 363247925 359302829 356892908 352461705 342353749 327806012 312291034
$$ packed form
36251E7909890j301533L653728M715419Q8506m930913m245318J097689L485518
36243F0472986n13987m120719l20076O340217O194997O1526j935158K975440N882112
36234G5037338J302203m020532k773069J475581J565415j251040m31753M919460
36226G5823603R565717J0428615R362117Q595785P910105O175802L231785O46177
36218A31739706R92721M401709O648644M801391L645744R718714J9015561J9899296
36210B00863486J0810548M707728J0260170J8870163J8924370J3592911J2970488
36203B90999864J5820051J3155534O110608N197772J1787692J4546807P341857
36196C64960185j712260l945096k409921m431203j0107956j4547737j5514978
$$ plain form
36189 312291034 298684514 288768617 281247814 271236239 255980004 239454416 226755699
36182 226755699 216524419 204760123 193254014 186489825 182166960 174044360 163670686
36175 163670686 158938998 159613234 155333242 141821979 128362682 123238338 121676359 115990071
36167 115990071 108672703 105815188 105069869 101267938 98210897 102591890 109937680 109560408
36159 109560408 101825851 97353381 99109642 99118633 95094391 95774191 104034335 108364059
36151 108364059 100301305 89225259 88490684 95258424 97026005 92903844 94275383 105225773
36143 105225773 115390429 115122796 107658968 101816870 100187931 99690796 98617452 97883702
36135 97883702 98016433 98824623 100443432 102182995 102115248 100071120 99392232 103312011 110614228
$$ packed form
36189C12291034j3606520r915897p520803j0011575j5256235j6525588j2698717
36182B26755699j0231280j1764296j1506109o764189m322865q122600j0373674
36175A63670686m731688O74236m279992j3511263j3459297n124344j561979n686288
36167A15990071p317368k857515p45319l801931l057041M380993P345790l77272
36159A09560408p734557m472470J756261Q991m024242O79800Q260144M329724
36151A08364059q062754j1076046p34575O767740J767581m122161J371539J0950390
36143A05225773J0164656k67633p463828n842098j628939m97135j073344p33750
36135I7883702J32731Q08190J618809J739563o7747k044128o78888L919779P302217
$$ plain form
36126 110614228 117068397 120693064 123579335 128303342 134352122 139425123 143403581 148820956
36118 148820956 156702767 164381565 169997147 177375326 192134939 212958474 231537048
36111 231537048 242867243 251214121 263372635 280347386 299094469 318165297 336849933
36104 336849933 352297775 363299605 374544363 390856377 408463256 418489832 419150012
36097 419150012 418152571 421597775 425849025 422746885 409204927 389773976 372299516 361667803
36089 361667803 355117107 343933600 323060340 298184474 278914344 265927968 251094972
36082 251094972 230764130 211640294 200493287 194427894 186146637 174394568 163915666
36075 163915666 157605963 153462716 148289311 141144341 133820328 129723910 130684006 133352800
$$ packed form
36126A10614228O454169L624667K886271M724007O048780N073001L978458N417375
36118A48820956P881811P678798N615582P378179J4759613K0823535J8578574
36111B31537048J1330195Q346878J2158514J6974751J8747083J9070828J8684636
36104C36849933J5447842J1001830J1244758J6312014J7606879J0026576O60180
36097D19150012r97441L445204M251250l102140j3541958j9430951j7474460j0631713
36089C61667803o550696j1183507k0873260k4875866j9270130j2986376j4832996
36082B51094972k0330842j9123836j1147007o065393q281257j1752069j0478902
36075A63915666o309703m143247n173405p144970p324013m096418R60096K668794
$$ plain form
36067 133352800 131193825 122035225 111132523 104516120 102010077 99552720 95658400 91870592
36059 91870592 88650010 84911011 81163343 79644776 80939873 82811123 82810741 80559735 77401811
36050 77401811 74942874 73704233 72354545 68940506 63942434 61322594 64885467 73366866
36042 73366866 80224551 79317173 71199263 63299537 62669487 68425602 72948882 70912159
36034 70912159 64633034 59380523 56789550 55640134 55822251 57349615 57854118 55623635
36026 55623635 53153661 53039346 52731954 49068645 45705539 48928283 57241503 62660882
36018 62660882 61903040 58540672 54479621 48347403 42943174 44178613 50202218 51544202
36010 51544202 45510712 40457302 41599169 43225277 40678904 39024998 42014323 43018805
$$ packed form
36067A33352800k158975r158600j0902702o616403k506043k457357l894320l787808
36059I1870592l220582l738999l747668j518567J295097J871250l82k251006l157924
36050G7401811k458937j238641j349688l414039m998072k619840L562873Q481399
36042G3366866O857685r07378q117910p899726o30050N756115M523280k036723
36034G0912159o279125n252511k590973j149416J82117J527364N04503k230483
36026E5623635k469974j14315l07392l663309l363106L222744Q313220N419379
36018F2660882p57842l362368m061051o132218n404229J235439O023605J341984
36010E1544202o033490n053410J141867J626108k546373j653906K989325J004482
$$ plain form
36002 43018805 36823444 31102285 34722399 42320799 42857924 37358202 35207611 37550799
35994 37550799 37830398 35624439 36186552 37836433 33634806 25725006 24558921 32036594
35986 32036594 37900893 35905712 32171642 33611320 38244602 41359393 42405926 41561182
35978 41561182 37454200 32243081 31588214 36019033 39162607 37364013 34138196 32854539
35970 32854539 32515766 32920770 35972576 39697989 39560568 37800478 41709803 49941822
35962 49941822 51641335 43497898 35973026 36402648 37675736 31986075 24719588 24292999
35954 24292999 27636578 27309556 25325519 27861104 32466734 32804184 31103545 33603906
35946 33603906 37737263 36538063 32770412 35539682 44267710 48914807 46057883 42446604
$$ packed form
36002D3018805o195361n721159L620114P598400N37125n499722k150591K343188
35994C7550799K79599k205959N62113J649881m201627p909800j166085P477673
35986C2036594N864299j995181l734070J439678M633282L114791J046533q44744
35978D1561182m106982n211119o54867M430819L143574j798594l225817j283657
35970C2854539l38773M05004L051806L725413j37421j760090L909325Q232019
35962D9941822J699513q143437p524872M29622J273088n689661p266487m26589
35954B4292999L343579l27022j984037K535585M605630L37450j700639K500361
35946C3603906M133357j199200l767651K769270Q728028M647097k856924l611279
$$ plain form
35938 42446604 41830185 40254813 36136458 33513565 32966550 30329243 26929504 29761550
35930 29761550 38189523 42149425 38021034 34418422 36363634 36005368 27494464 19555306
35922 19555306 21974543 28672478 27117827 18297203 13836426 17006325 20259801 20461850
35914 20461850 23133188 29964971 34285783 32735765 31249411 34605174 38683856 38609887
35906 38609887 37001207 37651015 37290731 31208377 22820144 19814293 23023975 26505756
35898 26505756 27637721 29735667 33992267 35918730 32617760 28174388 28005922 31635549
35890 31635549 35112127 37712235 41385618 44859163 43596654 36612720 29169312 26564964
35882 26564964 28169939 30019685 30737362 31479598 31613466 28778295 23527566 20050740
$$ packed form
35938D2446604o16419j575372m118355k622893n47015k637307l399739K832046
35930B9761550Q427973L959902m128391l602612J945212l58266q510904p939158
35922A9555306K419237O697935j554651q820624m460777L169899L253476K02049
35914B0461850K671338O831783M320812j550018j486354L355763M078682p3969
35906C8609887j608680O49808l60284o082354q388233l005851L209682L481781
35898B6505756J131965K097946M256600J926463l300970m443372j68466L629627
35890C1635549L476578K600108L673383L473545j262509o983934p443408k604348
35882B6564964J604975J849746P17677P42236J33868k835171n250729l476826
$$ plain form
35874 20050740 20889959 24019169 26686530 28799981 30151678 27990600 21573865 16397161
35866 16397161 18232013 23980851 24783700 18984722 15456423 21177112 31434903 37091529
35858 37091529 36949226 36769271 38740518 38785222 34166842 28033300 25155093 26960061 31448010
35849 31448010 34811461 33294100 27054514 21770355 22295654 25434902 24268050 19218592
35841 19218592 17925440 22896106 27013923 24816020 20866116 21429481 24223002 23694812
35833 23694812 21759385 24702474 31577594 34139596 28525283 20113726 15766876 16791392
35825 16791392 20532193 23913432 24313613 21384022 19036136 21751354 28448759 33939453
35817 33939453 36353565 38300379 40414324 39422597 34289791 29160459 27730261 28695848
$$ packed form
35874B0050740Q39219L129210K667361K113451J351697k161078o416735n176704
35866A6397161J834852N748838Q02849n798978l528299N720689J0257791N656626
35858C7091529j42303j79955J971247M4704m618380o133542k878207J804968M487949
35849C1448010L363451j517361o239586n284159N25299L139248j166852n049458
35841A9218592j293152M970666M117817k197903l949904N63365K793521n28190
35833B3694812j935427K943089O875120K562002n614313q411557m346850J024516
35825A6791392L740801L381239M00181k929591k347886K715218O697405N490694
35817C3939453K414112J946814K113945r91727n132806n129332j430198R65587
$$ plain form
35809 28695848 28893972 27272789 24032382 19710622 16879648 18746964 24151778 27878304
35801 27878304 27712627 26938144 28051967 29046819 28585653 29576793 33722227 37089410 35514580
35792 35514580 30711908 26970440 25585523 26655040 31975578 40794977 46556498 44164764
35784 44164764 37858140 35666908 38115703 38661390 33780186 26328056 19927288 16195126
35776 16195126 16753495 21678349 26313042 25811587 22498577 22318502 24609998 23104290
35768 23104290 17312574 14112438 16064017 17204973 14086144 12057511 15304976 19201931
35760 19201931 19548856 21356712 29309984 36355929 33306108 25370259 25860002 34531216
35752 34531216 36225131 23976173 10332686 9096333 16614073 20356990 18112955 17782331
$$ packed form
35809B8695848J98124j621183l240407m321760k830974J867316N404814L726526
35801B7878304j65677p74483J113823R94852m61166R91140M145434L367183j574830
35792C5514580m802672l741468j384917J069517N320538Q819399N761521k391734
35784D4164764o306624k191232K448795N45687m881204p452130o400768l732162
35776A6195126N58369M924854M634693n01455l313010j80075K291496j505708
35768B3104290n791716l200136J951579J140956l118829k028633L247465L896955
35760A9201931L46925J807856P953272P045945l049821p935849M89743Q671214
35752C4531216J693915j2248958j3643487j236353P517740L742917k244035l30624
$$ plain form
35744 17782331 22567181 27459247 29259614 30220924 31037906 28902780 24453082 23012623
35736 23012623 26175719 28928855 28341725 28614884 33325264 38624230 39337799 36753970
35728 36753970 34534492 31497218 25577286 21550424 26282206 37027796 42518762 36975112
35720 36975112 26476323 19717986 18562520 20235578 23184422 26879853 29710060 30898972
35712 30898972 32084320 34231025 35298830 33337179 29632104 26675798 25305928 25744324
35704 25744324 28803931 33707353 37023716 36166967 32136443 27208471 22493741 19480208
35696 19480208 20535828 24977397 27783228 25875317 23194899 25531287 32143771 36689744
35688 36689744 35423616 30612167 26421709 24893716 25579118 26079701 23494834 18217900
$$ packed form
35744A7782331M784850M892066J800367R61310Q16982k135126m449698j440459
35736B3012623L163096K753136n87130K73159M710380N298966P13569k583829
35728C6753970k219478l037274n919932m026862M731782J0745590N490966n543650
35720C6975112j0498789o758337j155466J673058K948844L695431K830207J188912
35712C0898972J185348K146705J067805j961651l705075k956306j369870M38396
35704B5744324L059607M903422L316363q56749m030524m927972m714730l013533
35696A9480208J055620M441569K805831j907911k680418K336388O612484M545973
35688C6689744j266128m811449m190458j527993O85402N00583k584867n276934
$$ plain form
35680 18217900 15332846 18875334 25584663 28290174 25214553 21706539 22232874 24889772
35672 24889772 25495567 23605373 21964893 22138848 23176190 23806499 24210292 25538410 28219043
35663 28219043 30932596 31839557 31095014 30879017 32078009 32731554 31517729 30907691 34118839
35654 34118839 40135649 44732571 45689265 44031816 40810969 36063370 30896818 27321646
35646 27321646 25620081 24526412 23877942 24213121 24238443 22338914 20408649 21974545 26202772
35637 26202772 28413408 27469663 27492057 30233895 31141513 26602418 20595103 19540734 23799204
35628 23799204 28945992 32785745 35946791 37370388 34819900 29528168 25516800 24161140
35620 24161140 23552628 22994031 23534395 24077843 22268537 20064056 22621873 29565020 33333271
$$ packed form
35680A8217900k885054L542488O709329K705511l075621l508014N26335K656898
35672B4889772O05795j890194j640480J73955J037342O30309M03793J328118K680633
35663B8219043K713553R06961p44543k15997J198992O53545j213825o10038L211148
35654C4118839O016810M596922R56694j657449l220847m747599n166552l575172
35646B7321646j701565j093669o48470L35179K5322j899529j930265J565896M228227
35637B6202772K210636r43745K2394K741838R07618m539095o007315j054369M258470
35628B3799204N146788L839753L161046J423597k550488n291732m011368j355660
35620B4161140o08512n58597N40364N43448j809306k204481K557817O943147L768251
$$ plain form
35611 33333271 29853477 25167837 26173224 29803188 28681178 24055872 23942644 28961438
35603 28961438 29830699 21856224 13282627 13707431 20717594 25009161 24319286 24264253 27260350
35594 27260350 28722122 25190748 19894676 18110990 21357542 27863859 35034407 39862736
35586 39862736 40275201 37736949 35951421 36107755 36107910 34701148 32855509 30748902 27678086
35577 27678086 25653050 28056020 33087995 33901979 28099986 22122043 22604309 27954981
35569 27954981 32631509 35354847 37992581 39941950 39379520 37713896 37423919 37374615 35295278
35560 35295278 32921600 33459489 35833703 36916047 37511311 39954910 41500032 37477311
35552 37477311 30588090 29149506 34908305 40178095 39440180 36510519 36523300 37545758
$$ packed form
35611C3333271l479794m685640J005387L629964j122010m625306j13228N018794
35603B8961438Q69261p974475q573597M24804P010163M291567o89875n5033K996097
35594B7260350J461772l531374n296072j783686L246552O506317P170548M828329
35586C9862736M12465k538252j785528J56334J55j406762j845639k106607l070816
35577B7678086k025036K402970N031975Q13984n801993n977943M82266N350672
35569B7954981M676528K723338K637734J949369n62430j665624k89977m9304k079337
35560C5295278k373678N37889K374214J082344N95264K443599J545122m022721
35552C7477311o889221j438584N758799N269790p37915k929661J2781J022458
$$ plain form
35544 37545758 35579414 32903793 34999539 41516335 46023237 44322591 38938026 35062163
35536 35062163 34639197 34926600 31895836 25254959 19957271 21073856 27269234 32059507
35528 32059507 31893361 29532939 28410347 27906858 26884044 27993561 34187984 42987518
35520 42987518 48456699 48319579 45886032 45143895 46560610 47703638 45979194 40925732
35512 40925732 35515405 34736797 40932337 50529240 56876580 56337838 50679566 44351099
35504 44351099 41245064 43528274 50754851 58757743 61335182 55629107 45987669 40487758
35496 40487758 42439924 46667951 45867627 39501596 33762846 33231743 36150124 38625150
35488 38625150 39439047 38694876 35831118 32341660 32827173 39049901 45912521 47932462
$$ packed form
35544C7545758j966344k675621K095746O516796M506902j700646n384565l875863
35536C5062163m22966K87403l030764o640877n297688J116585O195378M790273
35528C2059507j66146k360422j122592n03489j022814J109517O194423Q799534
35520D2987518N469181j37120k433547p42137J416715J143028j724444n053462
35512D0925732n410327p78608O195540R596903O347340n38742n658272o328467
35504D4351099l106035K283210P226577Q002892K577439n706075r641438n499911
35496D0487758J952166M228027q00324o366031n738750n31103K918381K475026
35488C8625150Q13897p44171k863758l489458M85513O222728O862620K019941
$$ plain form
35480 47932462 46675648 46432017 45951476 41803620 37418032 39563580 46216867 47820989
35472 47820989 42310028 38896620 43234926 48554749 47349361 43062617 42452245 43644548
35464 43644548 41032775 36876961 37979755 43452246 45358936 40817074 35006120 31972106
35456 31972106 30213482 28450852 28663270 31311072 33371512 33466956 34159902 36850240 38485428
35447 38485428 35865168 30349719 26296938 26659012 30801983 34831078 34524945 30506463
35439 30506463 29364319 35858890 45059989 47356058 41360602 36114589 38899396 46392795
35431 46392795 50860535 50324180 48366421 47136106 45476847 43010359 41972754 44121112
35423 44121112 47728912 48698844 44777094 38768340 36507946 40167218 44792867 44204914
$$ packed form
35480D7932462j256814k43631m80541m147856m385588K145548O653287J604122
35472D7820989n510961l413408M338306N319823j205388m286744o10372J192303
35464D3644548k611773m155814J102794N472491J906690m541862n810954l034014
35456C1972106j758624j762630K12418K647802K060440R5444O92946K690338J635188
35447C8485428k620260n515449m052781L62074M142971M029095l06133m018482
35439C0506463j142144O494571R201099K296069n995456n246013K784807P493399
35431D6392795M467740n36355j957759j230315j659259k466488j037605K148358
35423D4121112L607800R69932l921750o008754k260394L659272M625649n87953
$$ plain form
35415 44204914 39384674 37075428 40115612 44019728 44595174 43905821 45510452 48019651
35407 48019651 47715423 44620082 41330017 37993824 33597748 31014977 34875208 43660900
35399 43660900 49337595 47209697 41848440 39974213 40988847 39280678 34168591 31793214
35391 31793214 35840516 41168622 40328093 33935259 30025599 33206617 38717752 39180396
35383 39180396 34177093 29964213 31090688 35802405 39976483 42483514 44872928 47489073
35375 47489073 48441890 46781568 45005872 46619539 50970062 52295667 45959788 35131766
35367 35131766 28532357 30711069 37301202 41703212 43509375 46705949 51407942 52485828
35359 52485828 47173258 39800533 36668130 38761239 41817771 41999780 39478346 37387905
$$ packed form
35415D4204914m820240k309246L040184L904116N75446o89353J604631K509199
35407D8019651l04228l095341l290065l336193m396076k582771L860231Q785692
35399D3660900N676695k127898n361257j874227J014634j708169n112087k375377
35391C1793214M047302N328106q40529o392834l909660L181018N511135M62644
35383C9180396n003303m212880J126475M711717M174078K507031K389414K616145
35375D7489073R52817j660322j775696J613667M350523J325605o335879j0828022
35367C5131766o599409K178712O590133M402010J806163L196574M701993J077886
35359E2485828n312570p372725l132403K093109L056532J82009k521434k090441
$$ plain form
35351 37387905 38744345 43604293 48326676 48879561 45840077 44369949 47644067 52131009
35343 52131009 51847200 45953874 39036877 34576246 32087334 31318669 34626828 41974751
35335 41974751 46979306 43162544 33425405 27997058 31621119 37654261 37951382 34234079
35327 34234079 34293956 39379096 42309248 38790652 34034318 34877198 40257628 44042146
35319 44042146 43935897 42277986 39814768 34696088 28262971 26539296 33136406 43536421
35311 43536421 49399099 47547457 42510077 40255567 41057724 39792890 33400704 26506110
35303 26506110 27046648 35849538 43829363 42333268 33962898 28946672 31679616 36027916
35295 36027916 35329380 32079175 33685635 41262238 47615142 46556762 40156574 34819135
$$ packed form
35351C7387905J356440M859948M722383N52885l039484j470128L274118M486942
35343E2131009k83809n893326o916997m460631k488912p68665L308159P347923
35335D1974751N004555l816762r737139n428347L624061O033142K97121l717303
35327C4234079N9877N085140K930152l518596m756334Q42880N380430L784518
35319D4042146j06249j657911k463218n118680o433117j723675O597110J0400015
35311D3536421N862678j851642n037380k254510Q02157j264834o392186o894594
35303B6506110N40538Q802890P979825j496095q370370n016226K732944M348300
35295C6027916o98536l250205J606460P576603O352904j058380o400188n337439
$$ plain form
35287 34819135 33060539 32551666 32072876 33772987 37909615 39632640 35317957 29609359
35279 29609359 30236832 36183416 37870120 31308228 25144387 28633945 38263428 43446759
35271 43446759 41856253 40650685 43750017 46894057 46841860 47168791 50915949 53787225
35263 53787225 49995665 41262426 35265132 37094481 45504256 55516480 61645406 60491503
35255 60491503 53510818 46480943 44055830 45491775 46648031 44453987 38561256 31171332
35247 31171332 26576165 28093103 33844621 38332246 39425280 40091335 41727342 40986498
35239 40986498 36563528 33729282 36769936 41323360 40754044 36756587 36112359 39126139
35231 39126139 39760525 36752631 35712928 38830283 41218857 40462986 41258611 45696859
$$ packed form
35287C4819135j758596n08873m78790J700111M136628J723025m314683n708598
35279B9609359O27473N946584J686704o561892o163841L489558R629483N183331
35271D3446759j590506j205568L099332L144040n2197L26931L747158K871276
35263E3787225l791560q733239n997294J829349Q409775J0012224O128926j153903
35255F0491503o980685p029875k425113J435945J156256k194044n892731p389924
35247C1171332m595167J516938N751518M487625J093034O66055J636007p40844
35239D0986498m422970k834246L040654M553424n69316l997457o44228L013780
35231C9126139O34386l007894j039703L117355K388574p55871P95625M438248
$$ plain form
35223 45696859 46913266 39672811 31121739 31928284 40174845 43806545 38373157 32602537
35215 32602537 34121266 38309342 36429407 28864600 23936232 26414738 32877221 37567326
35207 37567326 38451890 37533185 38344226 43004743 49360217 52017681 49040095 46064518
35199 46064518 49548194 56906400 58977293 52852084 45841918 44067285 43738922 39130447
35191 39130447 33671950 35039229 41843872 44330252 38975129 33961440 37010244 44769723
35183 44769723 49030110 48111758 46250743 45172964 42707737 38635664 36187777 37023702
35175 37023702 38729985 38509597 36808425 36223407 38149879 40947338 41114896 37248556
35167 37248556 33054208 33971429 39706582 43501483 41179250 37142263 37606241 41612301
$$ packed form
35223D5696859J216407p240455q551072Q06545Q246561L631700n433388n770620
35215C2602537J518729M188076j879935p564807m928368K478506O462483M690105
35207C7567326Q84564r18705Q11041M660517O355474K657464k977586k975577
35199D6064518L483676P358206K070893o125209p010166j774633l28363m608475
35191C9130447n458497J367279O804643K486380n355123n013689L048804P759479
35183D4769723M260387r18352j861015j077779k465227m072073k447887Q35925
35175C7023702J706283k20388j701172n85018J926472K797459J67558l866340
35167C7248556m194348R17221N735153L794901k322233m036987M63978M006060
$$ plain form
35159 41612301 44113425 44834319 47042451 49208144 46072293 38531049 34454433 37531832
35151 37531832 42614320 44927934 46394554 48709935 47801272 41497669 36446947 39705978
35143 39705978 47787058 51762787 49726186 46112886 41791968 34394343 27142314 27051216
35135 27051216 33350046 37349029 35958162 35655712 39525919 40523826 33873125 27043672
35127 27043672 28706335 34750866 35434542 31693399 33148088 41864682 49272214 49794088
35119 49794088 47305129 45866820 43556649 39210558 36725636 37672757 37130309 32733314
35111 32733314 31011020 37421656 45734580 46076922 39839600 37032637 40483300 42810021
35103 42810021 40039149 38232862 42595662 48274401 48151683 44044574 43080056 46218647
$$ packed form
35159D1612301K501124P20894K208132K165693l135851p541244m076616L077399
35151C7531832N082488K313614J466620K315381r08663o303603n050722L259031
35143C9705978Q081080L975729k036601l613300m320918p397625p252029r1098
35135B7051216O298830L998983j390867l02450L870207R97907o650701o829453
35127B7043672J662663O044531O83676l741143J454689Q716594P407532N21874
35119D9794088k488959j438309k310171m346091k484922R47121n42448m396995
35111C2733314j722294O410636Q312924L42342o237322k806963L450663K326721
35103D2810021k770872j806287M362800N678739j22718m107109r64518L138591
$$ plain form
35095 46218647 47600756 44361437 40456167 39607328 39787678 37306764 32850343 30294263
35087 30294263 31219241 33452834 34576509 34493607 34029468 32819202 30124665 27164065 26762230
35078 26762230 29866443 33671894 34664951 32791241 30781445 29834385 28630975 27107873
35070 27107873 28054825 32897303 38405764 40693247 40920176 43273894 47748935 49231475
35062 49231475 45058767 39719020 39263636 43506500 47142333 47315098 46279623 46413738
35054 46413738 46377766 44117690 40968462 39774361 40087757 38531059 34339973 31625491
35046 31625491 34308659 40556582 44622176 43635556 40238810 38260610 38160712 38154847 38056754
35037 38056754 39466435 42289126 43425656 40170308 33755675 28148983 25783729 25713396
$$ packed form
35095D6218647J382109l239319l905270q48839J80350k480914m456421k556080
35087C0294263R24978K233593J123675q2902m64139j210266k694537k960600m01835
35078B6762230L104213L805451R93057j873710k009796r47060j203410j523102
35070B7107873R46952M842478N508461K287483K26929K353718M475041J482540
35062D9231475m172708n339747m55384M242864L635833J72765j035475J34115
35054D6413738l5972k260076l149228j194101L13396j556698m191086k714482
35046C1625491K683168O247923M065594r86620l396746j978200r9898n865r8093
35037C8056754J409681K822691J136530l255348o414633n606692k365254p0333
$$ plain form
35029 25713396 25778044 25178784 24615598 25256096 28264629 34009745 40605457 44535742 44466355
35020 44466355 43477803 45336376 49173267 50507902 47321211 41917451 36508175 31095103
35012 31095103 27282131 29296407 37194686 42930848 39084755 29719267 26189836 32252009
35004 32252009 39787309 40734069 36708044 33333147 30939091 26755970 22840241 24886371
34996 24886371 33395012 41560343 43283422 39487149 34986341 32282080 30721406 29800695
34988 29800695 30522241 33549361 37770620 41372549 43488819 43929339 41951024 37235777
34980 37235777 32570169 32865907 39033716 44981219 44683941 40969504 41926180 48531106
34972 48531106 52490196 48671909 42701916 41417137 42185970 38937454 33939019 34358247
$$ packed form
35029B5713396O4648n99260n63186O40498L008533N745116O595712L930285o9387
35020D4466355r88552J858573L836891J334635l186691n403760n409276n413072
35012C1095103l812972K014276P898279N736162l846093r365488l529431O062173
35004C2252009P535300R46760m026025l374897k394056m183121l915729K046130
34996B4886371Q508641Q165331J723079l796273m500808k704261j560674r20711
34988B9800695P21546L027120M221259L601929K116270M40520j978315m715247
34980C7235777m665608K95738O167809N947503k97278l714437R56676O604926
34972D8531106L959090l818287n969993j284779P68833l248516m998435M19228
$$ plain form
34964 34358247 39453812 41209667 37932807 37218766 42745557 47454100 44828243 39222952
34956 39222952 38493424 42150959 44050576 42903780 42612685 44082807 43667156 39543147
34948 39543147 34206181 30497871 29447475 31679541 36699992 41150297 42039480 41429263
34940 41429263 43581413 47744695 48618602 44228948 38210798 33439711 29037281 25730263
34932 25730263 28240903 38056383 48144449 50225438 45108056 40862522 41959104 45200170
34924 45200170 46359900 45773728 45475266 44818462 42434452 40555018 43240562 49695109
34916 49695109 52616325 45897784 32947231 24353581 26460183 34511691 38750603 35427851
34908 35427851 29242334 26081966 26912609 29381981 32121483 35190492 37906336 38750656
$$ packed form
34964C4358247N095565J755855l276860p14041N526791M708543k625857n605291
34956C9222952p29528L657535J899617j146796k91095J470122m15651m124009
34948C9543147n336966l708310j050396K232066N020451M450305Q89183o10217
34940D1429263K152150M163282Q73907m389654o018150m771087m402430l307018
34932B5730263K510640R815480J0088066K080989n117382m245534J096582L241066
34924D5200170J159730n86172k98462o56804k384010j879434K685544O454547
34916D9695109K921216o718541j2950553q593650K106602Q051508M238912l322752
34908C5427851o185517l160368Q30643K469372K739502L069009K715844Q44320
$$ plain form
34900 38750656 37531609 36236753 36964707 39155685 39672448 36700757 33212396 34234977
34892 34234977 39876675 44243140 43800450 43297067 48449636 55256460 53804155 42893952
34884 42893952 33222109 33353840 39546381 43702285 44633705 44976610 42587316 34090938
34876 34090938 24701940 25044679 36861304 49112913 50854894 42818335 33899651 30635158
34868 30635158 32841350 36368081 37474776 36002684 34988842 35672545 34398541 28275949
34860 28275949 22186926 23761227 31321183 34531950 29385009 24463126 27439498 32930334
34852 32930334 31452782 24883343 23264308 28635849 32278984 28966950 24757706 26994467
34844 26994467 33581920 37237337 35812477 33137456 32175938 32151429 31456650 29561256 26293615
$$ packed form
34900C8750656j219047j294856P27954K190978N16763k971691l488361J022581
34892C4234977N641698M366465m42690n03383N152569O806824j452305j0910203
34884D2893952r671843J31731O192541M155904R31420L42905k389294q496378
34876C4090938r388998L42739J1816625J2251609J741981q036559q918684l264493
34868C0635158K206192L526731J106695j472092j013842O83703j274004o122592
34860B8275949o089023J574301P559956L210767n146941m921883K976372N490836
34852C2930334j477552o569439j619035N371541L643135l312034m209244K236761
34844B6994467O587453L655417j424860k675021r61518k4509o94779j895394l267641
$$ plain form
34835 26293615 22273403 20087067 22378504 28282095 33827115 36488662 37552522 39273737
34827 39273737 41604919 43170151 43926422 44653164 44532475 41899159 37660299 35186568
34819 35186568 35567419 35663627 32987024 29888256 29655801 30755364 29597310 27757233 30569071
34810 30569071 38001148 43126605 42030129 39478470 41039905 44766871 45621814 43734952
34802 43734952 42273897 40554018 36245214 32398731 34721593 42072257 46757926 45138444
34794 45138444 41339382 39041616 36435145 32214926 30333682 34306581 41017898 44446484
34786 44446484 42576925 37413957 31530738 28090241 30760489 39010298 45731947 44103988
34778 44103988 35791648 28800628 28257538 32442829 36613367 37325765 33924297 29125955
$$ packed form
34835B6293615m020212k186336K291437N903591N545020K661547J063860J721215
34827C9273737K331182J565232P56271P26742j20689k633316m238860k473731
34819C5186568L80851R6208k676603l098768k32455J099563j158054j840077K811838
34810C0569071P432077N125457j096476k551659J561435L726966Q54943j886862
34802D3734952j461055j719879m308804l846483K322862P350664M685669j619482
34794D5138444l799062k297766k606471m220219j881244L972899O711317L428586
34786D4446484j869559n162968n883219l440497K670248Q249809O721649j627959
34778D4103988q312340o991020n43090M185291M170538P12398l401468m798342
$$ plain form
34770 29125955 27673128 31558954 37062305 38912576 36485859 33486033 32892124 35104436
34762 35104436 39516166 44278856 45729786 42272296 38273228 39673304 45687575 49462743
34754 49462743 47619904 44248657 43695930 44180381 41745237 36891548 33331662 32275805
34746 32275805 31722750 30425367 29391330 29782794 31682381 34577961 37100751 36901793
34738 36901793 33031237 28244229 26868431 30210488 35561059 39467609 40297206 38117106
34730 38117106 34629099 33463017 37619627 45184682 49870743 47753347 41739932 37328130
34722 37328130 35825891 34803137 33813041 35249473 39184325 41910043 41574075 41210119
34714 41210119 43149742 44260943 41300812 37902008 39856199 44643346 43131009 33161763
$$ packed form
34770B9125955j452827L885826N503351J850271k426717k999826n93909K212312
34762C5104436M411730M762690J450930l457490l999068J400076O014271L775168
34754D9462743j842839l371247n52727M84451k435144m853689l559886j055857
34746C2275805n53055j297383j034037L91464J899587K895580K522790j98958
34738C6901793l870556m787008j375798L342057N350571L906550Q29597k180100
34730C8117106l488007j166082M156610P565055M686061k117396o013415m411802
34722C7328130j502239j022754r90096J436432L934852K725718l35968l63956
34714D1210119J939623J111201k960131l398804J954191M787147j512337r969246
$$ plain form
34706 33161763 24268770 25101615 32175697 36404340 35953347 35810174 37661831 38070627 36180144
34697 36180144 35738678 38029662 39170030 36804545 33932364 33154615 32342781 29858263
34689 29858263 29232954 33442746 38221748 37390133 32796925 32086828 36796635 39727949
34681 39727949 36050659 30504528 29611928 32006234 32236651 30822221 33445320 40726666
34673 40726666 45850115 44368912 40468467 39888933 41557125 41437300 41055507 45261214
34665 45261214 52654561 55671303 51630883 46923451 46998391 48370715 45713362 41802218
34657 41802218 43189228 48710860 50466299 46160327 42423517 43528432 44222258 38703640
34649 38703640 31209557 30793841 37932934 43303995 40433619 33857067 32178730 36850386
$$ packed form
34706C3161763q892993Q32845P074082M228643m50993j43173J851657M08796j890483
34697C6180144m41466K290984J140368k365485k872181p77749q11834k484518
34689B9858263o25309M209792M779002q31615m593208p10097M709807K931314
34681C9727949l677290n546131q92600K394306K30417j414430K623099P281346
34673D0726666N123449j481203l900445n79534J668192j19825l81793M205707
34665D5261214P393347L016742m040420m707432P4940J372324k657353l911144
34657D1802218J387010N521632J755439m305972l736810J104915O93826n518618
34649C8703640p494083m15716P139093N371061k870376o576552j678337M671656
$$ plain form
34641 36850386 41525389 41120792 37896608 37670066 42214404 47482007 48942091 46482119
34633 46482119 42883847 39161831 34059999 28112987 25283070 28633638 35682060 40185962
34625 40185962 38651159 33855972 31483651 33771305 37121638 36478566 31784323 28537218
34617 28537218 30933430 36276634 38723490 37347995 36704321 39376674 42412719 42634734
34609 42634734 40966042 38600255 33279231 24086927 16678433 17634381 24860856 29717162
34601 29717162 28704091 26862055 28330293 29969769 27686124 23679179 22517196 23655890
34593 23655890 23353170 22025526 24024126 30271699 36151264 37935442 37454210 38419098
34585 38419098 40732689 40760451 36240136 29406114 25384249 27637369 34342791 39461387
$$ packed form
34641C6850386M675003m04597l224184k26542M544338N267603J460084k459972
34633D6482119l598272l722016n101832n947012k829917L350568P048422M503902
34625D0185962j534803m795187k372321K287654L350333o43072m694243l247105
34617B8537218K396212N343204K446856j375495o43674K672353L036045K22015
34609D2634734j668692k365787n321024r192304p408494R55948P226475M856306
34601B9717162j013071j842036J468238J639476k283645m006945j161983J138694
34593B3655890l02720j327644J998600O247573N879565J784178m81232R64888
34585C8419098K313591K7762m520315o834022m021865K253120O705422N118596
$$ plain form
34577 39461387 38402547 32481610 26907285 25120574 26603570 29304878 31628948 31986490
34569 31986490 29051639 23567013 18334823 15696572 16035133 18390397 20732641 20288888
34561 20288888 16464648 13203712 14875319 19538167 20639451 16567908 13437656 15819998
34553 15819998 20219219 22264579 25034575 33057882 41486155 40322706 29281973 19630642
34545 19630642 18925888 21793793 20031515 15004127 13755982 17424402 20783412 21408822
34537 21408822 22480206 26279348 30518009 32526003 32786229 32413522 30518391 26554554
34529 26554554 23030039 23029493 25777752 27133033 24950987 22153675 22910783 26519055 27663530
34520 27663530 23973980 20683162 24249841 32574939 36574832 32387165 26517341 25690673
$$ packed form
34577C9461387j058840n920937n574325j786711J482996K701308K324070L57542
34569C1986490k934851n484626n232190k638251L38561K355264K342244m43753
34561B0288888l824240l260936J671607M662848J101284m071543l130252K382342
34553A5819998M399221K045360K769996Q023307Q428273j163449j1040733r651331
34545A9630642p04754K867905j762278n027388j248145L668420L359010O25410
34537B1408822J071384L799142M238661K007994K60226l72707j895131l963837
34529B6554554l524515n46K748259J355281k182046k797312P57108L608272J144475
34520B7663530l689550l290818L566679Q325098L999893m187667n869824q26668
$$ plain form
34512 25690673 26884955 23338783 16987887 16958466 25698900 34224410 33977563 27615332
34504 27615332 23808301 25225662 26535462 22676488 15009594 9403647 10567237 17790028
34496 17790028 24727967 24770839 18576847 14592724 19396475 28996547 33242398 28256170
34488 28256170 20556913 18355252 22639802 28532470 32008554 32380486 30365451 27184391
34480 27184391 24941030 24932840 25400401 23264571 18541951 15035671 15919201 20324275 25192980
34471 25192980 28927243 31830993 33980323 34347587 32150716 28371963 25732115 26719994
34463 26719994 30686411 33239147 30445861 24053341 20298420 22527559 27497690 30509007
34455 30509007 30920678 29597033 24607790 15257495 8490435 13559852 28682415 39936190
$$ packed form
34512B5690673J194282l546172o350896k9421Q740434Q525510k46847o362231
34504B7615332l807031J417361J309800l858974p666894n605947J163590P222791
34496A7790028O937939M2872o193992l984123M803751R600072M245851m986228
34488B8256170p699257k201661M284550N892668L476084L71932k015035l181060
34480B7184391k243361q190M67561k135830m722620l506280Q83530M405074M868705
34471B5192980L734263K903750K149330L67264k196871l778753k639848R87879
34463B6719994L966417K552736k793286o392520l754921K229139M970131L011317
34455C0509007M11671j323645m989243r350295o767060N069417J5122563J1253775
$$ plain form
34447 39936190 37400779 27072937 21806251 24897946 29254449 30141402 30619625 33476958
34439 33476958 35080861 31221573 24665374 22062714 24947918 27974076 26287595 21526299
34431 21526299 19013955 20745183 23363434 23040429 20269133 18382396 18591190 18882631
34423 18882631 17817182 16900975 18057794 20543822 21758250 19972385 15379376 9863602
34415 9863602 6619488 8265405 13978761 19801051 22765426 23284374 22926914 22170315 21372681
34406 21372681 21315218 21290791 19301903 15699771 13703999 14728728 16642127 18275808 21029343
34397 21029343 23529578 20559239 11813507 5940195 9587541 17484010 20731071 20121999
34389 20121999 22231001 26341228 26185276 22512514 22069626 24425902 22163028 15391287
$$ packed form
34447C9936190k535411j0327842n266686L091695M356503Q86953M78223K857333
34439C3476958J603903l859288o556199k602660K885204L026158j686481m761296
34431B1526299k512344J731228K618251l23005k771296j886737K08794K91441
34423A8882631j065449r16207J156819K486028J214428j785865m593009n515774
34415I863602l244114J645917N713356N822290K964375N18948l57460p56599p97634
34406B1372681n7463k4427j988888l602132j995772J024729J913399J633681K753535
34397B1029343K500235k970339q745732n873312L647346P896469L247061o09072
34389B0121999K109002M110227j55952l672762m42888K356276k262874o771741
$$ plain form
34381 15391287 13079817 16886472 17360033 11802751 11852628 24077027 35639348 31833328
34373 31833328 18494316 12924675 18703249 23966888 21500280 16329449 13621918 11820018
34365 11820018 9735693 10045769 13107519 15447612 16123156 17236351 17490839 13299210
34357 13299210 7191438 6571679 12260621 16425273 14170671 9379594 6699020 5765023
34349 5765023 6236110 10311070 16496825 18889603 17034292 18515693 26474098 32513118
34341 32513118 28827654 20328405 16686944 18056372 17625232 14334031 13620527 17278548
34333 17278548 21177330 22785992 23608193 23845226 21230801 16142475 12377576 11703482
34325 11703482 12051367 11738919 11293845 10639822 8641912 6142125 5702640 7651713 9673134
$$ packed form
34381A5391287k311470L806655M73561n557282M9877J2224399J1562321l806020
34373C1833328j3339012n569641N778574N263639k466608n170831k707531j801900
34365A1820018k084325L10076L061750K340093O75544J113195K54488m191629
34357A3299210o107772o19759N688942M164652k254602m791077k680574r33997
34349E765023M71087M074960O185755K392778j855311J481401P958405O039020
34341C2513118l685464q499249l641461J369428m31140l291201p13504L658021
34333A7278548L898782J608662Q22201K37033k614425n088326l764899o74094
34325A1703482L47885l12448m45074o54023j997910k499787m39485J949073K021421
$$ plain form
34316 9673134 10595659 11221476 11277236 9268398 5967022 4557234 6361796 9259869 10980579
34307 10980579 11319056 10771182 9757410 9557298 11327225 13877175 14893142 14341441 14165188
34298 14165188 15045735 16284343 18109575 20590762 20977490 16444742 9555129 6574397
34290 6574397 9591003 14236028 15910988 14391125 11677382 9384456 8924149 10175828
34282 10175828 9693428 4955182 423938 3295960 12367106 18136915 16027897 11947819
34274 11947819 11454104 11668848 9340262 8808040 14131438 19962367 19644104 17416572 21983972
34265 21983972 30938218 33064850 25798416 19100589 19838270 22602427 20348167 15536602
34257 15536602 14715129 18082160 20752312 20702269 19776519 18728020 15971934 10944484 5866927
$$ packed form
34316I673134R22525O25817N5760k008838l301376j409788J804562K898073J720710
34307A0980579L38477n47874j013772k00112J769927K549950J015967n51701j76253
34298A4165188Q80547J238608J825232K481187L86728m532748o889613k980732
34290F574397L016606M645025J674960j519863k713743k292926m60307J251679
34282A0175828m82400m738246m531244K872022R071146N769809k109018m080078
34274A1947819m93715K14744k328586n32222N323398N830929l18263k227532M567400
34265B1983972Q954246K126632p266434o697827P37681K764157k254260m811565
34257A5536602q21473L367031K670152n0043r25750j048499k756086n027450n077557
$$ plain form
34248 5866927 3874006 5961632 9279970 9367332 5937464 4706268 9904316 16788994
34240 16788994 17018886 10615450 5949774 7419376 10576455 11481348 12987834 17522492
34232 17522492 20621608 17531259 11158470 7492726 6943075 5818646 3220172 1117981
34224 1117981 223035 562894 3514994 8827659 12579041 12535464 12167963 14575255 16249527
34215 16249527 12600988 6068368 2292247 1427605 228034 -189492 3470611 8883968
34207 8883968 10880504 10808984 14515024 21392349 24428783 21824368 19453562 19883502 17987735
34198 17987735 10978103 4722125 5353394 10835055 15310931 16531638 14967303 10704279
34190 10704279 5591666 4240213 8665946 14953914 18115177 17259835 14317089 11528391
$$ packed form
34248E866927j992921K087626L318338Q7362l429868j231196N198048O884678
34240A6788994K29892o403436m665676J469602L157079R04893J506486M534658
34232A7522492L099116l090349o372789l665744n49651j124429k598474k102191
34224A117981q94946L39859K952100N312665L751382m3577l67501K407292J674272
34215A6249527l648539o532620l776121q64642j199571m17526L660103N413357
34207H883968J996536p1520L706040O877325L036434k604415k370806M29940j895767
34198A7987735p009632o255978O31269N481661M475876J220707j564335m263024
34190A0704279n112613j351453M425733O287968L161263q55342k942746k788698
$$ plain form
34182 11528391 11448330 14709394 16760970 12514020 5198409 3545992 8608694 11859617
34174 11859617 9251755 7459410 11188976 14465971 12005912 9547680 12993346 15755461
34166 15755461 9066550 -1460966 -3262086 2940206 4779489 -733746 -2435877 6122208
34158 6122208 16017331 16485411 9135582 2764631 1686865 4883855 10482809 15493191
34150 15493191 15830177 11500005 8191506 10169365 15225270 19402658 22279726 24407373
34142 24407373 24129817 20940170 18119650 17878451 17069513 11888001 4347035 167414
34134 167414 1956719 7535602 13212356 16054913 14967040 12219615 12047392 15384278
34126 15384278 18168308 17210001 15086309 16133151 19948003 22521890 22199193 20745282
$$ packed form
34182A1528391q0061L261064K051576m246950p315611j652417N062702L250923
34174A1859617k607862j792345L729566L276995k460059k458232L445666K762115
34166A5755461o688911j0527516j801120O202292J839283n513235j702131Q558085
34158F122208R895123M68080p349829o370951j077766L196990N598954N010382
34150A5493191L36986m330172l308499J977859N055905M177388K877068K127647
34142B4407373k77556l189647k820520k41199q08938n181512p540966m179621
34134A67414J789305N578883N676754K842557j087873k747425j72223L336886
34126A5384278K784030r58307k123692J046842L814852K573887l22697j453911
$$ plain form
34118 20745282 19339022 17106952 13674006 10352589 8414394 8035725 8897048 10198776
34110 10198776 10411631 8758023 6832915 7215272 10391829 14201944 16380867 16790371
34102 16790371 17045073 18386817 19980919 19494607 15844683 10946401 7703419 6683530
34094 6683530 6258674 5690193 6101959 8285809 11502348 14752006 17414101 18520777 17412957
34085 17412957 15150437 13089913 10365084 5723306 1719009 3109043 9935852 15894939
34077 15894939 15431620 9550863 3211815 288811 2601510 9916617 18367070 22495997
34069 22495997 21693049 21103045 23396960 24106580 19275060 13132050 12056131 14313908
34061 14313908 13188601 8520795 6908752 10159162 11944240 8541135 5225646 7294218
$$ packed form
34118B0745282j406260k232070l432946l321417j938195l78669Q61323J301728
34110A0198776K12855j653608j925108L82357L176557L810115K178923M09504
34102A6790371K54702J341744J594102m86312l649924m898282l242982j019889
34094F683530m24856n68481M11766K183850L216539L249658K662095J106676j107820
34085A7412957k262520k060524k724829m641778m004297J390034O826809N959087
34077A5894939m63319n880757o339048k923004K312699P315107Q450453M128927
34069B2495997q02948n90004K293915P09620m831520o143010j075919K257777
34061A4313908j125307m667806j612043L250410J785078l403105l315489K068572
$$ plain form
34053 7294218 10940053 9428266 4250703 2845919 6873430 10065536 8411384 5851991
34045 5851991 7131107 10296868 10603503 8395161 8072243 10869241 13768202 15317261
34037 15317261 17348720 19723534 18402498 11699995 4542994 2583314 4749094 5864050
34029 5864050 4758577 5121007 9168803 15097242 20699717 25128940 26870448 24581784
34021 24581784 20850135 20615767 24329273 26786068 24426043 19598786 15498803 11211624
34013 11211624 4860924 -1840368 -5371485 -4013971 2488266 13138556 22976419 24852382
34005 24852382 18190039 11948823 13812282 19956386 21293885 16635762 12515023 11842658
33997 11842658 10929224 8208961 7995802 12757080 17748971 17151177 11627962 6591988
$$ packed form
34053G294218L645835j511787n177563j404784M027511L192106j654152k559393
34045E851991J279116L165761L06635k208342l22918K796998K898961J549059
34037A5317261K031459K374814j321036o702503p157001j959680K165780J114956
34029E864050j105473L62430M047796N928439N602475M429223J741508k288664
34021B4581784l731649k34368L713506K456795k360025m827257m099983m287179
34013A1211624o350700o701292l531117J357514O502237J0650290R837863J875963
34005B4852382o662343o241216J863459O144104J337499m658123m120739o72365
33997A1842658r13434k720263k13159M761278M991891n97794n523215n035974
$$ plain form
33989 6591988 5865009 9494579 15016460 18432963 16383445 9779289 3535977 1023448
33981 1023448 818941 506478 1101678 5110830 11876084 17659528 19919927 19600664 19344963
33972 19344963 20767877 23491912 26044057 27394916 27527131 26643445 24852812 23124957
33964 23124957 22851408 23084373 20285596 13280130 6483596 4853387 7432378 10111160
33956 10111160 12959812 18877522 25673583 26897496 22025948 18279289 19080447 18322137
33948 18322137 11436760 4967118 7122325 13985943 14797868 8387573 4019897 5885775
33940 5885775 7250469 3068715 -997682 2083529 9351683 12859007 11500005 10439992
33932 10439992 11225691 10116137 6280563 4793490 9128139 15365543 16940251 12467370
$$ packed form
33989F591988p26979L629570N521881L416503k049518o604156o243312k512529
33981A023448k04507l12463N95200M009152O765254N783444K260399l19263k55701
33972A9344963J422914K724035K552145J350859J32215q83686j790633j727855
33964B3124957k73549K32965k798777p005466o796534j630209K578991K678782
33956A0111160K848652N917710O796061J223913m871548l746659Q01158p58310
33948A8322137o885377o469642K155207O863618Q11925o410295m367676J865878
33940E885775J364694m181754m066397L081211P268154L507324j359002j060013
33932A0439992P85699j109554l835574j487073M334649O237404J574708m472881
$$ plain form
33924 12467370 6223704 2537515 2042520 2687890 2597709 1958512 2815613 6611405 11625218
33915 11625218 13930175 11706174 7631917 5877520 7421741 9628887 10015613 8823578
33907 8823578 7600477 6823510 6212191 6697159 10258712 16953409 23050837 23671137 17667614
33898 17667614 9055430 3170527 2139366 4471252 7760629 10368789 11259783 10272860
33890 10272860 8962388 9650210 12818165 16206881 17030288 14643094 11021272 9235347
33882 9235347 11116221 15382665 18391532 17944133 15789071 14767387 14497100 12733018
33874 12733018 10489852 11824428 17604446 23432103 25498986 24621882 22265630 17146114
33866 17146114 9644738 5307833 8338185 14401786 16001091 13132516 12027661 14424715
$$ packed form
33924A2467370o243666l686189m94995O45370r0181o39197Q57101L795792N013813
33915A1625218K304957k224001m074257j754397J544221K207146L86726j192035
33907H823578j223101p76967o11319M84968L561553O694697O097428O20300o003523
33898A7667614q612184n884903j031161K331886L289377K608160Q90994r86923
33890A0272860j310472O87822L167955L388716Q23407k387194l621822j785925
33882I235347J880874M266444L008867m47399k155062j021684k70287j764082
33874A2733018k243166J334576N780018N827657K066883q77104k356252n119516
33866A7146114p501376m336905L030352O063601J599305k868575j104855K397054
$$ plain form
33858 14424715 15612907 13562550 12048435 12406017 9965183 3076307 -927797 5108307
33850 5108307 17291402 24919365 22824490 14396959 5205143 -566841 590657 9103684
33842 9103684 19090196 22962915 20015459 16201288 15310702 15341681 14462220 14995913 18532299
33833 18532299 21352251 18863983 12304339 7045030 5307515 4449213 2648623 2534046
33825 2534046 7168321 14753248 20178771 21139738 19925511 18879966 17089486 13194403
33817 13194403 8840263 6444189 5171854 2594158 -366023 125701 5120136 10988938
33809 10988938 14044101 14234208 13514054 13186411 13375647 12561147 7855747 -790435 -7156750
33800 -7156750 -4491166 4778858 10579742 7783396 1435148 -2329046 -3528387 -3142552
$$ packed form
33858A4424715J188192k050357j514115L57582k440834o888876m004104O036104
33850E108307J2183095P627963k094875q427531r191816n771984J157498Q513027
33842I103684R986512L872719k947456l814171q90586L0979q79461N33693L536386
33833A8532299K819952k488268o559644n259309j737515q58302j800590j14577
33825B534046M634275P584927N425523R60967j214227j045545j790480l895083
33817A3194403m354140k396074j272335k577696k960181M91724M994435N868802
33809A0988938L055163J90107p20154l27643J89236q14500m705400q646182o366315
33800g156750K665584R270024N800884k796346o348248l764194j199341L85835
$$ plain form
33792 -3142552 1662593 11238455 18752969 18761879 15384916 14896666 15352972 11893097 7656479
33783 7656479 9329578 14660062 15139389 10154582 7807712 11126131 13871030 11962937
33775 11962937 9190181 8555583 7273184 4428374 5018602 11247089 17089707 17007799 13979562
33766 13979562 13610154 15744547 17123815 17400636 17437999 16228794 14366550 15884363 21408261
33757 21408261 23996842 17760677 7163827 1843408 4685630 10354404 13520679 13593521
33749 13593521 12825195 13761797 17185913 19989224 17705071 11277556 7111165 7818000
33741 7818000 8619329 6748153 7366100 13831413 19147769 16153021 10672450 13503559
33733 13503559 22563705 25114866 17223089 9000436 8647886 12567954 15110944 17682581
$$ packed form
33792c142552M805145R575862P514514Q910l376963m88250M56306l459875m236618
33783G656479J673099N330484M79327m984807k346870L318419K744899j908093
33775A1962937k772756o34598j282399k844810N90228O228487N842618q1908l028237
33766A3979562l69408K134393J379268K76821L7363j209205j862244J517813N523898
33757B1408261K588581o236165j0596850n320419K842222N668774L166275P2842
33749A3593521p68326R36602L424116K803311k284153o427515m166391P06835
33741G818000Q01329j871176O17947O465313N316356k994748n480571K831109
33733A3503559R060146K551161p891777q222653l52550L920068K542990K571637
$$ plain form
33725 17682581 22172214 23946623 19063656 12718824 12801791 18390324 21490854 18414745
33717 18414745 13545037 12396638 15567543 19690104 21173805 18879815 15096702 13457881
33709 13457881 14613338 15286572 13027892 10032772 10230259 14252642 19609234 24528134
33701 24528134 29036279 32746787 33888605 30971280 24512788 17165187 12362211 12003563
33693 12003563 15037311 19092082 23356818 28324326 32861615 34097654 31225883 27222415
33685 27222415 25333387 25608773 26453908 27992804 31760501 37549626 42288678 42703166
33677 42703166 39057716 35954298 38129214 44622044 48942477 46971901 42519115 41703293
33669 41703293 44141968 45183778 45664114 51833113 63916305 72595535 71408663 66162459
$$ packed form
33725A7682581M489633J774409m882967o344832Q2967N588533L100530l076109
33717A8414745m869708j148399L170905M122561J483701k293990l783113j638821
33709A3457881J155457O73234k258680k995120J97487M022383N356592M918900
33701B4528134M508145L710508J141818k917325o458492p347601m802976l58648
33693A2003563L033748M054771M264736M967508M537289J236039k871771m003468
33685B7222415j889028K75386Q45135J538896L767697N789125M739052M14488
33677D2703166l645450l103418K174916O492830M320433j970576m452786q15822
33669D1703293K438675J041810M80336O168999J2083192Q679230j186872n246204
$$ plain form
33661 66162459 65989610 70535801 73719377 76178283 84345418 98019491 108576964 111819073
$$ packed form
33661F6162459j72849M546191L183576K458906Q167135J3674073J0557473L242109
$$ [...]
##END NTUPLES=NMR SPECTRUM
##END=
