##TITLE=31Pdec_AT-45x
 Py-d5+CCl4, 128 sc
 22.2.2023
##JCAMPDX= 6.0         $$ Bruker NMR JCAMP-DX V2.0
##DATA TYPE= NMR SPECTRUM
##DATA CLASS= NTUPLES
##ORIGIN= UXNMR, Bruker Analytische Messtechnik GmbH
##OWNER= root
$$ XWIN-NMR		Version 3.5
$$ Wed Feb 22 14:14:02 2023 Russian Standard Time (UT+4h)  she@DPX200
##.OBSERVE FREQUENCY= 81.013821
##.OBSERVE NUCLEUS= ^31P
##.ACQUISITION MODE= SIMULTANEOUS
##.ACQUISITION SCHEME= undefined
##.AVERAGES= 128
##.DIGITISER RES= 16
##SPECTROMETER/DATA SYSTEM= spect
##.PULSE SEQUENCE= zgpg30
##.SOLVENT NAME= Pyr
##.SHIFT REFERENCE= (INTERNAL, Pyr, 0, 248.564)
##AUDIT TRAIL= $$ (NUMBER, WHEN, WHO, WHERE, WHAT)
$$ ##TITLE= Audit trail, XWIN-NMR		Version 3.5
$$ ##JCAMPDX= 5.01
$$ ##ORIGIN= Bruker BioSpin GmbH
$$ ##OWNER= she
$$ F:/spectra/data/she/nmr/P31/1/pdata/1/auditp.txt
$$ ##AUDIT TRAIL=  $$ (NUMBER, WHEN, WHO, WHERE, WHAT)
(   1,<2023-02-22 14:12:35.59 +0400>,<she>,<DPX200>,
      <continue with go, POWCHK disabled, PULCHK disabled
       configuration hash MD5:
       00 E9 B6 7A A2 85 ED C7 34 08 36 98 17 FE 4E 26
       data hash MD5: 32K
       CA C0 6F FC 59 F3 AA B9 28 DD 57 5B 1C B7 03 65>)
(   2,<2023-02-22 14:13:08.76 +0400>,<she>,<DPX200>,
      <Start of raw data processing
       efp BC_mod = 2 LB = 1 FT_mod = 6 PKNL = 1 PHC0 = -11003.32 PHC1 = 177.0102 SI = 64K 
       data hash MD5: 64K
       5D 39 D4 D7 57 F7 10 C1 51 3E 26 DE E3 FD A5 1B>)
(   3,<2023-02-22 14:13:34.68 +0400>,<she>,<DPX200>,
      <pk PHC0 = -4.993925 PHC1 = 0 
       data hash MD5: 64K
       0E 34 3D 1F CC 67 DF 5E 05 03 32 40 12 FF AC 4D>)
$$ ##END=
$$ 
$$ hash MD5
$$ FB 7C D2 F4 D5 4D F1 F2 07 C8 09 2A A8 70 B4 00
##$RELAX= 
##$RELAX= 
##$RELAX= 
##$RELAX= 
##$RELAX= 
##$RELAX= 
##$RELAX= 
##$RELAX= 
##$RELAX= 
$$ Bruker specific parameters
$$ --------------------------
##$DU= <F:/spectra>
##$EXPNO= 1
##$NAME= <P31>
##$PROCNO= 1
##$TYPE= <nmr>
##$USER= <she>
##$AMP= (0..31)
100 100 100 100 100 100 100 100 100 100 100 100 100 100 100 100 100 100 
100 100 100 100 100 100 100 100 100 100 100 100 100 100 
##$AQSEQ= 0
##$AQ_mod= 1
##$AUNM= <au_zg>
##$AUTOPOS= <>
##$BF1= 81.014009
##$BF2= 200.13
##$BF3= 200.13
##$BF4= 200.13
##$BF5= 200.13
##$BF6= 200.13
##$BF7= 200.13
##$BF8= 200.13
##$BYTORDA= 1
##$CFDGTYP= 0
##$CFRGTYP= 5
##$CHEMSTR= <none>
##$CNST= (0..31)
1 1 145 1 1 1 1 1 1 1 1 1 1 1 1 1 1 1 1 1 1 1 1 1 1 1 1 1 1 1 1 1 
##$CPDPRG= <waltz16>
##$CPDPRG1= <>
##$CPDPRG2= <waltz16>
##$CPDPRG3= <>
##$CPDPRG4= <mlev>
##$CPDPRG5= <mlev>
##$CPDPRG6= <mlev>
##$CPDPRG7= <mlev>
##$CPDPRG8= <mlev>
##$CPDPRGB= <>
##$CPDPRGT= <>
##$D= (0..31)
0 1 0 0 0 0 0 0 0 0 0 0.03 2e-05 3e-06 0 0 0 0 0 0 0 0 0 0 0 0 0 0 0 0 
0 0 
##$DATE= 1677060529
##$DBL= (0..7)
120 120 120 11 120 120 24 19 
##$DBP= (0..7)
150 150 150 150 150 150 150 150 
##$DBP07= 0
##$DBPNAM0= <>
##$DBPNAM1= <>
##$DBPNAM2= <>
##$DBPNAM3= <>
##$DBPNAM4= <>
##$DBPNAM5= <>
##$DBPNAM6= <>
##$DBPNAM7= <>
##$DBPOAL= (0..7)
0.5 0.5 0.5 0.5 0.5 0.5 0.5 0.5 
##$DBPOFFS= (0..7)
$$ [...]
##$SUBNAM2= <"">
##$SUBNAM3= <"">
##$SUBNAM4= <"">
##$SUBNAM5= <"">
##$SUBNAM6= <"">
##$SUBNAM7= <"">
##$SUBNAM8= <"">
##$SUBNAM9= <"">
##$SW= 501.771253377433
##$SWIBOX= (0..15)
0 1 3 0 0 0 0 0 0 0 0 0 0 0 0 0 
##$SW_h= 40650.406504065
##$TD= 32768
##$TD0= 1
##$TE= 0
##$TE2= 300
##$TE3= 300
##$TEG= 300
##$TL= (0..7)
0 120 53 12 22 120 120 120 
##$TP= (0..7)
150 150 150 150 150 150 150 150 
##$TP07= 0
##$TPNAME0= <>
##$TPNAME1= <>
##$TPNAME2= <>
##$TPNAME3= <>
##$TPNAME4= <>
##$TPNAME5= <>
##$TPNAME6= <>
##$TPNAME7= <>
##$TPOAL= (0..7)
0.5 0.5 0.5 0.5 0.5 0.5 0.5 0.5 
##$TPOFFS= (0..7)
0 0 0 0 0 0 0 0 
##$TUNHIN= 0
##$TUNHOUT= 0
##$TUNXOUT= 0
##$USERA1= <user>
##$USERA2= <user>
##$USERA3= <user>
##$USERA4= <user>
##$USERA5= <user>
##$V9= 5
##$VALIST= <valist>
##$VCLIST= <CCCCCCCCCCCCCCC>
##$VD= 0
##$VDLIST= <DDDDDDDDDDDDDDD>
##$VPLIST= <PPPPPPPPPPPPPPP>
##$VTLIST= <TTTTTTTTTTTTTTT>
##$WBST= 1024
##$WBSW= 4
##$XGAIN= (0..3)
0 0 0 0 
##$XL= 0
##$YL= 0
##$YMAX_a= 4168
##$YMIN_a= -5649
##$ZGOPTNS= <>
##$ZL1= 120
##$ZL2= 120
##$ZL3= 120
##$ZL4= 120
##$ABSF1= 0
##$ABSF2= 0
##$ABSG= 0
##$ABSL= 0
##$ALPHA= 0
##$AQORDER= 0
##$ASSFAC= 0
##$ASSFACI= 0
##$ASSFACX= 0
##$ASSWID= 0
##$AUNMP= <proc_1d>
##$AZFE= 0.1
##$AZFW= 0.5
##$BCFW= 0
##$BC_mod= 2
##$BYTORDP= 0
##$COROFFS= 0
##$CY= -3
##$DATMOD= 1
##$DC= 0
##$DFILT= <>
##$DTYPP= 0
##$F1P= 0
##$F2P= 0
##$FCOR= 1
##$FTSIZE= 65536
##$FT_mod= 6
##$GAMMA= 0
##$GB= 0
##$INTBC= 1
##$INTSCL= 6.047779e-11
##$ISEN= 30
##$LB= 1
##$LEV0= 0
##$LPBIN= 0
##$MAXI= 10000
##$MC2= 0
##$MEAN= 0
##$ME_mod= 0
##$MI= 50
##$NCOEF= 0
##$NC_proc= -6
##$NLEV= 6
##$NOISF1= 182.463
##$NOISF2= 159.3651
##$NSP= 0
##$NTH_PI= 0
##$NZP= 0
##$OFFSET= 248.5645
##$PC= 4
##$PHC0= -11008.31
##$PHC1= 177.0102
##$PH_mod= 1
##$PKNL= yes
##$PPARMOD= 0
##$PSCAL= 0
##$PSIGN= 0
##$REVERSE= no
##$SF= 81.0140089999694
##$SI= 65536
##$SIGF1= 159.3651
##$SIGF2= -187.1042
##$SINO= 113.3802
##$SIOLD= 16384
##$SREGLST= <1H.CDCl3>
##$SSB= 0
##$STSI= 65536
##$STSR= 0
##$SW_p= 40650.406504065
##$SYMM= 0
##$S_DEV= 0
##$TDeff= 32768
##$TDoff= 0
##$TI= <>
##$TILT= no
##$TM1= 0
##$TM2= 0
##$TOPLEV= 0
##$USERP1= <user>
##$USERP2= <user>
##$USERP3= <user>
##$USERP4= <user>
##$USERP5= <user>
##$WDW= 1
##$XDIM= 65536
##$YMAX_p= 285259660
##$YMIN_p= -46835505
$$ End of Bruker specific parameters
$$ ---------------------------------
##NTUPLES= NMR SPECTRUM
##VAR_NAME=  FREQUENCY,     SPECTRUM/REAL,   SPECTRUM/IMAG
##SYMBOL=    X,             R,               I
##VAR_TYPE=  INDEPENDENT,   DEPENDENT,       DEPENDENT
##VAR_FORM=  AFFN,          ASDF,            ASDF
##VAR_DIM=   65536,         65536,           65536
##UNITS=     HZ,            ARBITRARY UNITS, ARBITRARY UNITS
##FACTOR=    0.620285442955139, 1,           1
##FIRST=     20137.2065510682, 0,            0
##LAST=      -20513.1999529968, 0,           0
##MIN=       -20513.1999529968, -46835505,   0
##MAX=       20137.2065510682, 285259660,    0
$$ Real data points
##PAGE= N=1
##DATA TABLE= (X++(R..R)), XYDATA
$$ [...]
$$ plain form
37075 1662453 2643358 3731877 4006720 3072581 663995 -2683667 -5071510 -5029285 -3510369
37066 -3510369 -2649440 -3026226 -3602235 -3781161 -3914718 -4134709 -4185853 -4177977 -4292993 -4162857
37056 -4162857 -3630196 -3411734 -3772285 -3465489 -1587279 350372 78030 -2216538 -4199386
37047 -4199386 -4538357 -3810601 -2495645 -260680 2302015 3128372 988455 -2535633 -4282864
37038 -4282864 -2678668 447359 1352428 -1692095 -5940587 -6832591 -3501615 2456
37030 2456 -55153 -2508674 -3641317 -2397184 -766974 -28006 543360 1363797 1606540
37021 1606540 1116185 1173355 2491192 3909849 3952247 2751817 1716366 1733509 2148748
37012 2148748 1513679 -581106 -2663377 -3087041 -2364024 -2449476 -3683926 -4337185 -3634444
$$ packed form
37075A662453R80905J088519K74843r34139k408586l347662k387843M2225J518916
37066c510369Q60929l76786n76009j78926j33557k19991n1144P876j15016J30136
37056d162857N32661K18462l60551L06796J878210J937651k72342k294568j982848
37047d199386l38971P27756J314956K234965K562695Q26357k139917l524088j747231
37038d282864J604196L126027R05069l044523m248492q92004L330976L504071
37030B456n7609k453521j132643J244133J630210P38968N71366Q20437K42743
37021A606540m90355N7170J317837J418657M2398j200430j035451J7143M15239
37012B148748o35069k094785k082271m23664P23017q5452j234450o53259P02741
$$ plain form
37003 -3634444 -2945210 -3002752 -2499815 -1016606 -667604 -2547703 -4014384 -2379121 737888
36994 737888 1853747 682286 -502253 -958714 -1400630 -1188537 573457 2118688 1132052
36985 1132052 -905532 -497592 2222126 3791819 3124014 2476669 2550548 1288415 -1510847
36976 -1510847 -2839807 -1276768 718763 868587 -88552 -1034120 -2331875 -3457334 -2356822
36967 -2356822 905110 3102752 2319501 375988 -833705 -1991139 -3444711 -3313798
36959 -3313798 -1010535 677710 -187460 -1346065 2147 2975877 5209912 6485492
36951 6485492 7278511 6480567 3729764 1399946 1031990 436562 -2201090 -4205949 -2597317
36942 -2597317 199755 -222516 -2957460 -3312388 -732529 396029 -1891734 -4248341
$$ packed form
37003c634444O89234n7542N02937J483209L49002j880099j466681J635263L117009
36994G37888J115859j171461j184539m56461m41916K12093J761994J545231r86636
36985A132052k037584M07940K719718J569693o67805o47345P3879j262133k799262
36976a510847j328960J563039J995531J49824r57139r45568j297755j125459J100512
36967b356822L261932K197642p83251j943513j209693j157434j453572J30913
36959c313798K303263J688245q65170j158605J348212K973730K234035J275580
36951F485492P93019p97944k750803k329818l67956n95428k637652k004859J608632
36942b597317K797072m22271k734944l54928K579859J128558k287763k356607
$$ plain form
36934 -4248341 -3723436 -1808031 -910744 -560859 586252 1777747 1568257 384359 -246751
36925 -246751 126730 766551 889152 203665 -798808 -884569 485680 1916858 1800747
36916 1800747 1030078 1987229 4782909 6731609 6012294 3701944 1556176 -41960 -1027123
36907 -1027123 -733051 633430 1438855 1069770 1379908 3986339 7346728 8430149 6581000
36898 6581000 3888784 2102343 1075472 412699 764467 2474915 4138063 3922086 1995946
36889 1995946 346293 53719 22105 -979363 -2275622 -2549234 -2193873 -2599122 -3537416
36880 -3537416 -3438239 -2383847 -2415614 -4068877 -5051181 -3838561 -2297061 -2592112 -3409332
36871 -3409332 -2006193 1169772 2883998 1680474 -731022 -2562201 -3669367 -3838033
$$ packed form
36934d248341N24905J915405Q97287L49885J147111J191495k09490j183898o31110
36925b46751L73481O39821J22601o85487j002473q5761J370249J431178j16111
36916A800747p70669R57151K795680J948700p19315k310350k145768j598136r85163
36907a027123K94072J366481Q05425l69085L10138K606431L360389J083421j849149
36898F581000k692216j786441j026871o62773L51768J710448J663148k15977j926140
36889A995946j649653k92574l1614j001468j296259k73612L55361m05249r38294
36880c537416R9177J054392l1767j653263r82304J212620J541500k95051q17220
36871c409332J403139L175965J714226j203524k411496j831179j107166j68666
$$ plain form
36863 -3838033 -2075773 1270624 3759030 3567260 1658014 256289 304873 1188379 1824065
36854 1824065 1294058 -474120 -1984512 -1384390 821383 1691743 -321604 -2802952 -2350063
36845 -2350063 747100 2852771 1789979 -822329 -2480723 -2973540 -3374462 -3498628 -2388568
36836 -2388568 -620039 47227 -648047 -1130827 -687713 -416078 -715467 -123931 1868953
36827 1868953 3071416 1836098 126644 577120 2084731 1684774 -304495 -898235 282723
36818 282723 610136 -470150 -454685 1162621 1493054 -309588 -858042 1510111 2972808
36809 2972808 128314 -4011069 -4310019 -1091663 1137101 670676 -227274 -64348 229213
36800 229213 59912 119945 732077 1769613 3413108 4768622 3475432 -592948 -3476105
$$ packed form
36863c838033J762260L346397K488406j91770j909246j401725M8584Q83506O35686
36854A824065n30007j768178j510392O00122K205773Q70360k013347k481348M52889
36845b350063L097163K105671j062792k612308j658394m92817m00922j24166J110060
36836b388568J768529O67266o95274m82780M43114K71635k99389N91536J992884
36827A868953J202463j235318j709454M50476J507611l99957j989269n93740J180958
36818B82723L27413j080286J5465J617306L30433j802642n48454K368153J462697
36809B972808k844494m139383k98950L218356K228764m66425q97950J62926K93561
36800B29213j69301O0033O12132J037536J643495J355514j293190m068380k883157
$$ plain form
36791 -3476105 -2393760 -419544 -1638094 -4067129 -2810449 1407614 2998058 245445
36783 245445 -2837410 -3567403 -3453268 -3315693 -1672713 633988 189476 -2706276 -3315215
36774 -3315215 -325468 1458464 -718941 -2589335 -73085 3855800 4403151 2657119
36766 2657119 2675603 4222142 3974088 1792484 556810 1039284 1493609 1458068 2010389
36757 2010389 2951195 3139296 2862266 2934771 2572424 1056579 107011 1466882 3465522
36748 3465522 3208781 971370 -764655 -1350976 -1727113 -1424305 550245 2746542 2802400
36739 2802400 1334807 929000 1859648 2170307 1439620 1098416 1449430 1593678 1770219
36730 1770219 2591526 2771933 1049486 -614766 404671 2689381 3030745 2416796 4465943
$$ packed form
36791c476105J082345J974216j218550k429035J256680M218063J590444k752613
36783B45445l082855p29993J14135J37575J642980K306701m44512k895752o08939
36774c315215K989747J783932k177405j870394K516250L928885N47351j746032
36766B657119J8484J546539k48054k181604j235674M82474M54325l5541N52321
36757B010389R40806J88101k77030P2505l62347j515845r49568J359871J998640
36748C465522k56741k237411j736025n86321l76137L02808J974550K196297N5858
36739B802400j467593m05807R30648L10659p30687l41204L51014J44248J76541
36730A770219Q21307J80407j722447j664252J019437K284710L41364o13949K049147
$$ plain form
36721 4465943 8164012 8172864 3330948 -1156351 -1929127 -1979212 -4018487 -5021304 -1787550
36712 -1787550 2477392 2305932 -2110993 -6000430 -7100848 -7079973 -7043850 -6087706 -4196754
36703 -4196754 -2934988 -2793897 -2460859 -1088057 576626 1345578 521843 -1776283 -3978674
36694 -3978674 -3849144 -1385378 459931 -299141 -1722553 -1146948 467692 422847 -897481
36685 -897481 -743643 1054172 1655983 -28000 -1671533 -1448184 -531045 -580077 -1429482
36676 -1429482 -2476876 -3907489 -5257379 -5102100 -3568795 -2877102 -3827131 -4090939 -1984323
36667 -1984323 314697 -55357 -1985835 -2050961 92463 1217427 -536663 -3152108 -3833145
36658 -3833145 -2285791 -15504 1703745 2181764 1361181 596739 1794906 4559584 5795932
$$ packed form
36721D465943L698069Q852m841916m487299p72776n0085k039275j002817L233754
36712a787550M264942j71460m416925l889437j100418K0875L6123R56144J890952
36703d196754J261766J41091L33038J372802J664683P68952q23735k298126k202391
36694c978674J29530K463766J845309p59072j423412N75605J614640m4845j320328
36685h97481J53838J797815O01811j683983j643533K23349R17139m9032q49405
36676a429482j047394j430613j349890J55279J533305O91693r50029k63808K106616
36667a984323K299020l70054j930478o5126K143424J124964j754090k615445o81037
36658c833145J547354K270287J719249M78019q20583p64442J198167K764678J236348
$$ plain form
36649 5795932 3775119 1116128 1483362 4272910 5348067 2985675 121358 -337865
36641 -337865 289201 -915433 -3516958 -4310910 -2321980 -346066 -896887 -2941605 -3963296
36632 -3963296 -3580560 -3397606 -4202475 -5120934 -5310245 -4957062 -4464035 -3879575 -3387873
36623 -3387873 -3289470 -3180522 -2208941 -599713 163427 -585880 -1447841 -859468 532487
36614 532487 817993 -199656 -610513 685136 2119054 1450429 -1241236 -3630973 -3887159
36605 -3887159 -2410520 -839587 -62814 455814 1655415 3480764 4672250 4124667 2357978
36596 2357978 1176858 1700731 3186935 4099656 3866714 3088915 2390902 1769872 1074315
36587 1074315 541425 526750 807785 454033 -1179754 -3148815 -3280681 -732258 2259251
$$ packed form
36649E795932k020813k658991L67234K789548J075157k362392k864317m59223
36641c37865O27066j204634k601525p93952J988930J975914n50821k044718j021691
36632c963296L82736J82954q04869r18459j89311L53183M93027N84460M91702
36623c387873R8403J08948R71581J609228P63140p49307q61961N88373J391955
36614E32487K85506j017649m10857J295649J433918o68625k691665k389737k56186
36605c887159J476639J570933P76773N18628J199601J825349J191486n47583j766689
36596B357978j181120N23873J486204R12721k32942p77799o98013o21030o95557
36587A074315n32890j4675K81035l53752j633787j969061j31866K548423K991509
$$ plain form
36578 2259251 2602761 345075 -1256837 -88019 2367031 3882945 4547346 5083112 4291448
36569 4291448 1149804 -1907286 -1411514 1750882 3001017 557171 -2308416 -2612468
36561 -2612468 -1728000 -2101567 -2989096 -2292840 -506308 247624 -105740 276839 1957427
36552 1957427 3589574 4197517 4053041 3490714 2571895 1689923 1050565 -785 -1733644
36543 -1733644 -2826608 -2037779 -378332 191503 -350970 -402223 555936 1528319 1968228
36534 1968228 2228500 2265677 1734198 1165272 1349969 1978275 2617161 4161065 6998274
36525 6998274 8687233 6596181 2506101 1086052 3433265 5619819 4552991 1896335
36517 1896335 799291 1843511 3831809 5650006 5633275 2151693 -3044697 -5107735
$$ packed form
36578B259251L43510k257686j601912J168818K455050J515914O64401N35766p91664
36569D291448l141644l057090M95772L162396J250135k443846k865587l04052
36561b612468Q84468l73567q87529O96256J786532P53932l53364L82579J680588
36552A957427J632147O07943j44476n62327r18819q81972o39358j051350j732859
36543a733644j092964P88829J659447N69835n42473n1253R58159R72383M39909
36534A968228K60272L7177n31479n68926J84697O28306O38886J543904K837209
36525F998274J688959k091052m090080j420049K347213K186554j066828k656656
36517A896335j097044J044220J988298J818197j6731l481582n196390k063038
$$ plain form
36509 -5107735 -2349511 618533 -902659 -4976243 -6243677 -3729012 -1070367 -193273
36501 -193273 549062 1979533 2298508 679663 -947266 -1065041 -596244 -439477 289219
36492 289219 1923325 2520696 439927 -3024879 -5398396 -6107194 -6128368 -5686110 -4132614
36483 -4132614 -1571505 946098 2626461 3241798 2591452 813435 -880536 -887607 1005798
36474 1005798 3038983 2994731 266678 -3526652 -5923240 -5697062 -3568436 -941091 1499639
36465 1499639 3577760 4840277 5059411 5104751 5998815 7147442 6833041 4621708 1926806
36456 1926806 -107232 -1762065 -3203548 -3456816 -2132474 -827055 -1175197 -2329214
36448 -2329214 -2117426 -336405 894203 196943 -1271983 -1684133 -871669 127071 898276
$$ packed form
36509e107735K758224K968044j521192m073584j267434K514665K658645Q77094
36501a93273P42335J430471L18975j618845j626929j17775M68797J56767P28696
36492B89219J634106N97371k080769l464806k373517p08798k1174M42258J553496
36483d132614K561109K517603J680363O15337o50346j778017j693971p071J893405
36474A005798K033185m4252k728053l793330k396588K26178K128626K627345K440730
36465A499639K078121J262517K19134M5340Q94064J148627l14401k211333k694902
36456A926806k034038j654833j441483k53268J324342J305419l48142j154017
36448b329214K11788J781021J230608o97260j468926m12150Q12464R98740P71205
$$ plain form
36439 898276 1778755 2524785 2205743 775599 -283202 272969 1588316 1718299 474079
36430 474079 16057 1944384 4786250 5593144 3597549 888859 -572661 -1096952 -1798820
36421 -1798820 -2433018 -2129512 -1566357 -2554541 -5084543 -6307047 -3724143 1163862 3847914
36412 3847914 1856800 -2192402 -3511665 -622428 3262978 4376301 2556931 496206
36404 496206 -73057 98039 -174879 -546060 66705 1649200 3007497 3273445 2752723
36395 2752723 2171682 1635417 817664 48123 465498 2470610 4424352 3946928 725718
36386 725718 -2912289 -4593128 -4043131 -2198267 325713 2622385 2766917 -159749 -3883429
36377 -3883429 -5012551 -3311942 -1755990 -2018062 -2265644 -490173 2082911 2693189 895676
$$ packed form
36439H98276Q80479P46030l19042j430144j058801N56171J315347J29983j244220
36430D74079m58022J928327K841866Q06894j995595k708690j461520n24291p01868
36421a798820o34198L03506N63155r88184k530002j222504K582904M888005K684052
36412C847914j991114m049202j319263K889237L885406J113323j819370k060725
36404D96206n69263J71096k72918l71181O12765J582495J358297K65948n20722
36395B752723n81041n36265q17753p69541M17375K005112J953742m77424l221210
36386G25718l638007j680839N49997J844864K523980K296672J44532k926666l723680
36377c883429j129122J700609J555952k62072k47582J775471K573084O10278j797513
$$ plain form
36368 895676 -1102497 -1393447 -193332 1029257 1115157 -7101 -1344808 -1753284 -1208372
36359 -1208372 -734247 -757045 -342217 1298365 3294194 3909707 2392558 -421046 -2675640
36350 -2675640 -2417849 783246 4416363 4663959 760090 -3446435 -3843552 -1038899 805685
36341 805685 -494466 -2806136 -2880426 -165632 2939185 3445591 245860 -4665154 -7386283
36332 -7386283 -5669477 -1425005 1290704 772263 -860978 -628826 1983053 4775831
36324 4775831 5045201 2074872 -1832641 -3194057 -1096276 1563090 1765968 310865
36316 310865 163369 1752141 2655540 1887890 1417672 2533637 3531411 2619817 843882
36307 843882 182177 524457 638470 784447 2112614 4196661 5216783 4333868 2348111
$$ packed form
36368H95676j998173k90950J200115J222589Q5900j122258j337707m08476N44912
36359a208372M74125k2798M14828J640582J995829O15513j517149k813604k254594
36350b675640K57791L201095L633117K47596l903869m206525l97117K804653J844584
36341H05685j300151k311670p4290K714794L104817N06406l199731m911014k721129
36332g386283J716806M244472K715709n18441j633241K32152K611879K792778
36324D775831K69370k970329l907513j361416K097781K659366K02878j455103
36316C10865j47496J588772R03399p67650m70218J115965R97774r11594j775935
36307H43882o61705L42280J14013J45977J328167K084047J020122q82915j985757
$$ plain form
36298 2348111 324865 -1062060 -1193642 93801 1928813 3287339 4151953 4889604 5103312
36289 5103312 4269438 2957681 2186670 2068385 2244132 2927283 4097286 4487112 3217017
36280 3217017 1777418 2155499 3338316 2344840 -953873 -2897134 -1124082 1914263
36272 1914263 2471347 666743 -245148 1304761 3600333 4579746 4083433 2815798 1006563
36263 1006563 -1019553 -2303470 -2326833 -1801241 -1519059 -1147306 -111851 959264 913683
36254 913683 -60441 -561726 -65738 435075 260360 54755 109080 -814719 -3358243 -5439000
36244 -5439000 -4594173 -2037441 -1624447 -4241553 -6044987 -3848108 220047 1918980
36236 1918980 972018 741646 2585909 4085400 3431304 2305571 2754609 3759208 3299206
$$ packed form
36298B348111k023246j386925j31582J287443J835012J358526Q64614P37651K13708
36289E103312q33874j311757p71011j18285J75747O83151J170003L89826j270095
36280C217017j439599L78081J182817r93476l298713j943261J773052L038345
36272A914263N57084j804604r11891J549909K295572R79413m96313j267635j809235
36263A006563k026116j283917k3363N25592K82182L71753J035455J071115m5581
36254I13683r74124n01285M95988N00813j74715k05605N4325r23799k543524k080757
36244e439000Q44827K556732M12994k617106j803434K196879M068155J698933
36236A918980r46962k30372J844263J499491o54096j125733M49038J004599m60002
$$ plain form
36227 3299206 2180182 2972836 5660476 7105649 5378857 2396955 1109448 1725341
36219 1725341 2317864 2069669 1912404 2236328 2070108 1104491 695122 1634373 2358368
36210 2358368 1102200 -1072488 -1507305 41938 831374 -997724 -3952045 -5417080
36202 -5417080 -4602629 -2248654 852437 3609121 4468207 3301350 2287890 3090090 4281146
36193 4281146 3699875 2273113 2704838 4808751 5306470 2773650 -171887 -815067 102617
36184 102617 480474 348975 1006036 2056677 1771812 -86979 -1898169 -2604626 -2767002
36175 -2767002 -2968017 -2674163 -1282885 708604 2236188 2810962 2688776 2338092 2138373
36166 2138373 2330125 2923642 3749004 4706807 5766813 6607022 6587275 5450855 3873832
$$ packed form
36227C299206j119024P92654K687640J445173j726792k981902j287507O15893
36219A725341N92523k48195j57265L23924j66220r65617m09369R39251P23995
36210B358368j256168k174688m34817J549243P89436j829098k954321j465035
36202e417080Q14451K353975L101091K756684Q59086j166857j013460Q02200J191056
36193D281146n81271j426762M31725K103913M97719k532820k945537o43180R17684
36184A02617L77857j31499O57061J050641k84865j858791j811190p06457j62376
36175b767002k01015K93854J391278J991489J527584N74774j22186l50684j99719
36166B138373J91752N93517Q25362R57803J060006Q40209j9747j136420j577023
$$ plain form
36157 3873832 2814951 2352902 1859111 1502919 2522004 5095286 6932648 5695423 2485485
36148 2485485 904303 2399582 4691312 5473198 5222425 4973499 3909411 1523851 -29022
36139 -29022 1179615 3226899 3034401 1456421 1688518 3284186 2434372 -1364347 -3750899
36130 -3750899 -2150144 541450 1266680 1536936 3571255 5416513 4132095 1260288
36122 1260288 641779 2343965 3094006 1844342 714688 765619 889908 1060338 2822566
36113 2822566 5871953 7577344 6863541 5540265 4845450 3688604 1533174 126424
36105 126424 762062 2224170 2945782 2929181 2136023 -435331 -4165230 -5792229 -3431768
36096 -3431768 342529 1964820 1616306 1642883 1908676 450484 -1854833 -1313237 3053112
$$ packed form
36157C873832j058881m62049m93791l56192J019085K573282J837362j237225l209938
36148B485485j581182J495279K291730P81886k50773k48926j064088k385560j552873
36139b9022J208637K047284j92498j577980K32097J595668q49814l798719k386552
36130c750899J600755K691594P25230K70256K034319J845258j284418k871807
36122A260288o18509J702186P50041j249664j129654N0931J24289J70430J762228
36113B822566L049387J705391p13803j323276o94815j156846k155430j406750
36105A26424O35638J462108P21612j6601p93158k571354l729899j626999K360461
36096c431768L774297J622291l48514K6577K65793j458192k305317N41596M366349
$$ plain form
36087 3053112 7268444 7316364 4007650 1246893 1163116 2763897 4223038 4579560 3633095
36078 3633095 1744606 -245570 -1831649 -3343735 -4858819 -5214718 -3380146 -479962
36070 -479962 1070389 548549 -511174 -1116614 -2322526 -4708131 -6021830 -3636623 1181860
36061 1181860 3921421 2242711 -1283011 -2853717 -2043072 -1107175 -1053881 -716455 529124
36052 529124 1370374 574380 -1153217 -2317068 -2647260 -2909466 -3260127 -2864742 -1155715
36043 -1155715 1196323 2744291 2500341 817564 -773256 -833778 591851 2024256 2183851
36034 2183851 1242938 107470 -1034925 -2563997 -3943449 -3584225 -853717 2566544
36026 2566544 4272506 3679969 2073620 591120 -494216 -672989 781722 3152026
$$ packed form
36087C053112M215332M7920l308714k760757q3777J600781J459141L56522r46465
36078C633095j888489j990176j586079j512086j515084l55899J834572K900184
36070d79962J550351n21840j059723o05440j205912k385605j313699K385207M818483
36061A181860K739561j678710l525722j570706Q10645R35897N3294L37426J245579
36052E29124Q41250p95994j727597j163851l30192k62206l50661L95385J709027
36043a155715K352038J547968k43950j682777j590820o0522J425629J432405J59595
36034B183851r40913j135468j142395j529072j379452L59224K730508L420261
36026B566544J705962n92537j606349j482500j085336j78773J454711K370304
$$ plain form
36018 3152026 4423528 4116202 4189081 5653568 6245342 3901303 962510 1543220 5372561
36009 5372561 8014726 7416999 6220529 6428594 5981178 3099431 375133 1018214 3650977
36000 3650977 4656907 3810287 3567886 4170990 3854364 3257377 4922290 8069598 8500021
35991 8500021 5024959 1821434 2321872 4348532 3935530 1074806 -1292808 -1791782 -1035845
35982 -1035845 846194 3909940 6457236 6369255 4177214 2373892 1781526 916801 -934557
35973 -934557 -2342914 -2096286 -1053832 -668538 -981328 -1070548 -588322 84475 657321
35964 657321 1082411 1146236 583893 -347839 -800227 -78226 1520569 2732133 2400086
35955 2400086 585410 -1506286 -2614835 -2217596 -508262 1754740 3378150 3490006
$$ packed form
36018C152026J271502l07326P2879J464487N91774k344039k938793N80710L829341
36009E372561K642165n97727j196470K08065m47416k881747k724298O43081K632763
36000C650977J005930q46620k42401O03104l16626n96987J664913L147308M30423
35991H500021l475062l203525N00438K026660m13002k860724k367614m98974P55937
35982a035845J882039L063746K547296q7981k192041j803322n92366q64725j851358
35973i34557j408357K46628J042454L85294l12790q9220M82226O72797N72846
35964F57321M25090O3825n62343r31732m52388P22001J598795J211564l32047
35955B400086j814676k091696j108549L97239J709334K263002J623410J11856
$$ plain form
35947 3490006 2450209 1395293 708085 -215099 -1361254 -1428128 293784 2254663 2275802
35938 2275802 589010 -193698 1514623 4068595 4555740 2246502 -875382 -2682343
35930 -2682343 -2836126 -2007767 -547875 1021127 1230148 -783815 -3170655 -2901074 60713
35921 60713 2192742 1124877 -1174753 -1662613 -631628 -289255 -573090 214319 1389660
35912 1389660 342975 -2766521 -4514131 -3400862 -2040742 -2600562 -3325752 -1792091
35904 -1792091 1157850 3237724 4184187 4800389 4553178 2913424 1409169 1451513 1532330
35895 1532330 -417280 -3101121 -3536680 -1817930 -798276 -1388235 -1625161 -600438 28254
35886 28254 -821054 -1890588 -1900353 -1180315 -178399 1267619 2364199 1576699 -524662
$$ packed form
35947C490006j039797j054916o87208r23184j146155o6874J721912J960879K1139
35938B275802j686792p82708J708321K553972M87145k309238l121884j806961
35930b682343j53783Q28359J459892J569002K09021k013963k386840K69581K961787
35921F0713K132029j067865k299630m87860J030985L42373k83835P87409J175341
35912A389660j046685l109496j747610J113269J360120n59820p25190J533661
35904a792091K949941K079874R46463O16202k47211j639754j504255M2344Q0817
35895A532330j949610k683841m35559J718750J019654n89959k36926J024723O28692
35886B8254q49308j069534r765P20038J001916J446018J096580p87500k101361
$$ plain form
35877 -524662 -1107922 861558 2738968 2022739 -115099 -1099631 -823273 -833361 -1042835
35868 -1042835 26963 2233768 3529368 2860054 1451313 785239 760999 443242 -379790
35859 -379790 -1024857 -810092 236828 1296645 1276188 -316756 -2865262 -5017615 -5547820
35850 -5547820 -4051518 -1204579 1639917 3445724 4081593 3788578 2637610 1141596
35842 1141596 649694 1831595 3193676 2722411 892064 179473 1370393 2470325 2061389
35833 2061389 1591943 2906334 5283166 6712310 6773451 6367017 5649711 4267100 2962787
35824 2962787 2932848 3851189 4264673 3703624 2775631 1518958 -440964 -2168674 -1864410
35815 -1864410 523433 2740095 2790611 796240 -1913359 -4060062 -4465434 -2547276 465187
$$ packed form
35877e24662n83260J969480J877410p16229k137838r84532K76358j0088k09474
35868a042835J069798K206805J295600o69314j408741o66074k4240l17757q23032
35859c79790o45067K14765J046920J059817k0457j592944k548506k152353n30205
35850e547820J496302K846939K844496J805807O35869k93015j150968j496014
35842A141596m91902J181901J362081m71265j830347p12591J190920J099932m08936
35833B061389m69446J314391K376832J429144O1141m06434p17306j382611j304313
35824B962787k9939R18341M13484n61049r27993j256673j959922j727710L04264
35815a864410K387843K216662N0516j994371k709599k146703m05372J918158L012463
$$ plain form
35806 465187 2178327 1675323 369551 -281265 -434147 -512031 95630 1687700 3023963
35797 3023963 3002437 2449758 2572067 2591357 903022 -1960220 -3614323 -3020892 -1495799
35788 -1495799 -381902 377687 900279 515833 -785880 -1590390 -893817 435233 1074831
35779 1074831 1018950 810773 208755 -874894 -1161191 266620 1588160 -56518 -4285251
35770 -4285251 -7146915 -5985783 -2779287 -1298965 -2411844 -3912198 -4094921 -3517723
35762 -3517723 -3300639 -3329224 -2636694 -694791 1921632 3612011 2795478 -178676 -2511878
35753 -2511878 -1735915 1007880 2080674 97233 -2242367 -2046986 -200794 342980 -914425
35744 -914425 -1472595 348278 3091322 4177667 2745353 -141962 -2863936 -4045130
$$ packed form
35806D65187J713140n03004j305772o50816j52882p7884O07661J592070J336263
35797C023963k1526n52679J22309J9290j688335k863242j654103N93431J525093
35788a495799J113897P59589N22592l84446j301713q04510O96573J329050O39598
35779A074831n5881k08177o02018j083649k86297J427811J321540j644678m228733
35770d285251k861664J161132L206496J480322j112879j500354j82723N77198
35762c517723K17084k8585O92530J941903K616423J690379q16533k974154k333202
35753b511878P75963K743795J072794j983441k339600J95381J846192N43774j257405
35744i14425n58170J820873K743044J086345j432314k887315k721974j181194
$$ plain form
35736 -4045130 -3042414 -677012 1039499 774637 -749089 -1756099 -1464177 -631082 -356371
35727 -356371 -863444 -1406244 -1144868 -168987 503485 364654 531459 2425266 5375450
35718 5375450 6942486 6150923 4963445 5512134 7116219 7450588 5738210 3207620 1044532
35709 1044532 -457640 -1166195 -1230380 -1634426 -2922258 -3664694 -2131787 675163 1920088
35700 1920088 1039012 459250 1542727 2421483 1235102 -836917 -1666974 -1413214 -1530981
35691 -1530981 -1972558 -1534088 33170 2177743 4704835 6820601 6378883 2638260 -1304327
35682 -1304327 -1859175 -133716 -407186 -3400689 -4833955 -1890284 2332911 3122629 444428
35673 444428 -1780543 -1272612 454859 1085816 293739 -801208 -1398535 -1575783 -1778881
$$ packed form
35736d045130J002716K365402J716511k64862j523726j007010K91922Q33095K74711
35727c56371n07073n42800K61376R75881O72472j38831J66805J893807K950184
35718E375450J567036p91563j187478N48689J604085L34369j712378k530590k163088
35709A044532j502172p08555o4185m04046j287832p42436J532907K806950J244925
35700A920088q81076n79762J083477Q78756j186381k072019q30057K53760j17767
35691a530981m41577M38470J567258K144573K527092K115766m41718l740623l942587
35682a304327n54848J725459k73470k993503j433266K943671M223195P89718k678201
35673D44428k224971N07931J727471O30957p92077j094947n97327j77248k03098
$$ plain form
35664 -1778881 -2208898 -2603462 -2636575 -2442324 -2310212 -1955604 -899977 327720 442523
35655 442523 -651754 -1184796 377282 3223974 5050571 4615136 2714588 872211 -256002
35646 -256002 -1096844 -2097295 -2662869 -1525360 1499574 4575618 5435091 3708386 940401
35637 940401 -1358786 -2683538 -2931167 -2220044 -1309644 -907603 -533951 630612 1907297
35628 1907297 1784595 421738 -463437 -489780 -1214392 -3133302 -4334086 -3396772 -1683710
35619 -1683710 -1215525 -1879088 -2296270 -2026447 -1328432 -74504 1442300 1845135 587223
35610 587223 -478056 748333 3579277 5297975 4474364 2267186 971380 2213631
35602 2213631 5683172 8711859 8329544 4825151 1830829 1628187 2173370 569380 -2377559
$$ packed form
35664a778881m30017l94564l3113J94251J32112L54608J055627J227697J14803
35655D42523j094277n33042J562078K846692J826597m35435j900548j842377j128213
35646b56002q40842j000451n65574J137509L024934L076044Q59473j726705k767985
35637I40401k299187j324752k47629P11123R10400M02041L73652J164563J276685
35628A907297j22702j362857q85175k6343p24612j918910j200784R37314J713062
35619a683710M68185o63563m17182K69823O98015J253928J516804M02835j257912
35610E87223j065279J226389K830944J718698q23611k207178j295806J242251
35602B213631L469541L028687l82315l504393k994322k02642N45183j603990k946939
$$ plain form
35593 -2377559 -3590746 -2383599 -904727 -619360 -966692 -1210584 -1281147 -901325 107078
35584 107078 815125 244876 -942474 -1473467 -1507830 -1898012 -2321673 -2185920 -2374585 -3724596
35574 -3724596 -4727236 -3406763 -659241 1124552 1948663 3501654 5208020 4736260
35566 4736260 2430945 1341730 2166804 1905044 -1177408 -4531219 -4939772 -2584422 17778
35557 17778 1067957 388671 -812301 -456052 2143346 4456059 3692437 1357685 1460805
35548 1460805 4126955 5190284 2958871 774354 1112602 1801264 746994 -5486 1552491
35539 1552491 3004320 1429263 -1270845 -1257550 1279024 3165571 3386143 3148807 2451142
35530 2451142 665050 -746250 -114854 939682 -81323 -1725903 -553122 2715615
$$ packed form
35593b377559j213187J207147J478872K85367l47332k43892p0563L79822J008403
35584A07078P08047n70249j187350n30993l4363l90182m23661J35753j88665j350011
35574c724596j002640J320473K747522J783793Q24111J552991J706366m71760
35566D736260k305315j089215Q25074k61760l082452l353811m08553K355350K602200
35557A7778J050179o79286j200972L56249K599398K312713p63622k334752J03120
35548A460805K666150J063329k231413k184517L38248O88662j054270p52480J557977
35539A552491J451829j575057k700108J3295K536574J886547K20572k37336o97665
35530B451142j786092j411300O31396J054536j021005j644580J172781L268737
$$ plain form
35522 2715615 3682002 1042723 -1625217 -1585899 -281039 217440 255685 508208 143491
35513 143491 -1133175 -1912977 -1568753 -1435735 -2052990 -1758434 264740 1903387 1083678
35504 1083678 -1040875 -1854233 -782393 754432 1684571 1966828 1910663 2104627 3055475
35495 3055475 3957996 3161396 875242 -241025 1405553 3896391 4652645 4145211 4436612
35486 4436612 5229450 4283980 1514527 -279728 480895 1749890 967943 -1116693 -1542915
35477 -1542915 765451 3738872 4884517 3844538 2000874 801601 1107936 3095244
35469 3095244 5658521 6561842 4595110 1452410 38442 752110 1036384 -826599 -3224091
35460 -3224091 -3688812 -2242166 -504125 1174123 3275687 4593479 3111359 -277146
$$ packed form
35522B715615R66387k639279k667940L9318J304860M98479L8245K52523l64717
35513A43491j276666p79802L44224J33018o17255K94556K023174J638647q19709
35504A083678k124553q13358J071840J536825R30139K82257n6165J93964R50848
35495C055475R02521p96600k286154j116267J646578K490838P56254n07434K91401
35486D436612P92838r45470k769453j794255P60623J268995p81947k084636m26222
35477a542915K308366K973421J145645j039979j843664j199273L06335J987308
35469C095244K563277R03321j966732l142700j413968P13668K84274j862983k397492
35460c224091m64721J446646J738041J678248K101564J317792j482120l388505
$$ plain form
35452 -277146 -1762794 450321 3487924 3744436 1616621 131988 142206 -355046 -2213514
35443 -2213514 -3169654 -1076504 2623748 4415294 3060861 766306 -96449 132796 -313335
35434 -313335 -1609813 -2211977 -1506373 -826138 -1195128 -1573350 -644562 673164 259190
35425 259190 -1945889 -3478846 -2570570 -423187 511709 -418582 -1623823 -1301207 925776
35416 925776 4066916 6626758 7393721 6027478 3207140 92885 -2411959 -3871693
35408 -3871693 -4130004 -3389203 -2454038 -2291640 -2943688 -3269545 -2355191 -886706 -249700
35399 -249700 -344791 449658 2702471 4709695 4877904 4013035 3645703 3242698 1398501
35390 1398501 -823661 -650871 1957987 3549854 2050513 -214821 -210047 1290149 1281631
$$ packed form
35452b77146j485648K213115L037603K56512k127815j484633J0218m97252j858468
35443b213514r56140K093150L700252J791546j354433k294555q62755K29245m46131
35434c13335j296478o02164P05604O80235l68990l78222R28788J317726m13974
35425B59190k205079j532957R08276K147383R34896r30291j205241L22616K226983
35416I25776L141140K559842P66963j366243k820338l114255k504844j459734
35408c871693k58311P40801R35165J62398o52048l25857R14354J468485O37006
35399b49700r5091P94449K252813K007224J68209q64869l67332m03005j844197
35390A398501k222162J72790K608858J591867j499341k265334M774J500196q518
$$ plain form
35381 1281631 -820772 -2769736 -3123130 -2855646 -3226778 -3914195 -3779756 -2437841 -710647
35372 -710647 69773 -593255 -1542906 -1235303 53268 618485 213377 555511 2125110
35363 2125110 2900882 1936221 1645484 3959379 6440524 5576364 2327286 572901 990988
35354 990988 691408 -1173321 -1838264 41410 1760990 817959 -1365744 -2137785 -1540910
35345 -1540910 -1218202 -1274611 -699856 138221 -309926 -2310534 -4101405 -3731304 -976566
35336 -976566 2471676 4473891 4347556 3233316 2293735 1338918 129333 -144792 1449599
35327 1449599 3282444 2991311 1260939 1019583 2704521 3280552 855460 -2413643 -3388339
35318 -3388339 -1779337 467781 1799873 1744709 525680 -783640 -908380 85554 1081636
$$ packed form
35381A281631k102403j948964l53394K67484l71132o87417J34439J341915J727194
35372g10647P80420o63028r49651L07603J288571N65217m05108L42134J569599
35363B125110P75772r64661k90737K313895K481145q64160l249078j754385M18087
35354I90988k99580j864729o64943J879674J719580r43031k183703p72041N96875
35345a540910L22708n6409N74755Q38077m48147k000608j790871L70101K754738
35336i76566L448242K002215j26335j114240r39581r54817j209585k74125J594391
35327A449599J832845k91133j730372k41356J684938N76031k425092l269103r74696
35318c388339J609002K247118J332092n5164j219029j309320j24740R93934R96082
$$ plain form
35309 1081636 1854022 2949599 3705295 2871865 1405826 1638361 3095924 2642284 -38065
35300 -38065 -986521 1855587 4799693 3823905 581925 -746201 -23352 -322670 -2212797
35291 -2212797 -3306599 -2877759 -2857601 -4090256 -4968064 -4241882 -2522002 -668804 1028667
35282 1028667 1952827 1508900 332127 -635507 -1689100 -3018230 -2949067 -317730 2365819
35273 2365819 1663716 -1192086 -1362929 2443268 5890243 5456198 3114164 2242604 2200216
35264 2200216 345514 -2690777 -3626587 -1792864 -254327 -1135779 -2663243 -2204731 -202868
35255 -202868 911399 665543 1045820 2895338 4020590 2190349 -1484503 -4015186 -4466012
35246 -4466012 -4241376 -3926837 -2522891 -146514 1270552 1015295 788788 1521603 1549681
$$ packed form
35309A081636P72386J095577P55696q33430j466039K32535J457563m53640k680349
35300c8065r48456K842108K944106r75788l241980j328126P22849k99318j890127
35291b212797j093802M28840K0158j232655q77808P26182J719880J853198J697471
35282A028667R24160m43927j176773r67634j053593j329130O9163K631337K683549
35273B365819p02103k855802j70843L806197L446975m34045k342034q71560m2388
35264B200216j854702l036291r35810J833723J538537q81452j527464M58512K001863
35255b02868J114267k45856L80277J849518J125252j830241l674852k530683m50826
35246d466012K24636L14539J403946K376377J417066k55257k26507P32815K8078
$$ plain form
35237 1549681 -226921 -1864650 -1366225 94534 530372 569819 1521675 2008772 99508
35228 99508 -2677878 -3211983 -1614432 -361989 322703 2000520 3659459 2585213 -448549
35219 -448549 -1769852 -1098384 -2119171 -5596029 -7295002 -5033755 -2673066 -3847149
35211 -3847149 -6253920 -6127163 -4482878 -4299321 -4549884 -2236735 1473776 2392715 -2672
35202 -2672 -1722659 -379899 1794266 1779725 -559268 -3477846 -5490980 -5758656 -4405499
35193 -4405499 -3019279 -3132113 -4064614 -3999784 -3004125 -2862668 -3947325 -4590442 -3902732
35184 -3902732 -2936617 -2441508 -1627399 -83337 952299 394658 -986323 -1683074 -1220994
35175 -1220994 -91522 1064417 1610750 1229747 544978 494227 887349 786036 425777
$$ packed form
35237A549681j776602j637729M98425J460759M35838L9447R51856M87097j909264
35228I9508k777386n34105J597551J252443O84692J677817J658939j074246l033762
35219d48549j321303O71468j020787l476858j698973K261247K360689j174083
35211c847149k406771J26757J644285J83557k50563K313149L710511R18939k395387
35202b672j719987J342760K174165j4541k338993k918578k013134k67676J353157
35193d405499J386220j12834r32501O4830R95659J41457j084657o43117O87710
35184c902732R66115M95109Q14109J544062J035636n57641j380981o96751M62080
35175a220994J129472J155939N46333l81003o84769n0751L93122j01313l60259
$$ plain form
35166 425777 1098974 2657296 3028151 1299710 -411295 259706 2505366 3504356 2327810
35157 2327810 896932 1125250 2566560 3211961 1759616 -1076255 -2974340 -1923074
35149 -1923074 1579770 4534225 4535338 2634279 2002959 3813219 5880372 5876963 4374162
35140 4374162 3448375 3415596 2873527 1598958 1082485 1569647 920872 -1827268 -3664254
35131 -3664254 -1230572 3585046 5166363 1834160 -1535480 -427516 2921692 3211064
35123 3211064 -67948 -2615126 -2356684 -1966683 -3592393 -5263825 -4660481 -3091367 -2803574
35114 -2803574 -2781153 -700130 2353716 2856794 278688 -1924347 -1388665 37755 -500153
35105 -500153 -2910859 -5018577 -5597516 -4779672 -2749355 40088 2088268 2175190 1291698
$$ packed form
35166D25777O73197J558322L70855j728441j711005O71001K245660R98990j176546
35157B327810j430878K28318J441310O45401j452345k835871j898085J051266
35149a923074L502844K954455J113j901059o31320J810260K067153l409j502801
35140D374162r25787l2779n42069j274569n16473M87162o48775k748140j836986
35131c664254K433682M815618J581317l332203l369640J107964L349208K89372
35123C211064l279012k547178K58442L90001j625710j671432O03344J569114K87793
35114b803574K2421K081023L053846N03078k578106k203035N35682J426420n37908
35105e00153k410706k107718n78939Q17844K030317K789443K048180Q6922q83492
$$ plain form
35096 1291698 1690394 3919227 6046696 6034834 3877342 1176629 -562803 -1057867 -1378687
35087 -1378687 -2938780 -5574915 -6887339 -4789495 -784485 948282 -1485081 -5100537
35079 -5100537 -5715685 -3150051 -972991 -1426772 -2561717 -1119629 3006115 6378964
35071 6378964 5840714 1904537 -1942499 -2986939 -1806435 -869333 -1368035 -2562178 -3981711
35062 -3981711 -6305328 -9067178 -9436397 -5600739 -435447 1034775 -2003627 -5065948
35054 -5065948 -4503136 -1983654 -1070732 -1805488 -1632669 -275023 -92453 -1594813 -2067678
35045 -2067678 60624 2283877 1607128 -782012 -1100949 1491147 3646495 2500068
35037 2500068 -655601 -2522682 -2027442 -718669 230871 1379986 3089051 3967042 2482717
$$ packed form
35096A291698L98696K228833K127469j1862k157492k700713j739432m95064l20820
35087a378687j560093k636135j312424K097844M005010J732767k433363l615456
35079e100537o15148K565634K177060m53781j134945J442088M125744L372849
35071F378964n38250l936177l847036j044440J180504R37102m98702j194143j419533
35062c981711k323617k761850l69219L835658N165292J470222l038402l062321
35054e065948N62812K519482R12922p34756J72819J357646J82570j502360m72865
35045b067678K128302K223253o76749k389140l18937K592096K155348j146427
35037B500068l155669j867081M95240J308773R49540J149115J709065Q77991j484325
$$ plain form
35028 2482717 -627313 -2854531 -2738384 -1205393 -9389 231172 121096 433978 1490576
35019 1490576 3022553 4201758 4319884 3777992 3688590 4098065 3674081 2017284 1063941
35010 1063941 2563357 4966468 4997350 2252537 -60425 405154 2110975 2341359 1062805
35001 1062805 234066 521749 822644 516702 212304 297114 410881 510262 1066252 2023728
34991 2023728 2773921 3230460 3706978 3749808 2532798 514819 -866430 -1373528 -2072711
34982 -2072711 -2842431 -1912658 1008333 3203283 2353575 -26439 -680965 812899 1813603
34973 1813603 627643 -1353009 -1769256 39103 2874009 5052465 5617028 4896642 3910746
34964 3910746 2900081 1206983 -786320 -1069801 1110900 3211542 2537690 375176
$$ packed form
35028B482717l110030k227218J16147J532991J196004K40561j10076L12882J056598
35019A490576J531977J179205J18126n41892q9402M09475m23984j656797r53343
35010A063941J499416K403111L0882k744813k312962M65579J705821K30384j278554
35001A062805q28739K87683L00895l05942l04398Q4810J13767R9381N55990R57476
34991B023728P50193M56539M76518M2830j217010k017979j381249n07098o99183
34982b072711p69720R29773K920991K194950q49708k380014o54526J493864J000704
34973A813603j185960j980652m16247J808359K834906K178456N64563p20386r85896
34964C910746j010665j693098j993303k83481K180701K100642o73852k162514
$$ plain form
34956 375176 144436 2114429 3352838 2836338 2636964 3163738 1522522 -3131225 -6432911
34947 -6432911 -4381738 689335 3451501 2907307 2406410 3592494 4541033 3702319 1851452
34938 1851452 -265784 -2826814 -4853746 -4427196 -1905174 -78052 -146415 -334006 461149
34929 461149 686740 -597849 -1446605 -255116 1272455 999758 57163 650684 1820569
34920 1820569 856649 -1811469 -2665885 -247296 2818341 3730735 2891321 2186945 1971620
34911 1971620 1358576 270141 -385538 -153301 386813 375003 -429173 -1332313 -1239357 85750
34901 85750 1383184 1167590 -456575 -2056559 -2851359 -3340138 -3795925 -3397922 -1578494
34892 -1578494 621639 1396316 25025 -2593342 -4894183 -5784322 -5198253 -3847813 -2283018
$$ packed form
34956C75176k30740J969993J238409n16500j99374N26774j641216m653747l301686
34947f432911K051173N071073K762166n44194n00897J186084R48539q38714j850867
34938A851452k117236k561030k026932M26550K522022J827122o8363j87591P95155
34929D61149K25591j284589q48756J191489J527571k72697r42595N93521J169885
34920A820569r63920k668118q54416K418589L065637R12394q39414p04376k15325
34911A971620o13044j088435o55679K32237N40114j1810q04176r03140R2956J325107
34901H5750J297434k15594j624165j599984p94800m88779m55787L98003J819428
34892a578494K200133P74677j371291k618367k300841q90139N86069J350440J564795
$$ plain form
34883 -2283018 -391669 1680469 2593648 1071545 -1850975 -3312831 -1965505 454704
34875 454704 1682473 1722703 1860115 2012934 883989 -1571357 -3492698 -3226979 -1056671
34866 -1056671 1418119 2838875 2845023 1894513 574927 -1039912 -3080079 -4846876 -4994884
34857 -4994884 -3388413 -1799341 -1676985 -2099585 -1333927 354924 1254997 1115117 1418338
34848 1418338 2663892 3405239 2554197 982112 179546 655569 2076075 3633378 4053592
34839 4053592 2800157 1419372 1844638 3259239 2993887 874979 -229431 875715
34831 875715 1674086 277405 -1460542 -1550995 -1400206 -2562685 -2877438 134954 4229842
34822 4229842 5282072 3678785 3206904 4583034 5087564 4171683 4020516 4213645 1545685
$$ packed form
34883b283018J891349K072138R13179j522103k922520j461856J347326K420209
34875D54704J227769M0230J37412J52819j128945k455346j921341K65719K170308
34866a056671K474790J420756O148r50510j319586j614839k040167j766797j48008
34857d994884J606471J589072J22356m22600P65658J688851R00073j39880L03221
34848A418338J245554P41347q51042j572085q02566M76023J420506J557303M20214
34839D053592j253435j380785M25266J414601k65352k118908j104410J105146
34831H75715P98371j396681j737947r0453J50789j162479l14753L012392M094888
34822D229842J052230j603287m71881J376130N04530r15881j51167J93129k667960
$$ plain form
34813 1545685 -3440002 -5408562 -2249265 1005592 -367051 -3912467 -4588570 -2419658
34805 -2419658 -966461 -1015662 -687684 -20009 -674382 -2023136 -1869519 -605742 -682957
34796 -682957 -2118471 -2295844 -400475 1456861 1991405 2375078 3396279 3910978 3116320
34787 3116320 1945046 1210504 392329 -895483 -2029316 -2639467 -3069880 -3080875 -1842622
34778 -1842622 219579 1288903 571131 -617202 -829565 -262720 74198 -113661 -276561
34769 -276561 255254 1522571 2379142 1237113 -1704366 -3832058 -3113338 -836650 352524
34760 352524 189160 345140 1040586 831056 -438531 -1259341 -1246563 -1604640 -2336730 -1692381
34750 -1692381 678050 2435286 1678988 -475795 -1603572 -814365 966607 2324504
$$ packed form
34813A545685m985687j968560L159297L254857j372643l545416o76103K168912
34805b419658J453197m9201L27978O67675o54373j348754J53617J263777p7215
34796f82957j435514j77373J895369J857336N34544L83673J021201N14699p94658
34787C116320j171274p34542q18175j287812j133833o10151m30413j0995J238253
34778a842622K062201J069324p17772j188333k12363N66845L36918j87859j62900
34769b76561N31815J267317Q56571j142029k941479k127692P18720K276688J189174
34760C52524j63364J55980O95446k09530j269587q20810J2778l58077p32090O44349
34750a692381K370431J757236p56298k154783j127777P89207J780972J357897
$$ plain form
34742 2324504 2378948 1516059 1167354 1831690 2028478 876454 499426 3049718 6215292
34733 6215292 5412237 456742 -3877630 -4597547 -3753139 -3766795 -3697368 -2315628 -1143615
34724 -1143615 -1594783 -2033895 -567403 1630601 2449650 2108327 1778001 1131205 -180066
34715 -180066 -726222 411091 1607650 1504680 1568226 3005889 3585013 1060099 -2308860
34706 -2308860 -2674385 -553412 327022 -792997 -1011063 932064 2766424 2623644 1348882
34697 1348882 165405 -957513 -1894947 -2020285 -1887327 -2737107 -3833054 -2870633 360445
34688 360445 3291451 4266592 4355584 4574793 3935262 1719194 -521771 -1038505 -393463
34679 -393463 -223852 -665386 -586324 411821 1682936 2818027 4034973 5360033 6291750
$$ packed form
34742B324504N4444q62889l48705O64336J96788j152024l77028K550292L165574
34733F215292q03055m955495m334372p19917Q44408j3656O9427J381740J172013
34724a143615m51168m39112J466492K198004Q19049l41323l30326o46796j311271
34715a80066n46156J137313J196559j02970O3546J437663N79124k524914l368959
34706b308860l65525K120973Q80434j120019k18066J943127J834360j42780j274762
34697A348882j183477j122918r37434j25338J32958q49780j095947R62421L231078
34688C60445K931006R75141Q8992K19209o39531k216068k240965n16734O45042
34679c93463J69611m41534P9062R98145J271115J135091J216946J325060R31717
$$ plain form
34670 6291750 6472918 6229389 6090149 5833606 4507841 1887249 -539999 -1081105 -139760
34661 -139760 426840 258082 821599 2311276 2649709 899287 -744117 -339247 636350
34652 636350 11646 -1151649 -416703 1655282 2302524 941078 -427448 -675065 -341681
34643 -341681 632163 2795660 4900414 4805997 2825452 1357547 1170626 934574 383107
34634 383107 735865 1759359 1696435 604568 545239 1895076 2772575 2803410 3940375
34625 3940375 6506513 7929107 6764121 4663314 2994806 990903 -1220755 -1528902
34617 -1528902 161671 649914 -1231014 -1737972 1995357 6598626 6844057 2912477 -708085
34608 -708085 -1635446 -916583 483796 2382894 3495230 2715247 1727392 2878177 5149001
$$ packed form
34670F291750J81168k43529j39240k56543j325765k620592k427248n41106R41345
34661a39760N66600j68758N63517J489677L38433j750422j643404M04870R75597
34652F36350o24704j163295P34946K071985O47242j361446j368526k47617L33384
34643c41681R73844K163497K104754r4417j980545j467905j86921k36052n51467
34634C83107L52758J023494o2924j091867n9329J349837Q77499L0835J136965
34625C940375K566138J422594j164986k100807j668508k003903k211658l08147
34617a528902J690573M88243j880928n06958L733329M603269K45431l931580l620562
34608g08085r27361P18863J400379J899098J112336p79983r87855J150785K270824
$$ plain form
34599 5149001 5808211 5271944 6157115 7777697 6276051 1146912 -2744834 -1546797 2662400
34590 2662400 5443661 5535313 4487838 3264526 1950803 1292957 2003151 3400655 4596829
34581 4596829 6020820 7991948 8941361 7255431 4153663 2408809 2460735 2086746 111854
34572 111854 -1769377 -1576510 431936 2814394 4909225 6431924 6436819 4412560 1780099
34563 1780099 668191 1382785 2388574 2546429 1980598 962150 -352146 -927992 584943
34554 584943 3730926 6301117 7123788 7093401 6739032 4977832 1711079 -563470 26564
34545 26564 1640777 1540829 674768 2265231 6337707 8967240 7455142 3628831 1281494
34536 1281494 2332989 5900083 9220140 9333791 5915304 2458314 2437482 4598546 4963963
$$ packed form
34599E149001O59210n36267Q85171J620582j501646n129139l891746J198037M209197
34590B662400K781261R1652j047475j223312j313723o57846P10194J397504J196174
34581D596829J423991J971128R49413j685930l101768j744854N1926l73989j974892
34572A11854j881231J92867K008446K382458K094831J522699M895k024259k632461
34563A780099j111908P14594J005789J57855n65831j018448j314296n75846J512935
34554E84943L145983K570191Q22671l0387l54369j761200l266753k274549N90034
34545B6564J614213r9948q66061J590463M072476K629533j512098l826311k347337
34536A281494J051495L567094L320057J13651l418487l456990k0832K161064L65417
$$ plain form
34527 4963963 3261915 3377177 6603077 8829445 6672704 2629870 1138134 2533711
34519 2533711 4206430 5181719 5885227 5367419 2798885 525685 1573102 4556684 4979924
34510 4979924 1822359 -801624 514608 4030448 5703649 4257537 1850547 1059674
34502 1059674 2467582 4525042 5142213 3933949 2934028 4310198 7551045 9968668
34494 9968668 9873313 8136388 6671588 6487402 7285464 8038499 7944889 7441653 7847203
34485 7847203 9313299 10062753 8878805 7332842 7759616 9810759 11217994 11536700 12528295
34476 12528295 14627514 15817440 15149475 15021088 18102423 23438800 27423130 27745557
34468 27745557 24784546 19987404 14998417 12205055 13735370 18765616 23331324 24345024
$$ packed form
34527D963963j702048J15262L225900K226368k156741m042834j491736J395577
34519B533711J672719R75289P03508n17808k568534k273200J047417K983582M23240
34510D979924l157565k623983J316232L515840J673201j446112k406990p90873
34502A059674J407908K057460O17171j208264r99921J376170L240847K417623
34494I968668r5355j736925j464800j84186P98062P53035r3610n03236M05550
34485G847203J466096P49454j183948j545963M26774K051143J407235L18706R91595
34476A2528295K099219J189926o67965j28387L081335N336377L984330L22427
34468B7745557k961011m797142m988987k793362J530315N030246M565708J013700
$$ plain form
34460 24345024 23008950 22723864 24315264 25533407 25254572 25304608 26751037 27125793 24086950
34451 24086950 20019660 19481532 22790291 25798037 26083184 25649837 26768922 28958909
34443 28958909 31705837 36736829 45369084 56390483 68718930 83420027 100837704
34436 100837704 118719184 136104182 156354141 182911094 214095055 244891498 270704256
34429 270704256 285259660 278548628 244378167 190424588 135073561 92629019 65033873
34422 65033873 47587251 36791111 30551315 26088742 21957978 19806322 21124576 23909119
34414 23909119 24804823 23063835 20431257 18400151 17307218 17096833 17471066 17949918 18694818
34405 18694818 20551534 23781629 27625070 31306420 34412846 36365529 36894998 36926696
$$ packed form
34460B4345024j336074k85086J591400J218143k78835N0036J446429L74756l038843
34451B4086950m067290n38128L308759L007746K85147m33347J119085K189987
34443B8958909K746928N030992Q632255J1021399J2328447J4701097J7417677
34436A00837704J7881480J7384998K0249959K6556953L1183961L0796443K5812758
34429B70704256J4555404o711032l4170461n3953579n5351027m2444542k7595146
34422F5033873j7446622j0796140o239796m462573m130764k151656J318254K784543
34414B3909119Q95704j740988k632578k031106j092933k10385L74233M78852P44900
34405A8694818J856716L230095L843441L681350L106426J952683N29469L1698
$$ plain form
34397 36926696 37602591 38876674 40607598 43826734 48335442 50351580 46511067 39902576
34389 39902576 37575469 41204648 44738290 43047318 38618602 37069896 39688332 43465982
34381 43465982 45583829 44824629 41134253 36825151 35854364 38831952 40935693 37865839
34373 37865839 31641337 27116353 24986660 22331795 18470313 15732284 14964528 14472688
34365 14472688 13520170 13184149 13389413 12430655 10014894 7934204 7289721 7637200 8910987
34356 8910987 11224623 12675784 10823404 7040900 5833245 8465193 10671233 8689999
34348 8689999 4497519 2416951 3046389 3743308 3452054 3498508 4150510 3792350 2028637
34339 2028637 853710 1597660 2771718 2451391 1374416 1860811 4278992 6384100 6296918
$$ packed form
34397C6926696O75895J274083J730924L219136M508708K016138l840513o608491
34389C9902576k327107L629179L533642j690972m428716j548706K618436L777650
34381D3465982K117847p59200l690376m309102r70787K977588K103741l069854
34373C7865839o224502m524984k129693k654865l861482k738029p67756m91840
34365A4472688r52518l36021K05264r58758k415761k080690o44483L47479J273787
34356H910987K313636J451161j852380l782504j207655K631948K206040j981234
34348H689999m192480k080568O29438O96919k91254M6454O52002l58160j763713
34339B028637j174927P43950J174058l20327j076975M86395K418181K105108q7182
$$ plain form
34330 6296918 4687312 3470337 3502763 4369408 5471640 6208878 5775670 4127580 2778355
34321 2778355 3198285 4573078 4707110 3169828 1740092 1359530 692763 -1249470 -2914518
34312 -2914518 -2246263 309614 2431201 2701588 1415446 -505159 -1984731 -1970878 -562647
34303 -562647 686927 798671 748443 1441617 1546577 -595900 -3757763 -4906249 -3224939
34294 -3224939 -806466 603606 1269662 1654104 1295034 292752 1089 1212088 3007847
34285 3007847 4143892 4272479 3253415 828707 -2128344 -3486088 -2184749 240640
34277 240640 1476067 1018706 156965 153374 1272245 2960347 4236746 4398768 3838233
34268 3838233 3598567 3890575 3976132 3815530 4508413 6371320 7953619 8147061 8082215
$$ packed form
34330F296918j609606j216975L2426Q66645J102232P37238m33208j648090j349225
34321B778355M19930J374793J34032j537282j429736l80562o66767j942233j665048
34312b914518O68255K555877K121587K70387j286142j920605j479572J3853J408231
34303e62647J249574J11744n0228O93174J04960k142477l161863j148486J681310
34294c224939K418473J410072O66056L84442l59070j002282k91663J210999J795759
34285C007847J136045J28587j019064k424708k957051j357744J301339K425389
34277B40640J235427m57361q61741l591J118871J688102J276399J62022n60535
34268C838233k39666K92008Q5557j60602O92883J862907J582299J93442o4846
$$ plain form
34259 8082215 9377954 11365761 11875565 10417721 8754019 8258044 8455104 8572140 8864532
34250 8864532 9592771 10103425 10063030 10502900 12265565 14190350 14473577 13556251 13946718
34241 13946718 16849197 20399893 21855904 20345010 16767053 12260729 7951679 5230433
34233 5230433 4673171 4938391 4027392 1611476 -821187 -1852036 -1158843 876440 3237888
34224 3237888 4296940 3352072 2013291 2362426 3828438 3925743 2239708 1200497 2116453
34215 2116453 3026342 1980060 68333 -855634 -1357649 -2692887 -3494855 -1382123 2710967
34206 2710967 4884976 3217406 -107261 -2059185 -1963310 -752352 972081 2881589
34198 2881589 4090977 3624483 1530773 -801423 -1380861 841189 4581748 7005255
$$ packed form
34259H082215J295739J987807N09804j457844j663702m95975J97060J17036K92392
34250H864532P28239N10654m0395M39870J762665J924785K83227r17326L90467
34241A3946718K902479L550696J456011j510894l577957m506324m309050k721246
34233E230433n57262K65220r10999k415916k432663j030849O93193K035283K361448
34224C237888J059052r44868j338781L49135J466012R7305j686035j039211R15956
34215B116453R09889j046282j911727r23967n02015j335238q01968K112732M093090
34206B710967K174009j667570l324667j951924R5875J210958J724433J909508
34198B881589J209388m66494k093710k332196n79438K222050L740559K423507
$$ plain form
34190 7005255 6682339 5010782 3843955 3008463 1701199 916793 2064335 4050877 4507615
34181 4507615 3497262 3045558 3113967 1457639 -1897803 -3598647 -1863893 792264 1761468
34172 1761468 2205089 3935431 5095075 2790909 -1287153 -2011162 2168947 6752247
34164 6752247 6884498 3059487 -431695 -1084953 -340950 -766367 -2800729 -4749687 -5038475
34155 -5038475 -3539173 -887636 2310416 4927942 5077392 2031455 -1936362 -3446443
34147 -3446443 -1992961 -266459 -95388 -235109 726771 1601909 837117 -258373 721189
34138 721189 3186166 4140459 2750458 1513669 2285739 3663321 3498485 2007794 885210
34129 885210 809979 1419119 2621147 4235957 5133865 4614572 4309020 6750781 11825501
$$ packed form
34190G005255l22916j671557j166827q35492j307264p84406J147542J986542M56738
34181D507615j010353m51704O8409j656328l355442j700844J734754K656157R69204
34172A761468M43621J730342J159644k304166m078062p24009M180109M583300
34164F752247J32251l825011l491182o53258P44003m25417k034362j948958k88788
34155e038475J499302K651537L198052K617526J49450l045937l967817j510081
34147c446443J453482J726502J71071j39721R61880Q75138p64792j095490R79562
34138G21189K464977R54293j390001j236789P72070J377582j64836j490691j122584
34129H85210p5231O09140J202028J614810Q97908n19293l05552K441761N074720
$$ plain form
34120 11825501 16453233 18422443 18755844 19106012 18575709 15354553 10647888 8213699
34112 8213699 9599567 12274108 13529464 13959474 15264019 16555131 15593852 12828878
34104 12828878 11284974 12291240 13803890 13545482 11684772 9657351 8273409 7898890
34096 7898890 8692625 9577527 8618768 5607097 2810721 2055569 2554518 2719944 2395009
34087 2395009 1947603 1042257 33660 625947 2954110 3956705 1513555 -1439982 -471070
34078 -471070 3663963 5877873 4148427 1842879 1818566 2370630 1071420 -859268 -898131
34069 -898131 453252 718307 -576572 -1701279 -1669052 -1025391 -226680 695860 1184928
34060 1184928 668466 -191110 -229267 560591 1385967 2102068 2910394 3296763 2851880 2493744
$$ packed form
34120A1825501M627732J969210L33401L50168n30303l221156m706665k434189
34112H213699J385868K674541J255356M30010J304545J291112r61279k764974
34104A2828878j543904J006266J512650k58408j860710k027421j383942l74519
34096G898890P93735Q84902r58759l011671k796376p55152M98949J65426l24935
34087B395009m47406r05346j008597N92287K328163J002595k443150k953537R68912
34078d71070M135033K213910j729446k305548k4313N52064j299210j930688l8863
34069h98131J351383K65055j294879j124707L2227O43661P98711R22540M89068
34060A184928n16462q59576l8157P89858Q25376P16101Q08326L86369m44883l58136
$$ plain form
34050 2493744 3157679 3939010 3467090 2456328 2597506 3414945 2937139 1380226 1102423
34041 1102423 2402870 2585802 430071 -1500475 -910611 583216 265927 -1457857 -2363887
34032 -2363887 -2140698 -1931442 -1561890 -314844 559842 -612641 -2481172 -2154807 46837
34023 46837 846223 -726479 -1975888 -1289657 -531695 -1125476 -1283182 557464 2614604
34014 2614604 2875088 2701422 4112319 5612586 4426947 1465416 150627 985154 1211492
34005 1211492 -190797 -1131187 -656771 -717933 -2294365 -3300983 -2469090 -2212872 -4738073
33996 -4738073 -7565698 -6353563 -1078750 3905388 5753081 5997577 7012082 8377789
33988 8377789 8278871 6657506 5032512 3994068 2751955 1140492 379178 1086409 1738784
$$ packed form
34050B493744O63935P81331m71920j010762J41178Q17439m77806j556913k77803
34041A102423J300447J82932k155731j930546N89864J493827l17289j723784r06030
34032b363887K23189K09256L69552J247046Q74686j172483j868531L26365K201644
34023D6837P99386j572702j249409O86231P57962n93781j57706J840646K057140
34014B614604K60484j73666J410897J500267j185639k961531j314789Q34527K26338
34005A211492j402289r40390M74416o1162j576432j006618Q31893K56218k525201
33996d738073k827625J212135N274813M984138J847693K44496J014505J365707
33988H377789r8918j621365j624994j038444j242113j611463p61314P07231O52375
$$ plain form
33979 1738784 458692 -2102256 -3193393 -1542170 921110 1674913 629614 -709252
33971 -709252 -1937079 -3676329 -5308384 -5021726 -2545251 -39452 481425 -705812 -2023228
33962 -2023228 -2372062 -1361146 726419 2359329 1632314 -1194612 -3332478 -2799497 -883048
33953 -883048 -33373 -577051 -1013767 -435445 989890 2913480 4475623 4174598 2036804
33944 2036804 785591 2384609 4391608 2887445 -1347351 -3231731 -533037 3100628
33936 3100628 3796900 2612317 2451766 2818137 1287431 -1467766 -2134283 20727 1895750
33927 1895750 1124559 -950183 -1893780 -1450796 -874148 -731396 -813885 -1056484 -1296602
33918 -1296602 -983075 -130060 257149 -385923 -1164412 -1074037 -541831 -571358 -1068791 -1134287
$$ packed form
33979A738784j280092k560948j091137J651223K463280P53803j045299j338866
33971g09252j227827j739250j632055K86658K476475K505799N20877j187237j317416
33962b023228l48834J010916K087565J632910p27015k826926k137866N32981J916449
33953h83048Q49675n43678m36716N78322J425335J923590J562143l01025k137794
33944B036804j251213J599018K006999j504163m234796j884380K698694L633665
33936C100628O96272j184583j60551L66371j530706k755197o66517K155010J875023
33927A895750p71191k074742r43597M42984N76648J42752q2489k42599k40118
33918a296602L13527Q53015L87209o43072p78489R0375N32206k9527m97433o5496
$$ plain form
33908 -1134287 -433812 806695 2558449 4504250 5363923 4206042 2173644 1347544 1892821
33899 1892821 1916117 431177 -1129232 -1047586 348055 1407791 1292480 496920 -95719
33890 -95719 77678 953778 1608342 865539 -1242567 -3117971 -3290114 -2042796 -844858
33881 -844858 -603361 -973144 -981620 93478 2044385 3597725 3496112 2033585 854208
33872 854208 855429 1066874 125326 -1889974 -3663335 -3973744 -2341173 763575 3723682
33863 3723682 4711819 3590517 2100717 1610349 1754495 1876971 2243921 2747530 2144430
33854 2144430 273782 -567685 1317760 3872938 3794004 1325624 -355083 -102243 118703
33845 118703 -623768 -468266 1510006 2797400 868365 -2843413 -4699442 -3437997 -977212
$$ packed form
33908a134287P00475J240507J751754J945801Q59673j157881k032398q26100N45277
33899A892821K3296j484940j560409Q1646J395641J059736j15311p95560n92639
33890i5719J73397Q76100O54564p42803k108106j875404j72143J247318J197938
33881h44858K41497l69783q476J075098J950907J553340j01613j462527j179377
33872H54208J221K11445r41548k015300j773361l10409J632571L104748K960107
33863C723682R88137j121302j489800m90368J44146J22476L66950N03609o03100
33854B144430j870648q41467J885445K555178p8934k468380j680707K52840K20946
33845A18703p42471J55502J978272J287394j929035l711778j856029J261445K460785
$$ plain form
33836 -977212 560753 607632 -741495 -3320898 -6034823 -6841612 -4744325 -1381367 399324
33827 399324 -217054 -1063284 -41712 1713364 1420860 -843344 -1766775 104314 1619248
33818 1619248 -327105 -3635890 -3811620 -619851 1839192 1337960 -62246 -236620 85075
33809 85075 -238118 -718626 -1167209 -2716510 -5160924 -5856373 -3171291 1077432 4203952
33800 4203952 5502850 5151861 2896656 -291639 -1746216 -445288 1373764 1853828
33792 1853828 2186674 3445686 3751105 1677640 -262758 683392 2593962 1908150 -324936
33783 -324936 17653 3164568 4896947 3137191 567003 -191861 44863 -205059 -473706
33774 -473706 -158136 -76066 -578727 -534837 359300 537474 -764655 -2000666 -1980777 -1958068
$$ packed form
33836i77212J537965M6879j349127k579403k713925q06789K097287L362958J780691
33827C99324o16378q46230J021572J755076k92504k264204r23431J871089J514934
33818A619248j946353l308785j75730L191769K459043n01232j400206j74374L21695
33809H5075l23193m80508m48583j549301k444414o95449K685082M248723L126520
33800D203952J298898l50989k255205l188295j454577J300928J819052M80064
33792A853828L32846J259012L05419k073465j940398R46150J910570o85812k233086
33783c24936L42589L146915J732379j759756k570188p58864K36724k49922k68647
33774d73706L15570Q2070n02661M3890Q94137J78174j302129j236011J9889K2709
$$ plain form
33764 -1958068 -3306596 -4865695 -4498351 -2108614 541896 2127407 2505716 1981418 1074879
33755 1074879 500530 512916 759292 1161552 2020288 2838221 2300352 221225 -1591227
33746 -1591227 -1388584 381782 1819690 1784789 673031 -355577 -226010 1423886 3764307
33737 3764307 5209909 4825244 3208254 1853093 1735012 2374491 2212231 398860 -1704856
33728 -1704856 -1841565 -4437 1332107 999825 1027120 2941980 4517162 3241788 1114377
33719 1114377 1799513 4015531 2784543 -2347680 -5602797 -3321979 827108 1995596
33711 1995596 1261771 2475179 5169657 5609138 3401335 2158816 3603786 5187483
33703 5187483 4439125 2427843 1623558 2668455 4500692 5873379 5602512 2795309 -1863816
$$ packed form
33764a958068j348528j559099L67344K389737K650510J585511L78309n24298r06539
33755A074879n74349J2386K46376M02260Q58736Q17933n37869k079127j812452
33746a591227K02643J770366J437908l4901j111758j028608J29567J649896K340421
33737C764307J445602l84665j616990j355161j18081O39479j62260j813371k103716
33728a704856j36709J837128J336544l32282K7295J914860J575182j275374k127411
33719A114377O85136K216018j230988n132223l255117K280818M149087J168488
33711A995596p33825J213408K694478M39481k207803j242519J444970J583697
33703E187483p48358k011282q04285J044897J832237J372687k70867k807203m659125
$$ plain form
33694 -1863816 -5883200 -7062967 -5510661 -3140561 -1645488 -1332764 -1514904 -1546897 -1412558
33685 -1412558 -1317788 -946816 190895 1438689 990274 -1826795 -4833044 -4824236 -1170523
33676 -1170523 3360508 5550157 4655301 2105539 -748554 -3530063 -5668827 -5673542 -2729509
33667 -2729509 1243649 2574803 -291837 -4727844 -6700866 -5037450 -1857021 550853
33659 550853 1626707 1532008 232384 -1701700 -2803325 -2206805 -718461 177254 -221399
33650 -221399 -1590337 -3040121 -3704942 -3696083 -4363055 -6489688 -8427785 -7660000 -4431954
33641 -4431954 -2036794 -2764533 -5108149 -5953199 -4323925 -1908114 -645493 -671669 -388157
33632 -388157 1572027 4200068 4690563 2078756 -967188 -1780681 -1599293 -2886730 -4153809
$$ packed form
33694a863816m019384j179767J552306K370100J495073L12724j82140l1993J34339
33685a412558R4770L70972J137711J247794m48415k817069l006249Q808L653713
33676a170523M531031K189649q94856k549762k854093k781509k138764m715K944033
33667b729509L973158J331154k866640m436007j973022J663416L180429K407874
33659E50853J075854r4699j299624j934084j101625N96520J488344Q95715l98653
33650b21399j368938j449784o64821Q859o66972k126633j938097P67785L228046
33641d431954K395160p27739k343616q45050J629274K415811J262621k6176K83512
33632c88157J960184K628041M90495k611807l045944q13493J81388j287437j267079
$$ plain form
33623 -4153809 -1954710 2140072 2047294 -3681821 -8537707 -7054611 -2469521 -1072597
33615 -1072597 -2741489 -2500531 876176 3608278 3451505 2203777 1447243 376557 -1263031
33606 -1263031 -1867163 -730844 817753 1828673 2664037 3118684 2355709 1086351 950942
33597 950942 1343054 -18800 -2730626 -3378942 -868814 1324106 250780 -2148900 -2401305
33588 -2401305 -840072 -419332 -1559963 -1565927 829917 3141652 2410572 -774999 -2894258
33579 -2894258 -1727872 1097135 2233431 668828 -1438374 -2029241 -1723518 -2188593 -3437894
33570 -3437894 -4510097 -5683538 -7633182 -8965673 -7387127 -3566952 -1134827 -1952118
33562 -1952118 -3757222 -3748390 -2387830 -1968573 -2997059 -3912155 -3529483 -2099266 -366609
$$ packed form
33623d153809K199099M094782r2778n729115m855886J483096M585090J396924
33615a072597j668892K40958L376707K732102j56773j247728p56534j070686j639588
33606a263031o04132J136319J548597J010920Q35364M54647p62975j269358j35409
33597I50942L92112j361854k711826o48316K510128K192920j073326k399680k52405
33588b401305J561233M20740j140631n964K395844K311735p31080l185571k119259
33579b894258J166386K825007J136296j564603k107202n90867L05723m65075j249301
33570c437894j072203j173441j949644j332491J578546L820175K432125q17291
33562a952118j805104Q832J360560M19257j028486r15096L82672J430217J732657
$$ plain form
33553 -366609 1089994 1750485 1347081 164708 -1311502 -2846805 -4297123 -5365669 -5729507
33544 -5729507 -5082519 -3134192 -156590 2576475 3678819 3026958 1654335 506900
33536 506900 1365 284869 826177 286535 -1735511 -3242550 -1924684 1378781 3240549
33527 3240549 1925737 -766529 -2381890 -2635022 -2625086 -2976428 -3726426 -4651947 -4829825
33518 -4829825 -3178338 -244629 1826524 1877068 1003251 518784 111192 -966080 -2185001
33509 -2185001 -2454316 -1655219 -493552 414828 598099 -267358 -1745004 -2820921 -3084770
33500 -3084770 -2791836 -1685031 701994 3246388 3682748 1770616 220408 1182422 3335457
33491 3335457 3916609 2409866 684495 304721 1053051 1642303 1090438 -52429 346070
$$ packed form
33553c66609J456603O60491m03404j182373j476210j535303j450318j068546l63838
33544e729507O46988J948327K977602K733065J102344o51861j372623j147435
33536E06900n05535K83504N41308n39642k022046j507039J317866L303465J861768
33527C240549j314812k692266j615361k53132R936l51342p49998r25521j77878
33518d829825J651487K933709K071153N0544q73817m84467m07592j077272j218921
33509b185001k69315P99097J161667R08380J83271q65457j477646j075917k63849
33500c084770K92934J106805K387025K544394M36360j912132j550208R62014K153035
33491C335457N81152j506743j725371l79774P48330N89252n51865j142867L98499
$$ plain form
33482 346070 3559551 7331187 7655620 4002465 507211 587734 2636014 3021777 1289617
33473 1289617 -242723 -547958 -580446 -632436 100716 1294553 1271868 -492816 -2305323
33464 -2305323 -2109605 587545 4452800 6972197 5982954 1945125 -1863352 -2856146 -2208357
33455 -2208357 -2815137 -4938776 -6052469 -4779377 -2680540 -1706524 -1828146 -1962376 -1717730
33446 -1717730 -1257609 -456418 787230 1773504 1315469 -847526 -2989318 -2426360 1364917
33437 1364917 5022553 4554235 636778 -1686628 327190 3487931 3805669 2462318
33429 2462318 3180347 5655880 6087461 3534662 1066439 175006 -1350086 -4540898 -6495846
33420 -6495846 -4909494 -1933620 -698117 -749251 -35098 853458 -43128 -1986473 -2348016
$$ packed form
33482C46070L213481L771636L24433l653155l495254Q0523K048280L85763j732160
33473A289617j532340l05235l2488n1990P33152J193837k2685j764684j812507
33464b305323J95718K697150L865255K519397r89243m037829l808477r92794O47789
33455b208357o06780k123639j113693J273092K098837R74016j21622j34230K44646
33446a717730M60121Q01191J243648R86274m58035k162995k141792N62958L791277
33437A364917L657636m68318l917457k323406K013818L160741L17738j343351
33429B462318P18029K475533M31581k552799k468223q91433j525092l190812j954948
33420f495846J586352K975874J235503n1134P14153Q88556q96586j943345l61543
$$ plain form
33411 -2348016 -858599 276610 331475 877073 2307637 2724176 1321403 62711 371394
33402 371394 546379 -1362168 -3864207 -3786340 -794049 2404804 4025919 4758161 5144052
33393 5144052 4257390 2243599 1656095 4031679 6802182 6243629 2561225 -747710 -2091432
33384 -2091432 -3079060 -4323047 -3625659 -86119 3126915 2834829 487141 -260890 1035985
33375 1035985 1970676 1950880 2659503 4017117 3694435 1582454 1059036 3957869 7294719
33366 7294719 7339698 4581967 2117912 1123474 845705 1478293 3481281 4700234 2024384
33357 2024384 -3468694 -6473412 -4089583 313132 1955940 1010622 1146442 3129830
33349 3129830 3577913 501956 -3088646 -2895541 1170712 5155651 5863688 3746560 1295992
$$ packed form
33411b348016J489417J135209N4865N45598J430564M16539j402773j258692L08683
33402C71394J74985j908547k502039P7867K992291L198853J621115P32242L85891
33393E144052q86662k013791n87504K375584K770503n58553l682404l308935j343722
33384b091432r87628j243987O97388L539540L213034k92086k347688p48031J296875
33375A035985R34691j9796P08623J357614l22682k111981n23418K898833L336850
33366G294719M4979k757731k464055r94438k77769O32588K002988J218953k675850
33357B024384n493078l004718K383829M402715J642808r45318J35820J983388
33349C129830M48083l075957l590602J93105M066253L984939P08037k117128k450568
$$ plain form
33340 1295992 123649 -42395 -375123 -1365632 -2015276 -890912 1710069 3411942 2410716
33331 2410716 -191491 -1742189 -1108548 777454 2675135 3726164 3040139 640743
33323 640743 -1427503 -1078909 828616 1764983 1591188 2405446 4130995 3942991 1333733
33314 1333733 -85216 1873926 4186587 3466659 1413532 1513419 2939096 2430621 512843
33305 512843 591817 2436076 1948959 -1847483 -4520741 -2604761 1746886 4471672 4575035
33296 4575035 3258313 1009844 -1976044 -4513045 -5642565 -5692398 -4951893 -3197184 -1462068
33287 -1462068 -1754115 -3707732 -4277044 -2436683 -1217285 -2778840 -4462419 -2913071
33279 -2913071 341232 1244518 -465776 -1359444 -97684 808116 -675604 -3300578 -4844512
$$ packed form
33340A295992j172343j66044l32728r90509o49644J124364K600981J701873j001226
33331B410716k602207j550698O33641J886002J897681J051029o86025k399396
33323F40743k068246L48594J907525R36367j73795Q14258J725549j88004k609258
33314A333733j418949J959142K312661p19928k053127R9887J425677n08475j917778
33305E12843P8974J844259m87117l796442k673258J915980M351647K724786J03363
33296D575035j316722k248469k985888k537001j129520m9833P40505J754709J735116
33287a462068k92047j953617n69312J840361J219398j561555j683579J549348
33279b913071L254303R03286j710294q93668J261760R05800j483720k624974j543934
$$ plain form
33270 -4844512 -4684238 -3271989 -1154178 660131 1015801 18339 -1086848 -1701940 -2298264
33261 -2298264 -3021048 -3282259 -2835537 -1955950 -645279 975669 1834364 1232537 703829
33252 703829 2325482 5098482 5559030 2734239 -61524 154309 1828107 1451958 -1106377
33243 -1106377 -2475431 -714912 1954035 2107719 -629166 -3426360 -3792203 -2139515
33235 -2139515 -578752 -79583 115829 516492 363691 -723029 -1535778 -1171559 -1022846
33226 -1022846 -2799377 -5139400 -4785435 -1435027 1239069 548207 -1649311 -2206418 -1495992
33217 -1495992 -2288765 -4871494 -6307465 -4781794 -2131560 -1051954 -1631045 -2016506 -1370519
33208 -1370519 -714107 -1288024 -3189345 -5480910 -6877169 -6489025 -4590992 -2541444 -1343007
$$ packed form
33270d844512J60274J412249K117811J814309L55670r97462j105187o15092n96324
33261b298264p22784k61211M46722Q79587J310671J620948Q58695o01827n28708
33252G03829J621653K773000M60548k824791k795763K15833J673798l76149k558335
33243a106377j369054J760519K668947J53684k736885k797194l65843J652688
33235b139515J560763M99169J95412M00663j52801j086720q12749L64219J48713
33226a022846j776531k340023L53965L350408K674096o90862k197518n57107P10426
33217a495992p92773k582729j435971J525671K650234J079606n79091l85461O45987
33208a370519O56412n73917j901321k291565j396259L88144J898033K049548J198437
$$ plain form
33199 -1343007 -475903 1136242 3213234 4170242 3203560 1301632 -205133 -1066134 -1437598
33190 -1437598 -903970 629395 1867147 1536869 557834 1034917 2882635 3254287 167318
33181 167318 -4745548 -8182160 -8664533 -6857056 -3603961 431115 3613823 3929341 1352028
33172 1352028 -1596214 -2335314 -668042 1489546 2114294 638292 -1713438 -2833415
33164 -2833415 -1613887 796136 2134595 1527465 185873 -443357 -247840 201989 831530
33155 831530 1758088 2529678 2679460 2662295 3201007 3808818 3069938 743214 -1313214
33146 -1313214 -1074705 1181626 3111116 2960262 1251779 -442970 -1634711 -2935945
33138 -2935945 -4229617 -4078267 -1641314 1570382 2946934 1765508 75449 312574
$$ packed form
33199a343007Q67104J612145K076992R57008r66682j901928j506765q61001l71464
33190a437598N33628J533365J237752l30278r79035M77083J847718L71652l086969
33181A67318m912866l436612m82373J807477L253095M035076L182708L15518k577313
33172A352028k948242p39100J667272K157588O24748j476002k351730j119977
33164b833415J219528K410023J338459o07130j341592o29230J95517M49829O29541
33155H31530R26558P71590J49782j7165N38712O07811p38880k326724k056428
33146a313214K38509K256331J929490j50854j708483j694749j191741j301234
33138b935945j293672J51350K436953L211696J376552j181426j690059K37125
$$ plain form
33130 312574 2586587 4697472 4494130 1896372 -1152117 -2406999 -1180449 1176726
33122 1176726 2670297 2682814 2395313 2943766 3556289 2399832 -520137 -2348230 -405102
33113 -405102 4121487 7020144 6090253 3904922 4280876 7069485 8492022 6452618 3232546
33104 3232546 2136576 3477642 5331794 6630753 7425568 7067276 4627036 1138546
33096 1138546 -800681 -272861 875103 929803 618446 1392793 2845635 3436081 2977156
33087 2977156 2726776 3220685 3477570 2555703 821880 -640564 -1138229 -698186 16299
33078 16299 15922 -979814 -1601503 134201 4266292 8151952 9142362 7493459 5631586
33069 5631586 4850377 4064867 2101254 -181705 -1145986 -920793 -1198339 -2547555 -3400197
$$ packed form
33130C12574K274013K110885k03342k597758l048489j254882J226550K357175
33122A176726J493571J2517k87501N48453O12523j156457k919969j828093J943128
33113d05102M526589K898657r29891k185331L75954K788609J422537k039404l220072
33104C232546j095970J341066J854152J298959P94815l58292k440240l488490
33096A138546j939227N27820J147964N4700l11357P74347J452842N90446m58925
33087B977156k50380M93909K56885r21867j733823j462444m97665M40043P14485
33078A6299l77r95736o21689J735704M132091L885660R90410j648903j861873
33069E631586p81209p85510j963613k282959r64281K25193k77546j349216q52642
$$ plain form
33060 -3400197 -2316187 -117313 1262757 1340934 1237652 1536823 1400306 166679 -1366318
33051 -1366318 -2071679 -2125343 -2484964 -3089149 -2685025 -631206 1980749 3491321 3482094
33042 3482094 2914710 2737653 2945921 3071209 3055739 3179363 3272398 2600135 901779 -804871
33032 -804871 -1158630 -285956 74428 -1168025 -2699909 -2306395 89692 2110939 1925547
33023 1925547 337427 -873911 -1563617 -2812702 -4550105 -5310653 -4523620 -3532123 -3664967
33014 -3664967 -4370581 -4108553 -2426429 -378955 727709 479324 -391332 -566682 536607
33005 536607 1804842 1569160 -8531 -806464 365895 1992973 2037123 707659 -441862
32996 -441862 -1166230 -2324426 -3606248 -3722941 -2911823 -2998139 -4337486 -4736507 -2545782
$$ packed form
33060c400197J084010K198874J380070P8177j03282K99171j36517j233627j532997
33051a366318p05361n3664l59621o04185M04124K053819K611955J510572r227
33042C482094n67384j77057K08268J25288j5470J23624R3035o72263j698356j706650
33032h04871l53759Q72674L60384j242453j531884L93514K396087K021247j85392
33023A925547j588120j211338o89706j249085j737403p60548P87033R91497j32844
33014c664967p05614K62028J682124K047474J106664k48385q70656j75350J103289
33005E36607J268235k35682j577691p97933J172359J627078M4150j329464j149521
32996d41862p24368j158196j281822j16693Q11118q6316j339347l99021K190725
$$ plain form
32987 -2545782 760172 2444464 1820821 335510 -854828 -1918228 -3226813 -4443583
32979 -4443583 -4930883 -4410996 -3042982 -1172342 827563 2441242 2866580 1579930 -560464
32970 -560464 -1583508 -744112 170526 -692531 -2195076 -1711545 621078 1807617 552992
32961 552992 -971309 -1090890 -1429644 -3675013 -6110467 -6217104 -4854642 -4596979 -5116788
32952 -5116788 -3811310 -660282 1163481 75658 -1751459 -2093889 -1668203 -1781605 -1476390
32943 -1476390 611007 3077686 3124107 785162 -525306 1594629 5059201 5480492 1473175
32934 1473175 -3485714 -5118781 -3354903 -1790874 -2386092 -2949675 -1018997 1956239
32926 1956239 2710533 1100988 -91880 84221 -497628 -2890396 -4783376 -3962805 -1634378
$$ packed form
32987b545782L305954J684292o23643j485311j190338j063400j308585j216770
32979d443583m87300N19887J368014J870640J999905J613679M25338j286650k140394
32970e60464j023044Q39396R14638q63057j502545M83531K332623J186539j254625
32961E52992j524301j19581l38754k245369k435454j06637J362462K57663n19809
32952e116788J305478L151028J823763j087823j827117l42430M25686j13402L05215
32943a476390K087397K466679M6421k338945j310468K119935L464572M21291m007317
32934A473175m958889j633067J763878J564029n95218n63583J930678K975236
32926A956239P54294j609545j192868J76101n81849k392768j892980Q20571K328427
$$ plain form
32917 -1634378 -291576 -92121 451330 1477433 1804147 1271333 904301 966986 684294
32908 684294 -140928 -846524 -1278335 -1933034 -2602031 -2323877 -992156 322410 1066669
32899 1066669 1932055 3254918 3852276 2431971 -462736 -2756378 -2827837 -829708 1499703
32890 1499703 2083183 336158 -1777368 -1403495 1751358 4549860 4087622 1367729 -223125
32881 -223125 504143 1554089 1335655 817773 1152671 1376625 247515 -1303560 -1769654
32872 -1769654 -1939717 -3575295 -5774205 -5524868 -2163335 1411965 2779024 2740353 2802690
32863 2802690 2340105 268329 -2214512 -2897850 -1664299 -333668 -19347 -371790 -885672
32854 -885672 -1276116 -1031813 -209540 -185736 -1944441 -4084671 -4343802 -2737758 -1222119
$$ packed form
32917a634378J342802J99455N43451J026103L26714n32814l67032O2685k82692
32908F84294q25222p05596m31811o54699o68997K78154J331721J314566P44259
32899A066669Q65386J322863N97358j420305k894707k293642p1459J998129K329411
32890A499703N83480j747025k113526L73873L154853K798502m62238k719893j590854
32881b23125P27268J049946k18434n17882L34898K23954j129110j551075m66094
32872a769654j70063j635578k198910K49337L361533L575300J367059l8671O2337
32863B802690m62585k071776k482841o83338J233551J330631L14321l52443n13882
32854h85672l90444K44303Q22273K3804j758705k140230k59131J606044J515639
$$ plain form
32845 -1222119 -482427 642924 2332196 2818768 1230507 -574307 -328190 1859847 4240390
32836 4240390 5721625 6071678 4804723 1599410 -2294971 -4481924 -3758120 -1398864
32828 -1398864 318306 526145 191949 199752 -141433 -1845860 -3997962 -4304007 -2331023
32819 -2331023 -653776 -1612192 -4076934 -4927021 -2970595 192529 2665009 3843440
32811 3843440 3686047 2211620 208753 -805882 -14119 1780658 2855018 2079878 124212
32802 124212 -814485 578489 2581545 2406508 589633 714184 3566802 4993107 2255115
32793 2255115 -904823 193181 3289995 2435237 -2342065 -4996506 -3176332 -1326066
32785 -1326066 -2454749 -3305580 -1033299 993232 -1222170 -5074999 -5011946 -871778 2514332
$$ packed form
32845a222119P39692J125351J689272M86572j588261j804814K46117K188037K380543
32836D240390J481235L50053j266955l205313l894381k186953P23804K359256
32828a398864J717170K07839l34196P803l41185j704427k152102l06045J972984
32819b331023J677247r58416k464742q50087J956426L163124K472480J178431
32811C843440j57393j474427k002867j014635P91763J794777J074360p75140j955666
32802A24212r38697J392974K003056j75037j816875J24551K852618J426305k737992
32793B255115l159938J098004L096814q54758m777302k654441J820174J850266
32785a326066j128683q50831K272281K026531k215402l852829O3053M140168L386110
$$ plain form
32776 2514332 2711468 2026443 2838964 4491855 5171675 4105876 1616825 -1019655 -1926367
32767 -1926367 -553158 1139667 898008 -1063102 -2740754 -2751090 -900082 2134426 4336017
32758 4336017 3435631 161935 -1627195 -28814 1985238 1196911 -766922 -280880 2353376
32749 2353376 3712157 2773313 1761569 2075056 2944293 3826347 4845087 5115261 3713375
32740 3713375 1949698 1667288 1919076 632622 -1166928 -640752 1772477 2713753 1403907
32731 1403907 521155 1163669 1344193 383274 281980 1259238 412962 -3061537 -5560564
32722 -5560564 -4624792 -2862970 -3145633 -3518156 -931347 2714327 2859099 -745849 -3678395
32713 -3678395 -3151751 -1000958 -21787 -385661 -661350 -279296 230589 432871 557094
$$ packed form
32776B514332J97136o85025Q12521J652891O79820j065799k489051k636480r06712
32767a926367J373209J692825k41659j961110j677652j0336J851008L034508K201591
32758D336017r00386l273696j789130J598381K014052p88327j963833M86042K634256
32749B353376J358781r38844j011744L13487Q69237Q82054J018740K70174j401886
32740C713375j763677k82410K51788j286454j799550N26176K413229R41276j309846
32731A403907q82752O42514J80524r60919j01294R77258q46276l474499k499027
32722e560564R35772J761822k82663l72523K586809L645674J44772l604948k932546
32713c678395N26644K150793R79171l63874k75689L82054N09885K02282J24223
$$ plain form
32704 557094 1056067 1705922 1337436 -779819 -3287540 -3784276 -1928655 -6739 261026
32695 261026 -218230 -52529 281642 -147409 -500284 621914 2689970 3923391 3889603
32686 3889603 3700873 4021770 4434497 4474275 3900799 2269055 -394061 -2738642 -3240019
32677 -3240019 -2057045 -615873 361165 1153880 1668619 1322732 452225 344167 1298221
32668 1298221 1867414 877576 -705956 -1080066 -331984 -460049 -2366312 -4175227 -3666180
32659 -3666180 -1484949 -219984 -559465 -496687 1166310 2850441 3008971 2602744 2675096
32650 2675096 1550996 -2501970 -7149778 -8070775 -4787896 -1069632 482084 817203
32642 817203 1059781 427663 -1258237 -2228431 -1572267 -798907 -1198660 -2149203 -3214204
$$ packed form
32704E57094M98973O49855l68486k117255k507721m96736J855621J921916K67765
32695B61026m79256J65701L34171m29051l52875J122198K068056J233421l3788
32686C889603j88730L20897M12727L9778n73476j631744k663116k344581n01377
32677c240019J182974J441172R77038P92715N14739l45887q70507j08058R54054
32668A298221N69193r89838j583532l74110P48082j28065j906263j808915N09047
32659c666180K181231J264965l39481O2778J662997J684131J58530m06227P2352
32650B675096j124100m052966m647808r20997L282879L718264J551716L35119
32642H17203K42578o32118j685900r70194O56164P73360l99753r50543j065001
$$ plain form
32633 -3214204 -5069947 -6994226 -6633630 -4105140 -3001147 -4918463 -6340016 -4076943
32625 -4076943 -675865 -437334 -2487578 -2406863 602095 2866414 2284853 903059 857194
32616 857194 1392482 1121645 491343 586056 1292757 1831106 1998409 2140244 2483823 2710565
32606 2710565 1993546 36191 -1761084 -1515312 322172 1282399 733200 793453 2061012
32597 2061012 1734522 -1476686 -3919823 -2169830 1245504 1791043 196710 454462 2253642
32588 2253642 1662216 -1044526 -895736 3246340 5954714 3531123 -424067 -1058395 691469
32579 691469 1023064 -359678 -1080718 -852872 -1211667 -1927075 -1454701 -260645 -467241
32570 -467241 -2401807 -4125487 -4414986 -4060739 -3967441 -3642270 -2103123 535973 2754077
$$ packed form
32633c214204j855743j924279L60596K528490J103993j917316j421553K263073
32625d076943L401078K38531k050244Q0715L008958K264319n81561j381794m5865
32616H57194N35288k70837o30302R4713P06701N38349J67303J41835L43579K26742
32606B710565p17019j957355j797275K45772J837484R60227n49199O0253J267559
32597B061012l26490l211208k443137J749993L415334N45539j594333K57752J799180
32588B253642n91426k706742J48790M142076K708374k423591l955190o34328J749864
32579F91469L31595j382742p21040K27846l58795p15408M72374J194056k06596
32570d67241j934566j723680k89499L54247R3298L25171J539147K639096K218104
$$ plain form
32561 2754077 2897274 1071055 -543496 -147339 1355054 1910239 1586689 2049504 3078160
32552 3078160 2608394 704642 211014 2158909 3627833 2004755 -1412286 -4077648
32544 -4077648 -5696976 -6673952 -5796570 -2593471 69865 -861458 -4137994 -5857981 -4608176
32535 -4608176 -2274858 -812491 -882717 -2579185 -4692705 -4387859 -693571 2692922 1524331
32526 1524331 -2721421 -4384234 -1346521 2532848 3193701 967959 -1630072 -3355848
32518 -3355848 -3897230 -2883988 -1112252 -657791 -2046139 -3048477 -1824904 380288
32510 380288 1235058 501094 -455813 -1102177 -1894525 -2762001 -3057942 -2651853 -1810874 -328384
32500 -328384 2043731 4409170 5050489 3269786 417217 -1264915 -843475 392412 516653
$$ packed form
32561B754077J43197j826219j614551L96157J502393N55185l23550M62815J028656
32552C078160m69766j903752m93628J947895J468924j623078l417041k665362
32544d077648j619328r76976Q77382L203099K663336r31323l276536j719987J249805
32535d608176K333318J462367p0226j696468k113520L04846L694288L386493j168591
32526A524331m245752j662813L037713L879369O60853k225742k598031j725776
32518c355848n41382J013242J771736M54461j388348j002338J223573K205192
32510C80288Q54770p33964r56907o46364p92348q67476k95941M06089Q40979J482490
32500c28384K372115K365439O41319j780703k852569j682132M21440J235887J24241
$$ plain form
32491 516653 -575358 -1052530 171882 1755481 1877151 760414 -229888 -984813 -2067568
32482 -2067568 -2417793 -300638 3321113 5015922 3254827 257263 -1426293 -1818643
32474 -1818643 -1745146 -625550 1847027 3657948 2709386 263568 -248645 2284798 5265852
32465 5265852 5696262 3528587 1385958 1693748 4183801 5906362 4106500 -574117
32457 -574117 -4463279 -4831422 -2524952 -100458 1272343 1899286 1865407 977378 -249360
32448 -249360 -1096454 -1716562 -2430842 -2588350 -1584261 -404143 -469264 -1351174 -1412346 -489373
32438 -489373 -51467 -662624 -1212743 -1003620 -738656 -823782 -422440 866787 1825987 1226321
32428 1226321 -384171 -1517552 -1630975 -1304444 -1093908 -930362 -351251 942677 2346756
$$ packed form
32491E16653j092011m77172J224412J583599J21670j116737r90302p54925j082755
32482b067568l50225K117155L621751J694809j761095k997564j683556l92350
32474a818643P3497J119596K472577J810921r48562k445818n12213K533443K981054
32465E265852M30410k167675k142629L07790K490053J722561j799862m680617
32457e74117l889162l68143K306470K424494J372801O26943l3879q88029j226738
32448b49360q47094o20108p14280j57508J004089J180118o5121q81910o1172R22973
32438d89373M37906o11157n50119K09123K64964q5126M01342J289227R59200n99666
32428A226321j610492j133381j13423L26531K10536J63546N79111J293928J404079
$$ plain form
32419 2346756 2369286 395049 -1753043 -1604981 401323 1118010 -799959 -2750949 -2083601
32410 -2083601 -82989 317278 -701422 -454525 1410111 2058006 88729 -2005778 -1523916
32401 -1523916 659937 1963052 1935388 1866027 1787452 663880 -800259 -443115 1711733
32392 1711733 2769390 1238522 -343012 871842 3481890 3782377 1377823 -310379
32384 -310379 695516 2303549 2109555 931639 618745 667807 -290555 -1241971 -185268
32375 -185268 1928988 1907016 -919647 -3649118 -4148805 -3574332 -3494344 -3314971 -2319247
32366 -2319247 -1859296 -3191125 -4806436 -4359644 -2201329 -743415 -1027315 -1980248 -2500518
32357 -2500518 -2292649 -1091092 955906 2376512 1706526 -380782 -1863107 -1988183 -1534447
$$ packed form
32419B346756K2530j974237k148092J48062K006304P16687j917969j950990O67348
32410b083601K000612M00267j018700K46897J864636O47895j969277k094507M81862
32401a523916K183853J303115k7664o9361p8575j123572j464139L57144K154848
32392A711733J057657j530868j581534J214854K610048L00487k404554j688202
32384c10379J005895J608033j93994j177916l12894M9062r58362r51416J056703
32375a85268K114256k1972k826663k729471m99687N74473P9988J79373R95724
32366b319247M59951j331829j615311M46792K158315J457914k83900r52933n20270
32357b500518K07869J201557K046998J420606o69986k087308j482325j25076M53736
$$ plain form
32348 -1534447 -1005786 -433262 -436462 -1359474 -1827377 -544896 901016 -144980 -2941479
32339 -2941479 -3915351 -2023725 -104861 -57863 -377220 29133 -544690 -2755678 -3668859
32330 -3668859 -1387069 946411 -154863 -2344823 -779650 3879652 6070583 3737885
32322 3737885 976060 1267244 2753999 2284878 362880 -618112 -376999 -280110 -659796
32313 -659796 -921719 -1032452 -1049169 -401113 785074 1045876 -121385 -857940 291702
32304 291702 1750910 1310194 -165812 -105254 1572088 2581161 2291141 2497489 3774756
32295 3774756 4125007 2444083 649123 584760 985699 -304234 -2729761 -4115290 -4261637
32286 -4261637 -4720073 -5442407 -4619791 -2261659 -1055939 -2370905 -3824316 -2756472 -244186
$$ packed form
32348a534447N28661N72524l200r23012m67903J282481J445912j045996k796499
32339b941479r73872J891626J918864M6998l19357M06353n73823k210988r13181
32330c668859K281790K333480j101274k189960J565173M659302K190931k332698
32322C737885k761825K91184J486755m69121j921998r80992K41113R6889l79686
32313f59796k61923j10733j6717O48056J186187K60802j167261p36555J149642
32304B91702J459208m40716j476006O0558J677342J009073k90020K06348J277267
32295C774756L50251j680924j794960o4363M00939j289933k425527j385529j46347
32286d261637m58436p22334Q22616K358132J205720j314966j453411J067844K512286
$$ plain form
32277 -244186 724608 -247749 -1078813 -1153417 -2017900 -3838645 -4285837 -2243117 -39028
32268 -39028 -97298 -1367272 -1284326 238031 1227248 1047279 760616 544103 -635136 -2638119
32258 -2638119 -3841795 -3692727 -3458599 -3826189 -3831512 -3041007 -2715918 -3486691 -3708006 -1873080
32248 -1873080 714787 1640854 843477 326614 840513 981970 -161748 -1389413 -1273543
32239 -1273543 -316263 -28363 -594931 -747820 174161 1241605 1414919 1058693 1147526
32230 1147526 1588675 1525082 1076579 1278299 1994466 1602032 -277311 -1410380 -14117
32221 -14117 2174238 2215803 543532 385059 2617653 4227965 2878620 279961 -742998
32212 -742998 -413898 -983147 -2858475 -4115127 -3444254 -1691470 -432564 -326105 -947838
$$ packed form
32277b44186R68794r72357q31064p4604q64483j820745m47192K042720K204089
32268c9028n8270j269974Q2946J522357R89217j79969k86663k16513j179239k002983
32258b638119j203676J49068K34128l67590n323P90505L25089p70773k21315J834926
32248a873080K587867R26067p97377n16863N13899J41457j143718j227665J15870
32239a273543R57280K87900n66568j52889R21981J067444J73314l56226Q8833
32230A147526M41149o3593m48503K01720P16167l92434j879343j133069J396263
32221a4117K188355M1565j672271j58473K232594J610312j349345k598659j022959
32212g42998L29100n69249j875328j256652O70873J752784J258906J06459o21733
$$ plain form
32203 -947838 -1394376 -1102544 -546390 -701864 -1507150 -1807224 -1386127 -1717261 -3566781
32194 -3566781 -5149568 -4332078 -1782323 -74325 -154201 -598308 -277253 92192 -574884
32185 -574884 -2116956 -3507951 -3946194 -3288205 -2119916 -1465353 -1807571 -2547208 -2953744
32176 -2953744 -3085633 -3012597 -2017733 140696 1976634 1947511 800368 388993 639144
32167 639144 -15483 -1295743 -915746 1534593 3208789 2018730 -128759 -129156 1792593
32158 1792593 2642066 1041727 -1104997 -1357805 492773 2747708 3812984 3527471 3065635
32149 3065635 3632618 4972021 5525399 4473566 2889627 1986339 951726 -1969087 -6350090
32140 -6350090 -9171377 -8188460 -4638530 -1760911 -1296917 -2264871 -2732280 -1875153 -331211
$$ packed form
32203i47838m46538K91832N56154j55474q05286l00074M21097l31134j849520
32194c566781j582787Q17490K549755J707998p9876m44107L21055L69445o67076
32185e74884j542072j390995m38243O57989J168289O54563l42218p39637m06536
32176b953744j31889P3036R94864K158429J835938k9123j147143m11375K50151
32167F39144o54627j280260L79997K450339J674196j190059k147489l97J921749
32158A792593Q49473j600339k146724k52808J850578K254935J065276k85513m61836
32149C065635N66983J339403N53378j051833j583939r03288j034613k920813m381003
32140f350090k821287R82917L549930K877619M63994r67954m67409Q57127J543942
$$ plain form
32131 -331211 763841 882736 570685 830721 1863167 2723265 2673243 2433624 3163945
32122 3163945 4371167 4115682 1681839 -1199809 -2562795 -2511930 -2310039 -2317958 -2325692 -2924752
32112 -2924752 -4511008 -5462375 -3700952 -143732 1844482 990248 -331028 -25898 754007
32103 754007 193553 -935720 -845429 157530 576337 519489 1105979 1945007 1705676 665339
32093 665339 288482 607460 348215 -558051 -860632 -194468 853761 2541829 5205974
32084 5205974 6904415 4973168 416081 -2378919 -1288613 1111817 1951862 1818937
32076 1818937 2291622 2661615 1741227 765921 1587027 3318139 3482895 1661124 -365651
32067 -365651 -1426109 -1727433 -1350053 -62670 1629159 2942348 3909979 4519586 3587930
$$ packed form
32131c31211J095052J18895l12051K60036J032446Q60098n0022k39619P30321
32122C163945J207222k55485k433843k881648j362986N0865K01891p919p734n99060
32112b924752j586256r51367J761423L557220J988214q54234j321276L05130P79905
32103G54007n60454j129273R0291J002959M18807n6848N86490Q39028k39331j040337
32093F65339l76857L18978k59245r06266l02581O66164J048229J688068K664145
32084E205974J698441j931247m557087k795000J090306K400430Q40045j32925
32076A818937M72685L69993r20388r75306Q21106J731112J64756j821771k026775
32067c65651j060458l01324L77380J287383J691829J313189R67631O09607r31656
$$ plain form
32058 3587930 433873 -2972018 -3696435 -1448881 1392120 2997626 3347036 2725278 1376841
32049 1376841 605473 1722478 3596965 3655256 1710704 222251 140356 -526256 -2705591
32040 -2705591 -3935308 -2343950 -318552 -1086501 -3497682 -3864621 -2075241 -1875317 -4779475
32031 -4779475 -7530345 -7042258 -4680345 -3453880 -3457232 -2862026 -1768454 -1901753 -3101161
32022 -3101161 -3190464 -1569220 -232592 -543562 -1459962 -1998222 -3015588 -4891023 -5643368
32013 -5643368 -3731643 -1157069 -1006977 -2824924 -3431603 -2065112 -1410008 -2838476 -3840642
32004 -3840642 -1978592 1062747 1806381 -86895 -1707547 -1093756 709177 1748235
31996 1748235 1429837 313684 -922633 -1723271 -1775705 -1395643 -1232378 -1355651 -1161910
$$ packed form
32058C587930l154057l405891p24417K247554K841001J605506L49410o21758j348437
32049A376841p71368J117005J874487N8291j944552j488453q1895o66612k179335
32040b705591j229717J591358K025398p67949k411181l66939J789380J99924k904158
32031d779475k750870M88087K361913J226465l352N95206J093572j33299j199408
32022c101161q9303J621244J336628l10970r16400n38260j017366j875435p52345
32013e643368J911725K574574J50092j817947o06679J366491O55104j428468j002166
32004c840642J862050L041339P43634j893276j620652O13791J802933J039058
31996A748235l18398j116153j236317q00638n2434L80062J63265j23273J93741
$$ plain form
31987 -1161910 -324013 728157 1465653 1873168 2079670 1743757 325731 -1889496 -3353703
31978 -3353703 -2456459 449221 2699365 1867066 -1381133 -3894368 -3686807 -2006951 -1360208
31969 -1360208 -2497150 -4145095 -4930613 -4562531 -3480774 -2214434 -1076270 -126081 414113
31960 414113 -211072 -2451401 -5094571 -5892518 -4146111 -1646578 -373229 -355273 -585990
31951 -585990 -701822 -557088 521974 2412441 3219352 1535856 -1125664 -2189405 -1642325
31942 -1642325 -1520008 -2194855 -1850287 157506 2141601 3051867 3990068 5466176 5584989
31933 5584989 2951635 -479091 -1831213 -1389964 -1715519 -3221023 -3329452 -491947 3213425
31924 3213425 4697109 3610626 2024425 1128657 -74713 -2565556 -5093448 -5246094
$$ packed form
31987a161910Q37897J052170P37496M07515K06502l35913j418026k215227j464207
31978c353703Q97244K905680K250144q32299l248199k513235K07561J679856O46743
31969a360208j136942j647945p85518L68082J081757J266340J138164R50189N40194
31960D14113o25185k240329k643170p97947J746407K499533J273349J7956k30717
31951e85990j15832J44734J079062J890467Q06911j683496k661520j063741N47080
31942a642325J22317o74847L44568K007793J984095R10266R38201J476108J18813
31933E584989k633354l430726j352122M41249l25555j505504j08429K837505L705372
31924C213425J483684j086483j586201q95768j203370k490843k527892j52646
$$ plain form
31916 -5246094 -2479592 898547 2156622 900456 -1208465 -2924247 -4425730 -5801852
31908 -5801852 -5899967 -3694906 -180125 2236181 2168086 264764 -2089095 -3955336 -4465076
31899 -4465076 -2705496 721405 2877278 1142621 -3184469 -5841862 -4947080 -3480782
31891 -3480782 -4794119 -7333325 -6627459 -1911705 2526038 3296806 2101134 2218805 3414888
31882 3414888 3087222 977799 -348331 577101 2370470 3270097 3215423 2832633 2085549
31873 2085549 841111 -339283 -755252 -284242 770986 1906592 2383104 1674419 37861
31864 37861 -1854432 -3512814 -4245744 -3059124 -324497 1189085 -981293 -5296633 -7369323
31855 -7369323 -5326978 -2000730 -807872 -1369527 -893940 1323601 2910692 1911042 -392695
$$ packed form
31916e246094K766502L378139J258075j256166k108921j715782j501483j376122
31908e801852r8115K205061L514781K416306o8095j903322k353859j866241n09740
31899d465076J759580L426901K155873j734657m327090k657393Q94782J466298
31891c480782j313337k539206P05866M715754M437743P70768j195672J17671J196083
31882C414888l27666k109423j326130R25432J793369Q99627n4674l82790p47084
31873B085549j244438j180394m15969M71010J055228J135606M76512p08685j636558
31864C7861j892293j658382p32930J186620K734627J513582k170378m315340k072690
31855g369323K042345L326248J192858n61655M75587K217541J587091r99650k303737
$$ plain form
31846 -392695 -1095700 453751 1657997 278545 -1881792 -922059 3256245 5639001 2607507
31837 2607507 -2503855 -3545808 94860 3217200 2578169 565469 140683 439860 -312199
31828 -312199 -1095340 -340851 769820 452122 -256292 562677 1963855 1670731 146840
31819 146840 -277623 434263 185554 -1306291 -2151565 -1911034 -2215311 -3360262 -3543473
31810 -3543473 -2246768 -1267244 -1407107 -1270073 -649507 -1803192 -5253442 -7329600 -4803959
31801 -4803959 207343 3125513 3139236 3192934 4622069 5407919 4039346 1975954 1234875
31792 1234875 1863838 3011911 4626686 6625568 7650845 6191157 2493239 -1561636
31784 -1561636 -4146422 -4581710 -3361200 -1690584 -608991 -207430 -32269 -98943 -626511
$$ packed form
31846c92695p03005J549451J204246j379452k160337R59733M178304K382756l031494
31837B607507n111362j041953L640668L122340o39031k012700m24786K99177p52059
31828c12199p83141P54489J110671l17698p08414Q18969J401178k93124j523891
31819A46840m24463P11886k48709j491845q45274K40531l04277j144951j83211
31810c543473J296705R79524j39863J37034O20566j153685l450250k076158K525641
31801d803959N011302K918170J3723N3698J429135P85850j368573k063392p41079
31792A234875O28963J148073J614775J998882J025277j459688l697918m054875
31784a561636k584786m35288J220510J670616J081593M01561J75161o6674n27568
$$ plain form
31775 -626511 -941889 -123750 1058731 724379 -859982 -777063 2205993 4965237 4260548
$$ packed form
31775f26511l15378Q18139J182481l34352j584361Q2919K983056K759244p04689
$$ [...]
##END NTUPLES=NMR SPECTRUM
##END=
