##TITLE=31Pdec_AT-45bn
 CDCl3+DMF, 1500 sc
 25.1.2023
##JCAMPDX= 6.0         $$ Bruker NMR JCAMP-DX V2.0
##DATA TYPE= NMR SPECTRUM
##DATA CLASS= NTUPLES
##ORIGIN= UXNMR, Bruker Analytische Messtechnik GmbH
##OWNER= root
$$ XWIN-NMR		Version 3.5
$$ Thu Jan 26 13:41:06 2023 Russian Standard Time (UT+4h)  she@DPX200
##.OBSERVE FREQUENCY= 81.013821
##.OBSERVE NUCLEUS= ^31P
##.ACQUISITION MODE= SIMULTANEOUS
##.ACQUISITION SCHEME= undefined
##.AVERAGES= 1500
##.DIGITISER RES= 16
##SPECTROMETER/DATA SYSTEM= spect
##.PULSE SEQUENCE= zgpg30
##.SOLVENT NAME= Acetone
##.SHIFT REFERENCE= (INTERNAL, Acetone, 0, 248.564)
##AUDIT TRAIL= $$ (NUMBER, WHEN, WHO, WHERE, WHAT)
$$ ##TITLE= Audit trail, XWIN-NMR		Version 3.5
$$ ##JCAMPDX= 5.01
$$ ##ORIGIN= Bruker BioSpin GmbH
$$ ##OWNER= she
$$ F:/spectra/data/she/nmr/P31/1/pdata/1/auditp.txt
$$ ##AUDIT TRAIL=  $$ (NUMBER, WHEN, WHO, WHERE, WHAT)
(   1,<2023-01-25 17:20:31.70 +0400>,<she>,<DPX200>,
      <created by zg, POWCHK disabled, PULCHK disabled
       configuration hash MD5:
       00 E9 B6 7A A2 85 ED C7 34 08 36 98 17 FE 4E 26
       data hash MD5: 32K
       7B 6D DB 41 2D 56 FE E4 B2 01 1D 69 FB 4C 1F B0>)
(   2,<2023-01-26 13:39:16.59 +0400>,<she>,<DPX200>,
      <Start of raw data processing
       efp BC_mod = 2 LB = 1 FT_mod = 6 PKNL = 1 PHC0 = -11260.54 PHC1 = 646.0112 SI = 64K 
       data hash MD5: 64K
       4A E7 F4 7A C5 00 BB E5 DD B8 ED 76 FD 37 CA D9>)
(   3,<2023-01-26 13:39:54.67 +0400>,<she>,<DPX200>,
      <pk PHC0 = -9.055728 PHC1 = 0 
       data hash MD5: 64K
       33 7E 97 20 A4 B3 5F 7A FE A9 54 81 BE CB E9 4F>)
(   4,<2023-01-26 13:39:59.50 +0400>,<she>,<DPX200>,
      <abs ABSG = 5 
       data hash MD5: 64K
       40 11 FB B3 54 C0 A1 29 28 B4 46 E0 34 C6 C1 D1>)
$$ ##END=
$$ 
$$ hash MD5
$$ 85 96 4D A2 7B 1B 8C E3 C4 4D F4 38 1C 9C 02 DC
##$RELAX= 
##$RELAX= 
##$RELAX= 
##$RELAX= 
##$RELAX= 
##$RELAX= 
##$RELAX= 
##$RELAX= 
##$RELAX= 
$$ Bruker specific parameters
$$ --------------------------
##$DU= <F:/spectra>
##$EXPNO= 1
##$NAME= <P31>
##$PROCNO= 1
##$TYPE= <nmr>
##$USER= <she>
##$AMP= (0..31)
100 100 100 100 100 100 100 100 100 100 100 100 100 100 100 100 100 100 
100 100 100 100 100 100 100 100 100 100 100 100 100 100 
##$AQSEQ= 0
##$AQ_mod= 1
##$AUNM= <au_zg>
##$AUTOPOS= <>
##$BF1= 81.014009
##$BF2= 200.13
##$BF3= 200.13
##$BF4= 200.13
##$BF5= 200.13
##$BF6= 200.13
##$BF7= 200.13
##$BF8= 200.13
##$BYTORDA= 1
##$CFDGTYP= 0
##$CFRGTYP= 5
##$CHEMSTR= <none>
##$CNST= (0..31)
1 1 145 1 1 1 1 1 1 1 1 1 1 1 1 1 1 1 1 1 1 1 1 1 1 1 1 1 1 1 1 1 
##$CPDPRG= <waltz16>
##$CPDPRG1= <>
##$CPDPRG2= <waltz16>
##$CPDPRG3= <>
##$CPDPRG4= <mlev>
##$CPDPRG5= <mlev>
##$CPDPRG6= <mlev>
##$CPDPRG7= <mlev>
##$CPDPRG8= <mlev>
##$CPDPRGB= <>
##$CPDPRGT= <>
##$D= (0..31)
0 1 0 0 0 0 0 0 0 0 0 0.03 2e-05 3e-06 0 0 0 0 0 0 0 0 0 0 0 0 0 0 0 0 
0 0 
##$DATE= 1674650676
##$DBL= (0..7)
120 120 120 11 120 120 24 19 
##$DBP= (0..7)
150 150 150 150 150 150 150 150 
##$DBP07= 0
##$DBPNAM0= <>
##$DBPNAM1= <>
$$ [...]
##$SUBNAM3= <"">
##$SUBNAM4= <"">
##$SUBNAM5= <"">
##$SUBNAM6= <"">
##$SUBNAM7= <"">
##$SUBNAM8= <"">
##$SUBNAM9= <"">
##$SW= 501.771253377433
##$SWIBOX= (0..15)
0 1 3 0 0 0 0 0 0 0 0 0 0 0 0 0 
##$SW_h= 40650.406504065
##$TD= 32768
##$TD0= 1
##$TE= 0
##$TE2= 300
##$TE3= 300
##$TEG= 300
##$TL= (0..7)
0 120 53 12 22 120 120 120 
##$TP= (0..7)
150 150 150 150 150 150 150 150 
##$TP07= 0
##$TPNAME0= <>
##$TPNAME1= <>
##$TPNAME2= <>
##$TPNAME3= <>
##$TPNAME4= <>
##$TPNAME5= <>
##$TPNAME6= <>
##$TPNAME7= <>
##$TPOAL= (0..7)
0.5 0.5 0.5 0.5 0.5 0.5 0.5 0.5 
##$TPOFFS= (0..7)
0 0 0 0 0 0 0 0 
##$TUNHIN= 0
##$TUNHOUT= 0
##$TUNXOUT= 0
##$USERA1= <user>
##$USERA2= <user>
##$USERA3= <user>
##$USERA4= <user>
##$USERA5= <user>
##$V9= 5
##$VALIST= <valist>
##$VCLIST= <CCCCCCCCCCCCCCC>
##$VD= 0
##$VDLIST= <DDDDDDDDDDDDDDD>
##$VPLIST= <PPPPPPPPPPPPPPP>
##$VTLIST= <TTTTTTTTTTTTTTT>
##$WBST= 1024
##$WBSW= 4
##$XGAIN= (0..3)
0 0 0 0 
##$XL= 0
##$YL= 0
##$YMAX_a= 73804
##$YMIN_a= -14555
##$ZGOPTNS= <>
##$ZL1= 120
##$ZL2= 120
##$ZL3= 120
##$ZL4= 120
##$ABSF1= 248.5645
##$ABSF2= -253.2056
##$ABSG= 5
##$ABSL= 3
##$ALPHA= 0
##$AQORDER= 0
##$ASSFAC= 0
##$ASSFACI= 0
##$ASSFACX= 0
##$ASSWID= 0
##$AUNMP= <proc_1d>
##$AZFE= 0.1
##$AZFW= 0.5
##$BCFW= 0
##$BC_mod= 2
##$BYTORDP= 0
##$COROFFS= 0
##$CY= -3
##$DATMOD= 1
##$DC= 0
##$DFILT= <>
##$DTYPP= 0
##$F1P= 0
##$F2P= 0
##$FCOR= 1
##$FTSIZE= 65536
##$FT_mod= 6
##$GAMMA= 0
##$GB= 0
##$INTBC= 1
##$INTSCL= 6.047779e-11
##$ISEN= 30
##$LB= 1
##$LEV0= 0
##$LPBIN= 0
##$MAXI= 10000
##$MC2= 0
##$MEAN= 0
##$ME_mod= 0
##$MI= 50
##$NCOEF= 0
##$NC_proc= -7
##$NLEV= 6
##$NOISF1= 182.463
##$NOISF2= 159.3651
##$NSP= 0
##$NTH_PI= 0
##$NZP= 0
##$OFFSET= 248.5645
##$PC= 4
##$PHC0= -11269.6
##$PHC1= 646.0112
##$PH_mod= 1
##$PKNL= yes
##$PPARMOD= 0
##$PSCAL= 0
##$PSIGN= 0
##$REVERSE= no
##$SF= 81.0140089999694
##$SI= 65536
##$SIGF1= 159.3651
##$SIGF2= -187.1042
##$SINO= 113.3802
##$SIOLD= 16384
##$SREGLST= <1H.CDCl3>
##$SSB= 0
##$STSI= 65536
##$STSR= 0
##$SW_p= 40650.406504065
##$SYMM= 0
##$S_DEV= 0
##$TDeff= 32768
##$TDoff= 0
##$TI= <>
##$TILT= no
##$TM1= 0
##$TM2= 0
##$TOPLEV= 0
##$USERP1= <user>
##$USERP2= <user>
##$USERP3= <user>
##$USERP4= <user>
##$USERP5= <user>
##$WDW= 1
##$XDIM= 65536
##$YMAX_p= 383935148
##$YMIN_p= -85802563
$$ End of Bruker specific parameters
$$ ---------------------------------
##NTUPLES= NMR SPECTRUM
##VAR_NAME=  FREQUENCY,     SPECTRUM/REAL,   SPECTRUM/IMAG
##SYMBOL=    X,             R,               I
##VAR_TYPE=  INDEPENDENT,   DEPENDENT,       DEPENDENT
##VAR_FORM=  AFFN,          ASDF,            ASDF
##VAR_DIM=   65536,         65536,           65536
##UNITS=     HZ,            ARBITRARY UNITS, ARBITRARY UNITS
##FACTOR=    0.620285442955139, 1,           1
##FIRST=     20137.2065510682, 0,            0
##LAST=      -20513.1999529968, 0,           0
##MIN=       -20513.1999529968, -85802563,   0
##MAX=       20137.2065510682, 383935148,    0
$$ Real data points
##PAGE= N=1
##DATA TABLE= (X++(R..R)), XYDATA
$$ [...]
##PAGE= N=2
##DATA TABLE= (X++(I..I)), XYDATA
12217A1322764p799688k044758M536348m093385j6539823j0822243R071857J7632887
12209A263959O513767m952644j370868P931209P849686j30737n507422o008704
12201E588246n417854k681386M976361J2426811J0660538q1919q681783o208763
12193A0580251L498491Q462539K544859p295949r374340j913696M856021K637446
12185A3995622m190125o035921j686837J969817J133961r97913j016198k5305
12177C147101o73936l193691n127926l738044k9421j43202p701569j4222264o140425
12168c7823377J4284207K5686001J4386791m953183q515273L830415J1181894
12161A8077475L994644m994382n167974m827468j3664324k2474457j5258376M840924
$$ y = [11322764, 3523076, 1478318, 6014666, 1921281, -14618542, -25440785, -16368928, 1263959, 7777726, 2825082, 1454214, 9385423, 17235109, 17104372, 11596950, 5588246, 170392, -2510994, 2465367, 14892178, 25552716, 25470797, 16789014, 10580251, 14078742, 22541281, 25086140, 17790191, 8415851, 6502155, 11358176, 13995622, 9805497, 3769576, 2082739, 4052556, 5186517, 4188604, 3172406, 3147101, 2473165, -720526, -5848452, -9586496, -9615917, -9759119, -17460688, -31682952, -37823377, -23539170, 2146831, 16533622, 11580439, 3065166, 6895581, 18077475, 22072119, 17077737, 11909763, 7082295, -6582029, -29056486, -44314862, -39473938]
12153c9473938J6977730J0523047j248096j198082P290812O893785n912762j3635651
12145a9783155l544437J1731814J1766897j429050p635847l11943N197696j316916
12137e324941r351332p616910j417569J582719N745924J2977033J0755101o454947
12129H95078j8932268p990849J1251898R821853j0158060j9391416p268029O706237
12121c5065556R657379J2275860J9989473J6749628o049130k7598954k4032378
12114c4073678j027145J7170052J8817498R563872k190722r722741p225962J755181
12106f933645L721634n389384j0844746j772842R105736M925564o963926o438672
12098b0590281O201132J0792433J03112r696872o046970J383555j419696j0104611
$$ y = [-39473938, -22496208, -11973161, -13221257, -14419339, -7128527, -234742, -6147504, -19783155, -23327592, -11595778, 171119, -1257931, -8893778, -9205721, -4008025, -5324941, -14676273, -22293183, -23710752, -22128033, -16382109, -3405076, 7350025, 895078, -18037190, -26028039, -14776141, -4954288, -15112348, -34503764, -41771793, -35065556, -25408177, -13132317, 6857156, 23606784, 17557654, -10041300, -34073678, -35100823, -17930771, 886727, 10450599, 8259877, -1462864, -8688826, -6933645, -3212011, -8601395, -19446141, -21218983, -12113247, -7187683, -14151609, -20590281, -14389149, -3596716, -3493604, -13190476, -19237446, -17853891, -19273587, -29378198]
12090b9378198r576247K652911J2792467R844558m10311m228799J463097N515868
12082a1324654q39886r929091p198510P957236K0501787J9364423Q596102l124032
12074B4003375j2303821j5344211o801228Q263584J2839180Q77278r924217l196390
12066a586450R118340M719137j1557832j2937149O839832K2307989J5145212k4052
12058C2025027l404161k828569j6453039l5745227l3222850n494867J7682825
12051d7440861J5216569L588900Q761136K5381829K6031385M403911j5320403
12044B0622466j5582005q794905j1469018j4489958j27829K2607949K5414379
12037A8181079K831809j7407414j3181334L496185Q672788N25421m745694l19065
$$ y = [-29378198, -38954445, -36301534, -23509067, -13664509, -14074820, -18303619, -16840522, -11324654, -12164540, -22093631, -29292141, -21334905, -833118, 18531305, 27127407, 24003375, 11699554, -3644657, -10445885, -2182301, 10656879, 11534157, 1609940, -1586450, 7531890, 12251027, 693195, -12243954, -5404122, 16903867, 32049079, 32025027, 28620866, 25792297, 9339258, -26405969, -59628819, -65123686, -47440861, -32224292, -28635392, -19874256, 5507573, 31538958, 35942869, 20622466, 5040461, -3754444, -15223462, -29713420, -29841249, -7233300, 18181079, 21012888, 3605474, -9575860, -6079675, 2593113, 3118534, -1627160, -1946225]
12029a946225N024752L605992k248644o583153n375241K101962J0227065R790044
12021A4596552O26565n354241j449977K998982o44522m357698O71602L970944
12013A1058207p328723k0334012j1705153J1659914J6907138m961074k3009142
12006b7712845j2381199J0061824J4532981J505843o322131q39407N754782M175757
11998a1224395k897815j0331917j3338567o198212P975824J3957035N459125p73995
11990a7372917R865899K1719581J0377315j5169586k1473570j386666J4906894
11983A466950O545406r417143r275124K682266Q399864N042124P19505l344339
11975B819509p825899n432388N959860J2125542K617755r422310p069685K038226
$$ y = [-1946225, 3078527, 6684519, 4435875, -2147278, -7522519, -5420557, 4806508, 14596552, 15223117, 9868876, 8418899, 11417881, 10773359, 6415661, 7087263, 11058207, 3729484, -16604528, -28309681, -16649767, 257371, -4703703, -27712845, -40094044, -30032220, -15499239, -13993396, -20315527, -21154934, -15400152, -11224395, -14122210, -24454127, -37792694, -43990906, -36015082, -22058047, -16598922, -17372917, -7507018, 14212563, 24589878, 9420292, -12053278, -13439944, 1466950, 8012356, -1404787, -10679911, -7997645, 402219, 5444343, 6163848, 2819509, -5006390, -10438778, -4478918, 7646624, 10264379, 842069, -6227616, -4189390]
11967d189390l56269j0375090r350302J496538K365382q882626j0727277N612036
11959c4406998K0553515J7428753N706773l1491k899212r952150j4467791r557481
11951b7626082l564690l607936J102363J8362389K9081047J0861124k1814279
11944B793936k9964530l683456K3656408K1997791J535336r650607n406564q44882
11936D33432l541033n341958m92588M450287K300923l799548o293450l726281
11928a6010216M6376L629272R068773J5231959J5769017P164250m054468p089638
11920B3755325R5476P712354N444920o245540j7258555j7646651n938621Q953500
11912a127792J4036907M643527r220868j3442412o139261K444650M933199K785020
$$ y = [-4189390, -4545659, -14920749, -24271051, -22774513, -20409131, -29291757, -40019034, -34406998, -13853483, 3575270, 9282043, 9250552, 6351340, -3600810, -18068601, -27626082, -31190772, -34798708, -33696345, -15333956, 13747091, 24608215, 2793936, -27170594, -30854050, -7197642, 14800149, 16335485, 6684878, 1278314, 433432, -3107601, -8449559, -8942147, -4491860, -2190937, -5990485, -12283935, -16010216, -15963840, -12334568, -3265795, 11966164, 27735181, 34899431, 30844963, 23755325, 23850801, 31563155, 37008075, 30762535, 13503980, -4142671, -10081292, -1127792, 12909115, 17552642, 8331774, -5110638, -11249899, -8805249, -3872050, -1087030]
11904a087030k135693r735596j3223138k885155J5463434K0643061M739416j2537613
11896g58314j1300011R4337J161375p422993p929220L324636J1569504R191962
11888b068724M723910M400842L988864K381891N179015J0069516O059262o785656
11880B7948920j3381403o518987J771344l84664q480355j2934931j2329122o791766
11872c1100964O862607K2923620K4641588P553838q259957m589741P307863L062622
11864B8401476j8239207l2466293k3372008q40273J5293290J7005291J0370169
11857c847555M831260M303798N506759L553262j029928l842353m276473m845827
11849C52943l427818L219352P418642l142645k2493869k6866027p375782J5010353
$$ y = [-1087030, -3222723, -12958319, -26181457, -29066612, -13603178, 7039883, 11779299, -758314, -12058325, -11963988, -10802613, -18225606, -26154826, -22830190, -11260686, -2068724, 2655186, 7056028, 11044892, 13426783, 18605798, 28675314, 34734576, 27948920, 14567517, 8048530, 9819874, 9435210, 954855, -11980076, -24309198, -31100964, -24238357, -1314737, 23326851, 30880689, 22620732, 18030991, 25338854, 28401476, 10162269, -22304024, -45676032, -46516305, -31223015, -14217724, -3847555, 983705, 5287503, 10794262, 14347524, 13317596, 9475243, 5198770, 352943, -3074875, 144477, 7563119, 4420474, -18073395, -44939422, -52315204, -37304851]
11841c7304851J9901004J4960120J5695067J5794413J913637j5508553j4919453
11834E31384L58281Q269444O209593J1546468K3500662J8761922o485900k3139777
11826C9552077j2980364L423336K315954o150174j373485R039375M081605j1817866
11818B6090458j6711236j0177392j1988306k2715013j8173282Q950623L0320001
11811a4404147K0098245q215115k0583941n593998J7173390K4294987J0489757
11804B3259178j1709457k3264661j3268228Q955553K0295320R700029q163706
11797E804028j3120065n499542j17888j560454k045386n64957m568534j0421889
11789c2094687k851977J7517226K5379678M641708k3645566k6667465m114286
$$ y = [-37304851, -17403847, -2443727, 13251340, 29045753, 30959390, 15450837, 531384, 889665, 9159109, 15368702, 26915170, 50415832, 69177754, 62691854, 39552077, 26571713, 29995049, 32311003, 26160829, 24787344, 33826719, 37908324, 26090458, 9379222, -798170, -12786476, -35501489, -53674771, -44724148, -14404147, 5694098, -2521017, -23104958, -28698956, -11525566, 12769421, 23259178, 11549721, -11714940, -24983168, -16027615, 4267705, 13967734, 5804028, -7316037, -12815579, -12933467, -14493921, -16539307, -17104264, -21672798, -32094687, -34946664, -17429438, 7950240, 12591948, -11053618, -37721083, -41835369]
11782d1835369J4389479J2610230N684788J1077553K2218577K1589009O140736
11775E1875003j1985384k1625533k0010720j0479078o18654K433551K70654R80835
11767i159326N344455M590171l381990p542296j675006L764882n50377n345939
11759a3955426J132327R784127L519193j2355571j5006096R01868J5053682J2694768
11751A768872L467121J027990K504453N5207k381210J768534O708579L041572
11743A7961118n669122q757983n888860n543895q918035p927387N08379Q600586
11735a5635199Q465763J976989k531116L0140N842480N371640n329677j6447142
11727a8256122j3893912J255297J1890226P984273j29323L60620N113636L663832
$$ y = [-41835369, -27445890, -14835660, -9150872, 1926681, 24145258, 45734267, 51875003, 39889619, 18264086, -1746634, -12225712, -12844366, -10410815, -10140161, -9159326, -3814871, 775300, -2606690, -10148986, -11823992, -8059110, -8609487, -13955426, -12823099, -3038972, 480221, -11875350, -26881446, -25979578, -10925896, 1768872, 5235993, 6263983, 8768436, 8823643, 6442433, 8210967, 14919546, 17961118, 12291996, 3534013, -2354847, -7898742, -16816777, -24744164, -24235785, -15635199, -7169436, -5192447, -7723563, -7693423, -1850943, 3520697, -1808980, -18256122, -32150034, -30894737, -19004511, -11020238, -11149561, -10788941, -5675305, -2011473]
11719b011473l2762M429208J1519867N896584r686463j3634493K127902J7708076
11711A6316446J2450479p908095k1638498j7406214p72955J5581334J8924128
11704A5546625L643137j8786861k6207296j2020108M697808N964011r517M316499
11696b2855702J4794817J2708368k067762q625801J846233J2166987O180496q266637
11688E880999j4246571r507134k611004M037171J2864657J8672720J2022424n023045
11680B2090217j7476841j4687380k628051M215179L7994o216178k285828J1250751
11672e700137J9626162J1280788o767699j6481352r825552M387074J3513204J3138647
11664B3171135O213884j295240k641627L580671Q330278J883897j0426498j3086126
$$ y = [-2011473, -2044235, 2384973, 13904840, 19801424, 10114961, -3519532, -1391630, 16316446, 28766925, 20858830, -779668, -18185882, -18958837, -3377503, 15546625, 19189762, 402901, -25804395, -37824503, -33126695, -27162684, -27172201, -22855702, -8060885, 4647483, 2579721, -6046080, -4199847, 7967140, 14147636, 5880999, -8365572, -17872706, -20483710, -16446539, -3581882, 15090838, 27113262, 22090217, 4613376, -10074004, -12702055, -8486876, -8448882, -14665060, -16950888, -5700137, 13926025, 25206813, 18439114, 1957762, -7867790, -3480716, 10032488, 23171135, 29385019, 28089779, 25448152, 29028823, 37359101, 39242998, 28816500, 15730374]
11656A5730374l418548K663397o452676k0754167k1886568n281308J7544287L1226490
11648I371281K6550576P115784j0171187j1291161l760839n386141j3433305o379027
11640g384019J7118987K7274075O973860j8572229j8919969l074644J354431m920286
11632a49794j123385J0642232Q518947p343238j3189344l064868L256429j970240
11624d423261l209047M512399M768896o143871p709422P181527J4994072O65669
11616A0636962j5525402j1846273J020666L811547J621903O696041J0482353J642480
11608H540277o945397O02321J1241653M163678j0027914o288303Q418558L881617
11600A3586490k0531028l0392573r592798J5591089J7910599N243860n89264K769050
$$ y = [15730374, 12311826, 14975223, 8522547, -12231620, -34118188, -39399496, -21855209, 9371281, 35921857, 43037641, 32866454, 21575293, 17814454, 12428313, -1004992, -7384019, 9734968, 37009043, 43982903, 25410674, 6490705, 3416061, 4770492, -149794, -1273179, 9369053, 17888000, 10544762, -2644582, -5709450, -2453021, -4423261, -7632308, -3119909, 1648987, -4494884, -12204306, -5022779, 9971293, 10636962, -4888440, -16734713, -15714047, -11902500, -10280597, -3584556, 6897797, 8540277, 1594880, 2197201, 13438854, 17602532, 7574618, 1286315, 9704873, 13586490, -6944538, -37337111, -46929909, -31338820, -13428221, -8184361, -8773625, -6004575]
11592f004575M554086L246432L574023K141145o693856j6485282j4473883M15444
11584b9726466J5313397J8350745R414245k994622j0614213j1021086p235627
11577a8513627l119179j31735J403092J038869L0097Q34622K768832K681270J629401
11568a1378358M147655Q648274P843442K382628K105084P540128M848711j0029986
11560A6107578j7903458l767477J5630686J3294612p525875j8190815o818841
11553i173590Q071401Q008473k181786p121982j296638Q658113J1708979J575099
11545A8248069j3192591j3524962M227095J6690668N566146j0754529m164505
11538C095391J4190647P751040k3601344l6448245r609602K2491053K3347477
$$ y = [-6004575, -1450489, 1795943, 5369966, 7511111, 817255, -15668027, -30141910, -29726466, -14413069, 3937676, 13351921, 10357299, -256914, -11278000, -18513627, -21632806, -21764541, -20361449, -19322580, -19292483, -18457861, -15689029, -13007759, -11378358, -7230703, 1417571, 9261013, 11643641, 13748725, 21288853, 26137564, 16107578, -1795880, -5563357, 10067329, 23361941, 15836066, -2354749, -9173590, -1102189, 6906284, 4724498, -2397484, -3694122, 4963991, 16672970, 18248069, 5055478, -8469484, -4242389, 12448279, 18014425, 7259896, 3095391, 17286038, 25037078, 1435734, -35012511, -44622113, -22131060, 1216417]
11531A216417O445096M569716J5089412J2141132m021284q568022L067551P942376
11523C7882394l660634j1232613J507147J8345296J2501763j5513325l6819656
11516C010372k8319163R21802J9908077J0536933j1875271j8100470k296647J2163493
11508a4050874O812399p488766j0515394k825416P00778k146750n77850O134758
11500b3957115O079446k503831m852402O741713J8523610J5074323K428417j302024
11492A6232137P512791J3992302O892060o758272j3610454j2043926r730270p626551
11484e140183J092222J3542190J2302620j0259695l2276703k5274248N189069
11477d0824728K2705951R481593q951487k956947J6131717J4451225j0522681
$$ y = [1216417, 7661513, 12231229, 27320641, 39461773, 35440489, 26872467, 29940018, 37882394, 34221760, 22989147, 24496294, 42841590, 55343353, 39830028, 3010372, -25308791, -24386989, -4478912, 6058021, -5817250, -23917720, -26214367, -14050874, -7238475, -14727241, -25242635, -28068051, -27367273, -29514023, -30091873, -23957115, -17877669, -20381500, -25233902, -18492189, 31421, 15105744, 17534161, 16232137, 23744928, 37737230, 44629290, 37871018, 24260564, 12216638, 2486368, -5140183, -4047961, 9494229, 21796849, 11537154, -20739549, -46013797, -40824728, -18118777, -8637184, -17588671, -20545618, -4413901, 10037324, -485357]
11470d85357k4142705o038848J9695848K0003120j005535j1967618j66414J5013490
11462A0905981J3681107K5967j0845037j4169398j3097999p451103J791216N536190
11454a3623076r75030n204988N940539K0727484J5363818p484501j7930295l930866
11446g116915R449096J339831j0386627r82011J6132055R993478j4524071k2126213
11438a8221377l709340J0767124K552972r086645m327970N655034M549809L81060
11430a1439333N089081P983148l039047j2607124j039538J6888211J0256215j6702124
11422d610511k6788791o371659J3918260P173174j0123236p130033J3187471K1492886
11414G47561Q664407k666386L941797J3327083M852905j2131494j0096445J3718839
$$ y = [-485357, -24628062, -30666910, -10971062, 9032058, 8026523, -3941095, -4107509, 10905981, 24587088, 24613055, 13768018, -401380, -13499379, -20950482, -19159266, -13623076, -14598106, -19803094, -13862555, 6864929, 22228747, 14744246, -3186049, -7116915, 2332181, 3672012, -6714615, -7696626, 8435429, 18428907, 3904836, -18221377, -21930717, -11163593, -8610621, -17697266, -22025236, -16370202, -11820393, -11439333, -6350252, 1632896, -1406151, -14013275, -15052813, 1835398, 12091613, -4610511, -31399302, -37770961, -23852701, -16679527, -26802763, -33932796, -20745325, 747561, 9411968, 6745582, 10687379, 24014462, 28867367, 16735873, 6639428, 20358267]
11406B0358267K8611184J1737496j9798609l2072063j7365616L004991J1200069
11399E675719Q495349R98850r365848j6221702r901645N638762J2577919L813602
11391A711006o103994l246289N556698N351107m595526j2126812r123857J481306
11383b1096361J0661301J0457920J910594k887243M630989J3937204Q318827p120483
11375A8812748r923887L393416Q373628r527497l0004911k6701378l212893J6963746
11367c1827028K1878564J5596252M336304n161889n018062J353989j044774j3468422
11359a3355066j5075411L682669J9471509J0339529p716291o406977Q938215J1601078
11351A1479255j06183m270966K683570K236855p939597p914985O534810J3363584
$$ y = [20358267, 48969451, 60706947, 40908338, 8836275, -8529341, -5524350, 5675719, 14171068, 15169918, 5804070, -10417632, -20319277, -14680515, -2102596, 1711006, -4392988, -7639277, -2082579, 3268528, -1326998, -13453810, -22577667, -21096361, -10435060, 22860, 1933454, -953789, 3677200, 17614404, 25933231, 18812748, 8888861, 12282277, 20655905, 11128408, -18876503, -45577881, -48790774, -31827028, -9948464, 5647788, 9984092, 4822203, -195859, 1158130, 113356, -13355066, -28430477, -24747808, -5276299, 5063230, -2653061, -9060038, -121823, 11479255, 11373072, 7102106, 9785676, 12022531, 4082934, -3832051, 2702759, 16066343]
11343A6066343J877113q881724k486559J0015612J2319523P730595O201264M942781
11335D7784948k323819j1019108j4135282j3213462j0714940l929746M551175
11328c000234M200415n680374r579051J427335J3586311J0197344l611716r970083
11320b430053m171996K588237J877659l354684p636818j0194327j1508741q969136
11312d3799859J50116J2011372J5961557O112786p197715o966103N697657R308677
11304h721512n806974j7859655l784605K3088553K9595079J0466171p273212o592196
11296A3111649M24684j36972m141622n316741p606205j1402250q029995K308158
11288b0789294O756767K533644K278499P995738M039095j1811192j6801475m82946
$$ y = [16066343, 17943456, 9061732, 6575173, 16590785, 28910308, 36640903, 42842167, 47784948, 45461129, 34442021, 20306739, 7093277, -3621663, -7551409, -3000234, 1200181, -4480193, -14059244, -12631909, 954402, 11151746, 7540030, -2430053, -6602049, -4013812, -2136153, -5490837, -13127655, -23321982, -34830723, -43799859, -43649743, -31638371, -15676814, -9564028, -16761743, -23727846, -18030189, -8721512, -14528486, -32388141, -36172746, -13084193, 16510886, 26977057, 19703845, 13111649, 13536333, 13399361, 9257739, 3940998, -3665207, -15067457, -23097452, -20789294, -14032527, -11498883, -9220384, -1224646, 2814449, -8996743, -25798218, -26281164]
11280b6281164J2393576J4460j8427698j2200278J0941777J7803779K948214o376790
11272a9184124K613308R875466p76545j4734684j1135248M834568J1390754K022054
11264a5094451p731514l221170J0763442J7423424Q947696m545866p675223K001947
11256H68285J2251744J1043006j659744j6096491k1500204j3940043j043466L697572
11248b6379341k089297l903907P999177J8829146Q528946j4058397j9263915J62451
11240c0175137J8341674J4775652n35691r961163j2622074j3081402p593324L416717
11232c7434748Q637515N534082O551557J2900901O977573j2867032j8934882J218111
11224b7416923J6738680J417456j8641733n734885K3947752K4240144m714533
$$ y = [-26281164, -13887588, -13873128, -32300826, -44501104, -33559327, -15755548, -12807334, -19184124, -16570816, -6695350, -7471895, -22206579, -33341827, -28507259, -17116505, -15094451, -22825965, -26047135, -15283693, 2139731, 11087427, 6541561, -1133662, 868285, 13120029, 24163035, 22503291, 6406800, -15093404, -29033447, -30076913, -26379341, -28468638, -32372545, -24373368, -5544222, 2984724, -11073673, -30337588, -30175137, -11833463, 2942189, 2406498, -7554665, -20176739, -33258141, -40851465, -37434748, -28797233, -23263151, -16711594, -3810693, 3166880, -9700152, -28635034, -27416923, -10678243, -9260787, -27902520, -33637405, -9689653, 14550491, 9835958]
11217I835958j7131949L061232K0340048J0194047n539639m114970M63367r667042
11209G441052k0467839j1732953P136405J4574084J0413226P058382L972275m757638
11201A3636994j1212329n581757L313112J204641o953706o467643O25197n642
11193a1441133q700147j0909637j791948O844627O288921K334961K939574N906645
11185h528137L908420m624289j2984291j2346873j307360R716163Q498410k694609
11177b0362566q582928k067863O246745N613528J87597k874153p358482j5739266
11169d4937388j4899166N750837K8970153K6422485O23580j4357567j036363J6022117
11161B558688P734277j5299389j8711631M399110K3363037J3726597j0414704
$$ y = [9835958, -7295991, -4234759, 16105289, 26299336, 20759697, 16644727, 17108094, 7441052, -13026787, -24759740, -17623335, -3049251, 7363975, 14422357, 18394632, 13636994, 2424665, -3157092, 156020, 1360661, -5593045, -12060688, -11435491, -11441133, -20141280, -31050917, -32842865, -25998238, -19709317, -17374356, -14434782, -8528137, -4619717, -9244006, -22228297, -34575170, -35882530, -26166367, -17667957, -20362566, -28945494, -31013357, -24766612, -19153084, -18965487, -21839640, -29198122, -44937388, -59836554, -54085717, -25115564, 1306921, 1930501, -12427066, -13463429, 2558688, 10292965, -5006424, -23718055, -19318945, 4044092, 17770689, 7355985]
11154G355985j9220009p586976L740914J410536m424086m12277Q518378Q219191
11146b398344k027429q005539p58020J1189578J2584508q15106j8152906k4849874
11138c3233132j6570590k440421N869809P100015Q276343J0165144M325555r985378
11130b6492655j6627277k954111J7048453J6800689n831221k2700703j2228827
11123e2985652J2839142K4463352J4912189O78296k870149K653373P382544O712381
11115A3785476K633611k053450o234276q865633q086457l555196Q20834m55629
11107a2010720o794440r572406k356177R166886J3273932P067852q46035j888171
11099c959279M313254J2239070J4697922O891920o134232r539187L440133J7490845
$$ y = [7355985, -11864024, -19451000, -15710086, -14299550, -18723636, -19135913, -10617535, -2398344, -4425773, -12431312, -13189332, -1999754, 10584754, 9769648, -8383258, -33233132, -49803722, -52244143, -46374334, -39274319, -30997976, -20832832, -16507277, -26492655, -43119932, -46074043, -29025590, -12224901, -18056122, -40756825, -52985652, -40146510, -15683158, -770969, -92673, -2962822, -309449, 7073095, 13785476, 16419087, 14365637, 8131361, -734272, -8820729, -12375925, -11555091, -12010720, -18805160, -28377566, -30733743, -21566857, -8292925, -1225073, -2071108, -3959279, 353975, 12593045, 27290967, 34182887, 28048655, 18509468, 21949601, 39440446]
11091C9440446J3337028l042752q342714O51483J781294j3149001k0733873m639746
11083E302165J2925332M586686j6034835j4591658P392094J3299664r760908k9229023
11075b6110483j6765394J0618303J9208921O482903l270015J950832J0704229
11068B819296J0793679L179468o108763j2708820j2268710m381879J897505k151711
11060a8929935r994848o882343P275641J5358488P677724l530783k772979N364304
11052f434731L879361r712134j7599521o115815J3989744K0110361O903879p005994
11044a984850m111268Q852215J1573275o06955j1377120r385624m601345q940353
11036b0582025j3647379l467046J4284170J7658007O656905N550665K0192438
$$ y = [39440446, 52777474, 49734722, 41392008, 42043491, 43824785, 30675784, 9941911, 5302165, 18227497, 22814183, 6779348, -7812310, -420216, 12879448, 3118540, -26110483, -42875877, -32257574, -13048653, -6565750, -9835765, -7884933, 2819296, 13612975, 16792443, 10683680, -2025140, -14293850, -18675729, -16778224, -18929935, -28924783, -35807126, -28531485, -13172997, -5495273, -9026056, -11799035, -6434731, -2555370, -12267504, -29867025, -35982840, -21993096, -1882735, 5021144, -1984850, -6096118, 2756097, 14329372, 13722417, 2345297, -7040327, -11641672, -20582025, -34229404, -37696450, -23412280, -5754273, 902632, 6453297, 26645735]
11029B6645735K1325460q670460l7262624k3757503J4835472K2772014r959448
11022E928646k9491422j526343L2480007J8612209k4361469l3701459N8130K1864866
11014a0136835J471770k2089966p759287K2983268K5424704K133696r603315j181068
11006A242967K697710m606631j757112J4594235J6489738p838690k8835649j9426293
10998b7439725M043841R375822m181739j2345212m517060R331334J9765574K2256505
10990A6289340J0087806j3147677k3140738l568802K2093147J7626753j0939082
10983A5300747k1845393j511929J5932319N213158j1146145l423299J6581311
10976A5100769J7734595j102464j5991546j7598260j4280449n921541J2638617
$$ y = [26645735, 47971195, 39300735, 2038111, -21719392, -6883920, 15888094, 5928646, -23562776, -25089119, 7390888, 26003097, 1641628, -32059831, -32001701, -10136835, -8665065, -30755031, -38514318, -15531050, 9893654, 12027350, 2424035, 1242967, 3940677, -665954, -2423066, 12171169, 28660907, 20822217, -8013432, -27439725, -23395884, -14020062, -18201801, -30547013, -35064073, -25732739, -5967165, 16289340, 26377146, 13229469, -9911269, -13480071, 8613076, 26239829, 15300747, -6544646, -8056575, 7875744, 13088902, 1942757, -1480542, 15100769, 32835364, 31732900, 15741354, -1856906, -16137355, -22058896, -9420279]
10969i420279K7674837J9222391l045787q921096M688283Q307875j0415236k5436558
10961B654430j5688008J334528J046007q773908o173133O392962J0001545L378585
10953e826992R49699L880879K61640q386267o801795N944555J1767397K536382
10945D325498o877385k824745O987190P782168q03640p810313o455462J704757
10937c971932J0589105J1427743q63900j6991004j8225454l4244J8045553J6267430
10929A6243297Q41326o566245n33796L107073m803230j0679626J54157J7392751
10921A5155707J6862472n178038k4455632j9848142L81582J2476997Q241812j67588
10913C469170j836271O51807J123656o43250k846032n082977m441827K238686
$$ y = [-9420279, 18254558, 37476949, 34431162, 25510066, 30198349, 38506224, 28090988, 2654430, -13033578, -11699050, -10653043, -19426951, -25600084, -19207122, -9205577, -5826992, -4877293, -996414, -734774, -9121041, -15922836, -9978281, 1789116, 4325498, -2551887, -5376632, 1610558, 9392726, 8589086, 778773, -5676689, -3971932, 6617173, 18044916, 17181016, 190012, -18035442, -18069686, -24133, 16243297, 17084623, 10518378, 9984582, 13091655, 8288425, -2391201, -2237044, 15155707, 32018179, 26840141, 2384509, -17463633, -17082051, -4605054, 3636758, 3469170, 1632899, 2284706, 3408362, 2765112, -80920, -5163897, -9605724, -7367038]
10905g367038R245094O153336n003858r424364k304154K241555n816634j5119291
10897b7395354j1781755k126262J69988j644356M119650J2910480J0058230k139025
10889a7828404o203445J509136N695153q43457o290298j962019M332983N142045
10881a6448306N504475Q734193O929321k999397q825714j184849J0358056J2049083
10873A4116862N474239k79365n120401j2671718j7783128j4098681o900918m077467
10865d1340577j053300R782865K0324006J5355386j743489j0023872o33994J0496840
10857A163865O118523q829297j6217377r114869K746137Q658969Q927938R296344
10849B750233R586247M364708n075754o954704N913687K1583101K0444912J520021
$$ y = [-7367038, 1878056, 8031392, 3027534, -6396830, -8700984, -6459429, -12276063, -27395354, -39177109, -41303371, -41133383, -42777739, -38658089, -25747609, -15689379, -17828404, -24031849, -22522713, -16827560, -17671017, -23961315, -25923334, -21590351, -16448306, -10943831, -2209638, 4719683, 1720286, -7105428, -8290277, 2067779, 14116862, 19591101, 19311736, 14191335, 1519617, -16263511, -30362192, -37263110, -41340577, -42393877, -32611012, -12287006, 3068380, 1324891, -8698981, -9332975, 1163865, 7282388, -1546909, -17764286, -26879155, -24133018, -15474049, -6546111, 2750233, 12336480, 16701188, 11625434, 4670730, 10584417, 32167518, 52612430, 54132451]
10841E4132451j4782257j4034002n249733l404068o966018n082637K218217N693439
10833A2525392L283843N51297j625629n682791o662486J747364J1680150Q216035
10825B4033175o478276j3217890m396658M662906Q73614o577531l682240M438994
10817c43906L032800p264131j1801577m881962M133933P391818P362897P244606
10809D874478M935018K68930k372545l139143q507350j8384349k0921857q154809
10801e1401627J0706232K0590801J9132740J4116213P888297k878617j4023425
10794D130614j4792925m489390M198296L158557r94227n19430J058101j259883
10786i510287k126444M456671J1213974O862108m911029r321604j802706P428867
$$ y = [54132451, 39350194, 25316192, 20066459, 16662391, 9696373, 4613736, 6831953, 12525392, 15809235, 16360532, 14734903, 9052112, 2389626, 4136990, 15817140, 24033175, 17554899, 4337009, -59649, 4603257, 5476871, -1100660, -4782900, -343906, 2688894, -4575237, -16376814, -21258776, -17124843, -9733025, -2370128, 4874478, 9809496, 10078426, 7705881, 4566738, -3940612, -22324961, -43246818, -51401627, -40695395, -20104594, -971854, 13144359, 21032656, 18154039, 4130614, -10662311, -15151701, -10953405, -7794848, -8789075, -9308505, -8250404, -9510287, -11636731, -7180060, 4033914, 10896022, 5984993, -3336611, -5139317, 2289550]
10778B289550J0181824R070461P565353L294112m337092r313453o831871L77154
10770A2296038O258831O278215j907021j4823585k0813499j1294062N201568J1262889
10762g540626L858630k980191m35879M627437N699697P600154J3634892J5897793
10754D0361907Q186516l257469j1062682j6668370j9855445j2490776N093485
10747i692834J5295467N902559j0141705j3241002m088800M458231J0159734J6023404
10739A4675054J3815185k582530j5929448n748603J4725407J2557581j3020592
10732A8492054k5878014q573370J0285324J822062j8363068j6643950O967234
10725c1891728K2419650J5429269K331261K66521N370410N525278j144080p323728
$$ y = [2289550, 12471374, 21541835, 29107188, 32401300, 28064208, 18750755, 11918884, 12296038, 18554869, 24833084, 22926063, 8102478, -12711021, -24005083, -18803515, -7540626, -3681996, -6662187, -7098066, -2470629, 3229068, 10829222, 24464114, 40361907, 48548423, 45290954, 34228272, 17559902, -2295543, -14786319, -9692834, 5602633, 11505192, 1363487, -11877515, -15966315, -11508084, -1348350, 14675054, 28490239, 25907709, 9978261, 4229658, 18955065, 31512646, 18492054, -7385960, -15959330, -5674006, -3851944, -22215012, -38858962, -31891728, -9472078, 5957191, 8288452, 8554973, 13925383, 19450661, 18306581, 10982853]
10717A0982853o931336J50469Q384856J0098536L182293n104134o478232k192130
10709A2093175j48999l230935o381830m890154m56260J780324n70401m376116
10701f181196m074830Q95705L205117k798445j0035591o254580O338564J0974500
10693g930756Q27374r601464p100848m46388l448203q481759J792100K1124043
10685a3265901K2720948m83807k1517047j6211409M372246J3842477Q579139O231287
10677D267933J3388906J6045627L769871j3898111k1509601j6459761o820677
10670b1215813J030652N438053N878926L145933Q2585k117892m933233o865828
10662a9556617k397258Q398363J4905277Q255969m912334r463706j400476P707162
$$ y = [10982853, 4051517, 4201986, 12586842, 22685378, 25867671, 20763537, 14285305, 12093175, 11944176, 8713241, 2331411, -2558743, -3015003, -1234679, -1805080, -6181196, -10256026, -9360321, -6155204, -8953649, -18989240, -25243820, -18905256, -7930756, -7103382, -16704846, -23805694, -24252082, -27700285, -36182044, -34389944, -13265901, 9455047, 8971240, -12545807, -28757216, -24384970, -10542493, -1963354, 4267933, 17656839, 33702466, 37472337, 23574226, 2064625, -14395136, -21215813, -20185161, -14747108, -8868182, -5722249, -5639664, -7757556, -12690789, -19556617, -21953875, -13555512, 1349765, 9605734, 4693400, -4770306, -6170782, 1536380]
10654A536380O882528q13534l979607K243508R989985O747952r795526k5138594
10646a2326908k1440350l90857J5219056R690499m559142n852332M905991Q580616
10638f173427p9562n933494j029509L158935j471597m798040K446582J2245612
10630a634500J4252079J0965206N789749o076452k0341211j7479354O332802K2261372
10622A4069691Q102494j4218774j1711837N599097K961917j6749770j5606155
10615b7553337J2748354K7464622N857524j9940293j5454613M977278R591343
10608b309122N49601n86821N069654K761432j914229M919076J1374432l934147
10600A5929876k8045342k5635164M109806K1232957M489220j8080616j3882666
$$ y = [1536380, 8418908, 7605374, 3625767, 5869275, 15859260, 22607212, 12811686, -12326908, -33767258, -34158115, -18939059, -9248560, -13807702, -19660034, -14754043, -6173427, -6252989, -12186483, -13215992, -10057057, -11528654, -16326694, -13880112, -1634500, 12617579, 23582785, 29372534, 23296082, 2954871, -14524483, -8191681, 14069691, 22172185, 7953411, -3758426, 1840671, 4802588, -11947182, -27553337, -14804983, 12659639, 18517163, -1423130, -16877743, -11900465, -2309122, -1759521, -2346342, 2723312, 5484744, 3570515, 8489591, 19864023, 15929876, -12115466, -37750630, -33640824, -12407867, -7918647, -25999263, -39881929]
10593c9881929Q486298J9512882J2870354N232249N227645N656590J213282m606314
10585A3711057q813956j1506255j0117361k197854O763205Q019173K002722k496001
10577d635270j978607k635345q857853j4899099j2979847n159698p12121k439270
10569e4297110j995142P696954J9507637J8375687J164974j6119976j5319540
10562d0986516L141388K1425346K4620525J4877684M764873J026953j243017q480654
10554A9146582j6867970j6123707n266874L496115K298328O29992R428543J9033126
10546A5774135J1040903r276707j4875385K138698J4544361m5668k3296941k2462288
10538b6458892R76623J5430668O798916m693283J317893J6334165J7589561j571010
$$ y = [-39881929, -31395631, -11882749, 987605, 6219854, 11447499, 17104089, 18317371, 13711057, 4897101, -6609154, -16726515, -18924369, -12161164, -4141991, -2139269, -4635270, -6613877, -9249222, -18107075, -33006174, -45986021, -51145719, -51857840, -54297110, -56292252, -48595298, -29087661, -10711974, -9547000, -25666976, -40986516, -37845128, -16419782, 8200743, 23078427, 27843300, 28870253, 27627236, 19146582, 2278612, -13845095, -19111969, -15615854, -13317526, -12687534, -3258991, 15774135, 26815038, 17538331, 2662946, 4801644, 19346005, 19300337, -3996604, -26458892, -25482269, -10051601, -3252685, -7945968, -6628075, 9706090, 27295651, 25724641]
10530B5724641k4494357k8537695p268666K0228134K5745217M142698j8253396
10523b713424j7171725j505912M683586m41671m70758N539872K195080r919063
10515a9804015j0961648L420615J2397213M579174m286922n62843N677243L113602
10507f427581o56951J826400J573032n797966n753360P374290J2057639m982025
10499g86522j8068129k57081K7277347K3440475o327121j6423216O227378K1350403
10491C6433534J32086k9053697k3934079J0500755L2439268J9973013p995582
10484C8495298k1865106j2991990M405273J1035293J179583j2015484j2241125
10477c998258j196058M279537k616266r014056l381257O994610R152822M177964
$$ y = [25724641, 1230284, -27307411, -34576077, -14347943, 11397274, 15539972, -2713424, -19885149, -21391061, -16707475, -17149146, -17619904, -12080032, -9884952, -19804015, -30765663, -27345048, -14947835, -10368661, -14655583, -15218426, -9541183, -6427581, -7084532, -5258132, -3685100, -9483066, -15236426, -7862136, 4195503, -786522, -18854651, -19111732, 8165615, 31606090, 25278969, 8855753, 15083131, 36433534, 36565620, 7511923, -16422156, -5921401, 26517867, 46490880, 38495298, 16630192, 3638202, 8043475, 19078768, 20258351, 8242867, -3998258, -5194316, -914779, -3531045, -12545101, -15926358, -8931748, 221074, 4399038]
10469D399038J700528K389998r76741q864467j3371951j0088765k031503P166521
10461a9677342J4852425J4935446K523126j4432991j8298739l471409J2051610
10454a1517874O831630j4623958k4356159o496254K0522944K6732224Q108259
10447E200812j2124690j6171958r081251j777975N138982J2515031J3774292P143055
10439D616298L404908P968200Q144685n607596j8564459j2484120K696649K553054
10431g272381j1993983j5510335R99931J6615915J3682499P97025o063832n065513
10423a3810674j345204M346376J0121837J0535039P074908P333726R388077L186304
10415C6830389r086656j3145786o972650l357161l842292L853666J5452720P858145
$$ y = [4399038, 6099566, 8489564, 7512823, -1351644, -14723595, -24812360, -26843863, -19677342, -4824917, 10110529, 12633655, -1799336, -20098075, -23569484, -11517874, -4686244, -19310202, -43666361, -50162615, -29639671, -2907447, 5200812, -6923878, -23095836, -32177087, -33955062, -28816080, -16301049, -2526757, 4616298, 8021206, 15989406, 24134091, 18526495, -37964, -12522084, -9825435, -7272381, -19266364, -34776699, -33776768, -17160853, -3478354, -2681329, -8745161, -13810674, -15155878, -10809502, -687665, 9847374, 16922282, 24256008, 33644085, 36830389, 27743733, 14597947, 7625297, 4268136, 425844, 4279510, 19732230, 27590375]
10407B7590375j9566459l3553558j6069702O735451Q845178N263237J7094660
10400c660818K6847857R517533j6280447j5358884K576070o77664k2772190k2216200
10392d2024743R468864L0407295J5421422p960811r871676j786436n121714j2175184
10384b3642983o789513L782340N346412L190808P138862R631234K085538m813209
10376d070511K43235P007601K197027n718795k202392P808815J1405877R772712
10368B6443569P704558k139523k0969243k7350971o807986J7491281J4719382
10361I091067n681030j0093309M831001J1477571J050216n408470J379018M659023
10353A1305087k718276m563066M635060O473304n089342q110623O734469J3388141
$$ y = [27590375, 8023916, -25529642, -41599344, -34863893, -26018715, -20755478, -3660818, 23187039, 32704572, 16424125, 1065241, 3641311, 2963647, -19808543, -42024743, -32555879, -2148584, 13272838, 5312027, -4559649, -6346085, -11467799, -23642983, -30432496, -26650156, -21303744, -18112936, -10974074, -1342840, 742698, -4070511, -3827276, 3180325, 5377352, -341443, -2543835, 5264980, 16670857, 26443569, 34148127, 32008604, 11039361, -16311610, -23119596, -5628315, 9091067, 3410037, -6683272, -1852271, 9625300, 10675516, 5267046, 6646064, 11305087, 8586811, 4023745, 8658805, 15132109, 10042767, 1932144, 8666613, 22054754]
10345B2054754n096388k0324221j715820K8747656K6758219m422000k0016015
10338B5986185n385673N437169r410852k5162806j6777972j535129n447593j5783975
10330d8080646l924302K1416368K3891278j848683j9579151o090910J7053818
10323a7162228K0473437P795152m38405j922052o989830j1965747m624134R965679
10315d868128J3803753M710888j932299j107580m906967j6294993j8489606j321393
10307c0406325J9783901K4382820J3106441L30969p608408j2944536j4088188
10300g443326p477167K375061O440189K597776m197907r501277j1061958q017648
10292c6286257l445486j277678K542464J5216480K9188399K4465083j496873k1976847
$$ y = [22054754, 16958366, -3365855, -5081675, 23665981, 50424200, 46002200, 25986185, 20600512, 26037681, 16626829, -8535977, -25313949, -26849078, -32296671, -48080646, -52004948, -30588580, -6697302, -8545985, -28125136, -34216046, -17162228, 3311209, 11106361, 10667956, 8745904, 1756074, -10209673, -14833807, -4868128, 8935625, 13646513, 11714214, 10606634, 5699667, -10595326, -29084932, -30406325, -10622424, 13760396, 26866837, 27197806, 19589398, 6644862, -7443326, -14920493, -12545432, -6105243, -3507467, -7705374, -17206651, -28268609, -36286257, -39731743, -41009421, -38466957, -23250477, 5937922, 30403005, 28906132, 6929285]
10284F929285j3706276J1469815K3685015J2593979q463271k4346443k6378238
10277a8216134j0451758J3321126K0876744N667674m036669J4038992L3371766
10270E4571741J3400826l2402178m8132500j6875000J6164403J4161532l176105
10263b287281m097128M224774R71093n576285K041886J1833686K318983j5224639
10255e794911j2686240O900654J4528014L623994k661148O388704J2833393K752917
10247B5885377j2372394j6321289r112312O87231P347544N961281n110691j5556500
10239a8591753j1747278L302410J3115332J1483987P173411N318207K172315j300567
10231A0926064R2729J048506p639019j6967342q343113J2534104J7547713n44179
$$ y = [6929285, -6776991, 4692824, 28377839, 40971818, 32508547, 8162104, -18216134, -28667892, -15346766, 5529978, 11197652, 7160983, 21199975, 54571741, 67972567, 35570389, -12562111, -29437111, -13272708, 888824, -2287281, -6384409, -2159635, -1188542, -6764827, -4722941, 7110745, 9429728, -5794911, -18481151, -11580497, 2947517, 6571511, 3910363, 10299067, 23132460, 25885377, 13512983, -2808306, -11920618, -11233387, -3885843, 2075438, -3035253, -18591753, -30339031, -27036621, -13921289, -2437302, 4736109, 10054316, 12226631, 10926064, 11018793, 12067299, 4428280, -12539062, -20882175, -8348071, 9199642, 8655463]
10223H655463j5143762q467191J790874l294424j0670388j531972J2153920P735910
10215h771570p072191n371874J4589041K6689849J6549226k586687j4257610j6085807
10207C682377j0990150j602296M471150J636183j416680N726490J2928408J915800
10199A6351282j9852126k3854044l552698J3995303R276975k817472k139646M530234
10191h062192J193903o080440n51664J3266854J4158541k598900j8100033j7027843
10183b3801774m903872M821234P198931M976533J327385j890999l870334m724567
10175b0867463k939911M226802J3507403J4263776K290744r659130n500897J1901840
10167G223164K2374694J2940298p700291k0581130j6119321j405903P819322K884773
$$ y = [8655463, -6488299, -14955490, -13164616, -16459040, -27129428, -28661400, -16507480, -8771570, -15843761, -21215635, -6626594, 20063255, 36612481, 34025794, 19768184, 3682377, -7307773, -8910069, -4438919, -2802736, -4219416, 1507074, 14435482, 16351282, -3500844, -27354888, -30907586, -16912283, -7635308, -10452780, -12592426, -8062192, -6868289, -12948729, -13500393, -233539, 13925002, 11326102, -6773931, -23801774, -28705646, -23884412, -16685481, -11708948, -10381563, -12272562, -16142896, -20867463, -23807374, -19580572, -6073169, 8190607, 10481351, 822221, -4678676, 7223164, 29597858, 42538156, 34837865, 14256735, -1862586, -3268489, 4550833, 7435606]
10159G435606p761472p999410M302562J3478956R060292O01795r56228l097431
10151A5064670j4882893k1837563l575562K7650294L5478587J0929044j3320638
10144C5505939j0997260K769731J965061r244246j0571370l169908m486097j4350819
10136a2578969j4258754R34773J4704976J4402020N193366m018966j0350638r872667
10128a5844859J053466J3240374J1191037k439629o850913M836697J1978855k859499
10120A4305529k5328460k7776363o524982J5585596J9321707Q199051j158875
10113c376797J467882R802490P435715j1017120k5535028j1296512K2265669L3493908
10105B3240207L652372l0740924k5128522R609586K4009973K929484j7508019
$$ y = [7435606, -325866, -8325276, -4022714, 9456242, 18516534, 19118329, 18162101, 15064670, 181777, -21655786, -25231348, 2418946, 37897533, 48826577, 35505939, 24508679, 27278410, 29243471, 19999225, 9427855, 6257947, 1771850, -12578969, -26837723, -25902950, -11197974, 3204046, 8397412, 4378446, -5972192, -15844859, -14791393, -1551019, 9640018, 7200389, 349476, 5186173, 17165028, 14305529, -11022931, -38799294, -45324276, -29738680, -10416973, -2217922, -3376797, -1908915, 7893575, 15329290, 4312170, -21222858, -32519370, -10253701, 23240207, 26892579, -3848345, -28976867, -19367281, 4642692, 7572176, -9935843]
10098i935843j0583475L579709n95779j0433826k014877J4315031J0869823q821802
10090a3621039j4783457K88166J1270820L544592n790052J13207J1024906R691355
10082A738498j034744p085683n144781j285520J584898K619847j185941p578292
10074a7371718o772329L965761J3336500J2179041N281600j172771r425979j7004276
10066a6984171j1150596Q512860J9533060Q333295n187021R76176J2303234K169123
10058A8505960j8748467j6850103O006091J2270156q435531k0596533j753611
10051b9602038K1546401K0249415Q309961J1109192J9049955R031232j0085516
10044D9608602j2154865L87277L211045o147729q392778k077495n933181k0207972
$$ y = [-9935843, -20519318, -16939609, -17535388, -27969214, -29984091, -15669060, -4799237, -13621039, -28404496, -28116330, -16845510, -13300918, -19090970, -18977763, -7952857, 1738498, 703754, -6381929, -11526710, -12812230, -11227332, -8607485, -9793426, -17371718, -24144047, -20178286, -6841786, 5337255, 10618855, 9446084, 20105, -16984171, -28134767, -19621907, -88847, 8244448, 3057427, 4033603, 16336837, 18505960, -242507, -17092610, -11086519, 1183637, -7251894, -27848427, -29602038, -8055637, 12193778, 20503739, 31612931, 50662886, 59694118, 49608602, 37453737, 37841014, 41052059, 34904330, 26511552, 24434057, 18500876, -1707096]
10036a707096k1394628k718602J2003420N591877q994908j3960830j0448844m769807
10028d6399418N404972J7177409J6652684K172870o829330K15788O421358l263540
10020h447207j4210005o257410J0802144J2261715j775671r024505j908699N063427
10012a3496211M224414N333425J2738709J4696576M188005p667181r379608o340041
10004D298088r331906j6038779j5271279m070627Q398495J1837927N009927l133075
9996a8301229j666738R154418J4907658M889729r443489o754669J2636249K3651546
9988B9073475J1143954q875986j4208955p224623l780847m103270K665434J1620818
9980A6310000N948485j1454288j6461256j633655R136551j988006j7082682j0850452
$$ y = [-1707096, -23101724, -25820326, -13816906, -8225029, -17219937, -31180767, -41629611, -46399418, -40994446, -23817037, -7164353, -4991483, -11820813, -11605025, -5183667, -8447207, -22657212, -28914622, -18112478, -5850763, -7626434, -16650939, -18559638, -13496211, -9271797, -3938372, 8800337, 23496913, 27684918, 20017737, 10638129, 4298088, -5033818, -21072597, -36343876, -40414503, -32016008, -20178081, -15168154, -18301229, -19967967, -10813549, 4094109, 8983838, -459651, -7214320, 5421929, 29073475, 40217429, 31341443, 17132488, 9907865, 6127018, 2023748, 4689182, 16310000, 22258485, 10804197, -5657059, -7290714, 1845837, -142169, -17224851, -28075303]
9972b8075303Q738301J4348625L259423k094634M894507M280258j2938817k4414515
9964c2002155r720792J6079657K2672355O903639n922362K68705J1851259P031556
9956A7161862j3638729k6589103j3755560J3394380K4542804P562211j3853360
9949e175495j0211658J3209269K3913924Q734010r952840j0720698k186981j571209
9941F038322n148757p13167N756607q4151j2938996j3373001J633066J4561703
9933d268374J3717979N597854l28157l178078m438185l226663m99467J348607
9925D725516L093303N075989K646353n467294r536702j066986J2027791J4372217
9917B5870187L341633j0147741j6091101j1452780Q80224J0543981P304693j946886
$$ y = [-28075303, -19337002, -4988377, -1728954, -3823588, 1070919, 5351177, -7587640, -32002155, -41722947, -25643290, -2970935, 3932704, -1989658, -1720953, 10130306, 17161862, 3523133, -23065970, -36821530, -23427150, 1115654, 8677865, -5175495, -15387153, -2177884, 21736040, 30470050, 20517210, 9796512, 7609531, 6038322, 889565, 176398, 5933005, 5848854, -7090142, -20463143, -18830077, -4268374, 9449605, 15047459, 14719302, 11541224, 7103039, 3876376, 3376909, 4725516, 7818819, 12894808, 15541161, 10073867, 537165, -529821, 11497970, 25870187, 29211820, 19064079, 2972978, -8479802, -7599578, 2944403, 10249096, 8302210]
9909H302210P76010J2975993R560842j3214276k1833645J696457K3573182J0278874
9901C2115647j4853507j3291614K52018j0785566k9189746r991196L1931895L8822873
9893B5010804J0871502M580809K5213985J7939577j3873806O519389P7545433
9886A53807693P0110944p9737602k27476938j92160471r769831J17654510R4208883
9879g3362812J6163169r947136J544685o33883o787471P944701K2551604J4849138
9871b7678005P198918J7551604J8558709p600957k4819297l005542K3722076J1836405
9863A5763911j7675280j6333040J0740465J7990579n021528k4741505k0667856
9856c9944254n145310Q440293J7950303J7359484L367608p935943r83515J0940091
$$ y = [8302210, 9078220, 22054213, 31615055, 18400779, -3432866, -1736409, 21836773, 32115647, 17262140, 3970526, 4222544, -6563022, -35752768, -45743964, -13812069, 25010804, 35882306, 40463115, 65677100, 83616677, 69742871, 76262260, 153807693, 223918637, 144181035, -83295903, -275456374, -285226205, -167571695, -73362812, -57199643, -67146779, -65602094, -66235977, -73023448, -65078747, -42527143, -27678005, -20479087, -2927483, 15631226, 8030269, -16789028, -19794570, 3927506, 15763911, -1911369, -18244409, -7503944, 10486635, 5465107, -19276398, -39944254, -45089564, -36649271, -18698968, -1339484, 2028124, -5907819, -6891334, 4048757]
9848D048757O730417m775898j393822R195335Q71282k2630418l0417254j4265591
9840e2637192K841937R694894J8897909K9807095K0074163j1498627l0422389
9833a3242210j5117141J0439508J4888728L481080j332650j42430p201067j6177748
9825b4403930p769402J3775399K1255233M052319j6577973j8001220l729381P576847
9817b3822108O866718m91070n360439k252066P687019J5101572R661204n701831
9809A688999j3972812m169354J3129531J8368411O996566q252265j6111084j6797680
9801a9119688j3647532o987886J58136J311166k911584l171980L463421O884595
9793c4021352M50124o249042k121156O914179P274297j187229p041434m808152
$$ y = [4048757, 10779174, 6003276, 4609454, 13804789, 14676071, -7954347, -38371601, -52637192, -49795255, -40100361, -21202452, 8604643, 28678806, 17180179, -13242210, -28359351, -17919843, -3031115, 449965, -882685, -1025115, -8226182, -24403930, -32173332, -18397933, 2857300, 6909619, -9668354, -27669574, -31398955, -23822108, -16955390, -17446460, -22806899, -25058965, -17371946, -2270374, 7390830, 1688999, -12283813, -16453167, -3323636, 15044775, 22041341, 13789076, -2322008, -19119688, -32767220, -39755106, -39596970, -38285804, -41197388, -44369368, -40905947, -34021352, -33571228, -39820270, -41941426, -35027247, -27752950, -28940179, -35981613, -40789765]
9785d0789765K652335J3168360K2314739J8818266N35789j2195060r32046J8538436
9777B2111054J4273980j2999639k8550550j5101204N046803R123612M888627O921162
9769E713845R451435K889005n408498p352350j0301351j6968431j1156042J3401007
9761a9731380L1678156K1451880j273659r639386q368544j5342699k0515425m574749
9753b6315806J5510914O847563j9533317j9405684J1662343K7830815P386083
9746C982911j3602380m244802J2039535L549266j4525318j0474802Q211464J1664808
9738c399318l78686n016106n55884l457289r492108J091382K1898912K3367956
9730B4058859J069374j5285467q805048K220058k513o099676l652913j30730l647353
$$ y = [-40789765, -38137430, -24969070, -2654331, 16163935, 16699724, 4504664, 3572618, 22111054, 36385034, 23385395, -5165155, -20266359, -15219556, -6095944, -1207317, 5713845, 15165280, 18054285, 12645787, 5293437, -5007914, -21976345, -33132387, -19731380, 11946776, 33398656, 32124997, 22485611, 14117067, -1225632, -21741057, -26315806, -10804892, -3957329, -23490646, -42896330, -31233987, -3403172, 3982911, -9619469, -13864271, -1824736, 1724530, -12800788, -23275590, -15064126, -3399318, -3778004, -8794110, -9349994, -12807283, -22299391, -21208009, 690903, 24058859, 25128233, 9842766, 1037718, 3257776, 3255263, -2844413, -6497326, -6628056, -10275409]
9721a0275409m726870L190095O203826n831722j6227516o171869J2721874J5952389
9713e165202M697964O4707O180643O939874k440325p544705j233592N760451N543047
9704A2802862L028149L4429r199219j9720592j4984767N288298J6909629M475386
9696a365825j5130937j7771286m752685O034464P537985M235057k241734r258976
9688c2713937n922631J0178113J8894552K698268k1856410k2875940Q56698J8987069
9680c1754218J4398484J833060k376520k356431n260981n868697j247041n58034
9672c3190378o802038p018424N091435J4087350O616709n088338j940890J2074868
9664a6169706J8092581J1457043L328062o40958m545363q604252q269126n083045
$$ y = [-10275409, -15002279, -11812184, -5608358, -11440080, -27667596, -33839465, -21117591, -5165202, -467238, -402531, 5778112, 12717986, 10277661, 2732956, 1499364, 7259815, 12802862, 15831011, 15865440, 6666221, -13054371, -28039138, -22750840, -5841211, -1365825, -16496762, -34268048, -39020733, -32986269, -25448284, -21213227, -23454961, -32713937, -38636568, -28458455, -9563903, -6865635, -28722045, -51597985, -50741287, -31754218, -17355734, -15522674, -17899194, -20255625, -25516606, -31385303, -32632344, -33190378, -39992416, -47010840, -41919405, -27832055, -21215346, -26303684, -28244574, -16169706, 1922875, 13379918, 16707980, 16067022, 11521659, 2917407, -5351719, -10434764]
9656a0434764l740053q66591Q769426J8013035J5273863M679941J197188O133947
9648C9025992O073344j694968l028940O602626R363590p584106k7392384k4580160
9640c215006k291952J1397861L200411q486476k643594J3749368J7084370J380657
9632C0175639j4182495j2430013N99137P722030L737107l185567o769944p599099
9624a933205n421086J538983R067290R675399M537364K181607L216838j614533
9616B1248657j3698320j9309918q040892J1331073K1910677J7830358N067065
9609C6338700q399781j5389097j1176260j276986L75589j0266012j9389124j4590066
9601d3773037k106525N921832J0106880J5555550J5979171M569808p128992k331422
$$ y = [-10434764, -14174817, -15041408, -6271982, 11741053, 27014916, 31694857, 32892045, 39025992, 45099336, 43404368, 40375428, 46978054, 56341644, 48757538, 21365154, -3215006, -5506958, 5890903, 9091314, 604838, -2038756, 11710612, 28794982, 30175639, 15993144, 3563131, 4162268, 11884298, 15621405, 12435838, 5665894, -1933205, -7354291, -5815308, 3251982, 12927381, 17464745, 19646352, 22863190, 21248657, 7550337, -11759581, -19800473, -8469400, 13441277, 31271635, 36338700, 27938919, 12549822, 1373562, 96576, 472165, -9793847, -29182971, -43773037, -45879562, -39957730, -29850850, -14295300, 1683871, 6253679, -875313, -3206735]
9593c206735J2817314J5876302K420927q358810n407760j001404o477888j2973114
9585f311168q642087N71057J788044l622322l692064N192595J4376280J4754090
9577A4414425M874296r075652j5853488p295360R996884J7039841L792888j6832032
9569A061802k3717151j2194821L522786R104490L268388n849418r564012l997229
9561c8365165O835200J2756123P703750j598798l244687K951980L832382p855813
9553a6985028k0064578j6018077J614235J2924236Q795727L757104J2224548K2866096
9545I114263J2725423j6453240l4278581j9263405J3787553L2376906K2339091
9538B0348010k802930j9743698j4575724P526394K3496996J1985001j9395690
$$ y = [-3206735, 9610579, 25486881, 27907808, 19548998, 14141238, 13139834, 6661946, -6311168, -14953255, -14382198, -12594154, -16216476, -19908540, -14715945, -339665, 14414425, 19288721, 10213069, -5640419, -12935779, -2938895, 14100946, 17893834, 1061802, -22655349, -34850170, -31327384, -22222894, -18954506, -24803924, -34367936, -38365165, -31529965, -18773842, -11070092, -12668890, -15913577, -12961597, -9129215, -16985028, -37049606, -53067683, -51453448, -38529212, -29733485, -25976381, -13751833, 9114263, 21839686, 5386446, -28892135, -48155540, -34367987, -1991081, 20348010, 17545080, -2198618, -16774342, -9247948, 14249048, 26234049, 6838359]
9531F838359l6602023k0159630P682313J2620980m825567j3381630K501620K3893685
9523b1431893K7812326J4789186j376932j2865546j6265447p076691J0750338
9516e664659K0067687R195723j0124061j5451990j703095J3815894J4104709J465362
9508B5705570q838596q261592l138275l406650p925211o572849L379345J0979796
9500A921538O529909m069733p914000l097784J510819J380316N24157J517921
9492a696857J770082N78611O39570J285950j285425n807172o067562o68938M592794
9483f658947N091831J704111k838457n481987k781035L282033L105780p199478
9475a1776149j4797638n593391J2487089J7704184N596330n629779l569587K579923
$$ y = [6838359, -29763664, -49923294, -42240981, -29620001, -34445568, -47827198, -45325578, -21431893, 6380433, 21169619, 19792687, 6927141, -9338306, -16414997, -5664659, 14403028, 23598751, 13474690, -1977300, -3680395, 10135499, 24240208, 25705570, 16866974, 8605382, 5467107, 2060457, -5864754, -12437603, -9058258, 1921538, 8451447, 4381714, -3532286, -6630070, -5119251, -3738935, -3214778, -1696857, 73225, 651836, 1291406, 2577356, 1291931, -4515241, -10582803, -11251741, -6658947, -1567116, 136995, -2701462, -8183449, -10964484, -7682451, -4576671, -11776149, -26573787, -32167178, -19680089, -1975905, 3620425, -2009354, -5578941, -2999018]
9467b999018J260237l378188k885104k00198j803371m045346N52891R376532J2328139
9458H206574N259529n733202j0908567n074013O574215J0593438K00008j2993503
9450c875521j2286920Q1287O049185j43503l783509N351355J7145250J9081683
9442B7619307J4239736J0314423M885083n490319j3578576j2612605r309917j2430265
9434C636867j6994560j3187091l568344J557680m7109k798664l323858k74532
9426c4999611Q360552J7713350J5005259k296588j6976727j3953766j756753K859616
9418b6044668J258999N141048J1202299O203676o563389r219474J630435R649963
9410f741111O019096J215026L584150N658641Q94880k887772K010167Q721241
$$ y = [-2999018, -1738781, -5116969, -8002073, -8202271, -10005642, -14050988, -13498097, -4121565, 8206574, 13466103, 7732901, -3175666, -8249679, -1675464, 8917974, 9117982, -3875521, -16162441, -16081154, -10031969, -10175472, -13958981, -8607626, 8537624, 27619307, 41859043, 52173466, 57058549, 51568230, 37989654, 25377049, 16067132, 3636867, -13357693, -26544784, -30113128, -28555448, -28602557, -31401221, -34725079, -34999611, -26639059, -8925709, 6079550, 3782962, -13193765, -27147531, -28904284, -26044668, -24785669, -19644621, -8442322, -2238646, -8802035, -18021509, -16391074, -6741111, -722015, 493011, 4077161, 9735802, 10630682, 7742910, 9753077, 18474318]
9402A8474318P292559j77138o507742j1512931j6071603j3693947j126980R806726
9394a3516738N528203p959271j1686450q10569R514302P714265P56659j116866
9386a1576465j403805p142322j1084520q24976J6750939J8779594l93679j6534713
9378a3429947q605909R106330P228173j3434395k1116269o42730K2248428J7583276
9370a063043n928006j4881043J152421J8386598J5326163J75560o303634p49513
9362F115503L042162k251021p816565l896825N515540Q838577K298235p451072
9354D394534j3263154j2824315n778982M953200Q679097l592367k0636297j6954425
9346e5022709J1903088L4798819K3585664n775026j4792965J757080J1256168
$$ y = [18474318, 25766877, 25589739, 19081997, 7569066, -8502537, -22196484, -23323464, -13516738, -7988535, -15947806, -27634256, -28444825, -18930523, -11216258, -10459599, -11576465, -12980270, -20122592, -31207112, -32032088, -15281149, 3498445, 3104766, -13429947, -22035856, -12929526, -5701353, -19135748, -40252017, -40894747, -18646319, -1063043, -6991049, -21872092, -20719671, -2333073, 12993090, 13168650, 6865016, 6115503, 9157665, 6906644, -909921, -4806746, 708794, 9547371, 11845606, 4394534, -8868620, -21692935, -27471917, -22518717, -13839620, -17431987, -38068284, -55022709, -43119621, -8320802, 15264862, 9489836, -5303129, -3546049, 7710119]
9339G710119m095100k1743301j7286420j8525Q565315Q772948J2571902J6720257
9331A1197195J0793025Q50729Q95788P344962M438746q691189j7003898j3694511
9323c869153o588587j435487L515334O414895K068928n770251p358920k861692
9315a5884933j344112m271564m505352j211229m10998q01160M645782J2224839
9307a1558727J0196154L23857j809652P051107J0314067j457378j3972755j1615045
9299a2528372j069268K048923j865309j369142M230806N713463L133553O564018
9291D858672J5958374J6389140P07949j5053721j0621296R670836J9710785M243028
9283D5863767k2140158l3611775k2090116k53506J6508527K0119837Q115637j2570380
$$ y = [7710119, 3615019, -18128282, -35414702, -35433227, -26867912, -18094964, -5523062, 11197195, 21990220, 22840949, 23736737, 31081699, 35520445, 26829256, 9825358, -3869153, -10457740, -11893227, -8377893, -1962998, 105930, -5664321, -13023241, -15884933, -17229045, -21500609, -26005961, -27217190, -27628188, -28429348, -23783566, -11558727, -1362573, -1038716, -2848368, 4202739, 14516806, 13059428, -913327, -12528372, -13597640, -11548717, -13414026, -14783168, -10552362, -4838899, -1705346, 4858672, 20817046, 37206186, 37914135, 22860414, 12239118, 21909954, 41620739, 45863767, 23723609, -9888166, -31978282, -32231788, -15723261, 4396576, 12512213, -58167]
9275e8167k2417653q004644J4417003J4096558r893574k2635828m081355J8602890
9267a9974770J1539595j3403114j7460015N225750K1488652J1834005m503897
9260e253794n236229L329296M641487m18707j349553J757950K308711J515387
9252A294548M352661P693663M083894o580664j7012964k0622877j5237237l951678
9244d5980654M782614M578718O10310L379396J1742559J3416574N103727j537881
9236c904637O6239k55570j0868157k0421303j2332374R973390K5819348K2446195
9228A0523131O982853n144381n613231J768851N343307l386874j8603323k3552491
9220c1682158r956476J0230497J8478731J1279398J257594m77013M629002Q729364
$$ y = [-58167, -22475820, -30480464, -16063461, -1966903, -11860477, -34496305, -38577660, -19974770, -8435175, -21838289, -39298304, -34072554, -12583902, -749897, -5253794, -10490023, -7160727, -2519240, -2937947, -4287500, -2529550, -220839, 1294548, 5647209, 13340872, 17424766, 10844102, -6168862, -26791739, -42028976, -45980654, -41198040, -36619322, -36009012, -32629616, -20887057, -7470483, -2366756, -3904637, -3838398, -4093968, -14962125, -35383428, -47715802, -37742412, -11923064, 10523131, 17505984, 12361603, 6748372, 8517223, 13860530, 10473656, -8129667, -31682158, -41638634, -31408137, -12929406, -1650008, -392414, -869427, 3759575, 12488939]
9212A2488939P655241K702249k991446o651109o475864l247475j474671n836455
9204c830591j3928685j5173740k634471J4491591J8036738L429281j2902016j3831006
9196b6342899j288484J1109284J6620276J6704651J1196958m18087j1957525j5945467
9188c21293j2893932o561689L345818J3717027J3318589p7393q734205L3575Q986610
9179A0813107m098876k5803562k3069874L510387J8619581Q451898o44618P870427
9171d351530J1635598o830321k2920709r050838J6267723J6271726n178460j2595967
9163a6752778K141021R924786n287906k2299832j8194210m9395J1507383J0242148
9155b8768783L686559p51945J047700R541677J6914123J2476973k113795j2603046
$$ y = [12488939, 20144180, 22846429, 19854983, 13203874, 6728010, 3480535, 2005864, -3830591, -17759276, -32933016, -35567487, -21075896, -3039158, 390123, -12511893, -26342899, -27631383, -16522099, 98177, 16802828, 27999786, 27581699, 15624174, -321293, -13215225, -19776914, -16431096, -2714069, 10604520, 10527127, 1792922, 1826497, 10813107, 6714231, -19089331, -42159205, -38648818, -20029237, -11577339, -12221957, -4351530, 7284068, 453747, -22466962, -31517800, -15250077, 1021649, -4156811, -16752778, -14611757, -4686971, -9974877, -32274709, -50468919, -50518314, -39010931, -28768783, -25082224, -25834169, -24786469, -15244792, 1669331, 14146304, 12032509, -570537]
9147e70537j1284399o302345p070775j0368012p544974J824951J0266057J2124002
9139a8926032Q267672L773512L390349P187225J0228276Q511050L581496j146737
9131B4866811m810411o053658j322373P410016R471516p68483j2421983j1653805
9123D717630k420150o3399o461732p565102K343736J0314100N547832l357952
9115C054963k504221N966071Q969357L086751k986543n001026q974850j6668386
9107a5057884j6568326P17942K3426159K7747601Q029573j3413365j3684145K615614
9099C813169J3452122J0374636M050063J516765l253679j1941361j3361740k365878
9091B284097P686780M112772n426225o550123j298987j498949o371094m597438
$$ y = [-570537, -11854936, -18157281, -25228056, -35596068, -43141042, -41316091, -31050034, -18926032, -10658360, -6884848, -3494499, 3692726, 13921002, 22432052, 26013548, 24866811, 20056400, 14002742, 12680369, 20090385, 29561901, 28793418, 16371435, 4717630, 2297480, 2234081, -4227651, -11792753, -9449017, 865083, 6412915, 3054963, 550742, 6516813, 15486170, 18572921, 15586378, 10585352, 1610502, -15057884, -31626210, -30908268, -7482109, 20265492, 28295065, 14881700, 1197555, 3813169, 17265291, 27639927, 31689990, 33206755, 29953076, 18011715, 4649975, 2284097, 9970877, 14083649, 8657424, 2107301, 808314, -690635, -7061729, -11659167]
9083a1659167M236529P277799j604621j3163096j6227110r504289J062747Q169630
9075c1411578O894723R2956k564007J905973L378709m570860j0016307L23687
9067c5966704J6730625J8049757L654563o864993m786962o21980N55097P660492
9059a590105J9954282J8743121l557885k5380004k3327691l013307J3170874J6220964
9051A1220249J1848001L015605r749970j7517681j1296211J530266N277431j224565
9043f896875m871433j80854M506793L791878K906590M486187J416090r716658
9035d558282j8469898j3226533J879881J1751419R802255M689954O287629J0998857
9027I155282O606322q959506k0406694j2461257Q724418K0710803J2575912k364513
$$ y = [-11659167, -7422638, -144839, -1749460, -14912556, -31139666, -40643955, -39581208, -31411578, -24516855, -24423899, -26987906, -25081933, -21703224, -26274084, -36290391, -35966704, -19236079, -1186322, 2468241, -4396752, -9183714, -9805694, -9250597, -1590105, 18364177, 37107298, 33549413, 8169409, -15158282, -18171589, -5000715, 11220249, 23068250, 26083855, 16333885, -1183796, -12480007, -10949741, -5672310, -6896875, -11768308, -11949162, -7442369, -3650491, -743901, 3742286, 5158376, -4558282, -23028180, -36254713, -34374832, -22623413, -12821158, -8131204, -1843575, 9155282, 15761604, 6802098, -13604596, -26065853, -17341435, 3369368, 15945280, 13580767]
9019A3580767o571187q53061K551261J348842L939049J1541775J3664682L991636
9011D3193764r668127j5304370r633110J252554Q010875L921787q645092j7334678
9003d206397j2784818j869421J365259l092275k274872O145357P914899l304561
8995a2106829j2277447n299937P379121Q162168l91339l443207o74886l396951
8987b2049307r170824l388657J2225557J6655589K466502r981425k918638J2534316
8979c626887J5329274N315639j862327p34475O87126j686012l458350l140449
8971F823539m896493r205201j0343482m332686O283486J4915944J5260636P157814
8963B1663557O9404K992472Q709680N18635j9994784k8031949r727421J4764608
$$ y = [13580767, 7009580, 6156519, 8707780, 10056622, 13995671, 25537446, 39202128, 43193764, 33525637, 18221267, 8588157, 9840711, 17851586, 21773373, 13128281, -4206397, -16991215, -18860636, -17495377, -20587652, -22862524, -16717167, -8802268, -12106829, -24384276, -29684213, -22305092, -14142924, -14534263, -17977470, -18652356, -22049307, -31220131, -34608788, -22383231, -5727642, -3261140, -13242565, -16161203, -3626887, 11702387, 17018026, 15155699, 14421224, 15108350, 13422338, 9963988, 6823539, 1927046, -7278155, -17621637, -21954323, -15670837, -754893, 14505743, 21663557, 21732961, 24725433, 33435113, 33953748, 13958964, -14072985, -23800406, -9035798]
8955i035798J8685557N182301l531878j687495r27342l528642m31615O520103
8947A1245191M979741m640054q775482n037061n260340j1941237j2725524k023873
8939c4178639J0717020J6627909J3989768J236924j6506656j9294429L000016
8932b4408087K3644001J0276692k0010904j8874651J6114168L1738444K764549
8925B1244212k5813355j0768805K1032345J8903405j2309692k7945120j5371111
8918c1028121p97653K568453O579050J3828381J2602865M739892L355834M994588
8910A6843289l328132j3448510o115981J2093155J6652259O848153L439676O665195
8902C9649104l676740k4054055k4940237j262158J5122545O582853m662337R18136
$$ y = [-9035798, 9649759, 14832060, 11300182, 9612687, 8685345, 5156703, 4725088, 11245191, 16224932, 11584878, 2809396, -2227665, -7488005, -19429242, -32154766, -34178639, -23461619, -6833710, 7156058, 8392982, -8113674, -27408103, -24408087, -764086, 9512606, -10498298, -29372949, -13258781, 18479663, 21244212, -4569143, -15337948, 5694397, 24597802, 12288110, -15657010, -31028121, -31825774, -29257321, -22678271, -8849890, 3752975, 8492867, 11848701, 16843289, 13515157, 66647, -6049334, 6043821, 22696080, 29544233, 32983909, 39649104, 35972364, 11918309, -13021928, -14284086, 838459, 7421312, 2758975, 3677111]
8894C677111P945157j629022j5079862j2483765Q34000Q810750J0494001R964011
8886A2532381R26485j6711267k3918354q921421J0241135J1914765L610297N020826
8878e305153J2931023R529508m290978j0851259n907910j947852k756388J902840
8870f696169J3502381J7119628L757019j4196074j8523935q018163K036601L41070
8862a0677642o485002l471641J0494150J7373019L372198j8980191k4714999r104884
8854d2194992R064681J6128886J6724012J5164649M733273j4500273k5364689
8847b0244453j4959374O447508K0315800K2484607J9416161J2680028J24984j4494108
8839C1771153k3513782k2682101j2203647K174995Q124571j098333j2633776p992333
$$ y = [3677111, 11622268, 9993246, -5086616, -17570381, -16736381, -7925631, 2568370, 12532381, 13458866, -3252401, -27170755, -36092176, -25851041, -13936276, -10325979, -5305153, 7625870, 17155378, 12864400, 2013141, -3894769, -5842621, -8599009, -6696169, 6806212, 23925840, 27682859, 13486785, -5037150, -13055313, -11018712, -10677642, -17162644, -20634285, -10140135, 7232884, 10605082, -8375109, -33090108, -42194992, -33130311, -17001425, -277413, 14887236, 19620509, 5120236, -20244453, -35203827, -28756319, -8440519, 14044088, 33460249, 46140277, 46265261, 31771153, 8257371, -14424730, -26628377, -24453382, -16328811, -17427144, -30060920, -38053253]
8831c8053253P994395J2434251J190239m550277M698295J1154536L391156l272021
8823e012679K925885P691544n91055p163485j29881M170187o711480j1724684
8815a6545648O630492K1817973J921048l1574339l1040598L479063K6324383J6507896
8807b479730k292859j1182496j6664371j7242358J649548K8404682K7808593j549775
8799F451234j7299285J36981J5905811J063669j9044465j0782287J0831161J1492772
8791a244409m608843q701342J401746N647453K520493N084463P052823o918455
8783B33929k3901833j6452798Q409726J4896816l806155j4499606j93457J2811365
8775b2502013J947970j3358922o086701J3586332J7634781N157033k586684j42732
$$ y = [-38053253, -30058858, -17624607, -16434368, -20984645, -16286350, -5131814, -1740658, -5012679, -2086794, 5604750, 5013695, -2149790, -2279671, 1890516, -4820964, -16545648, -9915156, 11902817, 13823865, -17750474, -48791072, -45312009, -18987626, -2479730, -4772589, -15955085, -32619456, -49861814, -48212266, -19807584, 8001009, 6451234, -10848051, -10711070, 5194741, 6258410, -12786055, -23568342, -12737181, -1244409, -5853252, -14554594, -13152848, -7505395, -4984902, 99561, 7152384, 233929, -23667904, -40120702, -31710976, -16814160, -20620315, -35119921, -35313378, -22502013, -20554043, -33912965, -39999666, -26413334, -8778553, -3621520, -6208204, -6350936]
8767f350936n67659n577044k269706R017010R903961o114483k0638215j7071147
8759c9668219k698056P209222J1782596J6848455J7400714N620421j0306861j3828659
8751g640387n050100r00336q099107j2515391k114705J3781059J8458085J0401895
8743F321013J09685p698849j5064589j8624226j1331933L657132J3893578J4372154
8735a4366035J1511939Q147436j611130j6427217k0901495o566131J0956546J1100537
8727a8155550j858188n728235N118858J2095328L400888p226371m079623M989317
8719a1443576L575726m837452m387800L984376M630585k402064J220566J8061925
8711H402286K3973990N261118j5942085j4022984L76230j240734j8691483k4204098
$$ y = [-6350936, -6918595, -12495639, -14765345, -5748335, 4155626, -1958857, -22597072, -39668219, -42366275, -35157053, -23374457, -6526002, 10874712, 16495133, 6188272, -7640387, -12690487, -13590823, -21689930, -34205321, -36320026, -22538967, -4080882, 6321013, 6430698, -1268151, -16332740, -34956966, -46288899, -42631767, -28738189, -14366035, -2854096, 5293340, 3682210, -12745007, -33646502, -40212633, -29256087, -18155550, -20013738, -25741973, -20623115, -8527787, -5126899, -12353270, -16432893, -11443576, -7867850, -12705302, -17093102, -13108726, -8478141, -10880205, -9659639, 8402286, 32376276, 37637394, 21695309, 7672325, 8048555, 6807821, -11883662, -36087760]
8703c6087760o874961J2274834J3652402L451067k729562j058265L836073P623755
8695e912417N482776l501652q611285l19734R236477M81749j7704264j4700948
8687c5549298J2130727K6759006R060133j2453673o624621J1453188R753634o578119
8679G950977q976804K718026L972573o266725l536178J4640587J9514904j329522
8671B8687838k2359614k0351332o969658m150689j0528631j0575465O7467J4372273
8663c1807811K5724474K7875973J6097660j702667q706290k883987j689654j3618278
8655I289420k2259624j1737290P765696J5581200R114123J017383j991022k121798
8647D658088o40524Q77568k901429j0499219q878841O537389J7393478O192842
$$ y = [-36087760, -42962721, -30687887, -17035485, -13584418, -16313980, -17372245, -13536172, -5912417, -429641, -3931293, -12542578, -12862312, -3625835, -3144086, -20848350, -35549298, -23418571, 3340435, 12400568, -53105, -6677726, 4775462, 14529096, 7950977, -1025827, 1692199, 5664772, -601953, -4138131, 10502456, 30017360, 28687838, 6328224, -14023108, -20992766, -25143455, -35672086, -46247551, -46180084, -31807811, -6083337, 21792636, 37890296, 36187629, 27481339, 24597352, 22907698, 9289420, -12970204, -24707494, -16941798, -1360598, 7753525, 8770908, 6779886, 4658088, 4017564, 4895132, 1993703, -8505516, -17384357, -10846968, 6546510, 12739352]
8639A2739352j3487451j2782737Q983710K0357862K252593k4806801k9469584
8632c6213056j0217726Q142268J0400205O461088J0512999J8765534J6291425
8625B4142737M8201j5053979j4630971k180048P060111N198958k242193p414458
8617e071642q972184q267264m300859L056675R548977J0919695Q182237M976464
8609A0072099K016739k174423o415698o660981j444199M821494O072692J667257
8601G954980l446454o468252j0111837j4208644r995171P302856K4134950K1858148
8593A7020576M685691l772290L190255M187921j3021323k6088428j1719676J3938031
8585a1579243J7618955R6046p448928O113225J8389418J2970388O13283o568037
$$ y = [12739352, -748099, -13530836, -4547126, 15810736, 18063329, -6743472, -36213056, -46430782, -38288514, -27888309, -21427221, -10914222, 7851312, 24142737, 24190938, 9136959, -5494012, -7674060, -613949, 4585009, 2342816, -5071642, -14043826, -22311090, -26611949, -23555274, -14006297, -3086602, 5095635, 10072099, 12088838, 9914415, 3498717, -3162264, -4606463, 215031, 6287723, 7954980, 4508526, -1959726, -12071563, -26280207, -36275378, -28972522, -4837572, 17020576, 21706267, 17933977, 21124232, 25312153, 12290830, -13797598, -25517274, -11579243, 6039712, 6135758, -1313170, 4800055, 23189473, 36159861, 36773144, 30205107]
8577C0205107j2509177j7646751r647202J1063015K0518290L998823j9350626
8570F631479k2378022n111317J1749244J4779250M930116j0206834j7965618p081672
8562b4653374J5500693K6979430J7521447J922141n651711r045127j2184383p482324
8554B906792K893448n60444k0840367k8395213m761834K1569609J4698339j3033811
8546b5523481k1240574l047514J2729825J2820677J2300440J7146370J3245504
8539A8431247j557093r090972k964439J480061k365524j602124O976421O612142
8531A5919719p795727j5911694n456572O132040J401072q815797o910558J501046
8523a9936471J191958m359356p35136J1712055K0266140K0556116J7206304J0357477
$$ y = [30205107, 17695930, 49179, -9598023, 1464992, 21983282, 25982105, 6631479, -15746543, -20857860, -9108616, 5670634, 10600750, 393916, -17571702, -24653374, -9152681, 17826749, 35348196, 37270337, 31618626, 22573499, 10389116, 2906792, 5800240, 5239796, -15600571, -43995784, -48757618, -27188009, -12489670, -25523481, -46764055, -49811569, -37081744, -24261067, -11960627, 5185743, 18431247, 16874154, 7783182, 4818743, 6298804, 3933280, 2331156, 9307577, 15919719, 8123992, -7787702, -13244274, -7112234, -5711162, -14526959, -21437517, -19936471, -18744513, -23103869, -23839005, -12126950, 8139190, 28695306, 45901610, 56259087]
8515E6259087j967979j3307041j5472632j1235701p488644k152688Q212348J4780488
8507B7627238P313945n783310o372022N611736J1281442J624858j0308423j1166785
8499A9828679n011762j202364O43654K319575l127128j7528367k3451541m671745
8491c2200999K2577992K2931832p897140l0334289j3669245J9088545K3543578
8484D040274k483833j9339188o421993J1852132R575040l339518n509040M80700
8476a1145426N49905k839992m76043J521808m369584n042377J2321945K8978747
8468A9498983J7358910j2035051k2447948p673978J371103q636555j2461307O015671
8460a9010172K2765762J2973290q710769j3658283j985603O920302Q179895Q649721
$$ y = [56259087, 54291108, 40984067, 25511435, 14275734, 6787090, 4634402, 12846750, 27627238, 34941183, 29157873, 22785851, 28397587, 39679029, 41303887, 30995464, 19828679, 14816917, 13614553, 14258207, 16577782, 13450654, -4077713, -27529254, -32200999, -9623007, 13308825, 5411685, -24922604, -38591849, -19503304, 4040274, 1556441, -17782747, -24204740, -12352608, -2777568, -6117086, -11626126, -11145426, -10595521, -13435513, -13911556, -12389748, -16759332, -21801709, -9479764, 19498983, 36857893, 24822842, 2374894, -5299084, -3927981, -12564536, -25025843, -19010172, 3755590, 16728880, 8018111, -5640172, -7625775, -705473, 7474422, 16124143]
8452A6124143M695552r810628k2732924j6788313K306183J3624812J1976412R298635
8444H693872R591612M968963m826339j0124716q854552p392894m225638P413955
8436d755737J9705945J4378614q400085k4972187j9636657l811029M820731N496585
8428a7173820N431788L223760l407268m752723P749988K1325857J4172594j1092866
8420A5477310k4316698o191758K3360831K8262136J903044k4790911k2612145
8413h908191J138188J5087599L518590j7529933k2870343o837875J4326086K2472602
8405C96723J4545113J544355n155047m451278k628654k944567l244720l357283
8397e295358o314801r201896l362190R283976J2235287j074991j1014465J287894
$$ y = [16124143, 20819695, 11009067, -11723857, -28512170, -26205987, -12581175, -604763, 8693872, 18285484, 23254447, 18428108, 8303392, -551160, -7944054, -12169692, -4755737, 14950208, 29328822, 20928737, -4043450, -23680107, -27491136, -22670405, -17173820, -11742032, -8518272, -11925540, -16678263, -8928275, 12397582, 26570176, 15477310, -8839388, -15031146, 8329685, 36591821, 38494865, 13703954, -8908191, -7770003, 7317596, 10836186, -6693747, -29564090, -36401965, -22075879, 396723, 14941836, 16486191, 11331144, 6879866, 4251212, 1306645, -1938075, -5295358, -11610159, -20812055, -24174245, -14890269, -2654982, -3729973, -14744438, -13456544]
8389a3456544K0442103J5556718j1150097k3904451n946291J7313844J9547584
8382A8402866R647680P723999R471281o2704j4298583j4811023m052992j868902
8374A0151622j2660125j9351366j0623973M878812J3595344J1776788M218058
8367A985160m65859M897933J5490798J4668108l765850k1413577j8392870k411427
8359i407584L641047l748664q173115l376113k04721l174703l414815J232284
8351b6626384Q59458o018875p069536J680259P767495M677594L117930R665337
8343a1946722J2850833L879826n509137k225133M488424k574162j8454061j9899783
8335c9389915J091912K3248394K0816309n284206k6930410j9373888J0099958
$$ y = [-13456544, 6985559, 22542277, 11392180, -12512271, -18458562, -1144718, 18402866, 28050546, 35774545, 45245826, 45183122, 30884539, 16073516, 12020524, 10151622, -2508503, -21859869, -32483842, -27605030, -14009686, -2232898, 1985160, 1519301, 6417234, 21908032, 36576140, 32810290, 11396713, -6996157, -9407584, -5766537, -9515201, -17688316, -21064429, -21269150, -24443853, -27858668, -26626384, -25766926, -31785801, -38855337, -37175078, -29407583, -24729989, -21612059, -11946722, 904111, 4783937, -725200, -2950333, 1538091, -1036071, -19490132, -39389915, -38298003, -15049609, 5766700, 482494, -26447916, -45821804, -35721846]
8328c5721846K9399292K0323875R72294j261700J0218094Q705024j0959683k1756556
8320h1206o774957J3557137J3315736r14048o425499l200515q763360k1393623
8312b0680335j8030293P268991K7682276J8155979j0554059k6251462j5495787
8305c7904690L594953P491063l715288q885328M684535K1911129J7775693p738194
8297b786127k5663708j4968598R507433J9032373J0798058O153393J2539215J1384500
8289B5996539q247792k5686868j6366231R325973J7388559k412006k2538264j6723508
8281c9263598N865723J7860090J1045582o77520p397501j1764007j3025590m159507
8273d1516328R745243J0755857l540374r914164O453937K4865988J7681472p091212
$$ y = [-35721846, -6322554, 14001321, 14973615, 13711915, 23930009, 32635033, 21675350, -81206, -6856163, 6700974, 20016710, 19102662, 12677163, 9476648, 713288, -20680335, -38710628, -31441637, -3759361, 14396618, 3842559, -22408903, -37904690, -34309737, -26818674, -30533962, -39419290, -34734755, -12823626, 4952067, -2786127, -28449835, -43418433, -33911000, -14878627, -4080569, 2072824, 14612039, 25996539, 17748747, -7938121, -24304352, -14978379, 2410180, -1826, -22540090, -39263598, -33397875, -15537785, -4492203, -5169723, -12567224, -24331231, -37356821, -41516328, -31771085, -21015228, -24555602, -34469766, -28015829, -3149841, 14531631, 7440419]
8265G440419j8351987r328928j979873n213834k260291J2600528J8098083L451894
8257D456011q162511K353079J3969102j194549k6975169k3393946R402581K7109503
8249b435899O453637k1632493j9691260M342893J6271808P468997j92025N987521
8241c426821J1954310L632147r090737p535689P009776J4276450L691962j0590935
8233I920463r659522L509444R088782J20042p340647K05015J1433263P243750
8225B4520590q020139j0971474N322138J9167851J1038856r129412j8207118j2423309
8217A297983p144589r204784q105050K449933J1100466O408010l950564m580386
8209a1728981L693469O028642j953127p359997j520031O075886M190661j383572
$$ y = [7440419, -10911568, -20240496, -22220369, -27434203, -29694494, -17093966, 1004117, 4456011, -3706500, -1353421, 12615681, 11421132, -15554037, -38947983, -29545402, -2435899, 4017738, -17614755, -37306015, -32963122, -16691314, -9222317, -9414342, -3426821, 8527489, 12159636, 3068899, -4466790, 2542986, 16819436, 20511398, 9920463, 260941, 3770385, 12859167, 12979209, 5638562, 5843577, 17276840, 24520590, 16500451, 5528977, 10851115, 30018966, 41057822, 31928410, 13721292, 1297983, -5846606, -15051390, -23156440, -20706507, -9606041, -3198031, -7148595, -11728981, -8035512, -2006870, -3959997, -11319994, -12840025, -6764139, -2573478, -3957050]
8201c957050J505849R224918O610036q102456j7927131j0424693N637077J2700310
8193d733140M830599r688112j8919316j5558084j611639J0366622P771135n346841
8185c2888776j0086750K309670J6276120J2876071k649846q434066K179208J2719246
8177g699123J0357125M480644Q456338J4916582N784160j6644177k7153291j2175098
8169a9676840Q570894Q428901q230010j3028916M287459K1777692J8301845N86817
8161B1017842j3384928j9581267k0813224j1229493J0438191K4591557J3357312
8154D395990p889605r118637P729575J0992439r707024k6379568j5877479Q878331
8146c6975978K4180250K5507918J6890369l288319k6114743k6240663L535189
$$ y = [-3957050, -2451201, 6773717, 13383753, 5281297, -12645834, -23070527, -17433450, -4733140, 97459, -9590653, -28509969, -44068053, -45679692, -35313070, -27541935, -32888776, -42975526, -40665856, -24389736, -11513665, -14163511, -22597577, -20418369, -7699123, 2658002, 7138646, 15594984, 30511566, 36295726, 19651549, -7501742, -19676840, -11105946, -2677045, -10907055, -23935971, -19648512, 2129180, 20431025, 21017842, 7632914, -11948353, -32761577, -43991070, -33552879, -8961322, 4395990, -3493615, -12612252, -4882677, 6109762, -3597262, -29976830, -45854309, -36975978, -12795728, 12712190, 29602559, 26314240, 199497, -26041166, -22505977]
8139b2505977L1488579K6080396r12089j5884438j1783785o505619o776454n354002
8131a2153389n133151j3580908j8506627k181565K2462139K3219537j713827j8459244
8123b6047035p944266J0320808J4952120J2279694J4015432J2672113p65401j5021681
8115A4461784j4616157l457588M503613N722725L583376k723075j0904450r254749
8107a2684521O318429J9011806J1392105q591956j7974516r741227K266590O289151
8099c714139N091659M925597N028439J964471l514529p542608p180120k375619
8091g316849L253583M218664j172720p573813p928229j976788L056052J555918
8083a3884182k197604J221004J1275112J3129400k793290k1257094j7883510M416144
$$ y = [-22505977, 8982602, 35062998, 34150909, 18266471, 6482686, -22933, -6799387, -12153389, -17286540, -30867448, -49374075, -51555640, -29093501, -5873964, -7587791, -26047035, -33991301, -23670493, -8718373, 3561321, 17576753, 30248866, 29483465, 14461784, -154373, -3611961, 891652, 6614377, 10197753, 7474678, -3429772, -12684521, -6366092, 12645714, 24037819, 15445863, -2528653, -12269880, -10003290, -3714139, 1377520, 6303117, 11331556, 13296027, 9781498, 2238890, -4941230, -7316849, -4063266, 155398, -1017322, -8591135, -16519364, -18496152, -15440100, -13884182, -16081786, -14860782, -3585670, 9543730, 6750440, -14506654, -32390164, -27974020]
8075b7974020J4804345j088365j8055242r493196J1940256J6645507M783988K3469
8067h413258O685636O816982l548700q892717n718095o720173j0815687k937605
8059c3543617J1441014Q129336j0693085j2309620J0948761K2531271P31755k2245654
8051b5009839j1431134J4850421J7881921O66951m850571N515201P408319n214418
8043a83149j2599034o252712J116161K862711N440986P977014K961059k348426
8035a025390P047690K3748673K2210667k192738k3295268k0079671j319399J2339114
8027A7433678J2476344L005822p842723j0621695k881854M041611r04321r835806
8019D871056o753330O336931J2689765Q023434M037964N038602K290731o249521
$$ y = [-27974020, -13169675, -14258040, -32313282, -41806478, -29866222, -13220715, -8436727, -8413258, -1727622, 5089360, 1540660, -7352057, -13070152, -19790325, -30606012, -33543617, -22102603, -13973267, -24666352, -36975972, -26027211, -3495940, -2764185, -25009839, -36440973, -21590552, -3708631, -3041680, -7892251, -2377050, 5031269, -183149, -12782183, -19034895, -17918734, -15056023, -9615037, -1638023, 1323036, -1025390, 6022300, 29770973, 51981640, 49788902, 26493634, 6413963, 5094564, 17433678, 29910022, 32915844, 25073121, 14451426, 11569572, 15611183, 14706862, 4871056, -1882274, 4454657, 17144422, 25167856, 29205820, 34244422, 36535153, 30285632]
8011C0285632j1088474r338823q320236q048021j80363J1667010J1479886k880710
8003A3575901j2789039o465486M464663N158142j743504n385397l214480J072842
7995e326358N291519P186655M317440L4072M71374L738027K385652l226790n750981
7986I120610l973386k217936P69274P491143J0293063K037348o540474j320119
7978A5659523Q228754K183513j3231490j2864197L155905O926602r520874k0116072
7970a9578336r946957J668991J4241Q56614J5070181K1805274N401886j1533071
7962C758823m467456J0335982N073587j0884710j0875868o51548m972097j7179070
7954b9862357q292802J8035034K5932729O282994q527464R48697J2764613O020818
$$ y = [30285632, 19197158, 9858335, 1538099, -6509922, -6690285, 4976725, 16456611, 13575901, 786862, -5678624, -1213961, 3944181, 2200677, -3184720, -6399200, -5326358, -34839, 7151816, 11469256, 11503328, 11974702, 15712729, 18098381, 14871591, 9120610, 5147224, 2929288, 3698562, 11189705, 21482768, 23520116, 16979642, 15659523, 23888277, 26071790, 12840300, -23897, 3132008, 10058610, 537736, -19578336, -29525293, -27856302, -27842061, -26985447, -11915266, 9890008, 15291894, 3758823, -708633, 9627349, 14700936, 3816226, -7059642, -7711190, -12683287, -29862357, -38155159, -20120125, 5812604, 12095598, 3568134, 4516831, 17281444, 23302262]
7946B3302262m873516r53626O667408j55305j1855056q495758L530761J466775
7938H633945j5136744k3252420j2194830L631510J0227290J0598316R678385K338586
7930e475962j2014535j8134975m054780J7379271K3012049J1276327J618444K091903
7922A5697742j640912j7129507k5670866r482014J6257236K1441708M007619r418171
7914e937165m297565N476011O063380L689425N930837M600158p975705k1494537
7906a3945161k1191116p277234J0077022K2787929K2774687L886828k2310301
7899e197346k9700144j0953108R268066J0144316M281090J0736770J8815541Q083017
7891A5478202j0298045p251862J5072025K3425124N098074j3534599r106547O419238
$$ y = [23302262, 18428746, 17475120, 24142528, 23987223, 12132167, 3636409, 7167170, 8633945, -6502799, -29755219, -41950049, -38318539, -28091249, -17492933, -7814548, -5475962, -17490497, -35625472, -39680252, -22300981, 711068, 11987395, 13605839, 15697742, 14056830, -3072677, -28743543, -38225557, -21968321, -526613, 3481006, -5937165, -10234730, -4758719, 1304661, 4994086, 10924923, 15525081, 7549376, -13945161, -35136277, -42413511, -32336489, -9548560, 13226127, 17112955, -5197346, -34897490, -45850598, -36582532, -26438216, -22157126, -11420356, 7395185, 15478202, 5180157, -2071705, 13000320, 36425444, 41523518, 27988919, 18882372, 25301610]
7883B5301610R329388j979776j2835836j6762534j8028222j7889850j1561827
7876d4427047K546919J6839267J9029584M917219j2184734j3083354R64562O318157
7868a9079427p893644j8948215m132987K0340713K1939300K997164m473240P866577
7860a383759J3270589k504768j7784521j2290453K978666R777269R966490J1035851
7852A3065364P982256j743403o436539j493273j789687j4152818j9235544k561346
7844b6364990J7236905J6165161K160467k655095n8037n224792j1803627k127668
7836a2671676J5235517J3996490n052790j2710576R96440J1324377Q01808j3651965
7828a732375j0709943L250512J0000887Q119558O915674N895666r39124r339500
$$ y = [25301610, 34630998, 32651222, 19815386, 3052852, -14975370, -32865220, -44427047, -41880128, -25040861, -6011277, -1094058, -13278792, -26362146, -25397584, -19079427, -26973071, -45921286, -50054273, -29713560, -7774260, -4777096, -9250336, -1383759, 11886830, 9382062, -8402459, -20692912, -17714246, -7936977, 2029513, 13065364, 21047620, 19304217, 12867678, 11374405, 9584718, -4568100, -23803644, -26364990, -9128085, 7037076, 9197543, 6542448, 6484411, 1259619, -10544008, -12671676, 2563841, 16560331, 11507541, -1203035, -206595, 11117782, 11919590, -1732375, -12442318, -9191806, 809081, 8928639, 15844313, 21739979, 20800855, 11461355]
7820A1461355j0017993m202877n76026r01415p1176L119192N298351N634754M974331
7811A4718496J105433o745580j2036488q687612k412214m151495j2215946j1685416
7803d2110822M186634K0713723J8373230q70853j3867710n581717J0633372J0643288
7795B119145p294996k0021413j1902609M597600R497823L757345K265346O835195
7787a0146564N566350k835214m522337N540822J3602634R121065M75086j677858
7779A5123984j803080o975664j0038173j878680Q800100O401229o006852j0651882
7771g029018l080078K119519l884709j0286040l969870J1507141K1360669J6134592
7763B2872206j421222j8951369k2259496q994069M691644J748693j1013025j0091224
$$ y = [11461355, 1443362, -2759515, -3335541, -4236956, -4308132, -1188940, 4109411, 9744165, 14718496, 15823929, 9078349, -2958139, -11645751, -14057965, -18209460, -30425406, -42110822, -37924188, -17210465, 1162765, 291912, -13575798, -19157515, -8524143, 2119145, -5175851, -25197264, -37099873, -32502273, -23004450, -19247105, -16981759, -10146564, -4580214, -7415428, -11937765, -6396943, 7205691, 16326756, 16801842, 15123984, 13320904, 6345240, -3692933, -5571613, 3228487, 9629716, 3622864, -7029018, -10109096, -7989577, -11874286, -22160326, -26130196, -14623055, 6737614, 22872206, 21450984, 2499615, -19759881, -28753950, -24062306, -22313613, -33326638, -43417862]
7755d3417862R489851K3491513J2485100r627421j6204419m995234L717879m32367
7747b5492960o878194n348674o12587q36326l644670j151865P622811J5284198
7739b1058267J4720052O745711l86973n2654M067899K727994m464610o988532
7731d689380N82095R690832J1165128P527115L508488m512861j7362101k2139173
7723a6229857q753209J0246183J3771180P75886j2012874j4951125j0014585K415056
7715c4753345J9512265K4839619O714177j5938850j4342951N229449R442902p698797
7707f995531j5535304j46934J2666507M565168m362516L549427Q688214p431860
7699e002829k1484130n509539K0841739J9218225m169589j0441879O941317J5988200
$$ y = [-43417862, -33928011, -10436498, 2048602, -7578819, -23783238, -28778472, -25060593, -25492960, -32371154, -37719828, -38332415, -39168741, -42813411, -43965276, -36342465, -21058267, -6338215, 407496, 20523, -32131, 4035768, 6763762, 2299152, -4689380, -4107285, 5583547, 16748675, 24275790, 27784278, 23271417, 5909316, -16229857, -24983066, -14736883, -965703, -189817, -12202691, -27153816, -37168401, -34753345, -15241080, 9598539, 16312716, 373866, -13969085, -8739636, 703266, -6995531, -22530835, -22677769, -10011262, -5446094, -9808610, -6259183, 2429031, -5002829, -26486959, -31996498, -11154759, 8063466, 3893877, -6548002, 393315, 16381515]
7691A6381515L034195r045866m588732L083870K659478K095405M542459n20658
7683A7641666j1156209q850748P664856J4431672J175469j1251605p197944m74101
7675A983056m101215m708724R299057J9058776L054181k3982060k9008294p615346
7667c6020569J2828214J2203577j660405r879462l945930R758345J7112567R781426
7659A0177763m129685r790792p366559r955704j6979149j0529254J2481127K7620254
7651h471999J8213589J378974j735528q49577j5104878l3693039k9974278n656103
7643g5892839J1921480J3440640J6139977K6612327K7411300J0478451m651878
7636B5459458j829306N343899k112650j4581356q095205J4948689K4011275L079173
$$ y = [16381515, 19415710, 10369844, 5781112, 8864982, 11524460, 13619865, 18162324, 17641666, 6485457, -2365291, 5299565, 19731237, 20906706, 9655101, 2457157, 1983056, -2118159, -6826883, 2472174, 21530950, 24585131, 603071, -28405223, -36020569, -23192355, -10988778, -12649183, -22528645, -26474575, -16716230, 396337, 10177763, 6048078, -3742714, -11109273, -21064977, -38044126, -48573380, -36092253, -8471999, 9741590, 11120564, 9385036, 8535459, -6569419, -40262458, -70236736, -75892839, -63971359, -50530719, -34390742, -7778415, 19632885, 30111336, 25459458, 23630152, 28974051, 26861401, 12280045, 4184840, 19133529, 43144804, 46223977]
7628D6223977k4416872k5484845j355070J5114063M293645j5258519j4971855
7621a5855476M265033J6509532P882072r008606j6984724j2751296r40346J2544066
7613a4339745J6444351J613396k0270699k4086452o651215N377787m160535j4518256
7605f0591368j839779K0133863K0312442q21722j2506849o83856J4388140J1577054
7597a0032075k897103r375826j626814R369281J0818175J754452o511414m433122
7589a2934446J463058k711446j3317977r571408J2497313K6355190J2010033j2039889
7581A750428j6481093m049547K738750K055672P464902J2044216l240618k6838638
7573b4555928k2852757J2422942L7774829K4767045m985731j7608729j2145033
$$ y = [46223977, 21807105, -3677740, -5032810, 10081253, 14374898, -883621, -15855476, -11590443, 4919089, 12801161, 3792555, -13192169, -25943465, -26883811, -14339745, 2104606, 3718002, -16552697, -40639149, -47290364, -41912577, -46073112, -60591368, -62431147, -42297284, -21984842, -22806564, -35313413, -35997269, -21609129, -10032075, -12929178, -22305004, -23931818, -14562537, -3744362, -1989910, -8501324, -12934446, -11471388, -14182834, -27500811, -37072219, -24574906, 1780284, 13790317, 1750428, -14730665, -18780212, -16041462, -13985790, -6520888, 5523328, 2282710, -24555928, -47408685, -34985743, 2789086, 27556131, 22570400, 4961671, -7183362]
7566g183362o757272n152053j201690J310119l054672o523028j070907N675131
7558b3957734M514701J872144N954128Q944108J442441p539712m838037K956926
7550a0651035O62966q162258o295711Q754582K0701022J7365397K108128j5235075
7542I248016k4970996j9148828j018496J1114377L948258j1085302j2523039J993017
7534d2442993J6968765K3320125K2885287J4198794m208298j8893774j4107784
7527b279878L8103j996715j8565968j7913013J0931330L4306320K1849098p225284
7519A9143993j4371574K86236M988739p610927j0231571R156103K3959993J1628175
$$ y = [-7183362, -13940634, -19092687, -20294377, -18984258, -22038930, -28561958, -29632865, -23957734, -19443033, -17570889, -11616761, -2672653, -1230212, -8769924, -13607961, -10651035, -9988069, -18150327, -24446038, -15691456, 5009566, 22374963, 24483091, 9248016, -15722980, -34871808, -35890304, -24775927, -20827669, -31912971, -44436010, -42442993, -25474228, -2154103, 20731184, 34929978, 30721680, 11827906, -2279878, -2241775, -4238490, -22804458, -40717471, -29786141, 4520179, 26369277, 19143993, 4772419, 5058655, 10047394, 2436467, -7795104, 1360999, 25320992, 36949167]
$$ [...]
##END NTUPLES=NMR SPECTRUM
##END=
