##TITLE=31Pdec_AT-44x_T4
 DMSO-d6+CD3ONa, 800 sc
 25.8.2022
##JCAMPDX= 6.0         $$ Bruker NMR JCAMP-DX V2.0
##DATA TYPE= NMR SPECTRUM
##DATA CLASS= NTUPLES
##ORIGIN= UXNMR, Bruker Analytische Messtechnik GmbH
##OWNER= root
$$ XWIN-NMR		Version 3.5
$$ Thu Aug 25 13:55:58 2022 Russian Standard Time (UT+4h)  she@DPX200
##.OBSERVE FREQUENCY= 81.013821
##.OBSERVE NUCLEUS= ^31P
##.ACQUISITION MODE= SIMULTANEOUS
##.ACQUISITION SCHEME= undefined
##.AVERAGES= 800
##.DIGITISER RES= 16
##SPECTROMETER/DATA SYSTEM= spect
##.PULSE SEQUENCE= zgpg30
##.SOLVENT NAME= DMSO
##.SHIFT REFERENCE= (INTERNAL, DMSO, 0, 248.564)
##AUDIT TRAIL= $$ (NUMBER, WHEN, WHO, WHERE, WHAT)
$$ ##TITLE= Audit trail, XWIN-NMR		Version 3.5
$$ ##JCAMPDX= 5.01
$$ ##ORIGIN= Bruker BioSpin GmbH
$$ ##OWNER= she
$$ F:/spectra/data/she/nmr/P31/1/pdata/1/auditp.txt
$$ ##AUDIT TRAIL=  $$ (NUMBER, WHEN, WHO, WHERE, WHAT)
(   1,<2022-08-25 13:54:11.43 +0400>,<she>,<DPX200>,
      <created by zg, POWCHK disabled, PULCHK disabled
       configuration hash MD5:
       00 E9 B6 7A A2 85 ED C7 34 08 36 98 17 FE 4E 26
       data hash MD5: 32K
       B4 DC 91 76 68 50 A3 D7 E4 FD 46 9E A0 F1 8F 17>)
(   2,<2022-08-25 13:54:27.21 +0400>,<she>,<DPX200>,
      <Start of raw data processing
       efp BC_mod = 2 LB = 1 FT_mod = 6 PKNL = 1 PHC0 = -10239.32 PHC1 = -16.34367 SI = 64K 
       data hash MD5: 64K
       E6 56 E8 A0 AC 10 9A 55 8F C2 F5 20 3C 8F 26 B2>)
(   3,<2022-08-25 13:54:53.26 +0400>,<she>,<DPX200>,
      <pk PHC0 = 65.64613 PHC1 = -140 
       data hash MD5: 64K
       E9 75 A4 E6 F5 F7 22 51 C3 62 78 47 28 C2 12 8E>)
(   4,<2022-08-25 13:55:18.96 +0400>,<she>,<DPX200>,
      <pk PHC0 = -86.70452 PHC1 = 193.4003 
       data hash MD5: 64K
       72 BA A8 EA C4 F6 45 BC DB C9 29 5E B3 A2 65 9F>)
$$ ##END=
$$ 
$$ hash MD5
$$ CE DE E0 FF 03 6B 88 45 C5 FD 50 5B 00 F8 81 2C
##$RELAX= 
##$RELAX= 
##$RELAX= 
##$RELAX= 
##$RELAX= 
##$RELAX= 
##$RELAX= 
##$RELAX= 
$$ Bruker specific parameters
$$ --------------------------
##$DU= <F:/spectra>
##$EXPNO= 1
##$NAME= <P31>
##$PROCNO= 1
##$TYPE= <nmr>
##$USER= <she>
##$AMP= (0..31)
100 100 100 100 100 100 100 100 100 100 100 100 100 100 100 100 100 100 
100 100 100 100 100 100 100 100 100 100 100 100 100 100 
##$AQSEQ= 0
##$AQ_mod= 1
##$AUNM= <au_zg>
##$AUTOPOS= <>
##$BF1= 81.014009
##$BF2= 200.13
##$BF3= 200.13
##$BF4= 200.13
##$BF5= 200.13
##$BF6= 200.13
##$BF7= 200.13
##$BF8= 200.13
##$BYTORDA= 1
##$CFDGTYP= 0
##$CFRGTYP= 5
##$CHEMSTR= <none>
##$CNST= (0..31)
1 1 145 1 1 1 1 1 1 1 1 1 1 1 1 1 1 1 1 1 1 1 1 1 1 1 1 1 1 1 1 1 
##$CPDPRG= <waltz16>
##$CPDPRG1= <>
##$CPDPRG2= <waltz16>
##$CPDPRG3= <>
##$CPDPRG4= <mlev>
##$CPDPRG5= <mlev>
##$CPDPRG6= <mlev>
##$CPDPRG7= <mlev>
##$CPDPRG8= <mlev>
##$CPDPRGB= <>
##$CPDPRGT= <>
##$D= (0..31)
0 1 0 0 0 0 0 0 0 0 0 0.03 2e-05 3e-06 0 0 0 0 0 0 0 0 0 0 0 0 0 0 0 0 
0 0 
##$DATE= 1661421250
##$DBL= (0..7)
120 120 120 11 120 120 24 19 
##$DBP= (0..7)
150 150 150 150 150 150 150 150 
##$DBP07= 0
##$DBPNAM0= <>
$$ [...]
##$SUBNAM2= <"">
##$SUBNAM3= <"">
##$SUBNAM4= <"">
##$SUBNAM5= <"">
##$SUBNAM6= <"">
##$SUBNAM7= <"">
##$SUBNAM8= <"">
##$SUBNAM9= <"">
##$SW= 501.771253377433
##$SWIBOX= (0..15)
0 1 3 0 0 0 0 0 0 0 0 0 0 0 0 0 
##$SW_h= 40650.406504065
##$TD= 32768
##$TD0= 1
##$TE= 0
##$TE2= 300
##$TE3= 300
##$TEG= 300
##$TL= (0..7)
0 120 53 12 22 120 120 120 
##$TP= (0..7)
150 150 150 150 150 150 150 150 
##$TP07= 0
##$TPNAME0= <>
##$TPNAME1= <>
##$TPNAME2= <>
##$TPNAME3= <>
##$TPNAME4= <>
##$TPNAME5= <>
##$TPNAME6= <>
##$TPNAME7= <>
##$TPOAL= (0..7)
0.5 0.5 0.5 0.5 0.5 0.5 0.5 0.5 
##$TPOFFS= (0..7)
0 0 0 0 0 0 0 0 
##$TUNHIN= 0
##$TUNHOUT= 0
##$TUNXOUT= 0
##$USERA1= <user>
##$USERA2= <user>
##$USERA3= <user>
##$USERA4= <user>
##$USERA5= <user>
##$V9= 5
##$VALIST= <valist>
##$VCLIST= <CCCCCCCCCCCCCCC>
##$VD= 0
##$VDLIST= <DDDDDDDDDDDDDDD>
##$VPLIST= <PPPPPPPPPPPPPPP>
##$VTLIST= <TTTTTTTTTTTTTTT>
##$WBST= 1024
##$WBSW= 4
##$XGAIN= (0..3)
0 0 0 0 
##$XL= 0
##$YL= 0
##$YMAX_a= 150333
##$YMIN_a= -78160
##$ZGOPTNS= <>
##$ZL1= 120
##$ZL2= 120
##$ZL3= 120
##$ZL4= 120
##$ABSF1= 0
##$ABSF2= 0
##$ABSG= 0
##$ABSL= 0
##$ALPHA= 0
##$AQORDER= 0
##$ASSFAC= 0
##$ASSFACI= 0
##$ASSFACX= 0
##$ASSWID= 0
##$AUNMP= <proc_1d>
##$AZFE= 0.1
##$AZFW= 0.5
##$BCFW= 0
##$BC_mod= 2
##$BYTORDP= 0
##$COROFFS= 0
##$CY= -3
##$DATMOD= 1
##$DC= 0
##$DFILT= <>
##$DTYPP= 0
##$F1P= 0
##$F2P= 0
##$FCOR= 1
##$FTSIZE= 65536
##$FT_mod= 6
##$GAMMA= 0
##$GB= 0
##$INTBC= 1
##$INTSCL= 5.30512e-09
##$ISEN= 30
##$LB= 1
##$LEV0= 0
##$LPBIN= 0
##$MAXI= 10000
##$MC2= 0
##$MEAN= 0
##$ME_mod= 0
##$MI= 50
##$NCOEF= 0
##$NC_proc= -5
##$NLEV= 6
##$NOISF1= 182.463
##$NOISF2= 159.3651
##$NSP= 0
##$NTH_PI= 0
##$NZP= 0
##$OFFSET= 248.5645
##$PC= 4
##$PHC0= -10260.37
##$PHC1= 37.05659
##$PH_mod= 1
##$PKNL= yes
##$PPARMOD= 0
##$PSCAL= 0
##$PSIGN= 0
##$REVERSE= no
##$SF= 81.0140089999908
##$SI= 65536
##$SIGF1= 159.3651
##$SIGF2= -187.1042
##$SINO= 113.3802
##$SIOLD= 16384
##$SREGLST= <1H.CDCl3>
##$SSB= 0
##$STSI= 65536
##$STSR= 0
##$SW_p= 40650.406504065
##$SYMM= 0
##$S_DEV= 0
##$TDeff= 32768
##$TDoff= 0
##$TI= <>
##$TILT= no
##$TM1= 0
##$TM2= 0
##$TOPLEV= 0
##$USERP1= <user>
##$USERP2= <user>
##$USERP3= <user>
##$USERP4= <user>
##$USERP5= <user>
##$WDW= 1
##$XDIM= 65536
##$YMAX_p= 404403558
##$YMIN_p= -16785316
$$ End of Bruker specific parameters
$$ ---------------------------------
##NTUPLES= NMR SPECTRUM
##VAR_NAME=  FREQUENCY,     SPECTRUM/REAL,   SPECTRUM/IMAG
##SYMBOL=    X,             R,               I
##VAR_TYPE=  INDEPENDENT,   DEPENDENT,       DEPENDENT
##VAR_FORM=  AFFN,          ASDF,            ASDF
##VAR_DIM=   65536,         65536,           65536
##UNITS=     HZ,            ARBITRARY UNITS, ARBITRARY UNITS
##FACTOR=    0.620285442955139, 1,           1
##FIRST=     20137.2065510736, 0,            0
##LAST=      -20513.1999529914, 0,           0
##MIN=       -20513.1999529914, -16785316,   0
##MAX=       20137.2065510736, 404403558,    0
$$ Real data points
##PAGE= N=1
##DATA TABLE= (X++(R..R)), XYDATA
$$ [...]
39594 -3816629 -1356862 1163735 2245302 2042405 968787 -862194 -2598908 -2845858
39586 -2845858 -1517859 -263113 -448907 -1612794 -2405073 -2427531 -2677316 -4352978 -7272208
39577 -7272208 -9520217 -9233967 -6905719 -4969901 -4637494 -4417658 -2768386 -838735 -895131
39568 -895131 -2949303 -4876129 -5361024 -4772762 -3422126 -1121218 1339052 2312027 1459270
39559 1459270 122266 -950844 -2477352 -4531718 -5461970 -4284497 -2783588 -3534824
39551 -3534824 -6424030 -8497643 -7101631 -2411587 2673037 4443791 1078597 -5200454
39543 -5200454 -9109338 -7097471 -1396681 2150994 857269 -1668337 -348665 4535244
39535 4535244 7473173 4760832 -778148 -3486341 -1870640 262028 -597241 -3259639
39527 -3259639 -4068547 -1884288 949472 2037486 1447955 380781 -1145410 -3868880
39519 -3868880 -6939028 -7641008 -4543629 -292542 339486 -4174062 -9757129 -10860942
39511 -10860942 -6406746 -418263 2896046 3093654 2288313 1697594 711348 -1222975 -3106061
39502 -3106061 -3219829 -1170076 1305428 2002725 753702 -488276 -479805 -546176 -2524290
39493 -2524290 -5805512 -8090496 -8534700 -8271024 -8127537 -7939209 -8036995 -8986486 -9533679
39484 -9533679 -7499720 -3613338 -1728165 -3700264 -6525052 -6510550 -4017925 -1649947
39476 -1649947 193987 2743841 5039314 4332856 582917 -2433212 -1695575 1168281
39468 1168281 1879197 -1379741 -5824146 -7098499 -4172381 -642558 -399663 -2557172
39460 -2557172 -2615311 1031563 4260158 2477052 -3318414 -7995563 -8507353 -6263131 -4081367
39451 -4081367 -3159181 -2941695 -2210645 -364253 1270054 224255 -3634702 -6695885 -5752063
39442 -5752063 -2475716 -1224829 -3144059 -5391578 -6007278 -6216467 -7042065 -6669453 -3191488
39433 -3191488 1758818 4270297 2606033 -1048015 -3375339 -3547328 -3450050 -4571899 -5829194
39424 -5829194 -5453103 -4010835 -3431766 -3447566 -2033062 149028 -422534 -3996006 -5341196
39415 -5341196 -1275186 3091738 788499 -6352594 -9391895 -4477575 2316011 3646308
39407 3646308 -427943 -4697923 -5975047 -5110910 -4024457 -3326809 -2297742 -175877
39399 -175877 2148078 2267867 -522482 -3244285 -2888794 -999053 -1385100 -4106269 -5715548
39390 -5715548 -5160924 -4821959 -5239109 -3823548 -244780 1838013 734835 -113716 2186694
39381 2186694 5214979 5392717 3258600 1113652 -1175136 -4157676 -5710423 -4290897
39373 -4290897 -2702668 -4020533 -5923922 -4169744 -247007 53928 -4420060 -8108744
39365 -8108744 -6712736 -2533283 96970 728363 1334566 1821118 500086 -2032842 -2666040
39356 -2666040 113318 3846012 4871352 2472462 -899973 -3037255 -3965348 -4208595
39348 -4208595 -3135395 -790488 213474 -2508101 -6933189 -8358737 -5615748 -2526159
39340 -2526159 -2359824 -3873097 -4190064 -2774420 -810642 876274 1514097 292344 -1790267
39331 -1790267 -2336967 -1274394 -1395007 -3592866 -4923124 -3640682 -2462834 -3653847
39323 -3653847 -4528829 -2071122 1049241 70636 -4376679 -7606763 -8302777 -9168717 -10728552
39314 -10728552 -10075145 -6510933 -3495159 -3456210 -4619914 -4671911 -4269588 -5030754 -6500498
39305 -6500498 -6968126 -5881041 -4300135 -3722076 -4565537 -5216349 -3599308 -683519 -303374
39296 -303374 -3459453 -5511546 -2527894 2097102 2194956 -1689463 -3116474 337694 4023117
39287 4023117 3991775 2102906 1359483 1142445 -241781 -2266177 -4040694 -6049854 -7746952
39278 -7746952 -6829926 -3373947 -1454881 -3946721 -8440867 -10857779 -10467426 -8830882
39270 -8830882 -6504545 -3784430 -2490084 -3798731 -5681818 -5216495 -2469951 35778
39262 35778 740569 141969 -604240 -786782 -631111 -1265844 -2943585 -3409960 -389181
39253 -389181 4321470 6435611 5190950 3890412 3687911 1694991 -2757571 -5221932
39245 -5221932 -3012750 -345689 -2133781 -6465719 -8185764 -6767281 -5309406 -4319630
39237 -4319630 -2243358 -355117 -1201797 -3202231 -2611965 -359364 -1061908 -5116635 -7632186
39228 -7632186 -6105878 -3559891 -2583269 -1628343 641831 2236385 1686034 732077 543246
39219 543246 -562591 -2702431 -2121479 2697261 6438370 3523537 -3304167 -6473221
39211 -6473221 -4318036 -2519262 -4650550 -7057120 -5324078 -1262304 134860 -1979436
39203 -1979436 -3859991 -2980132 -782440 437025 329885 -774141 -3359533 -7093272
39195 -7093272 -9419611 -8177550 -4977595 -3700759 -5665124 -8357374 -9167364 -8118019
39187 -8118019 -6197939 -3456523 -354251 1097722 -134178 -1766602 -879927 1774176
39179 1774176 2652593 430479 -2305238 -2760676 -1212412 190121 145012 -1346634 -3905974
39170 -3905974 -6735706 -8164168 -6557534 -2163997 2360304 3967908 2261811 183319
39162 183319 780183 3433497 4609825 2504173 -822658 -2566534 -2383788 -1259549 519620
39153 519620 2109108 920142 -4134512 -9353029 -9719331 -5538740 -2359151 -3813762
39145 -3813762 -7479577 -8744245 -6205431 -2027791 894556 748134 -2498488 -6730928
39137 -6730928 -9058709 -8505199 -6522572 -4596839 -2809895 -1246877 -1077390 -3093147
39129 -3093147 -6254761 -8686899 -9499190 -9146995 -8594879 -8248713 -7201606 -4144975 -23665
39120 -23665 1430932 -2051046 -7393030 -9396964 -7493568 -5939238 -7093152 -8415435
39112 -8415435 -7444961 -5810635 -5735210 -5754793 -3278919 615922 2335176 671707 -2256420
39103 -2256420 -4252449 -4760084 -3927935 -2294645 -1146665 -1270639 -1602330 -716784 803313
39094 803313 1123786 -122160 -1429464 -1456860 -184196 1612247 2981163 3347756 3148166
39085 3148166 3076296 2360514 -368408 -3705095 -3630287 1013110 5753982 5906099 2502833
39076 2502833 -263492 -1153024 -1385206 -172216 3849972 7543459 5644979 -951651
39068 -951651 -4998694 -2893690 490979 -133321 -2660115 -2131117 885554 1820120 -186534
39059 -186534 -1502620 -318898 1080019 832009 264485 895393 1639488 577898 -2259680
39050 -2259680 -4998005 -5694431 -3664073 -222919 1832895 761570 -2212193 -4729514
39042 -4729514 -6405530 -8306013 -10012137 -9758711 -7414497 -4630136 -1763990 2360033
39034 2360033 6850723 8181853 5044049 1008866 8321 1364220 1867307 847530
39026 847530 137007 339185 403432 237302 569983 490965 -1722617 -5211613 -7036733
39017 -7036733 -6413777 -5301437 -4233808 -1262241 3460865 5813374 3196714 -1014190
39009 -1014190 -1891700 257935 1230841 -333242 -1706222 -1384878 -1610292 -4486859 -8624861
39000 -8624861 -11147990 -10984976 -9024962 -6822009 -6072405 -7488421 -9199540 -8215753 -4610098
38991 -4610098 -2150528 -3236982 -5335339 -4626413 -1410380 904378 1055767 967833 1721536
38982 1721536 1673384 -519175 -3474342 -4987631 -4557810 -2822215 -235292 2148905 2192340
38973 2192340 -835570 -4164278 -4306153 -1739222 -415558 -2224588 -4473456 -4168734
38965 -4168734 -2505151 -2751526 -5087792 -6449425 -5172811 -2899699 -1413274 -399753
38957 -399753 471200 -61938 -2340483 -3835099 -2374484 91819 -160423 -3366441 -6375514
38948 -6375514 -7635583 -8759298 -10687724 -11590953 -10005545 -7487387 -6356771 -6585391
38940 -6585391 -6468312 -4937632 -2017669 1455152 3494487 2208618 -1329034 -3448819
38932 -3448819 -2658186 -1894799 -4081627 -7712099 -9453244 -9031685 -8247137 -6830226 -3322207
38923 -3322207 695311 1602288 -687971 -2178430 -814171 690867 -312200 -2194012
38915 -2194012 -2092429 -491061 96028 -786084 -1700983 -2597731 -5037914 -9107805 -12278859
38906 -12278859 -12004371 -8437062 -4286012 -2465737 -3658318 -5742164 -6010010 -4159355
38898 -4159355 -2274948 -1711250 -1534365 -825749 -715196 -2426217 -4641550 -5014854 -3673218
38889 -3673218 -2977817 -3879129 -4657084 -3741960 -1936540 -950090 -1081883 -1426772 -1563661
38880 -1563661 -2028560 -3387556 -5420961 -7125173 -7441698 -6351751 -5182346 -5171646 -5753363
38871 -5753363 -5239841 -3529393 -2996662 -5630989 -9785314 -11041021 -6771609 622446
38863 622446 5529456 4337431 -1154556 -5588801 -5294611 -1415931 2244095 3640596
38855 3640596 3699971 3621994 2979922 1450136 711188 2408416 4644251 2964479 -4116172
38846 -4116172 -12144776 -14833990 -10584791 -3764519 111681 -685201 -3740096 -5693389
38838 -5693389 -5301948 -3978982 -3706078 -4377894 -3730070 -461658 3406849 4641311 2756030
38829 2756030 123030 -1641067 -3088662 -4328512 -3739405 -924750 1295483 229419
38821 229419 -2757992 -4098218 -2818504 -998145 -150100 152305 337533 290188 792252
38812 792252 2711274 4422425 3007148 -1208887 -4386739 -4710792 -4985498 -7612796 -10062825
38803 -10062825 -8602109 -4452087 -2425317 -4203243 -6507673 -6063340 -3382926 -1040562
38795 -1040562 -604650 -2000909 -3952092 -4457478 -2653086 -611299 -1223734 -3716294 -3746635
38786 -3746635 642849 5457639 5356482 337757 -4662284 -6030091 -4649149 -2902773
38778 -2902773 -1382152 234935 1201782 601992 -775828 -1366319 -1250286 -1891827 -3507670
38769 -3507670 -4580407 -4474336 -4593927 -5735581 -6036581 -3573686 93430 1449710 -224440
38760 -224440 -2220338 -2830615 -3661178 -6270312 -8926752 -8806024 -5877726 -2479742 -116953
38751 -116953 1180551 1190875 -380097 -2392452 -3155552 -2901882 -3399158 -5045346 -6420296
38742 -6420296 -6847309 -7021763 -6619522 -4008736 359444 2872968 1234599 -1907794 -2358097
38733 -2358097 -77944 1335241 154665 -1643305 -2230449 -2418899 -3031609 -2518457 487979
38724 487979 3869870 3987501 562753 -2722209 -2780489 -330862 2098426 3549758 4607741
38715 4607741 5146114 4019424 1030529 -2244888 -4209291 -4997638 -5766706 -6677520 -6517698
38706 -6517698 -4590029 -2262909 -1699055 -3001076 -3728864 -2068217 479663 1131333 27086
38697 27086 134342 2559108 4514485 3396954 467369 -1856021 -4170329 -8074774 -11357971
38688 -11357971 -9687153 -3432649 1458853 901284 -2622855 -4672328 -4640049 -4232952 -3320739
38679 -3320739 -1023812 1069268 736094 -790997 -254728 2458949 3994763 2499321
38671 2499321 -155760 -1584348 -1632261 -1290414 -1161639 -1610089 -2503818 -2600341 -1247163
38662 -1247163 -591665 -3410333 -8453294 -10946172 -8628915 -4456505 -2118339 -1761035
38654 -1761035 -1800055 -2113477 -3058608 -3585306 -2979068 -2764589 -4238000 -5622982 -4593405
38645 -4593405 -2435221 -2348762 -4100825 -4013337 -853288 1725156 292942 -3543765 -5876099
38636 -5876099 -6129601 -6839075 -8492517 -8207883 -4656645 -1209239 -1523783 -3908668 -3673482
38627 -3673482 -535653 562384 -2813679 -6314160 -5288531 -2093526 -2394309 -6189606
38619 -6189606 -7918881 -5195237 -1922307 -1499517 -2060073 -954885 472358 61049 -727020
38610 -727020 342231 1443375 -801816 -5221250 -6876705 -3858703 449626 2410687
38602 2410687 2213291 1889979 1912916 1426136 360691 -325302 -180930 -111711 -1362714
38593 -1362714 -3630653 -4739143 -3233992 -1021069 -1521241 -4798247 -6877764 -5105585
38585 -5105585 -1741513 -358355 -1041137 -1636667 -1561555 -1290395 49377 2942200 4748271
38576 4748271 2722736 -1032553 -1828453 720591 2453723 1475865 467771 1140004 1195994
38567 1195994 -988528 -2961684 -2517511 -1908848 -4098316 -7315131 -7282965 -3588663 -281104
38558 -281104 -520438 -3418439 -6113944 -6780934 -5478252 -3598986 -2567662 -2299644 -1557976
38549 -1557976 -378442 -585592 -2735832 -4444703 -3702575 -2142902 -2509602 -4271959 -4779836
38540 -4779836 -3903261 -4043058 -5523663 -5517577 -2559989 898796 2047638 1402832 1048964
38531 1048964 1104527 153071 -1991265 -4119961 -5591750 -6483583 -6131312 -3542336 487201
38522 487201 3355590 3396137 1499049 -515821 -2051726 -3570188 -5208204 -6498518 -7008208
38513 -7008208 -6553066 -5174451 -3490813 -2598380 -2944405 -3681326 -3728917 -2973392 -1813283
38504 -1813283 -328973 1098223 1217898 -502517 -2266217 -1703915 955187 3266102
38496 3266102 3982134 4029236 4048983 3438042 2366329 2152427 2615714 1631473 -1298740
38487 -1298740 -3585074 -3322238 -1944896 -1208669 -385289 1033483 912184 -1782310 -3618008
38478 -3618008 -1441570 1736744 671995 -3788007 -5962825 -4340194 -3185080 -4564352
38470 -4564352 -5065642 -2511551 -177006 -1166531 -3415721 -3888476 -3550445 -4141166 -3687661
38461 -3687661 32576 4193473 4098831 283457 -2198926 -1067260 773653 290077 -1812386
38452 -1812386 -3169969 -3142275 -2992125 -3995914 -5894051 -6673090 -4380292 213450 3823153
38443 3823153 4350225 2966950 1569219 126519 -1827491 -3045871 -2132059 111057
38435 111057 1856578 2485896 2020159 88935 -2639134 -3911220 -2904697 -1850065 -2532500
38426 -2532500 -3550451 -3559775 -4426584 -7739730 -10846726 -10520067 -8349250 -7875859 -8238495
38417 -8238495 -5822060 -950873 2535756 3702833 4885646 5857123 3597439 -1462201
38409 -1462201 -4811484 -4788276 -4634391 -6110321 -6686525 -5182540 -4537369 -6099798 -6513129
38400 -6513129 -3769168 -1444220 -2943883 -5942641 -6767816 -6219294 -6480309 -6093448 -3169807
38391 -3169807 -414245 -1491002 -4839967 -6503336 -6886471 -8911077 -11155357 -9237015
38383 -9237015 -3579832 326562 -136546 -2029570 -2768825 -3270292 -3976049 -3112450 -902694
38374 -902694 -585464 -2680839 -2796604 1577157 5997217 4785342 -915081 -4915096 -4160753
38365 -4160753 -1232162 567082 960684 1202132 1583839 1494852 623757 -667979 -1816050
38356 -1816050 -2850487 -4627097 -7458155 -9566974 -8497574 -4586594 -1185558 -388309
38348 -388309 -478109 789965 2324523 1563912 -1074069 -2529398 -1665346 -866352 -2579458
38339 -2579458 -6262640 -9482635 -10559563 -9469930 -7341901 -5694766 -5276343 -5238650 -4280805
38330 -4280805 -2747037 -2464486 -4143267 -6116983 -6347603 -4769006 -2893724 -1836511
38322 -1836511 -1593880 -1843252 -2549821 -3688829 -4808831 -5154517 -4437467 -3546348 -3938695
38313 -3938695 -5765564 -7179481 -6488418 -4494592 -3285124 -3038463 -2003931 153788
38305 153788 1394627 786959 605121 2851567 5379215 4236524 -718628 -5148813 -5355033
38296 -5355033 -2072189 1108861 1381492 -1492255 -5412699 -7532665 -6842271 -5214217
38288 -5214217 -4672417 -4257755 -1772432 1770034 2528876 -670465 -4325624 -5198245 -4376529
38279 -4376529 -4309812 -4498593 -3199391 -1597664 -2673210 -6361509 -8968524 -7775491 -4015273
38270 -4015273 -927271 -622789 -3089329 -6663509 -9131916 -9537688 -9020082 -9033476 -9224415
38261 -9224415 -8227415 -5957944 -3725499 -2564258 -2702493 -3913314 -5022762 -4178625 -1389814
38252 -1389814 415693 -932413 -3366793 -3506759 -1907641 -1970881 -4268290 -5889570 -5561522
38243 -5561522 -5299909 -6058889 -5807140 -3690094 -2477241 -4448492 -7633412 -8581100 -6693479
38234 -6693479 -3715707 -1043865 415909 -221833 -2317840 -3540499 -2975382 -2366251 -2631965
38225 -2631965 -1865179 892003 2756773 1077911 -2005496 -2725375 -1465205 -1357878 -2548430
38216 -2548430 -2330517 -428183 460180 -217318 422700 3506531 5667319 3701653 -620041
38207 -620041 -2801822 -1307475 999466 631015 -2567714 -5354518 -4795942 -1925094 -811658
38198 -811658 -3401981 -6709572 -6632486 -3194249 177698 1471116 1478530 1052937 66975
38189 66975 -880130 -724053 -327579 -1760731 -4574865 -5725684 -4261026 -3224191 -5298051
38180 -5298051 -9027079 -11272749 -11344355 -10508801 -8977573 -5866047 -1580363 1759959 2416404
38171 2416404 593695 -1976354 -3554449 -3897607 -4373712 -5862260 -6788192 -4773409 -403150
38162 -403150 2549629 1471478 -2082301 -4571937 -4190108 -1591093 1444334 2971114
38154 2971114 2004609 -103342 -678837 893135 2231863 1330643 -946637 -2945148 -4639585
38145 -4639585 -6104170 -5713584 -2597496 628947 715682 -1461385 -2186969 -612805 266059
38136 266059 -1195292 -2555128 -1246454 1499807 2804288 2227917 1329757 410177 -1679135
38127 -1679135 -4731131 -6529444 -5635642 -3381020 -2333102 -3578971 -5971760 -7395231
38119 -7395231 -6500585 -3951728 -2242937 -3381648 -6276801 -7450272 -5170576 -1858516
38111 -1858516 -1083987 -2960698 -4264503 -2799244 294758 2653824 3012646 964660
38103 964660 -3230220 -7406487 -8287828 -5373132 -2309617 -2406999 -4382586 -4827750 -3324327
38094 -3324327 -2236291 -2540987 -3110646 -3573918 -4560615 -5286428 -4299610 -2683578 -2893451
38085 -2893451 -4152319 -3195896 -461537 -684977 -5137445 -8154771 -5222789 -541389
38077 -541389 -1515853 -8148260 -13217845 -12029686 -7086115 -3193421 -2388061 -4203662 -6960936
38068 -6960936 -7858230 -5225751 -1618079 -1392871 -4359695 -5521260 -2614804 -13858
38060 -13858 -2429940 -7948812 -10887731 -9459531 -6724773 -5018148 -3498303 -1498555
38052 -1498555 -671575 -2243381 -4508517 -4986819 -3857802 -3506096 -5072994 -6885601 -6581326
38043 -6581326 -4020693 -1529780 -1255335 -2625050 -2965152 -836746 1902305 2176698 -481016
38034 -481016 -3323042 -3782879 -2248632 -726976 61688 734904 974661 -721304 -4411367
38025 -4411367 -7550363 -7815635 -6051727 -4835524 -4784516 -4210810 -2338298 -669056 -374392
38016 -374392 -318762 762767 1604225 138082 -2697367 -3333177 -291232 3475061 4221309
38007 4221309 2017791 -3012 -318555 -773613 -3131665 -5749799 -5444061 -2005898 1107525
37998 1107525 983950 -1457297 -3342004 -3645062 -3524102 -3658335 -3371576 -2637108 -3053524
37989 -3053524 -5746033 -9335132 -11062450 -9504803 -5612259 -1649719 325702 -392622
37981 -392622 -2696215 -4567974 -4952689 -4502706 -4286533 -4363808 -4020085 -2787105 -776144
37972 -776144 1370479 2440053 1452677 -730477 -1489874 622318 3495472 3447316 -255110
37963 -255110 -4138521 -4468293 -1597360 706813 50776 -1847085 -2023186 -742482 -1046495
37954 -1046495 -3725186 -5345140 -3128283 218678 -318013 -4781119 -7770070 -5918013
37946 -5918013 -2402876 -2103114 -4947515 -6793991 -5404202 -2774947 -1959754 -3686164
37938 -3686164 -6136020 -6726470 -4247506 -195912 2329151 1656548 -1165285 -4251994
37930 -4251994 -6452569 -6559401 -3461820 1234127 3106315 -38631 -4789293 -6457269
37922 -6457269 -5073084 -3970998 -4054449 -3480127 -2197944 -2295154 -3557680 -3039136 -124804
37913 -124804 1932327 1048240 -802986 -1574314 -2365196 -4184293 -4940061 -2978000 -891439
37904 -891439 -1982994 -4837404 -5484856 -3798009 -3403958 -5436299 -6741895 -5228502 -3037461
37895 -3037461 -2512395 -2356255 -567188 1249773 34632 -3328696 -4425158 -1460167
37887 -1460167 2195304 2929641 1677481 1532616 2552072 2187528 283316 -6629 2672493
37878 2672493 4989984 3426111 -443543 -2012982 27259 2365557 1976918 -336051
37870 -336051 -1950579 -1816385 -786492 7047 132984 47827 669209 1926064 2040102
37861 2040102 -118301 -2209104 -491876 4631937 7897724 5655233 650514 -2062885
37853 -2062885 -2005509 -2788203 -5712268 -7662263 -6020430 -2422409 54358 1017232 1835605
37844 1835605 2257335 739391 -2320457 -4378671 -4246234 -3574528 -3943406 -4484227 -3803459
37835 -3803459 -2487993 -1799359 -1372704 -549509 -678937 -3055178 -5452005 -4546226 -1722756
37826 -1722756 -1969345 -5899105 -7754310 -3912091 1363698 2650397 1617524 3139985
37818 3139985 6352804 6225048 2537064 223736 749169 228741 -2491778 -2986798 466346
37809 466346 2185387 -2641505 -9824828 -11693232 -7495954 -2987683 -1769938 -2240985
37801 -2240985 -2147121 -1407232 -402097 801226 1217927 -275900 -2926200 -5081867 -6608129
37792 -6608129 -8078957 -8601639 -7179479 -5305788 -5169599 -5993777 -5360588 -3616240 -3402592
37783 -3402592 -4931624 -5507598 -4244285 -3459631 -4216206 -4148074 -1711527 561137 -246542
37774 -246542 -2756809 -3362356 -1721243 -1084464 -3241650 -5842968 -5724463 -3139361 -1121575
37765 -1121575 -1281997 -1940391 -950141 994389 1387855 -318928 -2009085 -2282854 -2396126
37756 -2396126 -3625045 -4624012 -3370251 -533154 1131914 23694 -3391489 -7938402
37748 -7938402 -11932321 -12865148 -9435607 -3778413 484995 2295589 3190948 3706822 2555440
37739 2555440 -241632 -2260168 -1955775 -869493 -1122012 -2395983 -2927288 -2233293 -1313097
37730 -1313097 -942812 -1186343 -2143368 -3875953 -5644531 -6337417 -6040526 -6312505 -7949626
37721 -7949626 -8867125 -5933555 204421 3976548 966835 -5914877 -9654315 -8281406
37713 -8281406 -6557877 -7570511 -7774310 -3626353 1400039 1458690 -2942465 -6286445 -6269395
37704 -6269395 -5161232 -4184051 -2419584 -986297 -2365908 -5122167 -5036380 -2285638 -1552900
37695 -1552900 -3769058 -4207003 -1046022 860325 -1636999 -4249473 -2838770 -1022213
37687 -1022213 -3922681 -8771571 -9013339 -5084163 -3520734 -6187414 -7659483 -4277929
37679 -4277929 357964 1147501 -1745293 -4361046 -4224530 -2120804 -546275 -1647192
37671 -1647192 -5162575 -7918248 -7014505 -3578613 -1365619 -1643699 -1845478 269003 3365612
37662 3365612 4279764 1402726 -4170558 -9427609 -11158560 -8481631 -4021569 -1361564
37654 -1361564 -1365392 -2250966 -2720657 -3057037 -3367132 -2997108 -2014800 -1346112 -1063337 -327131
37644 -327131 622870 278683 -1768483 -3969901 -5027071 -5482009 -6372160 -7574128 -8243461
37635 -8243461 -7924172 -6640354 -4706134 -2821119 -1602295 -859012 -107034 249867 -765555
37626 -765555 -3186447 -5838564 -7568914 -7882271 -6681846 -4592262 -3312208 -4132509 -5908190
37617 -5908190 -5936077 -3399226 -766374 -881957 -3317404 -4718100 -3026129 -512005 -1274521
37608 -1274521 -5514849 -8294906 -5849657 -1339478 -809260 -4242757 -5518804 -2155155
37600 -2155155 461757 -2417911 -7341408 -8390326 -6330581 -5901352 -6779146 -4383737
37592 -4383737 1223221 4442685 2931629 835608 1469226 2526235 1091599 -1538947
37584 -1538947 -3011028 -3819734 -5104915 -5892165 -5203852 -3982048 -2769026 -637233 1607134
37575 1607134 847956 -3300647 -6709299 -6852256 -6746609 -9227905 -11282325 -8841224 -4129226
37566 -4129226 -2738147 -5115846 -6399753 -4126018 -1177653 -839508 -3001412 -5715517
37558 -5715517 -7154833 -5829331 -2031852 896133 -37960 -2821886 -2665123 863058
37550 863058 2772973 -159172 -4798455 -6272241 -4340657 -2627521 -3287268 -4990766
37542 -4990766 -5494285 -4137884 -1757939 540132 2069749 2502585 1575287 -773134 -3846041
37533 -3846041 -6297674 -7271246 -7058351 -6363385 -5648394 -5524221 -6562692 -7906067 -7367785
37524 -7367785 -4167157 -470446 1137023 673330 -128404 -543181 -978528 -1430361 -1733670
37515 -1733670 -2551380 -4244211 -5519627 -5049967 -3570306 -2449439 -1315908 467295
37507 467295 1070975 -1885309 -7002546 -9894159 -8666845 -5816268 -4218074 -4068304 -4593288
37498 -4593288 -5904674 -7579045 -7623337 -4832939 -992455 878097 -70474 -1850244 -2069580
37489 -2069580 -521086 623278 -647137 -3541798 -5449804 -5722763 -6324609 -7653644
37481 -7653644 -6751140 -2370161 1201097 -191386 -3206779 -1056485 5708887 8817047
37473 8817047 3833451 -3943916 -7556650 -6798709 -5159427 -3424323 -933840 620918
37465 620918 -238858 -1069488 687360 2309067 -568617 -6313929 -8841539 -6466505 -3758770
37456 -3758770 -3918926 -4681602 -3730103 -3314829 -6074113 -9650365 -9619755 -6219238 -4157211
37447 -4157211 -5733029 -7530427 -5340583 -215659 2614234 371814 -3808425 -4871656
37439 -4871656 -1865777 1650416 2573291 1501406 714146 1082290 2197815 3783380 5171534
37430 5171534 4632231 1357910 -2438563 -3439387 -1137538 1886930 3533231 4130695
37422 4130695 4454300 3723941 910025 -2897518 -4915611 -3736219 -1325681 -1310899 -5057890
37413 -5057890 -9923578 -12039901 -10418065 -7165486 -4009081 -689010 2628842 3806095
37405 3806095 1552722 -1826550 -2917310 -1627021 -830125 -2040430 -3831303 -4608061
37397 -4608061 -4599113 -4442551 -3747344 -2127737 -414700 154460 -705062 -2247880 -3363221
37388 -3363221 -3184304 -1813731 -530298 -518600 -1472622 -2264983 -2652756 -3166751 -3664195
37379 -3664195 -3521423 -3168356 -3721698 -4887871 -5005695 -3715073 -2878558 -3962350 -5892481
37370 -5892481 -6490682 -4966929 -2203522 367053 1480535 819428 -226952 120523 1249459
37361 1249459 360486 -3414101 -6935207 -6928363 -4383879 -2756011 -2908457 -2704495 -1246731
37352 -1246731 -457641 -1850621 -4358537 -6388772 -7711913 -8039405 -6082177 -2067797
37344 -2067797 627441 -1004145 -5257640 -7327004 -5031376 -860964 1533934 747117
37336 747117 -2567420 -6886748 -9964221 -9717360 -6268242 -2074169 642110 1566879 1328216
37327 1328216 650596 796502 2553867 4023146 2121948 -2355351 -4338086 -1528846
37319 -1528846 1374513 -792318 -5641108 -6762195 -3711895 -2502219 -5930960 -9530267
37311 -9530267 -9132079 -6987754 -6916477 -7653271 -5388393 -258972 3992324 5408996 5191304
37302 5191304 4555326 3444630 1954706 478703 -1162193 -2760189 -2839301 -844108 936823
37293 936823 15549 -2803148 -5006846 -6183750 -7378856 -7857782 -6018481 -2946418 -1415943
37284 -1415943 -1455921 -630080 1002701 291998 -3423596 -6046771 -4319986 -666472 358544
37275 358544 -1641191 -3209592 -2620352 -2155195 -4416254 -8352363 -10206019 -8045506 -4350200
37266 -4350200 -3161720 -4800811 -5176263 -1530085 3039203 3476957 111031 -1586224
37258 -1586224 1079472 4122598 2670416 -2424751 -6453955 -7272958 -6711788 -6455864 -5740941
37249 -5740941 -3721323 -1735147 -1661487 -3026087 -3348869 -1516927 404485 -297276 -3236962
37240 -3236962 -5218292 -4400275 -2470594 -1868258 -2583233 -3133941 -3143417 -3061934 -2654282 -1867531
37230 -1867531 -1951336 -3357285 -3856236 -1646182 888470 88722 -3124430 -4473188 -3223795
37221 -3223795 -3151758 -5738009 -7237923 -4679423 -559244 1393434 1766696 3469434 6710244
37212 6710244 9341707 10538270 11116027 11395509 11390315 12192216 14806800 18147850 19915020
37203 19915020 18999953 16122962 13132729 12228186 14125582 16387431 15804755 13005944
37195 13005944 11650701 12146107 10283774 4369170 -612278 276449 4504666 5941013
37187 5941013 3664188 2058462 3615059 6375347 7854620 7301121 4503323 213314
37179 213314 -2667986 -2023108 -139743 -715752 -2922769 -2620051 856820 3648763 3438683
37170 3438683 2106224 1438218 474220 -1356632 -2230722 -990232 744047 1199597 632795
37161 632795 -416861 -2358971 -4576097 -4756640 -1935948 1673619 3255152 2299091 277235
37152 277235 -920265 14415 2398195 3253578 797283 -2229337 -1904332 681675 841714
37143 841714 -1960168 -3025947 -567102 660838 -2955992 -7549078 -7644173 -4619974 -3986790
37134 -3986790 -6482357 -7401686 -4232327 -120437 970554 -922155 -2786553 -2241345
37126 -2241345 534336 3016142 2422277 -1284189 -4961158 -5822995 -4280744 -2132677
37118 -2132677 176664 2426754 2637951 -718621 -5453468 -7656135 -6657377 -5272318
37110 -5272318 -5292851 -5588758 -4992858 -4331289 -4617839 -5303726 -5473914 -5372278 -5700383 -6289678
37100 -6289678 -6295253 -5353978 -4203556 -4118862 -5298878 -5775344 -3123076 2125645 6237732
37091 6237732 6621884 5017494 4912916 7258345 10542256 13606484 16082394 17362622
37083 17362622 17853697 20198979 26180156 33029346 36044346 34567800 32095605 30802718
37075 30802718 29959978 29958254 32994110 37973513 39449696 34934779 29622004 29797509 34170338
37066 34170338 36193348 33284620 28837830 25587339 22156885 17420267 13794984 13498909
37058 13498909 14405436 12594831 7508351 2070296 -1288601 -2407845 -1899109 -309873
37050 -309873 1191158 1411361 925475 1599699 3638901 4541277 2022521 -2904759 -6735407
37041 -6735407 -6866107 -3560937 877924 4136393 5436276 5757631 6480723 7616895 7742585
37032 7742585 5840631 2683397 220420 136773 2876479 6986504 9380761 7841401
37024 7841401 3860806 1436395 2254556 3841851 3573861 2361931 2496340 3880503 4959030
37015 4959030 5694727 6615879 6291558 3304219 -105083 -276879 2154097 2776610 -17886
37006 -17886 -3012549 -3522240 -2618443 -1646698 215340 2768380 3182581 458889 -1919528
36997 -1919528 -919702 1530395 2256212 1994533 2870138 3406762 893704 -2824892 -3005111
36988 -3005111 797941 3704292 2215892 -1834495 -4873192 -5805271 -5401357 -4123360
36980 -4123360 -2171060 -210694 1096937 1628179 1595731 1292994 620013 -1412463 -5273176
36971 -5273176 -8449983 -6982247 -1187077 3073884 1797497 -1271682 -223521 3855792
36963 3855792 4613915 371552 -3439358 -2454271 1214484 3456878 3733273 3940367 5047144
36954 5047144 7108272 10214334 13706805 16422888 18718719 22115327 26367963 29398705
36946 29398705 30588975 31313447 31827004 30852091 28690250 27057489 25262567 20914968
36938 20914968 15522304 14291106 18047489 20478028 16975010 11619917 10765683 13439414
36930 13439414 13604503 9530382 5149467 3093095 1815636 -101320 -1397577 -990320
36922 -990320 -11399 179084 -363959 -1268498 -2604770 -3986854 -4505268 -3901833 -2690637
36913 -2690637 -1343515 -431537 -804646 -2222566 -2745164 -1189325 736532 676559 -826517
36904 -826517 -1141714 676351 3046396 4457996 4911522 4888267 4630054 4472053 4629338
36895 4629338 4821141 4906282 5082381 4655063 2113702 -2215424 -5271152 -4846848 -2532419
36886 -2532419 -1111933 -720710 94573 1240441 1788646 2269817 3197721 2769140 -455350
36877 -455350 -3753970 -3098842 757769 3103985 2049807 319151 -131856 -970657 -3604324
36868 -3604324 -6173878 -6391384 -4670711 -2725200 -1234359 -224217 224880 640071 1635878
36859 1635878 2235805 903883 -1506655 -2494504 -1836484 -1621830 -1987089 -655804 2239019
36850 2239019 3163359 1034088 -194902 2167854 4525803 2288696 -2778217 -5119140
36842 -5119140 -3414426 -1239626 -593548 299362 2266284 2736565 -168618 -4178945 -5737057
36833 -5737057 -4598515 -3638071 -4911509 -7447599 -8805084 -7863180 -5773584 -4400937
36825 -4400937 -4236015 -4299800 -3925700 -3676211 -4145348 -4820893 -4845167 -4216669 -3575486 -3361796
36815 -3361796 -3645252 -4113444 -3926244 -2550310 -1099604 -1586687 -4192399 -6588756 -6861058
36806 -6861058 -5844525 -5501411 -6156832 -6598105 -6027973 -4748616 -3547293 -3160705 -3535368
36797 -3535368 -3215525 -845356 2283581 3215619 1724407 1125270 2969812 3764990 -2885
36788 -2885 -5766510 -7676199 -4401523 -147809 1729849 1912176 1410236 -977656 -5543441
36779 -5543441 -9366621 -9757711 -7851105 -6430590 -6002001 -5419539 -4749709 -4589598 -3538035
36770 -3538035 351983 5566944 7756203 5351417 1874259 1030379 1853360 1142256 -1030173
36761 -1030173 -1557063 505564 2588280 3129136 3895908 5957961 6632441 3605608 -305675
36752 -305675 -592474 1956451 2219078 -1272273 -3903643 -1930041 2144735 3447241 961995
36743 961995 -2604308 -4797057 -4819771 -2979312 -1060434 -1480221 -3963267 -4971660 -2553420
36734 -2553420 473836 671586 -1073243 -1824295 -1522858 -1882055 -2232541 -819087 904933
36725 904933 -104181 -2919054 -3253180 -274 3041421 2801780 577856 -858071 -418391
36716 -418391 1742194 4457750 4817316 923594 -3994303 -4411204 -474236 1464715 -1982596
36707 -1982596 -6404658 -6705594 -4428020 -4105320 -6099281 -7556191 -7720882 -7715715 -7008156
36698 -7008156 -4599283 -2395748 -3075958 -5373306 -5479168 -2720237 -190355 -13479 -1423493
36689 -1423493 -3350225 -5481629 -6697000 -5780899 -4130300 -4806421 -8295238 -11603080
36681 -11603080 -11883092 -8882972 -4086328 158872 1185736 -1390004 -3938542 -2772146
36673 -2772146 493025 984767 -2222978 -4970832 -4434063 -2420737 -1289578 -894604 -1132025
36664 -1132025 -3197211 -6120638 -6208862 -2713945 -242456 -2339322 -6206080 -7295893
36656 -7295893 -5705616 -3956545 -1831267 1462238 2670792 -1845527 -8977734 -11461562
36648 -11461562 -7639529 -2973745 -1216918 47146 3160054 5241211 2808826 -2310512
36640 -2310512 -5517070 -5507095 -4538163 -4397172 -5056206 -6091047 -6872959 -6280044 -4288519
36631 -4288519 -2824030 -3158688 -3732158 -2625685 -845901 -608468 -1387188 -625246 1961653
36622 1961653 3809700 3638328 3372102 4776542 6370628 5420868 1802756 -1744683 -2680492
36613 -2680492 -738744 2639931 5558346 6227974 3759636 -473762 -2975087 -1262539
36605 -1262539 2850712 4644068 2016100 -1890202 -3052332 -1932285 -1864232 -3133587
36597 -3133587 -2417727 1404091 4741053 4435970 2197763 1309781 1559642 663798 -1147840
36588 -1147840 -1596840 -508828 -46690 -921502 -1313638 158785 2649519 4359618 3837211
36579 3837211 555827 -3844507 -5898515 -4364999 -2712892 -4439392 -7267822 -6312092
36571 -6312092 -2297063 -1262254 -5363975 -9542975 -9453620 -7425376 -7201900 -7478424 -5300322
36562 -5300322 -2450436 -3148513 -7198410 -10400544 -10966856 -10974854 -11598476 -11164992 -8661504
36553 -8661504 -5713073 -4008290 -3340351 -3051457 -3204616 -3585174 -3476509 -3028072 -3092595
36544 -3092595 -3307973 -2230733 8943 940484 -1435180 -6171831 -10289774 -11316169
36536 -11316169 -8833124 -4625521 -1521444 -1169331 -2791091 -4575705 -5666121 -5968072
36528 -5968072 -5157359 -3505394 -2754930 -4106554 -5921192 -5699693 -4049856 -4161973 -7082815
36519 -7082815 -9942587 -9672042 -6532332 -3055000 -1059941 -609030 -652667 91647 2023429
36510 2023429 3985913 4444588 3314324 1728886 343253 -939549 -1997610 -2680700
36502 -2680700 -3515956 -4707400 -5088943 -3859149 -2499005 -2674185 -3095762 -1401728 1378114
36493 1378114 1749336 -720396 -2520557 -1695120 -564087 -1425608 -2889568 -2604057 -903636
36484 -903636 563470 1739132 3511107 5734548 7576201 8441296 7555874 4485906 873271
36475 873271 -708131 -453691 -1053322 -2855529 -2959388 -640042 571883 -1217540 -2648155
36466 -2648155 -940303 911217 -506227 -2266153 328526 5060879 5428569 841164
36458 841164 -2555803 -1370912 1120952 1500290 461913 -1193701 -4783089 -9064164
36450 -9064164 -8830074 -2302133 4244019 3889106 -1659708 -4721211 -1795920 3245655
36442 3245655 5320848 3566540 464317 -1456376 -1389674 -500671 -611782 -1605713 -1012245
36433 -1012245 2241333 4927455 2984559 -2589871 -6266622 -4942287 -1678844 -1092839
36425 -1092839 -3178688 -4084930 -2117273 -176509 -1380305 -4353808 -5054229 -2573023
36417 -2573023 -378002 -965181 -1999833 -205391 2855687 2633315 -1207384 -3639157
36409 -3639157 -1516214 1946350 2395608 723922 648934 2224907 2152719 -310796 -2167191
36400 -2167191 -1703512 -690860 -560532 -199138 671017 -482902 -4746026 -8293244 -6804728
36391 -6804728 -1836783 867977 -1089617 -4314702 -4847692 -2737879 -623156 -346713
36383 -346713 -2074831 -4709598 -6139882 -4886975 -2320515 -1304993 -1943443 -1163567 2281920
36374 2281920 5314863 5131804 3513919 3558469 4478609 3477219 1215513 1047699 3375994
36365 3375994 5163562 5209951 5454024 6188158 4598590 33773 -3483268 -2915690 -985230
36356 -985230 -1832691 -4469149 -4430730 -559374 3602809 4871806 3882663 3211262 4010655
36347 4010655 4835879 2972591 -2465931 -8203094 -9203631 -4570132 930193 2775652
36339 2775652 1760882 988542 564024 -1145856 -2977192 -2103533 978509 2745428 1921475
36330 1921475 675160 339192 -215183 -1187374 -582604 2204592 4635552 4490303 2573990
36321 2573990 594898 -1115178 -2266315 -1623418 588409 1467381 -965574 -4457693
36313 -4457693 -5260230 -3250584 -1861529 -3058501 -4642876 -3384099 553170 3716752
36305 3716752 3706073 1987010 1405432 1950953 1169862 -1233600 -2114082 351798 3286253
36296 3286253 2970038 37510 -2054006 -2038002 -1140503 69158 1445439 1124955 -2254545
36287 -2254545 -5985712 -6260961 -4067241 -3363566 -3969608 -2146541 1392399 881432 -4890024
36278 -4890024 -8908078 -5606903 1292008 4949259 4567760 3486222 2414646 311798
36270 311798 -1116617 182501 1606105 -1046175 -6603633 -9730901 -8347882 -5169810
36262 -5169810 -2623190 -921966 -569190 -1924585 -2571071 43839 3471012 2880883 -957816
36253 -957816 -1922512 2113595 5940308 5310546 3045270 3200481 3859852 740856 -4984511
36244 -4984511 -7899858 -6325940 -4222841 -4795271 -6294540 -5733409 -3925146 -4446596 -8584396
36235 -8584396 -13318510 -14683136 -12109997 -8539223 -6394974 -4721679 -1375270 2739922
36227 2739922 3698035 -490665 -6574658 -9346137 -7690014 -5639211 -6999213 -10416940
36219 -10416940 -11280502 -7973658 -4105066 -3622062 -5669736 -6539101 -5542720 -5646636 -7988935
36210 -7988935 -9332070 -6865709 -2824419 -1618266 -3967576 -6529669 -6436704 -3958405
36202 -3958405 -1411576 -1343656 -4828564 -9635003 -11303394 -8224482 -4275722 -3881977 -6045617
36193 -6045617 -6560125 -4689987 -3377612 -3452540 -2536360 -274903 257560 -1940585 -3406873
36184 -3406873 -1838447 -96230 -1342692 -3605023 -3231707 -1322252 -2118061 -6081992
36176 -6081992 -9074505 -8523821 -6469161 -5582658 -5575004 -5134967 -4712983 -5222385 -5763687
36167 -5763687 -4946020 -3530898 -3594966 -5384988 -6928000 -6817519 -5622749 -4252739 -2774731
36158 -2774731 -1546667 -1562777 -2359342 -1470606 2016056 5002274 4192741 1168000 242435
36149 242435 1822096 1992290 -814673 -3194081 -2487157 -843355 -864348 -1063507 768035
36140 768035 2944310 2805870 1655621 2296727 3755767 3257226 1746973 2170686 3344444
36131 3344444 1248169 -3772679 -6818085 -5938169 -4224861 -3481408 -1660559 1549612
36123 1549612 2353445 -1056208 -5030780 -6287933 -6573201 -7985933 -8186559 -4722369 -474597
36114 -474597 147733 -2038553 -2698985 -640587 1509039 1890818 816931 -1192181 -3284757
36105 -3284757 -3542636 -1723475 -1103743 -3981440 -7144393 -6010323 -1693790 838227
36097 838227 553399 909218 2825118 2856780 -390361 -3284645 -2898549 -1406592 -1960659
36088 -1960659 -3620169 -3538499 -1749895 -661735 -1315777 -2865075 -4745929 -6950553 -8631535
36079 -8631535 -8403282 -6004977 -2537229 673347 2670917 2986803 2147408 1674885 2786893
36070 2786893 5264512 7851787 9231500 8475754 5509492 1669031 -996648 -1625951
36062 -1625951 -1279396 -1486032 -2684936 -4320210 -5628710 -5909047 -4802571 -2876520 -1365741
36053 -1365741 -878279 -846300 -570569 -175252 -66555 -21623 526148 1552596 2413662 2799474
36043 2799474 3229357 4174306 4839936 3619980 326827 -2785608 -3508300 -2790937 -3491181
36034 -3491181 -5815399 -6380292 -3009452 1845022 4515009 4982748 5600261 6459099 5581953
36025 5581953 3284860 2581761 4511904 6355809 5869173 4431445 4090985 3907509 1831573
36016 1831573 -1173894 -1664927 1715872 6145735 7570031 4811823 478550 -1746795
36008 -1746795 -566712 2138898 4000319 5038876 7059999 10818321 15391652 20236551
36000 20236551 25897766 32189402 37554488 41049357 43236310 44290507 43251057 40367025
35992 40367025 37937890 36892228 34632244 28942966 22399358 19540480 20425541 20580260
35984 20580260 17461328 13415464 11284969 10500176 9420394 8639941 9206026 9491250 7035173
35975 7035173 2740101 254297 1087264 2820872 2654465 547129 -1958510 -4001577
35967 -4001577 -5118448 -4232200 -796580 3567368 6101227 5633010 3453656 1666085
35959 1666085 1437004 2644680 4347785 5515094 5823232 5659426 5032230 3125479 -202455
35950 -202455 -3058877 -3052248 -239427 2669251 3303722 1782282 -357841 -2125234 -3333245
35941 -3333245 -3947793 -4097056 -4147892 -4060000 -3161112 -1154698 1183442 2904851 3922978
35932 3922978 4498787 4294652 2870418 874902 -125076 895473 3525199 6321384 7738312
35923 7738312 7013189 4814429 2979408 3021869 4661054 6044334 5592764 3628980 2121638
35914 2121638 2677849 4789921 6412653 6369222 5551877 5389505 6029008 6839396 7729734
35905 7729734 8653995 8686400 7323133 5989131 6153497 6576910 5111163 2871687 3142927
35896 3142927 5683452 6146520 2845494 76472 1748907 5186057 5336099 2718328
35888 2718328 2403526 6066014 9689615 9433603 5980036 2432240 1073723 2783427
35880 2783427 6632987 9340561 7970231 3993743 2018713 3800840 6416919 7244403
35872 7244403 7421320 8620519 9496325 7993411 5076867 3397569 3490328 3679293 2876589
35863 2876589 1377973 -413933 -2091471 -2575996 -1216855 655400 908975 -617197
35855 -617197 -1773476 -569313 3017737 7623201 11786831 14376834 14553702 12096613
35847 12096613 7988784 4360867 2984628 3310953 2954158 1242687 1156230 5498827 11677566
35838 11677566 13422482 8544489 2068835 -33750 2291311 4780967 4950436 3422405
35830 3422405 655841 -3734118 -8210925 -9316925 -5852818 -843705 2198963 3391193
35822 3391193 5154848 7869368 9082699 7334817 4886406 5065133 7521601 8180704
35814 8180704 4717774 300695 -150191 3490451 6516638 6128904 5158899 7373073 11470469
35805 11470469 12577221 8815959 3708438 1816625 3850621 6720603 7431749 6331993
35797 6331993 6524435 9801853 13547171 13299071 8780168 4937870 5270946 6586880 3640903
35788 3640903 -2523840 -5194964 -1213506 4603114 6053341 3255952 1010300 1667549
35780 1667549 3080568 3107816 2935998 4813604 8306455 10466812 9427164 6629569 4897223
35771 4897223 4841467 4376952 2170876 172656 1165969 4546529 6702714 5790550 3978284
35762 3978284 4037039 5574212 6083774 4388519 1527206 -763569 -1068173 1094790 4077292
35753 4077292 4636092 1640598 -1696961 -1633506 848536 1537351 -561796 -1929251 -456691
35744 -456691 1277811 865428 623262 3692693 8039379 8767971 5390008 2347118 2361991
35735 2361991 3642375 4354813 5338340 6672561 5983875 3016679 1971570 5513633 9713669
35726 9713669 9485714 6391346 5540170 6508088 4047061 -2052455 -4876587 -493251 6026258
35717 6026258 8358910 7420845 7371329 7610872 4911387 754492 -243183 1644681 1376867
35708 1376867 -2165450 -3836314 -483605 3962435 4681441 2712492 1781191 1985011 1049326
35699 1049326 -476539 52594 2423597 3564308 2459638 1516984 2615097 4775910
35691 4775910 6339740 6832021 6076890 4019596 2216776 2957095 5743193 7026533 4942490
35682 4942490 2125839 1912023 3643782 4210547 3023565 2677048 4894835 8335332 10991884
35673 10991884 12895239 15435827 19096368 22862455 25530566 27072807 28837822 32550674
35665 32550674 38951496 47364587 56572777 65798910 74750803 83233831 91010372 97574726
35657 97574726 101888613 103023919 101332189 98188630 94301704 89217520 82718639 75405174
35649 75405174 67538801 59009797 51032159 45655096 42455913 38329976 32475320 28706611
35641 28706611 29810452 32344804 31272221 27659828 26470001 27760884 26328761 20771322
35633 20771322 16621671 18092831 22124635 23845955 23233555 22571763 21543839 19382276
35625 19382276 18457047 20660679 22673223 20021096 14262178 11004659 11681203 12363702
35617 12363702 10557850 8220148 7341150 6940387 5799485 4676840 4345337 4120655 3487729
35608 3487729 2980415 2793817 2654279 3302430 5722969 8728744 9858430 8903781 7969606
35599 7969606 7875659 7293303 5748101 4562714 4284194 3956349 3432979 3598286 3921013
35590 3921013 2920747 1587956 2914302 7097319 10618012 11189487 10109961 8448085
35582 8448085 4901494 -404873 -3857494 -3137992 -992480 -916808 -1603589 641021 5604172
35573 5604172 9028020 8271954 5165109 3141174 3569213 5115251 5522616 3934322 1779405
35564 1779405 902230 1171257 1333212 1653433 3234113 4925806 4200570 1623853 896462
35555 896462 3322692 5891775 6417614 6741152 8638698 10345414 9986254 9121060 9888014
35546 9888014 11693411 13585221 16539391 20272952 21581646 19783718 20049691 26464885
35538 26464885 35089285 39491006 40504835 44297964 52532916 61003044 67254606 72968286
35530 72968286 78534220 81568842 81974363 82878097 85046068 85412953 82669700 79275406
35522 79275406 76061739 69980044 60007249 50699693 46236779 44370323 40083491 32835062
35514 32835062 26510261 23695595 23315654 23273762 22765663 22019089 21465849 21268816 20859749
35505 20859749 19227293 16097921 12353811 9168554 7354608 7295062 8564753 9990212
35497 9990212 11041076 12344263 13708186 13265643 10649927 9148707 11425440 14534284
35489 14534284 13462177 9114359 7853904 12223692 16931611 16301815 11815298 9174271
35481 9174271 10464982 12478280 11726075 8638999 6747469 8571046 12319503 13320415
35473 13320415 9771880 5719758 5945784 9202089 10073475 6857468 3220701 1793735
35465 1793735 876388 -1134336 -2538993 -1747044 -114795 938622 2254877 4100598
35457 4100598 4404110 2416150 976629 2297220 4292945 4010115 2130998 1075717
35449 1075717 950328 518947 309874 1633359 3799896 4932988 4563651 3601476 3010970
35440 3010970 3731487 5926015 7293176 4987809 520892 -887904 2215763 4907956
35432 4907956 3622199 1937896 4368598 8524388 9051897 6406483 5533230 7526990
35424 7526990 8767795 7686157 6577064 6655677 6671688 6797797 8719161 11151338 10439926
35415 10439926 6955440 5886997 9488087 12928263 10770709 4245894 -954424 -1662378
35407 -1662378 951137 4743406 8631209 11733742 12981787 12226022 10729203 9980516
35399 9980516 10112787 9830157 8356259 7052155 7677010 9069259 8032462 4563193 3219895
35390 3219895 6902621 12017333 13283731 11179737 10332068 11848736 12111926 9109807
35382 9109807 5323053 3432470 3081231 3083970 3470444 4070845 3986489 3573287 4302783 5865143
35372 5865143 6196194 5120167 4983676 6730744 8336475 8286086 7750697 8064982 8747050
35363 8747050 9226628 9895006 10337319 9280715 7391204 7159808 8777323 9277160 7264799
35354 7264799 5174995 4929995 4727961 2609599 103532 -579028 -297669 -828282 -1278502
35345 -1278502 28119 1941203 2185076 1362815 1908363 3845611 4776713 3823339 2778175
35336 2778175 3188594 4538779 5704778 6617590 8008964 10185181 12104953 11881365 9275286
35327 9275286 7284003 8879959 12031302 11368960 6058446 2137197 4406803 9681714
35319 9681714 11912017 10885019 10836220 12386590 11735091 7863883 5118726 7073673 11918174
35310 11918174 15858566 17875420 18948696 19075345 17640252 15591754 15111253 17156553
35302 17156553 20304762 22209969 22141442 21942865 23726803 26575600 27339090 25652001 25648135
35293 25648135 30163711 35365455 35051761 29515318 25815679 28581856 34431111 37218026
35285 37218026 35744040 33866028 34829195 37950526 40398905 40657317 39972706 40589911 42511072
35276 42511072 42827644 39292485 33666064 29894504 29686993 31683753 34022028 35337064
35268 35337064 34200763 30734931 28312408 30090694 33812296 33850842 28908867 23615314
35260 23615314 21501044 20849837 19374636 18377934 19146932 19278996 16688723 14222214 15750718
35251 15750718 19691474 21066240 19066367 18244114 22176181 29395716 35870012 38801611
35243 38801611 37862037 34957927 32822744 32253360 31511454 29914549 29983781 33339867 36604953
35234 36604953 35308472 30579178 27712753 28816913 31285734 33178753 35298657 37716347
35226 37716347 39293382 41553513 47880718 57328422 64470283 67692662 72290559 81919615
35218 81919615 91919744 95574652 92934764 88536724 83924205 78066847 72524036 69928927
35210 69928927 68630546 64817415 59383377 56870531 57757921 57884277 56092883 56025878 58594682
35201 58594682 59149114 55394447 52283453 54421133 58291069 57575505 52898970 50214002
35193 50214002 51295137 52004351 49768377 47059746 46348508 46365104 45204217 43334555 41485008
35184 41485008 38768938 35180001 33192502 34330522 36390692 36793839 36796353 39250000 43535765
35175 43535765 46337567 47064449 48732095 52650237 55627273 54327002 49931929 46208085
35167 46208085 44724016 44533089 45305900 47625407 50336003 50760658 48542995 46754475
35159 46754475 47685384 49634542 49861382 49024687 50083083 53731432 57892526 61666355
35151 61666355 66659868 73396735 79228215 81783739 82404722 83576405 84223682 80592845
35143 80592845 71747912 61476587 54020409 50082005 48006563 46745459 45879210 44190375
35135 44190375 40426450 35060394 29707263 25290668 22346743 22318972 26052069 31037132
35127 31037132 33015690 31302035 29879674 31627143 34119886 33778895 31895735 32676581
35119 32676581 36360034 38763331 38115809 37863298 40720093 43789778 42853970 38982104
35111 38982104 37222724 40067636 45695359 51957775 58480185 64657003 69089282 72275437
35103 72275437 77189759 85424002 94513419 101005840 105382647 112245246 125390588 143385397
35095 143385397 160576584 172999889 183224533 198098672 221013657 248016774 273038022
35088 273038022 294981345 316774567 338781373 357140051 368585305 372820762 369323278
35081 369323278 356256719 334880209 311269010 290339595 270757909 249057002 226411092
35074 226411092 207217617 192305148 178034266 162268944 147333232 135963267 127388057
35067 127388057 119058999 110209987 101991440 95231362 89550784 84346211 79753825 76514371
35059 76514371 74992327 74473869 73921634 73336011 73212023 72428358 68586245 61632654 55217594
35050 55217594 52446408 51822785 49807684 46081577 43329501 42662159 42644957 42775907 44443430
35041 44443430 47734547 50472068 51646499 53072438 56204288 59760874 62157794 64106586
35033 64106586 66894956 69869525 71661749 72639955 74251993 76839091 79729055 82814625
35025 82814625 86748451 92153782 99375212 107968414 115896044 121069339 124882603 132225596
35017 132225596 146110092 163935412 181165595 197084256 214347670 234275079 255842234
35010 255842234 278663711 303399627 328871932 351966284 371180145 387332217 399685199
35003 399685199 404403558 398796673 384718754 365655392 342684778 316047675 288798489
34996 288798489 265037760 244792752 224292636 202215686 182551248 169417544 161256911
34989 161256911 152556359 140215637 126003494 113321675 103879130 97704369 94175573
34982 94175573 91911596 89068693 85113611 81617296 80160701 79934349 78584769 75273195
34974 75273195 71727094 70010394 70145801 70373226 69122047 66265284 62941713 60692309
34966 60692309 60391167 61361846 61722668 60305226 58209203 57671234 59252167 61176347 62041886
34957 62041886 62927056 65274980 67560879 66638379 62870316 61216359 65303471 72282538
34949 72282538 76147233 75129971 72968592 73211569 75397310 77439907 78818404 79930908
34941 79930908 80516394 80395313 80194596 79983994 78697799 76017864 73071903 70214705 66436834
34932 66436834 62447272 61444746 64225888 66222438 62996734 56636611 52459345 50801277
34924 50801277 47179468 40496651 35674021 36452281 40043218 41541282 40319263 39147784
34916 39147784 39364460 39941897 40066216 40115241 40531217 41150536 41140366 39156103 35006661
34907 35006661 31583537 32849197 38742172 44325635 45467776 43115131 40330409 37886703
34899 37886703 35476823 34783130 37503509 41462812 42509970 40191551 38236767 39050974
34891 39050974 40817117 41086929 40624122 41867014 45003557 47467448 47280350 45883385
34883 45883385 46961061 52174347 58645628 62045606 62230508 63709707 69418867 76302641
34875 76302641 79373048 78503256 78191739 81234334 85595481 87636701 85901490 81397982
34867 81397982 76431621 73595697 73846229 75133748 74797869 73381225 73714146 75944754
34859 75944754 76380790 72484324 66447751 62017570 59782319 57663813 54609622 51583077
34851 51583077 49590721 48544279 47770854 46429680 43933947 41056284 39912124 41509780
34843 41509780 43792640 43488945 39745803 34751513 30833632 28187361 25886611 24187376
34835 24187376 24742545 28235525 32415841 33662473 31017031 27556179 26526032 27086990
34827 27086990 25883064 22258979 19159430 18507791 18748509 18361631 18907227 22171376 26508991
34818 26508991 28969406 29563386 30259301 30745555 28818242 24960028 22903267 24575356
34810 24575356 27463731 28559500 28422115 29280831 30990140 31399573 29902910 28259133
34802 28259133 27919117 28449718 29061203 30191537 32647107 36014492 38967360 40844416
34794 40844416 41895165 41926796 40023757 36500645 33995627 34804803 37461829 38101214 35521798
34785 35521798 32545476 31517475 31256448 30298523 30200004 32391122 34105138 31761696 27118526
34776 27118526 25230830 26672463 27076565 24991089 24312836 26744515 27677595 23538674
34768 23538674 18326075 17646125 19923717 19496469 16037472 14394680 15920971 16479577
34760 16479577 13807827 11074993 11320559 13141123 14129196 14571567 15248166 14914949 12621842
34751 12621842 9947434 8596113 8067694 7765693 8929496 11989088 14153669 12523370
34743 12523370 8343089 5615057 6208445 8363436 9530176 9131494 8806335 10631783
34735 10631783 14427623 16830964 14771639 9976023 7456403 8912763 10755905 9948835
34727 9948835 8210394 8053501 8149617 6154465 3495442 3301438 5229874 6302959 5826550
34718 5826550 5699739 6503398 6940597 6901114 7669731 9080699 9585087 9253256 9773976
34709 9773976 11272671 11925921 11067270 10091427 9848106 9428156 7949822 5660132 3212956
34700 3212956 1615879 2465150 6167661 10405016 12456443 12373405 11782214 10858617 9259642
34691 9259642 8553487 10072854 11486805 9687649 6331711 5843818 8232153 9132755 7420879
34682 7420879 7030851 9592032 11011702 8377855 5246470 6107899 9520996 11143407
34674 11143407 10717519 11428122 13968589 15650860 14998116 13633973 13224701 13092638 11696023
34665 11696023 9157731 7456737 8013582 9281833 8003712 3950551 1575922 4279109
34657 4279109 8703860 8938186 5536695 4988058 9655129 14120098 13673632 10860709 10199175
34648 10199175 11215320 10881005 9080389 7285243 4956197 1558470 -573487 415375
34640 415375 2156680 1729310 595469 1616962 3533077 3088404 816547 -3052 1213551
34631 1213551 2394753 3013785 3888141 4008484 2002858 -268078 56929 2032258 2689646
34622 2689646 2420262 3774223 5960941 5921511 4394555 5229588 8392083 9373356 6676209
34613 6676209 4499024 6132715 9411501 10937198 10805803 10788732 11061850 10893447 10125252
34604 10125252 8661907 6851332 6746716 9845311 13354437 12680982 8317035 5847448
34596 5847448 7867095 10587524 10481348 9496021 10565179 12185467 11429987 9186703 8220121
34587 8220121 8252599 7088939 5205648 5242866 7420603 8865472 7698888 5232864 3645052
34578 3645052 3333129 3246783 2823735 2906804 4675388 7699204 9771391 9568420 8704847
34569 8704847 9618649 12127829 14092796 14812241 15228849 15345337 14576589 14410671 17025122
34560 17025122 20941710 22015688 19573236 17451641 17782296 18371422 18214204 20488801
34552 20488801 26478925 30973033 28589525 21774818 17581242 18398293 20627878 21222735
34544 21222735 20630467 19580670 17544411 15033165 13793752 13882928 13477851 12234193 12015746
34535 12015746 13434910 14269019 12579104 9445476 7327068 7113610 7912051 8688931 9091212
34526 9091212 9253999 9573430 10440913 11864407 13462043 14792838 15549548 15693043 15599052
34517 15599052 15712087 15934827 15909564 15966607 16965593 18990388 21083120 22478916 23164121
34508 23164121 23143061 22380893 21614287 21812368 22639168 22970726 22961851 23565434 23830097 21363815
34498 21363815 16393292 12580489 12230975 13260166 12866046 11695100 11818541 12775201 12780157
34489 12780157 12377159 13481672 15490733 15725998 13865986 12921967 15006165 18473454
34481 18473454 20358581 19885061 18275333 16362112 14084635 12058935 11893748 13912899
34473 13912899 15560591 14046530 10731101 10452815 15090964 20292167 21270812 19627152
34465 19627152 20405424 23890474 25558918 24029836 23197661 25028567 26062620 23941290
34457 23941290 22125910 24177398 27774014 28894446 28175008 28228555 27893440 24575721 19945571
34448 19945571 17780423 17773912 16843277 15255043 15884882 18158391 18395188 16123465 14625431
34439 14625431 14822396 13904871 10913529 8654119 8778225 9604905 10248876 12366735 16044390
34430 16044390 18282420 17699151 16869549 17878727 19291334 19712269 20507623 22327041 22579958
34421 22579958 19595145 16226330 15898768 17607645 18292095 17918176 18450649 19518042 19210011
34412 19210011 18421604 20402400 25632765 30341766 31073338 28574729 26261268 26332363 28188649
34403 28188649 29700990 29367241 27576943 25976300 25600783 26005275 26204818 25613585 23868437
34394 23868437 20847381 17369047 14867550 13917911 14070459 15237068 17612917 19868628
34386 19868628 19568641 16494458 13563861 12962818 13225954 11976055 9782786 8931021 9636071
34377 9636071 10081943 9462483 8419944 6981525 4843940 3624608 5749184 10253719
34369 10253719 12498584 9763134 5106505 3658387 6457953 10174134 12103596 12885109
34361 12885109 14053289 15302734 15503621 14933712 14725298 14661362 13314825 10620609 8804323
34352 8804323 9867351 13015705 15600492 16221530 15955990 16584696 18450908 20368101 21184554
34343 21184554 21070236 21282555 22767985 25147878 27251179 28402144 28650848 27886130 25656529
34334 25656529 22203222 18839305 16728487 15844534 15526750 15342505 14929888 13818131 12100317
34325 12100317 10653803 10149607 10505167 11568211 13145844 13928832 12136712 8345393
34317 8345393 5874619 6637841 8267089 7683088 6130414 7548493 12384319 16388457
34309 16388457 16283654 13757288 12318734 12331784 11280125 8069983 5046708 5242909 8483715
34300 8483715 11235230 10818210 8979115 9547500 12549741 13424175 9691141 5522237 6292867
34291 6292867 10509518 11799031 8669044 7202898 12223436 19972061 22863644 19073483
34283 19073483 13888108 12470512 14377518 15557756 13707866 10635363 9861448 12427088
34275 12427088 15474287 15455880 12353675 9616038 10030609 13013866 16069770 17359077
34267 17359077 16470401 14344859 13181903 14891968 18674418 21323585 20752068 18066548
34259 18066548 15511904 13787535 12321625 10803143 9225133 7487459 6146199 6666094
34251 6666094 9759776 14041985 17100025 17297772 14254987 8909691 3866214 2186830
34243 2186830 4491355 8154072 10370780 10959068 11156041 11102910 10148425 8585477 7270809
34234 7270809 6153989 4834698 3990875 4517674 5712160 6177172 6232395 7343458 9135269
34225 9135269 9365982 7627840 6741289 8833160 11772897 11713107 8220361 4468046 2626047
34216 2626047 1725123 671686 563741 2103341 2878065 214292 -4085460 -5020044 -761880
34207 -761880 4944294 7635623 6980625 5504482 4713545 4391854 4187645 3895354 3099339
34198 3099339 2094912 2196445 3797393 5371280 5799784 6113507 7161465 7401235 5551410
34189 5551410 3909445 5818462 10476039 13363876 11790242 7403840 3354616 1589183
34181 1589183 2863868 6572899 10089241 10707590 8828921 7310199 7536693 8173568 7803189
34172 7803189 6641074 5606230 5708657 8047565 12150452 14800546 13172888 8787550
34164 8787550 5624904 4855690 4532599 3829450 3751774 3869804 2557436 760884 1221544
34155 1221544 3361215 3428433 664754 -1341483 -716486 220811 284497 1967738 6038912
34146 6038912 8748542 7913517 7058000 9391291 11960711 10557981 6853376 5440875
34138 5440875 6484567 6604171 5197052 4670882 5435621 5467380 4467627 4345311 5683954
34129 5683954 7139680 8119979 9075663 9495591 8276471 5674753 2845902 443718 -622204
34120 -622204 905643 3726086 3658430 -613490 -4151490 -2074180 3057029 4711845 1543311
34111 1543311 -1764146 -1785127 290430 2243038 3435688 3806705 3735488 4501895 5877465
34102 5877465 4755630 -189790 -4555035 -3604283 318200 1309822 -772535 -968615 1674186
34093 1674186 2814899 969839 -269324 584924 594848 -842774 -5400 3676918 5104879
34084 5104879 2007957 -676033 877791 3098635 2056430 617023 2504614 4755506
34076 4755506 3248741 1261441 4419119 10152186 10780154 5766008 2407299 4168391
34068 4168391 6456351 5548783 4151528 5102770 6059491 4534119 3134616 5128839 8408564
34059 8408564 8657321 6256532 5418517 7460466 9079353 7447832 3840151 1417475
34051 1417475 1489985 2844887 3657341 3478194 3658646 5600736 8389184 9157396 6556342
34042 6556342 2749179 858215 1556097 3524361 5888153 8033737 8099867 4664966 -83213
34033 -83213 -1847845 408393 3331758 4379152 5124257 7562062 10111179 10238843 8834427
34024 8834427 8427902 8504092 6520674 2994566 1489041 3195154 5261013 5271162 3839442
34015 3839442 1784423 -1477992 -5061474 -5830085 -2930277 -2028 -185413 -1645157
34007 -1645157 -902521 1897864 4148243 4979246 5041772 4037065 1851201 488737 1485933
33998 1485933 2936760 2450350 1312578 1943235 3070452 1995989 238385 1658445
33990 1658445 5519384 6935434 4575840 2475550 3119821 4054768 3143969 2093997 2267302
33981 2267302 1675443 -771984 -2192280 -473549 1501237 389313 -1772829 -728072
33973 -728072 2958580 4681291 2862399 849761 1362529 2757317 2229479 178414 -584399
33964 -584399 1065285 3001027 2623123 228877 -1437572 -957888 -54284 -617007 -1484971
33955 -1484971 -328711 2297379 3653607 3319989 3901425 6693563 9501598 9738951 7273327
33946 7273327 3393036 -532084 -2522257 -879858 3126277 5871868 5747164 4510570
33938 4510570 3604291 2333716 929822 1788727 5459158 8563210 8314685 6479486 6283199
33929 6283199 7784951 8849262 8450912 6588071 3222198 -242843 -790016 2376227
33921 2376227 6127121 7790196 8353855 8806788 6938453 1508383 -3765994 -4904053
33913 -4904053 -3523711 -3213009 -2857208 645289 5191953 5722192 2808059 2115535 4981687
33904 4981687 6394346 3829620 1399115 2313078 3153048 -163255 -5157311 -6279615
33896 -6279615 -2910246 530923 1029193 -150368 -372256 1467821 4711676 7485847
33888 7485847 7588780 4411376 55494 -2352361 -1518233 1033595 2574127 2007445 1459009
33879 1459009 4017399 9049437 11727332 9382697 6069119 6989677 10162881 9102026
33871 9102026 3426752 244619 3208303 6733394 4852898 123338 -1522025 -285159
33863 -285159 -544348 -2392431 -2079040 369322 889271 -1003814 -806300 3259983 6900363
33854 6900363 6580184 4693311 4644620 4984479 2603676 -1046327 -1364413 2955491 8426094
33845 8426094 11058562 9411382 4349766 -1176431 -2785654 1495497 7777797 9592861
33837 9592861 5208785 -781965 -3533112 -2749943 -628596 1756596 3953433 4593034
33829 4593034 3166883 1912651 3243020 6104583 7326614 5961242 3770516 1808718
33821 1808718 -609174 -3250872 -4182324 -2790371 -1249197 -1426538 -2154118 -1334224 609059
33812 609059 1309057 -267894 -2802745 -4412628 -4055177 -1647844 1723492 4023060 4180366
33803 4180366 3660068 4667404 6863342 7609939 5903446 4225570 5211249 7726762 8061664
33794 8061664 4741409 498663 -945417 1239737 5097510 8709970 11448078 12836244
33786 12836244 12011643 9025427 5525206 3203678 2214930 1799608 1660511 1833404 1996176
33777 1996176 2041333 2718573 4531742 6581320 7750024 8361188 9156770 9375707 7885214
33768 7885214 5798938 5517980 6979742 7382017 5431898 3513575 4246741 6731154 7906224
33759 7906224 6517270 4187328 3086559 3604980 4156662 2998061 551958 -566109
33751 -566109 1145763 3549486 3510111 1374486 199404 848624 1189873 559619 1230277
33742 1230277 3995145 5928033 4813401 2746152 2768921 4607657 6387780 7972850
33734 7972850 9607938 9620643 6818231 3327362 1834384 1706315 983302 337531 1533528
33725 1533528 3650142 4548888 4520349 4615623 3191474 -1145145 -4603575 -1907987 5306565
33716 5306565 9580112 7886139 5197403 6205860 8969816 9566646 8297393 7561358
33708 7561358 7076973 5155517 2447809 901125 534548 171184 -7992 674178 1245325
33699 1245325 481641 -471439 537574 3203563 5027384 4894728 4366096 5210518 7172130
33690 7172130 8488648 7678535 4782706 1612712 647341 2881073 6677081 9213728
33682 9213728 9138915 7652202 7041630 8169344 9449103 8789652 6627734 5825862 7686025
33673 7686025 9498024 7930696 3885621 1453130 2264669 3636096 2936278 1225934
33665 1225934 1144641 3072970 5196054 6393157 7346803 8861741 10238317 9963952 7948502
33656 7948502 6328649 7035659 8913503 9106377 7491267 6992032 8332135 7939396 3855689
33647 3855689 411281 2617076 8197229 10485142 8081329 5912319 6801915 8001507
33639 8001507 7277040 6723746 8252662 10178103 10940345 11912800 13756350 14050113 11573458
33630 11573458 9190097 9248868 9629555 7843019 5798692 6610864 9350297 10963362 11299493
33621 11299493 12351900 14141593 14973698 14473916 13201574 10700425 7080846 5039818
33613 5039818 6915585 10786111 12669773 11811044 10941920 12025505 14332496 16189353
33605 16189353 16648432 16197114 17100919 21362977 27103932 29588670 27538875 25117043
33597 25117043 25353280 25678718 23496265 21831647 24276456 27886346 27384282 24044658
33589 24044658 23627308 26668164 27717776 24284143 20098510 18605358 18930329 19505017
33581 19505017 20497971 21379779 20920903 20753310 24046956 29413510 31187520 27426599 22703056
33572 22703056 21062339 21200652 20948949 21478848 23865671 25892000 25824594 25621302 26846702
33563 26846702 26917898 23338186 18747659 17555675 19483704 20338628 18024334 14541168
33555 14541168 12762701 13667600 16083189 17607625 16913482 16014833 18123614 22371791
33547 22371791 23841105 20510892 16546147 16038866 17062319 15506341 11720806 9117317
33539 9117317 8499495 8237162 8417051 10339066 12945835 14048675 14373786 16207368 18590876
33530 18590876 18274325 15398748 13776174 14930021 16115271 15392249 14634321 15718926
33522 15718926 17255664 17349806 16735410 16682655 16173442 14021557 12194142 13852077 18425139
33513 18425139 21352072 19402076 14553082 11640061 13131199 17265803 20850059 22475754
33505 22475754 22552864 21599736 20125137 19585015 21271054 23904485 24457957 22266080 20270827
33496 20270827 20896477 22793741 23518024 23404014 24244421 25677868 25860506 24843554 24317622
33487 24317622 24440920 23778633 22226935 21268119 21379227 21871959 23207936 26504356 30591508
33478 30591508 32783869 33212485 35225601 40520767 46944237 52185835 56305797 59079413
33470 59079413 58546172 54861188 52423649 54732156 59282707 60992865 59001398 56574578
33462 56574578 55615450 55079150 54164627 53227800 51508374 47568192 42472011 39177437 38016577
33453 38016577 36087249 32266190 29501784 30258992 32562972 32944584 31084174 29019112
33445 29019112 27561346 26241078 25534425 26317888 27700778 27844430 26567124 25063587
33437 25063587 23671654 22205304 21795422 23548123 25626920 24863229 21686318 20203963
33429 20203963 22312891 24892962 24577619 22344084 20928989 20281986 18853509 17636195
33421 17636195 19023923 22043021 22488263 18737093 14575491 14698805 19269945 24526181
33413 24526181 27480634 28194299 27861879 26598321 24063503 21363900 20690150 22492822
33405 22492822 24255852 23451501 20950285 19640401 20142545 20434314 19827119 20159766 22007269
33396 22007269 23069231 22273631 22149975 24398796 26453481 26145640 26572808 31337417 37393213
33387 37393213 38688240 35704926 34752220 37732502 39581513 37382678 35167032 36676619
33379 36676619 39536418 40620592 41733709 44986416 47058571 43936488 38382378 36769435
33371 36769435 40072407 43364840 43498113 42434426 42947983 44951032 46440906 45406959
33363 45406959 41140031 35835817 33628068 35620746 37779763 36604214 34349748 34732012
33355 34732012 36098056 34165761 29824310 28135491 29990845 30796433 28046091 24564749
33347 24564749 23031928 22518589 22018162 22497337 23646909 23276494 21825295 22764755 26390550
33338 26390550 28095545 25509527 22512302 22824978 24305094 23656720 22401013 23192456
33330 23192456 23856775 20861357 16326590 15659239 19386128 22904352 23864813 24349084 25372256
33321 25372256 24588140 21117070 18281607 19101589 22062305 23689843 23182482 22320073 22290303
33312 22290303 22715270 23168319 23968083 25340229 26589086 26522131 24933475 23581924 24738119
33303 24738119 28139067 30556461 29706298 27536882 27655184 30038548 30802450 27738567
33295 27738567 23833335 23715641 27723481 31271647 30203959 25525104 21952285 22313402
33287 22313402 24873129 26732820 28084332 30999033 34995758 36919124 35590145 33479916
33279 33479916 32547100 31470006 29064308 27577875 29545650 33402969 35604112 35770961
33271 35770961 36313920 37882002 38879334 39167828 40422139 42362133 42281289 39482174 37001797
33262 37001797 37319078 39051130 39858080 40354262 42669882 46472888 48968612 48642611 47113759
33253 47113759 46838813 48013832 48424422 46278399 42780879 41249379 43380966 47174520
33245 47174520 49341079 49075029 48355731 49104442 51343390 53805756 55130206 54776099 53817582
33236 53817582 54215270 56204483 57455666 56248916 54002035 52577572 50889909 47419089
33228 47419089 44630785 46505475 52016703 55833059 56058457 56188847 57881222 57378646
33220 57378646 52452890 47890724 49124794 53920563 55962481 54454325 54168370 56854027
33212 56854027 58787280 57627458 56066933 56515473 56766667 54007232 49805743 47721835
33204 47721835 48083447 48433782 47933599 48151676 49739630 50984896 50224233 47995952 46075128
33195 46075128 45255840 44670683 43158348 41215798 41152161 44288056 48146238 48374258 44327337
33186 44327337 40558829 40819936 42598418 40835034 35975779 34123454 38533049 45020415
33178 45020415 47923465 47254789 46792341 47558661 47285228 45394746 44379548 45754228 47952348
33169 47952348 49221938 49910509 50752262 51274106 51189121 51294829 51722768 51316787 50076378
33160 50076378 50094161 52396647 54862549 55243941 54432416 54533476 55372134 55426583 54889751
33151 54889751 55092187 55825302 55951847 56031184 57676185 60698742 63357105 64966400 65747130
33142 65747130 64731076 60921190 56413171 55112656 57815047 61385479 63351845 64422996
33134 64422996 65681633 66272431 65319308 63787625 62939611 62638051 62138819 60930540 58400667
33125 58400667 54802501 52784549 55063302 59764067 61210755 56858157 50600813 47461852
33117 47461852 47771862 48676153 48682162 48005883 46487877 44049186 41917877 40974556 39945602
33108 39945602 37266896 33637784 30951369 29967615 30720913 33626097 38087377 41331561
33100 41331561 40820535 37117584 32997144 30810158 31617955 34905435 37818612 37063453
33092 37063453 33305964 31198464 33167770 36157866 36893655 36821590 38330346 39583510
33084 39583510 37889536 35508242 36561605 39815129 40308654 37434691 35642521 37115793
33076 37115793 39416572 41020492 43516430 46798296 47375204 43859913 39865662 39034175
33068 39034175 40758423 42803673 44459652 45005311 42891603 39087148 37764351 40717133
33060 40717133 44084544 43601293 40404554 38554232 39232943 40692068 41959287 43217317
33052 43217317 43883766 43423247 43077649 44139727 45546326 45705237 45605507 47415144 50779395
33043 50779395 53146628 53328673 52437831 51710497 51549630 52297847 53786507 54353900 52411855
33034 52411855 49023759 47096453 47839195 49561824 50177291 49500423 48623206 47996890 46839300
33025 46839300 44406140 41597930 40564103 41911115 43117885 41514799 38434297 37936870
33017 37936870 41223441 45155096 47049008 47723433 48308441 47464726 44279112 40909743
33009 40909743 39208394 37265063 32977710 29045944 30170337 36177542 41915120 43820179
33001 43820179 43189623 42934752 44228619 46596352 48623026 48393280 45536979 42598623
32993 42598623 42049981 42622308 41394205 38739649 37756725 39138484 40394567 40362497 40660750
32984 40660750 42013786 42913631 42943141 43714261 45187857 44799987 42000723 39972800 40563871
32975 40563871 41066478 38981237 36796039 38275520 42212376 43970435 42233806 40390487
32967 40390487 41212444 43364120 43985600 42598630 41404030 42614825 46001041 48923548
32959 48923548 49172553 47756264 47674027 49692573 51199806 50099980 47759932 46609134
32951 46609134 46819876 47340845 48393656 50435214 51973913 51213768 49244484 49016938 51341680
32942 51341680 54076859 55138747 54369243 52634899 51026831 50863780 52664234 55074266
32934 55074266 56259949 56141092 56003804 56657723 58442641 61794871 65637205 66540351 62498209
32925 62498209 56728469 54316316 55422694 55567836 52825324 50549987 51811365 55196105
32917 55196105 58153293 60828371 63899408 65772166 65157225 64026302 64649944 65596315
32909 65596315 64171237 61404801 60899396 63434432 66286251 67707155 68699819 70170734
32901 70170734 71611114 73264550 76532474 81054977 84038465 84064136 83568946 85905366
32893 85905366 91340048 97396895 102113238 105716362 109754605 115386448 122054753 127778000
32885 127778000 131709395 136094449 143822200 153921510 161892236 165372639 167049281 170465342
32877 170465342 175251953 178607236 179517440 178867027 176805266 173042281 169053721 166869107
32869 166869107 165615866 162093791 155267490 147674718 141735563 137152207 132884335 129095080
32861 129095080 125576242 120669812 114071912 108914687 108283433 110661817 111700412 110064204
32853 110064204 108417855 108299638 107418199 103765304 99653204 98800486 100816584 101656851
32845 101656851 99247116 95760887 93867470 93453054 93241691 93187323 93304949 92104864 88798973
32836 88798973 85831709 86241362 88987070 90073787 88524207 87765163 89866868 91938720
32828 91938720 90876237 88886292 90507858 95555262 99211957 99151468 98544242 100709669
32820 100709669 104201552 105503683 104220418 102876104 102982790 104084277 106055828 109597673
32812 109597673 114246605 118209906 120826954 123362465 126663001 129869844 132534884 136225269
32804 136225269 142261456 149051536 153726997 155829743 157258098 158752519 158814698 156657381
32796 156657381 153893252 151906768 149355146 144191314 137095917 130907182 127121969 124771569
32788 124771569 122549248 120231547 117761044 114491681 109962020 104548123 99140550 94881267
32780 94881267 92852865 92757461 92159968 88712593 83364884 79859402 80654783 84584025 88556266
32771 88556266 89887091 86850301 79298129 69955921 63405180 62265273 65080044 68475130
32763 68475130 70206296 69825412 68273725 67683640 69714787 72983668 73934484 71444533
32755 71444533 68674687 68879655 71182406 72225790 70512414 67450182 65436815 66308128
32747 66308128 70157678 74352409 75433998 73240671 71037202 70345473 68600256 63958760
32739 63958760 59230796 58065273 59972872 62218515 63794263 64152702 61358969 55864660
32731 55864660 52757375 54824952 56493041 51347135 43256873 41946687 48401080 53492035
32723 53492035 51995684 48925200 49110202 49213667 45123543 40088308 39155728 40643532
32715 40643532 39597999 36173718 34427336 35177426 35742233 35336381 35746354 37385065 38694224
32706 38694224 38884716 38153753 36171476 33168577 31263816 31982267 33718413 33983377 32494295
32697 32494295 29890062 25761029 20625744 17388303 17764801 19515604 20122888 20552922
32689 20552922 22215720 23368461 22545302 22423814 25463307 28496607 27204630 23728198
32681 23728198 23608303 26516307 26723325 22709578 19740412 21622980 25491390 26679365
32673 26679365 24398419 20920371 18791598 20008004 24475194 28472822 27997949 23981237
32665 23981237 20730020 19548020 18314024 17082860 18539923 22148306 23672801 22202626
32657 22202626 21911637 24471117 25508851 22064221 18228303 18880171 22121981 22933876
32649 22933876 21123319 20461205 21963844 22938804 21750401 19519411 17677844 17053546
32641 17053546 18661674 22477141 26057147 26878383 25290418 23123938 20821173 18393337
32633 18393337 17584211 19910565 23486789 24857748 23482114 21749171 21216642 21620817
32625 21620817 23028021 25809578 28361079 27748171 23362481 17910670 14304061 13254778
32617 13254778 14022775 15594652 16768330 16743687 16004994 15378790 14466035 12662591 11317342
32608 11317342 12478991 15274171 16153411 13793448 11392189 12304135 15178070 15813583
32600 15813583 13021085 10078522 10115572 12308698 13833119 13924282 14024128 14565126 14006826
32591 14006826 11741684 9992325 11207321 14607849 17033892 16721278 14634942 12449358
32583 12449358 11083710 11232764 13283773 16050735 17313737 16528207 15608042 16134075 17198853
32574 17198853 17178526 16359551 16250650 17056941 17465715 16712397 15438355 14377124 13414922
32565 13414922 12461633 12352610 13963706 16653699 18493605 18361315 17106167 16085926
32557 16085926 15383423 14605327 14632562 16551105 19026061 19265538 17129206 15525684 15679723
32548 15679723 15260875 13194439 12672269 15827982 18567207 15635289 8977162 5617460
32540 5617460 7949989 11703872 13657310 15442708 18262716 19539838 17679550 15637201
32532 15637201 16417460 18430412 18444780 16338610 14059530 12408925 11544096 12305520 14493466
32523 14493466 16031827 16087106 16616688 18694657 20145955 19323671 18225374 18920453 19901905
32514 19901905 19358431 19029989 20797051 22305826 20826733 19171130 22094819 27945470
32506 27945470 29936973 26096880 22245470 23370551 26841772 26939703 22736110 18373911
32498 18373911 17375173 19385015 21911341 23346309 23936938 24335506 23720341 20403602 14895499
32489 14895499 10857964 11253251 14535601 16738758 16631755 16470178 18011366 20355494
32481 20355494 22016101 22877693 23456350 23910782 24309519 24542510 23831533 21753821 19682040
32472 19682040 19470803 20633130 20741901 18985003 17265075 16957026 16655676 14778940 12894619
32463 12894619 14088583 18302198 21689646 21585298 20168202 21073740 23517208 23116655
32455 23116655 19026754 16387931 19158105 23832317 24415369 21314594 19982334 21857667
32447 21857667 22988341 22196758 23823707 29803473 35238960 35858299 34626476 36211143
32439 36211143 39456304 40859696 41691604 45272887 49694727 49914485 46035009 43372406
32431 43372406 44509010 46705669 47265650 46444669 44803376 42419642 41090332 42774033
32423 42774033 45397880 44569146 39859128 35062590 32004054 28935595 25682528 25017824
32415 25017824 27219118 28217751 25614494 22362059 21850833 23003170 23026730 21899192 21252306
32406 21252306 21298325 21494950 22194669 23337260 23384864 21636421 19893599 19982168 21243852
32397 21243852 22140036 22668071 23430662 23729680 22405243 19824155 17809766 17947382 20139385
32388 20139385 22120784 20978910 16626095 12917238 13154655 15454338 15522678 13164820
32380 13164820 12176625 14026611 16094516 16769037 17630124 19162953 18973899 16545808 15442540
32371 15442540 17789807 20283645 19114958 15843741 14839490 17317798 21358421 25657059
32363 25657059 29584558 31169883 28874990 24697726 22296127 22395794 22757567 22270671 22272000
32354 22272000 23624336 24920746 24470311 22674873 21497740 21929895 22551859 21184946
32346 21184946 18198160 16967844 19640884 23586590 24407574 21682033 18721690 17166336
32338 17166336 15731183 14602073 16485772 21541958 25369540 24578897 21075375 18338899
32330 18338899 16684765 14947938 13688925 13496158 12862589 11146673 11131660 14995925 19955313
32321 19955313 21850719 21296887 22103827 24801542 26076354 24324273 21786347 20757171
32313 20757171 20840562 20524743 19024756 16263560 13147774 11875850 13872160 17401368
32305 17401368 19168630 18238764 16589333 16008037 16370424 16985451 17816656 18961893 20052934
32296 20052934 20475645 19878722 18949756 19670068 23260807 27521021 28479158 25718787 23441536
32287 23441536 24565173 26686528 26496459 25295550 26339582 28811144 28986628 26572159
32279 26572159 25343235 27218016 29773025 30674265 31041289 32647937 34397944 33814966
32271 33814966 30810371 28141914 28257960 30533883 31956351 30729336 28911507 30322720
32263 30322720 35538224 40567780 41463308 38654445 35425836 33725725 33209419 33064505
32255 33064505 32842458 32361121 32285309 33822672 36707956 38978705 39904525 41106237 43307150
32246 43307150 44493987 43396808 42111343 42508272 42673181 40340166 37489088 37457308 39276279
32237 39276279 39302193 37331028 36577965 38089301 39478243 39099440 37559219 35297239 32630665
32228 32630665 31881170 35040113 39275547 39508414 36074071 34875423 38537189 42399056
32220 42399056 41794342 38892097 38788435 41945385 44362629 43564851 41038259 39377464
32212 39377464 39558846 40961455 42469178 43420251 44100967 45123126 46300347 46803419 46295155
32203 46295155 45163000 44099621 44210420 46300082 48751583 48017763 43553322 40149159
32195 40149159 41848788 45454740 44925775 41139110 41201130 47439774 53487183 53772198 51070033
32186 51070033 50705829 52145282 51517352 49197180 49135215 52000682 54185893 53579063 52072301
32177 52072301 51772848 52266802 52689246 53666926 55727437 57661341 57882001 56306323 53942550
32168 53942550 51668317 50391566 51330520 54448128 56912747 55257044 50161569 47350408
32160 47350408 51423933 59554867 64242819 62476245 58664886 57300137 56920870 54543341
32152 54543341 52274004 54301999 59308418 61744551 60415131 60082641 63464984 66840770
32144 66840770 65751183 60868921 55766113 52289527 50513487 50213653 50007653 47709104
32136 47709104 43689512 41304799 42086227 43457921 43352748 43744399 46604829 49405426
32128 49405426 48429946 44482950 41536167 41171462 41982137 43297020 45613413 47687237
32120 47687237 46883344 43026420 39200770 37981086 38789523 39466392 38843308 37334429 36230424
32111 36230424 36739831 38892996 41311911 42540145 42253591 40865517 38883502 37249109
32103 37249109 37144179 38512822 39753250 39741061 39159817 39088343 39500273 40014947 40814131
32094 40814131 41821541 42226550 41804699 41510168 41890115 42131292 41368636 39624682 37091205
32085 37091205 34268202 33115166 35628789 40485109 43607698 43068055 40901872 39288215
32077 39288215 38146925 37663865 39292990 42157425 42387759 38895814 36098984 37571902
32069 37571902 40604584 40907238 39104640 37933953 36395588 32346922 28368965 28763832
32061 28763832 32073297 32773943 29777807 27193862 26821631 26057295 23764400 22170115
32053 22170115 21848763 20683920 19222288 20994376 25344541 26068678 20533623 14654314
32045 14654314 14562582 17902546 18209241 14411659 10910153 10556488 12419451 15167377 18321309
32036 18321309 20739902 21360459 21111378 21502031 22095938 21690940 20758982 20229537 19273262
32027 19273262 17037818 15133879 15315122 15988939 14450196 11597153 10722998 12093922
32019 12093922 12498156 10271495 7279114 5646230 5892814 8521360 13666600 18480013
32011 18480013 18912409 15533643 13618844 15434473 16536916 12877002 7838387 7656091
32003 7656091 12152238 15148081 13395475 10232862 9825151 12074435 14701273 16791665
31995 16791665 18162214 17891837 15868239 14025959 13943606 14579509 14229449 13331252 13271338
31986 13271338 13586493 12679553 10669282 9313178 9416191 10315975 11634838 13429112 14702097
31977 14702097 14000549 11798508 10290956 10433530 11095712 11478280 12201473 13378081 13897404
31968 13897404 13623577 14045211 15414972 15518336 13117939 10571598 10725921 12796208 13822382
31959 13822382 12993588 11887240 11297394 10620200 9915185 9745087 9129415 6621051 3658683
31950 3658683 3694292 7064290 9822833 9323747 8076632 9512660 12217607 11879959 8017299
31941 8017299 5012878 5949013 8699741 9765803 9347116 9933022 11400971 10989083 8278002
31932 8278002 6811307 9028663 12122757 11676306 7966233 5390736 6011010 7172362
31924 7172362 6320858 4816724 5053273 6501326 7242059 7536592 8928822 10908972 11436520
31915 11436520 10352969 9558820 9842260 9992004 9210587 8128561 7165853 6042393 5182060
31906 5182060 5434469 6137510 5795454 5020919 6082847 8774676 9771578 7628097 5420223
31897 5420223 6020820 7358688 5693325 1932257 764157 3710832 6714029 5751346
31889 5751346 2172657 679837 3483334 8192335 10942365 10267385 7849245 6322899
31881 6322899 6776605 8152928 8644200 7479549 5636109 5081365 6856804 9374757 9422846
31872 9422846 6142218 3196006 4685348 9109283 10533751 6692906 2380577 2485846
31864 2485846 5127078 5550743 4106118 5010073 8321694 9196281 5952043 3155648 4382793
31855 4382793 6951495 7206987 6688083 8613125 11449880 11082495 7643988 5264869 5717496
31846 5717496 6740884 6492331 5609030 4775761 4018014 4461599 6912343 8559002 5371699
31837 5371699 -1574152 -6530071 -6779100 -5250706 -4068416 -919137 5210783 9834682
31829 9834682 8949280 5378236 4333431 5656492 5581135 3894262 3773880 5680803 6850766
31820 6850766 6629132 7326044 9400363 10278378 8725415 6512844 4977604 3458825 1815109
31811 1815109 1081662 977833 38383 -1282176 -980922 661388 1222067 505598 842266
31802 842266 2425221 2629975 999126 406948 1756395 2164054 543786 364648 3975318
31793 3975318 8332867 9595052 8285346 6705536 4878985 2523752 1481403 2386971
31785 2386971 2299617 -343897 -1779433 1630754 7170401 9885296 9984197 10738477 11668710
31776 11668710 9999409 7038683 6517834 7559759 6022935 2571876 2425715 6364241
31768 6364241 8975004 7592213 6184306 7560951 8202308 4978496 1526282 2760570
31760 2760570 6957063 8662173 6881652 5183254 5245790 5348365 4832779 5550728 8228483
31751 8228483 10780355 11235457 10017942 8601757 7807380 8011077 9274159 10465717 9655049
31742 9655049 6386119 2789571 1572668 3231180 5840795 7416592 7816081 8042743
31734 8042743 8265906 7567523 5847283 4768919 5732079 7631779 8099974 6823768 6135504
31725 6135504 7872315 10730071 11443719 8222499 2726485 -1215248 -1009103 2305799
31717 2305799 5289179 5707299 4134535 2030553 -37323 -1449366 -834851 1815534
31709 1815534 3822133 2915645 757863 955691 4007028 6580780 5810256 2269704 -1427212
31700 -1427212 -3218375 -2611599 -567291 1402454 2694023 3650865 3840702 2174350 -200169
31691 -200169 168602 3927655 6550402 4448821 898877 1497958 5705134 8076529 6710673
31682 6710673 4710366 3514400 902783 -3391311 -5876167 -4901883 -2944033 -1431335
31674 -1431335 1545063 6029973 7906251 5036790 1305717 1108052 3585164 5528013
31666 5528013 6244794 6218145 4654906 2015550 1517403 4318405 6424347 4255790 194473
31657 194473 -1376933 -468016 309373 875005 2332681 3152511 1681136 308055 2133252
31648 2133252 5312598 5700872 3472527 2071814 2133674 1725420 1246500 2444156 3573340
31639 3573340 1523116 -1713904 -906658 3910721 7034671 5956244 4364614 4845323
31631 4845323 4865018 2512794 460679 877137 1298856 -701060 -2763182 -1505230 2133036
31622 2133036 4887933 5861269 5916431 4797645 2146030 -468992 -1402187 -1150332 -369123
31613 -369123 2216895 7212706 11776259 12426501 9406186 5808931 3609757 2750263 2761555
31604 2761555 3073323 2991083 3220246 5673824 9827916 11587923 8458097 3538494 1075104
31595 1075104 273217 -2176288 -5045781 -3469200 2925853 8006973 7070344 2748550
31587 2748550 604138 1988955 4161454 5295482 6066979 6978143 6931148 4979330 1987260
31578 1987260 -80699 -48621 1367123 2148199 1013070 -919703 -1103007 1375023 4281426
31569 4281426 4445853 1220990 -2781331 -4329031 -2640247 131981 1306357 454986
31561 454986 -459442 254791 1945195 2838019 2581900 2289992 2452352 2579316 3080059
31552 3080059 5343690 8872259 10421045 8086784 4766061 4704802 7247142 7450015 3514010
31543 3514010 -3742 1457714 5816846 7386788 4822580 2078114 1855774 2253710
31535 2253710 961068 -846207 -860481 795320 2671605 4547506 6471090 7071041 5484342
31526 5484342 3470183 2807428 2058911 -716861 -3302728 -1724490 2906719 4833421
31518 4833421 2109294 -221299 2020252 5526267 4854342 1167810 327224 3584572
31510 3584572 5729134 3128624 -1270985 -2987466 -2163151 -1745664 -2245412 -1869438 -507926
31501 -507926 50229 -295574 474823 2577714 3097821 329047 -2916602 -2844891 -75091
31492 -75091 1415006 186759 -1020945 -76324 1304452 839229 -394228 22117 1589642
31483 1589642 1873237 1109798 2406978 6710989 10532238 10212986 6414145 2701321 1205652
31474 1205652 1399855 1959829 1918322 655762 -1414337 -2454480 -1156841 1050854 1407409
31465 1407409 -457028 -1865599 -683677 1943055 3354806 2724192 1478595 1119718
31457 1119718 1849944 3008461 3700953 3101539 1243040 -424438 -372506 902940 1354159
31448 1354159 411052 50316 1730445 3648190 2911436 -339877 -3136513 -3689824 -2830086
31439 -2830086 -1395640 909024 3101968 2495246 -1096551 -3261662 -222572 5439915
31431 5439915 7713611 4915437 913722 -1042467 -1568178 -1467588 840282 5766559
31423 5766559 9685272 8976669 5200145 3112818 4493763 6845312 7765238 7618909 7383877
31414 7383877 6386948 3647426 251421 -1039053 1412465 6080143 9257090 8535823
31406 8535823 5445259 3795614 4976793 6111671 3927086 -748469 -4052918 -3897944
31398 -3897944 -1717383 296070 1508463 2049413 1788511 1147860 1458736 3261964 5138900
31389 5138900 5357562 4178214 3582557 4871828 7102573 7921809 5942754 2517230 760675
31380 760675 2057286 3977616 3015791 -770777 -3669830 -3206757 -1033566 103814 99149
31371 99149 229654 -18853 -1955148 -4240259 -3676860 -1115 2871924 1789240 -1448275
31362 -1448275 -2583841 -291535 2829069 4002739 3110641 1631507 325211 -1104631
31354 -1104631 -2628685 -3187883 -1854373 553414 1853917 1077197 -4543 954930 3540447
31345 3540447 5017839 4295598 3536870 4793599 6697925 6210351 2686410 -1576196 -4308869
31336 -4308869 -5053376 -4220216 -2165149 433777 2531015 3497222 3318579 2169285 583343
31327 583343 -370423 -235148 -159125 -1469871 -3552868 -4565802 -4000369 -2914188 -1771452
31318 -1771452 71255 2554182 4477660 5321258 5783912 6066969 5390254 3770888 2480514
31309 2480514 2026831 1407704 100028 -912752 -765302 378659 2456054 5330394 7019452
31300 7019452 5007427 471072 -1931098 -271412 1816247 857004 -1222392 -835294
31292 -835294 1290405 2056129 1667427 2665260 4633036 4709908 2847113 1897194 2579912
31283 2579912 2957867 3067523 5165462 8538098 9038392 5448810 1716442 797697 733562
31274 733562 -617579 -1401072 264454 2094658 1528395 580840 2265817 4716541 3875377
31265 3875377 391725 -1432835 -914163 -1797471 -5226722 -7016739 -3943000 1186791
31257 1186791 3391954 1787741 -609802 -1517490 -1217231 -656186 -19793 781097 1606993
31248 1606993 2269170 2505202 1817436 -124310 -2898150 -5409448 -6608077 -6236349 -4999760
31239 -4999760 -3764921 -2513654 -772055 651173 -303972 -3923175 -6929924 -5903633
31231 -5903633 -2053085 -41561 -1701921 -3619387 -2310378 608818 778445 -2826863
31223 -2826863 -6893430 -8387360 -7516214 -5727420 -3294309 -297673 1719995 1067427
31215 1067427 -1626473 -3776857 -3656105 -1858645 -124305 280690 -858390 -2563741
31207 -2563741 -3012239 -1281500 915865 584731 -2766773 -5989017 -6009324 -3544256 -1684501
31198 -1684501 -1718008 -2182431 -1565249 107517 2351383 4740662 5901189 4259607 1005466
31189 1005466 259543 4208316 9244865 9393632 3502015 -3064865 -4521368 -921297
31181 -921297 2679670 2363317 -668683 -2240570 -368454 2448325 2191073 -1830748 -5789068
31172 -5789068 -5438288 -1004203 2937151 2660382 -602635 -2565923 -1095197 2039587
31164 2039587 4443264 5926976 6929432 6161107 2358879 -2442810 -4283938 -2195343
31156 -2195343 759668 1883493 1659060 1283800 402813 -848108 -323565 2952020 6239148
31147 6239148 6607032 5189009 4867416 5496530 5053551 4095697 4855806 6650763 6574673
31138 6574673 4551890 3303269 3297725 2501282 1433761 2960064 5810821 4330583 -2581978
31129 -2581978 -7980260 -6260736 -1046048 1118364 553941 2053673 5857468 7563730
31121 7563730 5605826 2690751 267540 -2709575 -5324255 -4563159 -781416 1531233
31113 1531233 139654 -1824204 -972427 1668085 3206682 3234705 3409771 4687418 6651471
31104 6651471 8014224 6818545 2063549 -4005507 -7370803 -6995853 -5961964 -6854686
31096 -6854686 -8389290 -8068533 -5968138 -3979772 -2918176 -2252624 -1617723 -1071209 -640553
31087 -640553 -523523 -739886 -147871 2447524 5509395 5408279 1382392 -2307285 -1390347
31078 -1390347 2873733 5643462 4757503 2245178 268327 -1174688 -2010496 -675818
31070 -675818 3209862 6708910 6464814 3013178 36144 -533408 -316909 -751775 -191492
31061 -191492 3008436 6386409 5882054 2066832 -14528 1831804 3682516 1743986
31053 1743986 -1752051 -2323917 -47880 1685869 2218849 3488169 4841379 3416724
31045 3416724 71057 -373271 3570540 7091363 5743214 1277587 -1778386 -2159219
31037 -2159219 -1663723 -1508862 -1753093 -2531949 -3451966 -3211489 -1564304 -1095 774330
31028 774330 1767893 2922992 2539161 1195547 2542012 7364570 10531929 7729041 2173022
31019 2173022 179323 2559134 5334198 6919658 8867659 10447967 8590523 3721926
31011 3721926 164762 -484226 -1344888 -3977244 -5064771 -2067054 1975612 2719205 619227
31002 619227 -724293 -214070 242971 -284499 -521355 398061 1489422 1481936 431385
30993 431385 -563313 -640983 -154985 -424316 -2041702 -3703152 -3810862 -2974651 -3271011
30984 -3271011 -4990527 -6099065 -5330771 -3722948 -2379894 -902812 890018 1835855
30976 1835855 1457208 1219267 2208388 3305023 3249605 2724829 2631760 2249888 1345595 2170102
30966 2170102 6284504 10582024 9941670 3762993 -3117968 -6305493 -5927472 -4393382
30958 -4393382 -2944413 -1783649 -1426921 -2100387 -2968186 -3308907 -3508557 -3807919 -3167513
30949 -3167513 -798177 1907477 2526883 538569 -2140316 -3583197 -3702767 -3390949 -2836326
30940 -2836326 -1477346 766179 2964895 4009733 3674455 2780885 2471486 3288531 4709767
30931 4709767 5491349 4668418 2413307 -50036 -1301878 -513689 2097733 4997235 5914893
30922 5914893 3877267 787581 -331659 848990 1456096 -301717 -2150876 -1041258
30914 -1041258 1987968 3030115 878355 -1640043 -2102169 -1235100 -417156 556057 1732949
30905 1732949 1801726 645329 689935 3285206 5808596 5192501 2708020 2095022 4020998
30896 4020998 5759716 5902418 5901831 6592600 6397654 4096242 939267 -1197950 -1919319
30887 -1919319 -1590491 -272831 1492126 2187620 769053 -2035431 -4268749 -3970314 -308835
30878 -308835 5042985 8049250 5893219 559835 -3128044 -3145929 -1758952 -1378654 -1814018
30869 -1814018 -2274817 -2933182 -3093313 -882566 3228096 5445300 3711797 1216264 1916821
30860 1916821 4779110 5883660 4482179 3033492 2315771 803118 -1250184 -1412813
30852 -1412813 454315 1302207 5336 -186147 3355208 7969773 8970562 5890481
30844 5890481 2520253 1421771 1151639 -782534 -4289367 -6965264 -6989073 -4878675 -2611357
30835 -2611357 -1509426 -1209418 -678368 180232 494617 -111313 -763605 -383232 881917
30826 881917 1562433 205731 -3008679 -5930586 -6321904 -4460275 -3012103 -3551561 -4311550
30817 -4311550 -2875316 -134067 742933 -935864 -2344173 -1593330 -614560 -1807329 -3769894
30808 -3769894 -2991328 819076 3631398 1975330 -2659705 -5457532 -3815885 -261253
30800 -261253 525199 -2842606 -6809802 -7032380 -3390003 139993 230910 -2489495 -5049742
30791 -5049742 -5769141 -5511350 -5896871 -6963481 -6786120 -3739012 790982 3073368 1403223
30782 1403223 -1428764 -1845114 -546913 -1077999 -3772388 -4760853 -1945794 1543607 1900087
30773 1900087 -233003 -1748926 -1830163 -1692183 -1369551 -179520 584470 -1138062 -4502938
30764 -4502938 -6369746 -5642068 -4135519 -2946588 -1023636 1887216 3818552 3537802
30756 3537802 2629093 3068495 4547908 5637729 5867888 5165792 3035413 223687 -398248
30747 -398248 2837637 6991624 7121023 2393296 -2672770 -3626926 -802340 2268433 3338364
30738 3338364 2753538 1439791 -264236 -1690532 -1567692 385529 2536882 3029088 1949539
30729 1949539 933298 908122 1194426 763262 -587511 -2412080 -4029301 -4597143 -3813125
30720 -3813125 -2825885 -3251347 -4737693 -4855712 -2429482 275448 234330 -2246969 -3906058
30711 -3906058 -2791016 -429249 631670 65068 -277787 987375 2936811 3280250 1106662
30702 1106662 -1613728 -2011726 131051 1986852 1390272 -465552 -1192354 -650565 -399662
30693 -399662 -760647 -752047 -485869 -1077056 -1972269 -866321 2850273 6581245 7589352
30684 7589352 6034474 3892249 2227011 767951 -764159 -2033918 -2318396 -962920
30676 -962920 1554560 2955574 1163012 -2478038 -3863261 -1213256 2257238 2484396
30668 2484396 -127253 -1910832 -1680456 -2433535 -6755496 -12793478 -16283820 -15413377 -12062796
30659 -12062796 -8607266 -5235822 -1231409 2341181 3141130 960067 -1211799 -810466
30651 -810466 957529 1300955 420408 1182709 4183884 6168693 4664099 1636952 482523
30642 482523 1279498 1561305 579229 -79823 158556 -315623 -2421730 -4431672 -4086249
30633 -4086249 -1530744 837968 862926 -1521617 -4324549 -5082819 -3093771 -356817 365787
30624 365787 -1383542 -3412283 -3765134 -2820570 -1910071 -1102140 287090 1709084 1689944
30615 1689944 206372 -899465 -520552 111614 -570785 -2091204 -2890105 -2584064 -1556035
30606 -1556035 644227 4004968 5808713 3071359 -2333770 -4719343 -2315076 -154044
30598 -154044 -2507417 -6192691 -5734432 -2240225 -1381554 -3892305 -4512321 -837171 3109671
30589 3109671 4058424 4345213 6391242 7559396 4919538 1083351 249151 1342131 433113
30580 433113 -1909654 -1331257 2787953 5882970 5044340 2867186 2961887 4994015 6000485
30571 6000485 4430610 1365805 -965395 -1094275 357547 1263280 741995 396590 1460250
30562 1460250 2267508 866912 -1355226 -1704516 -697405 -1113057 -3323827 -5260946 -6422556
30553 -6422556 -7811929 -8237107 -5371102 -799267 1005244 -294702 -160140 2863056
30545 2863056 4040835 255502 -4350489 -4633377 -1971548 -870540 -1650443 -1604448 -710709
30536 -710709 -952257 -1840366 -1588614 -1191505 -2452082 -3387304 -777891 3735863 5461608
30527 5461608 3887542 2553504 2116307 -227513 -3952018 -4543832 -1399443 152419
30519 152419 -2395218 -4153392 -989958 3435952 3926871 2247279 3254330 6100267
30511 6100267 6148168 3647039 3397092 6123434 6924215 3393863 -607899 -1273782 60058
30502 60058 569467 341275 238893 -886411 -3476662 -4724997 -2433784 724461 577570
30493 577570 -2340242 -3807708 -2493629 -1645749 -3833703 -7379863 -9189724 -8608793 -7082020
30484 -7082020 -5841190 -5307761 -5436859 -5443040 -4251136 -2203115 -1244051 -2437110 -4399157
30475 -4399157 -5304866 -5294008 -5446745 -5384759 -3830776 -1150786 670315 764313 310443
30466 310443 281723 -10798 -1215936 -2252655 -1684485 33953 979493 80101 -1891316
30457 -1891316 -3262361 -2662863 126477 3574120 5127508 3572614 396905 -1914234
30449 -1914234 -2288178 -971624 1709607 4776034 5862905 3593100 267868 -672304
30441 -672304 61586 -1727380 -6771137 -9858249 -6910419 -1452466 -243404 -4188806
$$ [...]
##END NTUPLES=NMR SPECTRUM
##END=
