##TITLE=31Pdec_AT-44x_T3
 DMSO-d6+CD3ONa, 324 sc
 25.8.2022
##JCAMPDX= 6.0         $$ Bruker NMR JCAMP-DX V2.0
##DATA TYPE= NMR SPECTRUM
##DATA CLASS= NTUPLES
##ORIGIN= UXNMR, Bruker Analytische Messtechnik GmbH
##OWNER= root
$$ XWIN-NMR		Version 3.5
$$ Thu Aug 25 13:29:20 2022 Russian Standard Time (UT+4h)  she@DPX200
##.OBSERVE FREQUENCY= 81.013821
##.OBSERVE NUCLEUS= ^31P
##.ACQUISITION MODE= SIMULTANEOUS
##.ACQUISITION SCHEME= undefined
##.AVERAGES= 324
##.DIGITISER RES= 16
##SPECTROMETER/DATA SYSTEM= spect
##.PULSE SEQUENCE= zgpg30
##.SOLVENT NAME= DMSO
##.SHIFT REFERENCE= (INTERNAL, DMSO, 0, 248.564)
##AUDIT TRAIL= $$ (NUMBER, WHEN, WHO, WHERE, WHAT)
$$ ##TITLE= Audit trail, XWIN-NMR		Version 3.5
$$ ##JCAMPDX= 5.01
$$ ##ORIGIN= Bruker BioSpin GmbH
$$ ##OWNER= she
$$ F:/spectra/data/she/nmr/P31/1/pdata/1/auditp.txt
$$ ##AUDIT TRAIL=  $$ (NUMBER, WHEN, WHO, WHERE, WHAT)
(   1,<2022-08-25 13:20:40.42 +0400>,<she>,<DPX200>,
      <created by zg, POWCHK disabled, PULCHK disabled
       configuration hash MD5:
       00 E9 B6 7A A2 85 ED C7 34 08 36 98 17 FE 4E 26
       data hash MD5: 32K
       7D 17 78 40 2B B5 2C E0 E9 31 7C 79 3C DF 1C 1C>)
(   2,<2022-08-25 13:20:45.48 +0400>,<she>,<DPX200>,
      <Start of raw data processing
       efp BC_mod = 2 LB = 1 FT_mod = 6 PKNL = 1 PHC0 = -10285.38 PHC1 = 88.85633 SI = 64K 
       data hash MD5: 64K
       62 4A A7 78 3B 59 55 5A D8 D9 71 6B 87 2D FF 70>)
(   3,<2022-08-25 13:20:59.79 +0400>,<she>,<DPX200>,
      <abs ABSG = 5 
       data hash MD5: 64K
       48 73 AA 82 11 F9 8C C1 B2 50 0A 41 45 99 26 68>)
(   4,<2022-08-25 13:21:23.79 +0400>,<she>,<DPX200>,
      <pk PHC0 = 46.06216 PHC1 = -105.2 
       data hash MD5: 64K
       9A 0A 14 5B BE 9F 47 DD 9E 1E 39 9A 63 A2 BE 28>)
$$ ##END=
$$ 
$$ hash MD5
$$ DD 32 A9 43 1F 05 85 12 22 87 C5 83 6B 59 28 3E
##$RELAX= 
##$RELAX= 
##$RELAX= 
##$RELAX= 
##$RELAX= 
##$RELAX= 
##$RELAX= 
##$RELAX= 
$$ Bruker specific parameters
$$ --------------------------
##$DU= <F:/spectra>
##$EXPNO= 1
##$NAME= <P31>
##$PROCNO= 1
##$TYPE= <nmr>
##$USER= <she>
##$AMP= (0..31)
100 100 100 100 100 100 100 100 100 100 100 100 100 100 100 100 100 100 
100 100 100 100 100 100 100 100 100 100 100 100 100 100 
##$AQSEQ= 0
##$AQ_mod= 1
##$AUNM= <au_zg>
##$AUTOPOS= <>
##$BF1= 81.014009
##$BF2= 200.13
##$BF3= 200.13
##$BF4= 200.13
##$BF5= 200.13
##$BF6= 200.13
##$BF7= 200.13
##$BF8= 200.13
##$BYTORDA= 1
##$CFDGTYP= 0
##$CFRGTYP= 5
##$CHEMSTR= <none>
##$CNST= (0..31)
1 1 145 1 1 1 1 1 1 1 1 1 1 1 1 1 1 1 1 1 1 1 1 1 1 1 1 1 1 1 1 1 
##$CPDPRG= <waltz16>
##$CPDPRG1= <>
##$CPDPRG2= <waltz16>
##$CPDPRG3= <>
##$CPDPRG4= <mlev>
##$CPDPRG5= <mlev>
##$CPDPRG6= <mlev>
##$CPDPRG7= <mlev>
##$CPDPRG8= <mlev>
##$CPDPRGB= <>
##$CPDPRGT= <>
##$D= (0..31)
0 1 0 0 0 0 0 0 0 0 0 0.03 2e-05 3e-06 0 0 0 0 0 0 0 0 0 0 0 0 0 0 0 0 
0 0 
##$DATE= 1661419240
##$DBL= (0..7)
120 120 120 11 120 120 24 19 
##$DBP= (0..7)
150 150 150 150 150 150 150 150 
##$DBP07= 0
##$DBPNAM0= <>
##$DBPNAM1= <>
$$ [...]
##$SUBNAM3= <"">
##$SUBNAM4= <"">
##$SUBNAM5= <"">
##$SUBNAM6= <"">
##$SUBNAM7= <"">
##$SUBNAM8= <"">
##$SUBNAM9= <"">
##$SW= 501.771253377433
##$SWIBOX= (0..15)
0 1 3 0 0 0 0 0 0 0 0 0 0 0 0 0 
##$SW_h= 40650.406504065
##$TD= 32768
##$TD0= 1
##$TE= 0
##$TE2= 300
##$TE3= 300
##$TEG= 300
##$TL= (0..7)
0 120 53 12 22 120 120 120 
##$TP= (0..7)
150 150 150 150 150 150 150 150 
##$TP07= 0
##$TPNAME0= <>
##$TPNAME1= <>
##$TPNAME2= <>
##$TPNAME3= <>
##$TPNAME4= <>
##$TPNAME5= <>
##$TPNAME6= <>
##$TPNAME7= <>
##$TPOAL= (0..7)
0.5 0.5 0.5 0.5 0.5 0.5 0.5 0.5 
##$TPOFFS= (0..7)
0 0 0 0 0 0 0 0 
##$TUNHIN= 0
##$TUNHOUT= 0
##$TUNXOUT= 0
##$USERA1= <user>
##$USERA2= <user>
##$USERA3= <user>
##$USERA4= <user>
##$USERA5= <user>
##$V9= 5
##$VALIST= <valist>
##$VCLIST= <CCCCCCCCCCCCCCC>
##$VD= 0
##$VDLIST= <DDDDDDDDDDDDDDD>
##$VPLIST= <PPPPPPPPPPPPPPP>
##$VTLIST= <TTTTTTTTTTTTTTT>
##$WBST= 1024
##$WBSW= 4
##$XGAIN= (0..3)
0 0 0 0 
##$XL= 0
##$YL= 0
##$YMAX_a= 61367
##$YMIN_a= -35673
##$ZGOPTNS= <>
##$ZL1= 120
##$ZL2= 120
##$ZL3= 120
##$ZL4= 120
##$ABSF1= 248.5645
##$ABSF2= -253.2056
##$ABSG= 5
##$ABSL= 3
##$ALPHA= 0
##$AQORDER= 0
##$ASSFAC= 0
##$ASSFACI= 0
##$ASSFACX= 0
##$ASSWID= 0
##$AUNMP= <proc_1d>
##$AZFE= 0.1
##$AZFW= 0.5
##$BCFW= 0
##$BC_mod= 2
##$BYTORDP= 0
##$COROFFS= 0
##$CY= -3
##$DATMOD= 1
##$DC= 0
##$DFILT= <>
##$DTYPP= 0
##$F1P= 0
##$F2P= 0
##$FCOR= 1
##$FTSIZE= 65536
##$FT_mod= 6
##$GAMMA= 0
##$GB= 0
##$INTBC= 1
##$INTSCL= 5.30512e-09
##$ISEN= 30
##$LB= 1
##$LEV0= 0
##$LPBIN= 0
##$MAXI= 10000
##$MC2= 0
##$MEAN= 0
##$ME_mod= 0
##$MI= 50
##$NCOEF= 0
##$NC_proc= -6
##$NLEV= 6
##$NOISF1= 182.463
##$NOISF2= 159.3651
##$NSP= 0
##$NTH_PI= 0
##$NZP= 0
##$OFFSET= 248.5645
##$PC= 4
##$PHC0= -10239.32
##$PHC1= -16.34367
##$PH_mod= 1
##$PKNL= yes
##$PPARMOD= 0
##$PSCAL= 0
##$PSIGN= 0
##$REVERSE= no
##$SF= 81.0140089999908
##$SI= 65536
##$SIGF1= 159.3651
##$SIGF2= -187.1042
##$SINO= 113.3802
##$SIOLD= 16384
##$SREGLST= <1H.CDCl3>
##$SSB= 0
##$STSI= 65536
##$STSR= 0
##$SW_p= 40650.406504065
##$SYMM= 0
##$S_DEV= 0
##$TDeff= 32768
##$TDoff= 0
##$TI= <>
##$TILT= no
##$TM1= 0
##$TM2= 0
##$TOPLEV= 0
##$USERP1= <user>
##$USERP2= <user>
##$USERP3= <user>
##$USERP4= <user>
##$USERP5= <user>
##$WDW= 1
##$XDIM= 65536
##$YMAX_p= 406789814
##$YMIN_p= -21116209
$$ End of Bruker specific parameters
$$ ---------------------------------
##NTUPLES= NMR SPECTRUM
##VAR_NAME=  FREQUENCY,     SPECTRUM/REAL,   SPECTRUM/IMAG
##SYMBOL=    X,             R,               I
##VAR_TYPE=  INDEPENDENT,   DEPENDENT,       DEPENDENT
##VAR_FORM=  AFFN,          ASDF,            ASDF
##VAR_DIM=   65536,         65536,           65536
##UNITS=     HZ,            ARBITRARY UNITS, ARBITRARY UNITS
##FACTOR=    0.620285442955139, 1,           1
##FIRST=     20137.2065510736, 0,            0
##LAST=      -20513.1999529914, 0,           0
##MIN=       -20513.1999529914, -21116209,   0
##MAX=       20137.2065510736, 406789814,    0
$$ Real data points
##PAGE= N=1
##DATA TABLE= (X++(R..R)), XYDATA
$$ [...]
37516h256050L717918L891633M367545K627167k957639p540545n643554P37474
37508i056051M992321M209563M57948l361109m915793k523157K297692M921865
37500b976721L387888R30762J68013o58077k376375j610025K371707L599810j350344
37491A486638n881861l097169K339970J728479k624922j494168M369263M454811
37483A281041l434555q251821k995113M444683M137961j417979l534454j167476
37475a0937713J65714p89242J59776M189834O818941M596493j11867k501339j148749
37466D41848Q21598o2128k871770l130223O08251L584834J484173k270355j267758
37457b661530L340465M055308r58442m776582k695699J289330K459617K485288
$$ y = [-8256050, -4538132, -646499, 3721046, 6348213, 3390574, -4149971, -9793525, -9056051, -4063730, 145833, 603781, -2757328, -7673121, -10196278, -7898586, -2976721, 411167, 1341929, 1509942, 851865, -1524510, -3134535, -762828, 2836982, 1486638, -4395223, -7492392, -5152422, -3423943, -6048865, -7543033, -3173770, 1281041, -2153514, -10405335, -13400448, -8955765, -4817804, -6235783, -9770237, -10937713, -10771999, -11561241, -11401465, -7211631, -392690, 4203803, 4091936, 1590597, 441848, 1263446, 1201318, -1670452, -4800675, -4192424, -607590, 876583, -1393772, -2661530, 678935, 4734243, 3775801, -1000781, -3696480, -2407150, 52467, 2537755]
37449B537755L708153L099443j748441o065680m405039L52711J577044p24209
37441a668263j349625O05867J230182l29288p18712Q70028J331161l18235j312782
37432a659667m31776L06878J20476O09726J502652L41361k255570k119738J685630
37423a900028M376135K349140j596557k942961j774627j054328j388194j095731
37415e027151K32269J391175J729391J300545o6677j872597k418012j148508j22059
37406f001624r87603j946829l33297K863547M008691J972443n70753j131350j16272
37397b243047Q83726J144641M74007r95296j883821n73447J929656K379916k10684
37388I05651k779452k551738p16600M34877J381205L099983L309767m47299n230658
$$ y = [2537755, 6245908, 9345351, 7596910, 1531230, -2873809, -2521098, -944054, -1668263, -3017888, -2412021, -1181839, -1511127, -2229839, -1359811, -28650, -346885, -1659667, -2091443, -1784565, -1664089, -1054363, 448289, 789650, -1465920, -3585658, -1900028, 2476107, 4825247, 3228690, 285729, -1488898, -2543226, -3931420, -5027151, -4794882, -3403707, -1674316, -373771, -440448, -2313045, -4731057, -5879565, -6001624, -6989227, -8936056, -9269353, -6405806, -2397115, -424672, -995425, -2126775, -2243047, -1359321, -214680, 259327, -735969, -2619790, -3193237, -1263581, 1116335, 905651, -1873801, -4425539, -5142139, -4707262, -3326057, -226074, 3083693, 2636394, -2594264]
37379b594264n442219j118059J905387R99029J58489K231932L611640P00709l222421
37370b769777k839057R06862K793984J332265n17082j060396j184116r80632Q0499
37361d237450L48264j994919m703511l758216O00816M362859N462124M698343
37353G78310K274557j530255l527449j207353J880867O11868k849195j961633
37345e530283K860869M295287L52941k467490o84008O15735k277947m798302k517556
37336a0150754J105636J458448O04041J932006K939023K66597l058323k372024
37328g275350P95805K131485J797362K037107J673438n74230j537545Q64140J993840
37319A906052k105891o203434l463787K396758K484676k414815l171044K374501
$$ y = [-2594264, -8036483, -9154542, -7249155, -6250126, -6091637, -3859705, -248065, 452644, -2769777, -5608834, -4701972, -1907988, -575723, -1092805, -2153201, -3337317, -4317949, -4237450, -3889186, -5884105, -10587616, -14345832, -13745016, -9382157, -3920033, 778310, 3052867, 1522612, -2004837, -3212190, -1331323, -719455, -3568650, -5530283, -2669414, 1625873, 1978814, -488676, -1172684, -556949, -2834896, -7633198, -10150754, -9045118, -7586670, -6982629, -5050623, -2111600, -1845003, -4903326, -7275350, -6479545, -4348060, -2550698, -513591, 1159847, 585617, -951928, -87788, 1906052, -199839, -6403273, -9867060, -7470302, -4985626, -7400441, -10571485, -8196984]
37311h196984O377798M303650R51920O34746O23918j820395l688135j910530J177159
37302a546853K098739J268553O40462M97305Q64384K034570K173915j020479n059176
37293A951420m401045Q45351L653743O6002m964075m997414p15128K576930K427804
37284c556412O72499j51217Q66381K555731K374202n02653l021570k205047k46694
37275c214780j085723k942827o06475M829205O007107P83923l918134k825901
37267b973605L66171O02471l92820R60336K681413J009036k338754k685404L66658
37258b404498L132772L198659P95051k732998m639839k034519L451506N815877
37250D582011K697545r37966o95115O08423j044593l232874j746559J149020K44260
$$ y = [-8196984, -1819186, 2484464, 3436384, 4071130, 4695048, 2874653, -813482, -2724012, -1546853, 551886, 1820439, 2460901, 2958206, 3822590, 5857160, 8031075, 7010596, 1951420, -2449625, -1604274, 2049469, 2115471, -2848604, -7846018, -8561146, -5984216, -3556412, -2883913, -3035130, -2168749, 386982, 2761184, 2258531, -763039, -2968086, -3214780, -4300503, -7243330, -7849805, -3020600, 2986507, 3770430, -147704, -2973605, -2607434, -2004963, -2397783, -1437447, 1243966, 2253002, -85752, -2771156, -2404498, 728274, 3926933, 4721984, 1988986, -2650853, -4685372, -1233866, 4582011, 7279556, 6341590, 5646475, 6254898, 5210305, 1977431, 230872, 1379892, 1624152]
37241A624152l413530m013827l13764L136305L444628K125888P93976n07250j019237
37232A857341j85511j18497k379100l649400j46839M980710N169555P57002j351735
37223D933526J156157K656339n47088m130779l141199M23507J911953J403807
37215D666223J930813L372954K947390K34988k294065l042309k439187q19705
37207D557102K084303N405549O935936N265903J289800k574821m311024l696899
37199A4955849k122154r89408n65739o16784j253812k273669k641322j917049
37191B575912j251642j485859j387614L42936K493120L073285K486654K189475
37183I036267J299692j843580n213381m459558M69513M084365K491718j533985
$$ y = [1624152, -1789378, -5803205, -6116969, -2980664, 463964, 2589852, 3383828, 2876578, 1857341, 1671830, 1553333, -825767, -4475167, -4622006, 358704, 5528259, 6285261, 4933526, 6089683, 8746022, 8198934, 4068155, 926956, 1350463, 3262416, 4666223, 6597036, 9969990, 12917380, 13152368, 10858303, 7815994, 5376807, 4557102, 6641405, 12046954, 18982890, 24248793, 25538593, 22963772, 18652748, 14955849, 12833695, 11844287, 11278548, 10661764, 9407952, 7134283, 4492961, 2575912, 1324270, -161589, -1549203, -1206267, 1286853, 4360138, 6846792, 9036267, 10335959, 8492379, 3278998, -1180560, -711047, 3373318, 5865036, 4331051]
37175D331051k841106o36073J615631J288195q47153k349636j710153K89154J097359
37166B37269p45835l031049k067644J909927M073275J410110k587589k346470
37158c148006K150564N323380L336598j477891m304839l538788j159194J009400
37150a808776K947208M360418L411764p33204n319995o361057l530394l48842
37142g382878R36380J779834L296124L183104j72977l275679j815737K039718
37134a412111K100672k040543l619949Q87966N695432M094164j535793l663625
37126E06213r55805O78927j926306m419745k220598K268202L387465L78816k203345
37117d506176j326250R00527J015087j074539k656462k050505j94967J195543
$$ y = [4331051, 1489945, 853872, 2469503, 3757698, 2910545, 560909, -1149244, -860090, 237269, -508566, -3539615, -5607259, -3697332, 375943, 1786053, -801536, -3148006, -997442, 4325938, 7662536, 6184645, 1879806, -1658982, -2818176, -1808776, 1138432, 5498850, 8910614, 8177410, 2857415, -3503642, -7034036, -7382878, -6446498, -4666664, -1370540, 1812564, 1639587, -1636092, -3451829, -1412111, 688561, -1351982, -4971931, -4083965, 1611467, 5705631, 4169838, 506213, -449592, 229335, -1696971, -6116716, -8337314, -6069112, -2681647, -2302831, -4506176, -5832426, -4931899, -3916812, -4991351, -7647813, -9698318, -9893285, -8697742]
37109h697742J642932J720104J687508J068172m10370j899141j948318j86948
37101g023803J845468K225902J085755O56906K292516M243616L560460q4176l732727
37092E069917m421814k004093J517344M205872N138233M321189K763377K047825
37084A8637850K819948L871175L384676R84450j848317l212732k383099k47996
37076B2005955J575925K192689J998056J741439J509143J086695O67539M20604
37068C3198045L7310m69430o18829j188140m169843q831534j0138729n010763
37060B808087J581455K166762k189990l120911J684129M190068j019781p091493
37052i91674n038920K248495M823736J049979j473594O61302K175061l83582k675442
$$ y = [-8697742, -7054810, -5334706, -3647198, -2579026, -2989396, -4888537, -6836855, -7023803, -5178335, -2952433, -1866678, -1209772, 1082744, 5326360, 8886820, 8802644, 5069917, 648103, -1355990, 161354, 4367226, 9505459, 13826648, 16590025, 18637850, 21457798, 25328973, 28713649, 29698099, 27849782, 24637050, 22253951, 22005955, 23581880, 25774569, 27772625, 29514064, 31023207, 32109902, 32777441, 33198045, 33235355, 32765925, 32147096, 30958956, 26789113, 17957579, 7818850, 2808087, 4389542, 6556304, 4366314, 1245403, 2929532, 7119600, 6099819, -991674, -6030594, -3782099, 1041637, 2091616, 618022, 1279324, 3454385, 3070803, 395361]
37043C95361q48892J713639Q97555q18487P02637L331429J947605k807374n071058
37034e57585k300021J822770L305068K543879K034480K354238K067892L49622
37026A1620343j500676j283999J220098L134410J718099j495309k292485Q39J178116
37017A2299436j316002m044040k854070M76470J095471j314299k570796r43087
37009H29083Q57262J037055J198406J920935N26135l822198o606876l649817K129023
37000e580992M307510K126439Q47819K609037K709816k056176o483067l981582
36992e501196K350107K943363l876856q425656l693062M152098N235989N77081
36984f238132j065735J995165K642120j615957l723725N90396M609939J260217
$$ y = [395361, -453531, 1260108, 2157663, 1339176, 2041813, 5373242, 7320847, 4513473, -557585, -2857606, -1034836, 2270232, 4814111, 6848591, 9202829, 11270721, 11620343, 10119667, 8835668, 10055766, 13190176, 14908275, 13412966, 11120481, 11121320, 12299436, 10983434, 6939394, 4085324, 4561794, 5657265, 4342966, 1772170, 829083, 1686345, 2723400, 3921806, 5842741, 6368876, 2546678, -4060198, -7710015, -5580992, -1273482, 852957, 1700776, 4309813, 7019629, 4963453, -1519614, -5501196, -3151089, -207726, -4084582, -12510238, -16203300, -12051202, -6815213, -6238132, -7303867, -5308702, -2666582, -4282539, -8006264, -7415868, -2805929, -1545712]
36976a545712n020504n120862P84240M887809M429677L430046K927271o53908
36968D118057o148126o205306J116828P321984N075542j547012l967690r91740
36960a227463K242998K997345K300482P72837p42334Q40943N937908Q231477K869370
36951B4223563l778301j598563P049167R199870R56581o025347k708254L365249
36943C0683965Q59597o896645p557098N17153O116405K251986n258060q199881
36935A2517422o118444k793733K56765K648515K787643N75049j325991j588728
36927F958498j772777j963282J88643L713932L353804k008851n661600k686095
36919A22272K059894J613876k185720k762222p9814N71688j049762j19350L135594
$$ y = [-1545712, -6566216, -11687078, -10902838, -6015029, -1585352, 1844694, 4771965, 4118057, -2030069, -8235375, -7118547, 203437, 5278979, 3731967, -235723, -1227463, 1015535, 4012880, 6313362, 7086199, 6343865, 7184808, 13122716, 21354193, 24223563, 20445262, 18846699, 25895866, 35095736, 36052317, 30026970, 27318716, 30683965, 31543562, 24646917, 17089819, 17606972, 23723377, 25975363, 20717303, 12517422, 6398978, 3605245, 3862010, 6510525, 9298168, 9873217, 8547226, 6958498, 5185721, 3222439, 3411082, 7125014, 10478818, 8469967, 2808367, 122272, 2182166, 3796042, 1610322, -1151900, -1231714, -660026, -1709788, -1829138, 1306456]
36910A306456K595343k681479n321818j169573L811982L184689l4351M93669L342309
36901E527227K055707l355213n407123k48615O335752O448033j19992o358919
36893D876857o556161j929592K053969K271795N86987J57764J117461J548573
36885D127653J145167R80334M83184j587731l282084j168982L142617L395421
36877G235579k025776o483016m583779k52642K928k527209k035246J219265J762872
36868g687024q07933j032679K136353K850076j188898l893251q05930L228712
36860g200574K249683r97845m98551K435009K102051j033922j450445J015265
36852c379329Q93158k209239j819570L721278O487361R28120o579493o765478
$$ y = [1306456, 3901799, 1220320, -4101498, -5271071, -1459089, 1725600, 1691249, 2184918, 5527227, 7582934, 4227721, -1179402, -1428017, 4907735, 11355768, 11235776, 4876857, -1679304, -3608896, -1554927, 716868, 1303855, 1461619, 2579080, 4127653, 5272820, 6253154, 6736338, 5148607, 1866523, 697541, 3840158, 7235579, 5209803, -1273213, -5856992, -6109634, -6106706, -8633915, -10669161, -9449896, -7687024, -8494957, -9527636, -7391283, -4541207, -5730105, -9623356, -10429286, -7200574, -4950891, -5948736, -6447287, -4012278, -1910227, -2944149, -4394594, -3379329, -2486171, -4695410, -6514980, -2793702, 3693659, 4621779, -1957714, -8723192]
36844h723192p57333L088414K059212P80730J686785J861951j59084j566188r26648
36835b655353o44905j632599r85527K296329M205579J725555k169899l151344
36827c012164j728998j044326j422044j149276m07350l83501j37712J777717L834154
36818c673500L309418N95887j560156k088822j694690k65076K197564L257177
36810G7802P65944k770728k781076O67854L037500K263307R73025J034172O10718
36801C878518j497020k753430q83243K051014K525687O53239k48515J651602M315098
36792I692950M071337k69726n379925o317556k531551O72585r66134m164195k505193
36783g697408L706054P252279M278751n73846j445072R35002J834434m52069l468874
$$ y = [-8723192, -9480525, -6392111, -4332899, -3552169, -1865384, -3433, -162517, -1728705, -2655353, -3300258, -4932857, -5918384, -3622055, 583524, 2309079, 139180, -3012164, -4741162, -5785488, -7207532, -8356808, -8764158, -9147659, -9285371, -7507654, -3673500, -364082, 231805, -1328351, -3417173, -5111863, -5376939, -3179375, 77802, 843746, -1926982, -4708058, -4040204, -1002704, 1260603, 2233628, 3267800, 3878518, 2381498, -371932, -1255175, 795839, 3321526, 3974765, 3726250, 5377852, 9692950, 13764287, 13494561, 8114636, 1797080, -734471, -61886, -1028020, -5192215, -7697408, -3991354, 3260925, 7539676, 6965830, 5520758, 6455760, 8290194, 7838125, 4369251]
36774D369251m380516k329239J355590L646142K323092r96938k603351j877641
36766d93610j442403j734442p9696L398241M271340R33115k033599j269991j78089
36757A370866k316720m344940j746197K533680K457957q18882q66162L030468
36749f99930M709952J371564k400558k524170r00075n59185p77623M8806J016096
36740g15123J033351R40575R09428p12387l504090l578435P65427N115943M402872
36731D657561R8069j985292M6300K095223N06192k804469l263655J52449L704453
36722C206831L730119J029776p03808K2534J012488L08685p59715j40335J196974
36713H903549O04168k097789m353285m367913k641363l66199J503364J910386
$$ y = [4369251, -11265, -2340504, -984914, 2661228, 4984320, 3987382, 1384031, -493610, -1936013, -3670455, -3750151, -351910, 3919430, 4852545, 2818946, 1548955, 1370866, -945854, -5290794, -7036991, -4503311, -2045354, -2864236, -3730398, -699930, 4010022, 5381586, 2981028, 456858, -443217, -1002402, -1780025, -1731219, -715123, 318228, 1258803, 2168231, 1455844, -2048246, -5626681, -4861254, 254689, 4657561, 4755630, 2770338, 2816638, 4911861, 5418053, 2613584, -650071, -497622, 3206831, 6936950, 7966726, 7262918, 7285452, 8297940, 8606625, 7846910, 7706575, 8903549, 9507717, 7409928, 3056643, -1311270, -3952633, -4318832, -2815468, -905082]
36705i05082O53457n76432k46619M57690m39417j868646r09072K289636M113762
36696B569277K601655r4043j273139r64609n30692m19804n17395p91961o96341
36687a17052L29940J351210Q90783n07193j052241r95668k081562l459101j914712
36678g555596K572858N286756L036810j116942k135943K88284K151328Q58063
36670C385618k012346l109376r40878K512323L485296Q46711j644372J5107L610146
36661F148229K960885k653517o355065l484171J370718J402646k410646l878350
36653f899271j483049O39623N97409J121956L328258M089067J840282k0549J257390
36644D471116K743025M07845l948527m912251j476966J645632J077031q85110
$$ y = [-905082, -251625, -828057, -1074676, -616986, -1056403, -2925049, -3834121, -1544485, 2569277, 5170932, 5076889, 3803750, 2839141, 2308449, 1888645, 1371250, 579289, -117052, 212888, 1564098, 2454881, 1947688, 895447, -100221, -2181783, -5640884, -7555596, -4982738, 304018, 3340828, 2223886, 87943, 376227, 2527555, 3385618, 1373272, -1736104, -2676982, -164659, 3320637, 4167348, 2522976, 2538083, 6148229, 9109114, 6455597, 100532, -3383639, -2012921, -610275, -3020921, -6899271, -8382320, -7742697, -7145288, -6023332, -2695074, 1393993, 3234275, 3213726, 4471116, 7214141, 7621986, 3673459, -1238792, -2715758, -1070126, 6905, -878205]
36636h78205n58524J709048K963670K327313J197307q6628k426950m928118m963765
36627e644852k073499J058133K533045L239181L648430K072898j577097l717933
36619d61694k055375M53910N07241J73325K536572M421178M54693o638749p677206
36610h286105k18428P204508O834682J278221k283589j801166J03530J590460
36602D422113J836796n07597m588615o201739l441660k52167l54912j379741K84946
36593a0182576K683683K112645M26766J872167M945259M537377R18838p44431
36585F569728M55105Q86l116739l709301P81946N093886L505671k182148n762764
36576A636270m525352q82288J566153J132604j054406j827891N74791L493866
$$ y = [-878205, -1436729, 272319, 3235989, 5563302, 6760609, 6673981, 4247031, -681087, -5644852, -7718351, -6660218, -4127173, -887992, 2760438, 4833336, 3256239, -461694, -2517069, -2063159, -1555918, -1382593, 1153979, 5575157, 6029850, -608899, -8286105, -8504533, -1300025, 5534657, 6812878, 4529289, 2728123, 2831653, 4422113, 6258909, 5751312, 1162697, -5039042, -8480702, -8732869, -9087781, -10467522, -10182576, -7498893, -5386248, -4959482, -3087315, 1857944, 6395321, 7314159, 6569728, 7024833, 7025719, 3908980, 199679, 981625, 6075511, 9581182, 7399034, 1636270, -2889082, -3771370, -2205217, -1072613, -2127019, -3954910, -3380119, 113747]
36568A13747K917422l92414j581782R03980K969846J408505j550448k492217j683977
36559F12662j014339n32036J56167J09220o80016k92187J360476J304198j115698
36550i1553j705594J753009M244996O17518n187124m827146J779867N750909K053140
36541D388022l693920m001061L17735K921215J357150j073573j414508m95443
36533a694383R6512Q56495K419256L136832J222672j618988j755844O98180J019730
36524D380462l162787p001367m546511K012156M669736J228204j653151P37469
36516c335789L695208J281581l262580k400028L229374N291373O20274m112760
36508A006653k775927J703433K990852O44627r47487J3392J151675O22541n68275
$$ y = [113747, 3031169, 2638755, 1056973, 1960953, 4930799, 6339304, 4788856, 2296639, 612662, -401677, -933713, -777546, -668326, -1348342, -1640529, -280053, 1024145, -91553, -1797147, -44138, 4200858, 4818376, -368748, -5195894, -3416027, 2334882, 4388022, 694102, -3306959, -2989224, -68009, 1289141, 215568, -1198940, -1694383, -1597871, -741376, 1677880, 4814712, 6037384, 4418396, 2662552, 3360732, 4380462, 1217675, -5783692, -10330203, -8318047, -3648311, -2420107, -4073258, -3335789, 359419, 1641000, -1621580, -4021608, -792234, 4499139, 5119413, 1006653, -1769274, -65841, 2925011, 3569638, 2622151, 2635543, 3787218, 4409759, 3841484]
36499C841484r97282p75454n73912m10320J06047J061240J809580J216245q65027
36490D412601k429367j275550J561521K460692J24281k553889k859229j818002
36482b376942j298598l69304K166719L851175J525018k810432l761566l67501
36474c441431K436686J401611m30714Q57036L823847M373061K076970k09512j571343
36465I316211l575304n802795n097191n85107L889057M507977K349083R77052
36457E978983P65053j096287m989407o668123k675787L932104O237621J836068
36449C320225m107151n416256k251594N67187J029000J778525M083263M332340
36441C335539m37210o460415p103461j887029K837452K744910O61321Q72368K350209
$$ y = [3841484, 2844202, 2068748, 1494836, 1084516, 1190563, 2251803, 4061383, 5277628, 4412601, 1983234, 707684, 2269205, 4729897, 4854178, 2300289, -558940, -2376942, -3675540, -4044844, -1878125, 1973050, 3498068, 687636, -3073930, -3441431, -1004745, 396866, -33848, 823188, 4647035, 9020096, 11097066, 10887554, 9316211, 5740907, -61888, -5159079, -5744186, -1855129, 2652848, 5001931, 5978983, 6744036, 5647749, 658342, -6009781, -8685568, -4753464, 1484157, 3320225, -786926, -6203182, -8454776, -7887589, -6858589, -5080064, -996801, 3335539, 2898329, -3562086, -10665547, -12552576, -9715124, -6970214, -6308893, -5436525, -3086316]
36432c086316J430196j259736j381565J906916L963062J519762k015927j145972
36424f9580L688092O219476K617454l374939n189874j558808K457977K171688
36416F961486j472953m250724m152387k397789j81416K532532M660141L562079
36408E260969j146751n479922n363449j932592J80721o09261j112771J180859
36400i022197L972426L570153N05256j070763Q48608L564209L570203J045825
36392F983720j034001j195688r33582j790632k737491j677940J226173L253400
36384B093959K357961l56547k021361j296809M41485J107705M01767k51837r4428
36375B381895k78829j737743k725781q22400K448491K253336k382230n388175
$$ y = [-3086316, -1656120, -2915856, -4297421, -2390505, 1572557, 3092319, 1076392, -69580, 3618512, 9837988, 12455442, 9080503, 3890629, 2331821, 4789798, 6961486, 5488533, 1237809, -2914578, -5312367, -5493783, -2961251, 1698890, 5260969, 4114218, -1365704, -6729153, -8661745, -8481024, -9090285, -10203056, -9022197, -5049771, -1479618, -974362, -2045125, -1196517, 2367692, 5937895, 6983720, 5949719, 4754031, 3820449, 2029817, -707674, -2385614, -1159441, 2093959, 4451920, 4095373, 2074012, 777203, 1218688, 2326393, 2728160, 2476323, 2381895, 2103066, 365323, -2360458, -3182858, -734367, 1518969, -863261, -6251436]
36367f251436j521138N093208N875638L02004l246168k47178L560094K035925
36359E600949j817077j877214Q15998R52386j386863j733278K35l06834k594547
36350b346245k319188Q27297J636424j452899l307610q70882J940073J446190
36342d446840j23899N3060N84730M78104K282863N813211N201634j693797p070355
36333A078711l778881L147659M022845p66729l067290r50752L5883j576805j081713
36324b937072K199116K810329n49313k109126M80998J719787j611652m363021
36316d359954k162129J065331O15807r13444L47725J703501n22161k930117p43892
36307g899333K679354Q42842m260207m714101M09965L887557K370229P41437K534459
$$ y = [-6251436, -7772574, -2679366, 3196272, 3498276, 252108, 4930, 3565024, 5600949, 3783872, 1906658, 2722656, 3675042, 2288179, 554901, 555136, 248302, -2346245, -4665433, -3838136, -2201712, -3654611, -6962221, -7833103, -5893030, -4446840, -4570739, -4517679, -3932949, -3454845, -1171982, 4641229, 9842863, 8149066, 1078711, -2700170, 447489, 4470334, 3703605, 636315, -314437, -278554, -1855359, -2937072, -737956, 2072373, 1523060, -586066, -105068, 1614719, 3067, -4359954, -6522083, -5456752, -4840945, -5754389, -5406664, -3703163, -4225324, -7155441, -7899333, -5219979, -4377137, -8637344, -13351445, -12941480, -9053923, -6683694, -5942257, -3407798]
36298c407798M051745J597813j857236j665038J326935K822266J321223j183997
36290C005913k630814k283439m20768J377762J218712n45158j578669j131081
36282b987542p86835q67889N46890L395969M024896N48646l165953k377093J651635
36273a7276L347878M63066l459627m194948j525884J687350K933987J749280n13598
36264D70228j724752n99400K011128L708811K782804j24660k609775k810858j090424
36255A3102Q14259K027122K834973K705360P2961m565122p428357n721883j537062
36246a0784647J293755K546736M083267M566857J081019m071885m367656J247980
36238d404574N456383K710232k770468l639920Q763K198025O42258j034233N9779
$$ y = [-3407798, 643947, 2241760, 384524, -1280514, 46421, 2868687, 4189910, 3005913, 375099, -1908340, -2329108, -951346, 267366, -277792, -1856461, -2987542, -3774377, -4642266, -4095376, -699407, 3325489, 3874135, 708182, -1668911, -17276, 3330602, 3793668, 334041, -3860907, -5386791, -3699441, -765454, 983826, 470228, -1254524, -1853924, 157204, 3866015, 6648819, 6524159, 3914384, 1103526, 13102, 827361, 2854483, 5689456, 8394816, 8467777, 3902655, -3525702, -9247585, -10784647, -9490892, -6944156, -2860889, 1705968, 2786987, -1284898, -5652554, -4404574, 1051809, 3762041, 991573, -2648347, -2639584, -441559, 200699, -833534, -773755]
36229g73755K243313K611958P30633j672407k548720j141670Q05186N71462j519217
36220f93217j937075L83885J673097l18808j686042J056234L682942L81055n519151
36211b977080n251105J635753O060031L264140q17740k70440J812154J97266l182349
36202D70630l175762j96499J349818N53102O293J84295p54569k526947k793154
36193f882793j242910J86247P10768J093286J335632R69748P86985J462055J594257
36184A3275j1144j516970o89313J106329J113915M0143O40464K370927J907049
36175D974675j089380l049032j971428m7546J31064j201509k441661k538495q52084
36166h085396K238552M191686K568083j119724k614035m24948K590032L486805
$$ y = [-773755, 1469558, 4081516, 4812149, 3139742, 591022, -550648, 254538, 826000, -693217, -2630292, -2246407, -573310, -892118, -2578160, -1521926, 2161016, 2542071, -2977080, -8228185, -6592432, -532401, 2731739, 1913999, 1643559, 3455713, 3652979, 470630, -2705132, -2901631, -1551813, -998711, -992418, -808123, -1562692, -4089639, -6882793, -8125703, -7939456, -7228688, -6135402, -4799770, -3830022, -3043037, -1580982, 13275, 2131, -1514839, -2204152, -1097823, 16092, 56235, 696699, 3067626, 4974675, 3885295, 836263, -1135165, -1182711, -1051647, -2253156, -4694817, -7233312, -8085396, -5846844, -1655158, 912925, -206799, -2820834, -3245782, -655750, 2831055]
36158B831055K240848K38102j228938p33333J781025L118919J84518m485054m915034
36149i67892l27567L254042J815151j258912j446011J12783J04781p86578j35482
36140C64315Q43638m75433k514293j691285P22041k03553m476504n450826Q73072
36131a2008828R017595J0210570L401345l626003m081518L7946J736141j271682
36123C415566m010042j991442K112983K741718l9796j197746P28527J498262j063882
36114B194148k914557o07078K640563K075372j159861k560490j337490J4590Q93794
36105g61009K179064K482597J26571k500641j892056M59098M40170j332772q55498
36096a654476J235385K17972l558490l759895J552228O008406M760132J351161
$$ y = [2831055, 5071903, 5310005, 4081067, 3347734, 5128759, 8247678, 8432196, 3947142, -967892, -1295459, 1958583, 3773734, 2514822, 1068811, 1181594, 1286375, 499797, 364315, 1207953, 732520, -1781773, -3473058, -2751017, -2954570, -7431074, -12881900, -12008828, -2991233, 7219337, 10620682, 6994679, 2913161, 2951107, 4687248, 3415566, -594476, -2585918, -472935, 2268783, 2228987, 1031241, 1759768, 3258030, 2194148, -720409, -1327487, 1313076, 3388448, 2228587, -331903, -1669393, -1654803, -761009, 1418055, 3900652, 4027223, 1526582, -365474, 93624, 533794, -798978, -1654476, -419091, -201119, -3759609, -7519504, -5967276, 41130, 4801262, 6152423]
36088F152423M45186K06739k399067m352201j623708K556537K126032j427330
36080A684611r91451M308429O855218J893246n216813o478391j771960K047400
36072B330289N56598l297074l705771P00423N295534N009154L15314l567068l027343
36063F10056L70310K920608K974146J177201j019618j743752K3409K217745J442421
36054H972526j758677k954431r70732l40072l364498m890328l07728N766274N785860
36045E938194R88168j222980M17798M03187k232977j829619K648341L944594j455971
36036G598735o083225k566934M630722N941816P03924l154304j123363L088048
36028I035419M085886P04778m438159p259937m693101J693020N729596L669657
$$ y = [6152423, 6597609, 6804348, 4405281, 53080, -1570628, 985909, 3111941, 1684611, 693160, 5001589, 11856807, 13750053, 8533240, 2054849, 282889, 2330289, 2886887, -410187, -4115958, -3415535, 1879999, 6889153, 7204467, 3637399, 610056, 980366, 3900974, 6875120, 8052321, 7032703, 5288951, 5312360, 7530105, 8972526, 7213849, 4259418, 3288686, 2948614, -415884, -5306212, -5613940, 152334, 5938194, 6926362, 5703382, 6121180, 6524367, 4291390, 2461771, 5110112, 9054706, 7598735, 1515510, -1051424, 3579298, 9521114, 10225038, 7070734, 5947371, 9035419, 13121305, 13826083, 9387924, 2127987, -2565114, -872094, 4857502, 8527159]
36020H527159o20515j319158P81205N13735k470727l057770O06948L875338K809922
36011I646137m48207j970422j583027j252790j050189J93604K074299L077266
36003H686671K889651K570206L160207M971587P192858P735448M978018K51123
35995D2435769k963690k927768j300355n58487j467605l494631n767770o890074
35987A7065389n599270k525957O9229Q49886L80663m99729j495822j965794j275070
35978E003525k53321k24462n80046K72403J705278J656957N99624J011464K530287
35969A1721709K037917m28429r51177J118254J006832l025880n035523o55413
35961E788290M309056K039824m252822m470172K507790O671389J999152n137606
$$ y = [8527159, 7906644, 6587486, 7368691, 7882426, 5411699, 2353929, 2960877, 6836215, 9646137, 9197930, 7227508, 5644481, 4391691, 3341502, 3535106, 5609405, 8686671, 11576322, 14146528, 17306735, 22278322, 29471180, 37206628, 42184646, 42435769, 39472079, 36544311, 35243956, 34685469, 33217864, 29723233, 23955463, 17065389, 11466119, 8940162, 9009391, 9859277, 10239940, 9740211, 8244389, 6278595, 5003525, 4750204, 4525742, 3945696, 4218099, 5923377, 7580334, 8179958, 9191422, 11721709, 13759626, 13331197, 12380020, 13498274, 14505106, 11479226, 6443703, 5788290, 10097346, 12137170, 7884348, 3414176, 5921966, 12593355, 14592507, 9454901]
35953I454901o258951k078813J325582J820498J152822j18023j933756k006340
35945A357920Q14148K795838L05452l383683k046837L710601O682450L430490
35937A3666379j314050k214040k89018L43918j078852k010727r75655Q57534J606488
35928H591977O45193p48010m05847J894845L108563P03290k810043k617001J052128
35919I415095K666326l48257l807571l566001j444602r34236j351220p05721m40469
35910e16656j899942j514611L918991R615194Q056388Q44866k875132k98923J394668
35901A6724843k343887n840411k981394K788730M614488K672081J355673M21217
35893A7411340l090527o769669n109371P51525L492947P03752j772807L34844
$$ y = [9454901, 3195950, 1117137, 2442719, 4263217, 5416039, 5298016, 3364260, 1357920, 2172068, 4967906, 5273358, 1889675, -157162, 3553439, 10235889, 13666379, 12352329, 10138289, 9849271, 10193189, 9114337, 7103610, 6127955, 6985489, 8591977, 9237170, 8489160, 8083313, 9978158, 13086721, 13790011, 10979968, 8362967, 9415095, 12081421, 11733164, 7925593, 4359592, 2914990, 1980754, 629534, -76187, -516656, -2416598, -3931209, -12218, 9602976, 17659364, 18504230, 15629098, 15330175, 16724843, 14380956, 8540545, 5559151, 8347881, 12962369, 15634450, 16990123, 17411340, 14320813, 7551144, 2441773, 3193298, 6686245, 7389997, 5617190, 5952034]
35885E952034L264432K158895j003396j219286J323695J963049j000851m079518
35877G359054l857557j154632R54749J161081O55274P13977Q71400l8661j628530
35868E036155j965530j78023K190705L205302K571706O86611k410324n338451
35860C798151m817947J78121N295921N443490J560372j180882j125543j250794
35852G900889k485384j606771K313494M652427J808963k961132m123531j368381
35844D130574J223135J219722o22170k951694m277050k441528K501737O084886
35836D867612M120771j049466l098096l46250K447564J563321q72936j431731
35828F200789o92328q36882r32363J170605L665575K268160k646002m897203q80427
$$ y = [5952034, 9216466, 11375361, 10371965, 9152679, 10476374, 12439423, 11438572, 7359054, 3501497, 2346865, 3301614, 4462695, 5117969, 5831946, 6703346, 6664685, 5036155, 3070625, 2892602, 5083307, 8288609, 10860315, 11546926, 9136602, 3798151, -1019796, -841675, 4454246, 9897736, 11458108, 10277226, 9151683, 7900889, 5415505, 3808734, 6122228, 10774655, 12583618, 9622486, 5498955, 4130574, 5353709, 6573431, 5951261, 2999567, -1277483, -3719011, -1217274, 4867612, 8988383, 7938917, 4840821, 4494571, 6942135, 8505456, 7632520, 6200789, 5508461, 4671579, 3739216, 4909821, 8575396, 10843556, 8197554, 3300351, 2419924]
35819B419924M448703L856404j960859n310014k313364K501236L908284L048155
35811A0598469L364709L891568J637821k132294l607047k934880l392613m727816
35803B697917l221999J244181L982652K627206J97727n02313l94716k88606J053585
35794G395634K685598Q83136m078408o000325j578126L925939M426235J720183
35786I379866J131852K600147K235556k20255j737422j882448k564616l262290
35778E680390j837966R53509K582476L112995L859850L405115L4478l521249l303222
35769A0966376o92415q042q78644N52342L597981L317927p75222l314194j727864
35760A1038245L03069j7962l59674J104682J611810j103768m286275m357299k006098
$$ y = [2419924, 6868627, 10725031, 8764172, 3454158, 1140794, 3642030, 7550314, 10598469, 13963178, 17854746, 19492567, 17360273, 13753226, 10818346, 7425733, 2697917, -524082, 720099, 4702751, 7329957, 7527684, 7025371, 6630655, 6342049, 7395634, 10081232, 10964368, 6885960, 885635, -692491, 3233448, 7659683, 9379866, 10511718, 13111865, 15347421, 15127166, 13389744, 11507296, 8942680, 5680390, 3842424, 4795933, 7378409, 10491404, 14351254, 17756369, 17790847, 14269598, 10966376, 10273961, 10265919, 9387275, 9939617, 13537598, 16855525, 16080303, 12766109, 11038245, 11341314, 11323352, 10963678, 12068360, 13680170, 12576402, 8290127, 3932828, 1926730]
35751A926730J24921J647245L270525M076697K731558l92686l912070o206101
35743C266819m867021J322894Q652718J0367916M372348l803279p483275n578346
35735F250774j416351K006612L527034L026861J272763o77754k535935l914523
35727G539481l274968l70477J569914o0483k291072o77718K815179K376918j565643
35718F061131k321294J948796N023853K992827o7184l63517n09165k602442k788902
35709G374103J124317L520733k29426m719364k590651K962849L050482k333838
35701H159205m294450P27658N650098L661122k475898n251944k242658K066722
35693E999855K485324q56475k879359j47093M023054L902446J08483j266359R39974
$$ y = [1926730, 2051651, 3698896, 6969421, 11046118, 13777676, 13384990, 9472920, 3266819, -1600202, -277308, 8375410, 18743326, 23115674, 19312395, 11829120, 6250774, 4834423, 6841035, 10368069, 13394930, 14667693, 13989939, 11454004, 7539481, 4264513, 3894036, 5463950, 5403467, 3112395, 2434677, 5249856, 7626774, 6061131, 3739837, 5688633, 10712486, 13705313, 13638129, 13274612, 12765447, 10163005, 7374103, 8498420, 12019153, 11789727, 7070363, 4479712, 7442561, 10493043, 8159205, 3864755, 4592413, 10242511, 13903633, 11427735, 6175791, 3933133, 5999855, 8485179, 7628704, 4749345, 4602252, 8625306, 12527752, 12636235, 11369876, 12309850]
35684A2309850N91291m478854o755224p29526O855594O782241J623677L62932
35676A6561981K947405J596366m164435n686870K86549O055602N269663J836101
35668B4702362K092874N281686O882938O248605O010979P134086Q333493Q425682
35660G5112705P097193N013515L756409L571498J889563k740967o624047n440915
35652H1634954j742359k233087p763511j2068527j1050622p264947m065831j375528
35644C4070542R33043J122414p31952j998894k078172k942823m093705k558185
35636B1722268Q74395J611146q45067j497963J389807L021082N61703k073623
35628B4763748j780947j625086l801844m052212O88680M899867K015281m796251
$$ y = [12309850, 12901141, 8422287, 1667063, 937537, 7793131, 14575372, 16199049, 16561981, 19509386, 21105752, 16941317, 11254447, 11540996, 17596598, 22866261, 24702362, 26795236, 32076922, 38959860, 45208465, 51219444, 58353530, 66687023, 75112705, 82209898, 87223413, 90979822, 94551320, 96440883, 93699916, 87075869, 81634954, 79892595, 77659508, 69895997, 57827470, 46776848, 39511901, 35446070, 34070542, 35003585, 36125999, 35394047, 33395153, 31316981, 28374158, 24280453, 21722268, 22596663, 24207809, 23362742, 21864779, 23254586, 26275668, 26837371, 24763748, 22982801, 21357715, 17555871, 13503659, 14192339, 19092206, 21107487, 16311236]
35620A6311236o831149k311109K255258J922912j430279l386695k005077J370040
35612E895137L367769J437241k698563m432961k541629n67641k18272J546104
35604A787185N638042O822185J716472m262749m273104k71976R73326j279903
35596F849478k357732j209688r91684j751935k25354L091848L782588J101868
35588H289389p20766K34643J011332k01239j128640k05462P54868N31472N78518
35579I144115J305028N60132k143811l744171k115364P70211K068391J614604
35571G459135O74030j33128k19523J053429K503435J661274j495918l652371k338519
35562E511844R43000K933250K296501J95080j345795r48112J143039L278912M199915
$$ y = [16311236, 9480087, 7168978, 9424236, 11347148, 9916869, 6530174, 4525097, 5895137, 9262906, 10700147, 8001584, 3568623, 1026994, 459353, 241081, 1787185, 7425227, 14247412, 15963884, 11701135, 7428031, 7156055, 8129381, 6849478, 4491746, 3282058, 2290374, 538439, 313085, 3404933, 7187521, 8289389, 7568623, 7803266, 8814598, 8613359, 7484719, 7279257, 8034125, 8565597, 9144115, 10449143, 11009275, 8865464, 5121293, 3005929, 3776140, 5844531, 7459135, 8133165, 8000037, 7780514, 8833943, 11337378, 12998652, 11502734, 7850363, 5511844, 6454844, 9388094, 11684595, 11879675, 10533880, 9585768, 10728807, 14007719, 18207634]
35553A8207634L966595K542367o56937m383583n263385k335027O93053Q07682
35545A3578399M65946K972900N961401M799756M87588j658569Q7653L072842O101472
35536C5869388R700001J1593782R005135M945519M628796N970438K488164l948908
35528H0252315l855930L758516P316481J75431q449010p943688k323309j894242
35520F7036564o392858p918058n650183n482244p498955n865181q80698K56499
35512B7604886l813728n632399j564647K168179L36398k897107j940422Q39278
35504A5100438J86239k675076k640726L44681J533751o47939k501304j127302
35496G572762J650124K417423N67060j448238j012262J852529M161660L026309
$$ y = [18207634, 22174229, 24716596, 24059659, 19676076, 14412691, 12077664, 12770717, 13578399, 14044345, 17017245, 22978646, 27778402, 28265990, 26607421, 26695074, 29767916, 35869388, 45569389, 57163171, 66168306, 71113825, 75742621, 81713059, 84201223, 80252315, 76396385, 80154901, 87471382, 87646813, 79197803, 71254115, 68930806, 67036564, 60643706, 52725648, 47075465, 41593221, 34094266, 28229085, 27348387, 27604886, 23791158, 18158759, 16594112, 18762291, 19098689, 16201582, 14261160, 15100438, 15286677, 12611601, 9970875, 10315556, 11849307, 11201368, 8700064, 7572762, 9222886, 11640309, 12207369, 10759131, 9746869, 11599398, 15761058, 18787367]
35488A8787367o79766k979701j623083J365176K748673J927839N94233P5675K34802
35479B0451215m0190j778597m147232m085212j01164M008384L054854j566462
35471A5795596k774274J501519M202663l21280o984709p235361j722506J756221
35463D217869P75207L50936K556111K782437j132610l857854j123960K851480
35455G419616K076040j586253j697370K540948N536117L782223l21633l187256
35447A4562432m040129l547069k140336p80796p32313j668945j856140n32134
35439g35430J420689K845066K773898N03764k718810l356464K94183M702364M990937
35430A0720197J349186j854840k423128j689593k36626K743961N549480M759051
$$ y = [18787367, 18107601, 15127900, 13504817, 14869993, 17618666, 19546505, 20140738, 20216413, 20451215, 20411025, 18632428, 14485196, 10399984, 10298820, 14307204, 17362058, 15795596, 13021322, 14522841, 18725504, 18404224, 11419515, 4184154, 2461648, 4217869, 4993076, 5344012, 7900123, 10682560, 9549950, 5692096, 4568136, 7419616, 9495656, 7909403, 6212033, 8752981, 14289098, 18071321, 17749688, 14562432, 10522303, 6975234, 4834898, 4054102, 3321789, 1652844, -203296, -735430, 685259, 3530325, 6304223, 6807987, 4089177, 732713, 1026896, 5729260, 10720197, 12069383, 10214543, 7791415, 6101822, 5865196, 8609157, 14158637, 18917688]
35422A8917688J159152l66589J347267J584548j901640m234093j443002K161333
35414A7224664N92661l755833l649514J427218M476650J718900k437343k680478
35406A2916925K39292K236452J741835J82224r68404j343967j170984r48127q95853
35397A1989393n11151L29632L77314j189596k678770j890927L03015J059022j1531
35388G776401m94397N49171J121587l4123j244668q15266K99223M26661o5314
35379G519275K73376J435315J939014P91541j522988l643329m367245l385678
35371i60719j280848J128677L051304L534902K318403J016222J476550K475159
35363A2759650Q81325k755273l645870k78586J964184r51856m222855j390550
$$ y = [18917688, 20076840, 19710251, 21057518, 22642066, 20740426, 16506333, 15063331, 17224664, 17817325, 14061492, 10411978, 11839196, 16315846, 18034746, 15597403, 12916925, 13156217, 15392669, 17134504, 17316728, 16348324, 15004357, 13833373, 12885246, 11989393, 11478242, 11807874, 12185188, 10995592, 8316822, 6425895, 6728910, 7787932, 7776401, 7282004, 7831175, 8952762, 8918639, 7673971, 6858705, 7157928, 7584589, 7519275, 7792651, 9227966, 11166980, 11958521, 10435533, 6792204, 2424959, -960719, -2241567, -1112890, 1938414, 5473316, 7791719, 8807941, 10284491, 12759650, 13640975, 10885702, 7239832, 6961246, 8925430, 7973574, 3750719, 2360169]
35355B360169M372060M485972j023157l229664J104880M398139J037180l748996
35347I756583l222132L00933R84180m55014K47548K190072J382776j257200j449644
35338H478102O05783R14214q20407j088175M76110N23374j440432k100906o45141
35329D902522j09933j294620j115411J231236K076033k38017j849851L23587L219921
35320G145467K560755k64099o83796J818326L418060K129344L14311N73913K078707
35311A9090988K241375M35593j370139j375702k82778j33121j173394j349468
35303A6083354M66296K488035K746778K010145J665243N62051k490458m486544
35295A9044900j399499M394568N467076n6242m667389j821752M491540N623070
$$ y = [2360169, 6732229, 11218201, 10195044, 6965380, 8070260, 12468399, 13505579, 9756583, 6534451, 6835384, 7819564, 7364550, 7612098, 9802170, 11184946, 9927746, 8478102, 9083885, 9998099, 9177692, 8089517, 8565627, 9089001, 7648569, 5547663, 4902522, 4792589, 3497969, 2382558, 3613794, 5689827, 5451810, 3601959, 3925546, 7145467, 9706222, 9442123, 8758327, 10576653, 13994713, 16124057, 16438368, 17012281, 19090988, 21332363, 21767956, 20397817, 19022115, 18739337, 18606216, 17432822, 16083354, 16549650, 19037685, 21784463, 23794608, 25459851, 26021902, 23531444, 19044900, 17645401, 22039969, 27507045, 27450803, 22783414, 20961662, 25453202, 31076272]
35287C1076272O59729l064265q69523L737135N302770L263289M94658j221190
35279C9378875j645017n82010J291244J726318l73737k599530j941666O09870
35271C5864347J131866j513483l895668k979072k60995J030863P95393J163573
35263C1336824J851604J35872m009351o304833l635903J469843M239988L501129
35255B8585173J397927q79850l422514m576032j894527L268715N950433L860743
35247C2290068L61649n47976P10395J394863Q38355n4287j465198l546367m229331
35238B5752171j713427J729121K071011n79663j982994Q2961L271840N018962
35230C3649982N682448N788364L929677J48388j767652R35863N057317N429761
$$ y = [31076272, 31736001, 28671736, 27802213, 31539348, 36842118, 40105407, 40600065, 39378875, 37733858, 37151848, 38443092, 40169410, 39795673, 37196143, 35254477, 35864347, 36996213, 35482730, 31587062, 28607990, 28346995, 29377858, 30173251, 31336824, 33188428, 33324300, 29314949, 23010116, 19374213, 20844056, 25084044, 28585173, 29983100, 29103250, 25680736, 21104704, 19210177, 22478892, 28429325, 32290068, 32651717, 32103741, 32814136, 34208999, 35047354, 34993067, 33527869, 29981502, 25752171, 24038744, 25767865, 27838876, 27259213, 25276219, 25359180, 28631020, 33649982, 39332430, 45120794, 49050471, 49198859, 47431207, 48367070, 53424387, 58854148]
35222E8854148K546013J592999M084761N468181K453462j933326l415193k750451
35214F6900594l095598l858804j950981K027833L741982J491685j716222l357949
35206F0182540m433601n649592m769213p81642K625859J602163k064091l644122
35198D3068301k363241j240619j028958N63234L173324K652995k130259n903877
35190C6790900l937697R44992K525204J17546j531262l97609J31924k137261l791274
35181B8715463j075782L687540M993635K020345n26297M82495K503291J870773
35173D2671463o17228j377912L99985J994510J546411K82474k03356l32345r49129
35164D3414873j383918p90901O0618J14223q9790K38830J98125q77848o08680
$$ y = [58854148, 61400161, 62993160, 67077921, 72546102, 74999564, 73066238, 69651045, 66900594, 63804996, 59946192, 57995211, 60023044, 63765026, 65256711, 63540489, 60182540, 55748939, 50099347, 45330134, 44548492, 47174351, 48776514, 46712423, 43068301, 40705060, 39464441, 38435483, 38998717, 42172041, 44825036, 42694777, 36790900, 32853203, 33798195, 36323399, 36440945, 34909683, 34512074, 34643998, 32506737, 28715463, 27639681, 31327221, 36320856, 38341201, 37814904, 38297399, 40800690, 42671463, 42054235, 40676323, 41076308, 43070818, 44617229, 44899703, 44696347, 44364002, 43414873, 42030955, 41240054, 41300672, 41414895, 41325105, 41563935, 41762060, 40884212, 40275532]
35155D0275532L773676R879474J1311187O057427J37636j34130L274016L388554
35147G7963372j517521o031372o253629n058718o200741p650765n368287j082390
35139C8799949n31957m157301n450628p44987M499496L374441k183453m401050
35131B9204510j168071J976149J654584J506673M318925N633822P65823o096048
35123C7796367o766050j116836K921552J242496j803575k087950j698603k830140
35115B5657261k444083J540129M212174Q12035l954033j889770N338111P802287
35107C7074111K642602j464193J776545O511848M720001p83680j204064M250929
35099E3524099P811866N669523L143411N792567J1556759J4645592J3224063J0420499
$$ y = [40275532, 44049208, 53928682, 65239869, 71297296, 71434932, 71300802, 74574818, 77963372, 76445851, 70414479, 64160850, 59102132, 52901391, 45250626, 39882339, 38799949, 38267992, 34110691, 28660063, 27915076, 32414572, 35789013, 33605560, 29204510, 28036439, 30012588, 31667172, 33173845, 37492770, 43126592, 43892415, 37796367, 31030317, 29913481, 32835033, 34077529, 32273954, 30186004, 28487401, 25657261, 23213178, 24753307, 28965481, 29777516, 25823483, 23933713, 29271824, 37074111, 39716713, 38252520, 40029065, 46540913, 51260914, 50477234, 49273170, 53524099, 61335965, 67005488, 70148899, 75941466, 87498225, 102143817, 115367880, 125788379]
35091A25788379J0091812J3372385J7617247J8256574J4077962J0424469J3417977
35084B23046805K0987472K4771544K2095403J9723931K2390564K4267111J8094880
35077C75377710P510994J664072K97322n898625j9670584l1780863l4522927l1965903
35069B61011196l1135287l0330555k4205110j5619362j2827149j6189935j7014183
35062A13689615j1084774n013066n359044q415482o736735j160126Q94850k694417
35054G4120821n785416l713289J16726J11388l492286o169097n840721m127654
35046D5220472k366434k94884J554330J604091k9928j237647j113860j132935
35038D2203205k244476k996141j787378P82013L043993M209912M122672K719237
$$ y = [125788379, 135880191, 149252576, 166869823, 185126397, 199204359, 209628828, 223046805, 244034277, 268805821, 290901224, 310625155, 333015719, 357282830, 375377710, 382888704, 384552776, 384850098, 378951473, 359280889, 327500026, 292977099, 261011196, 229875909, 199545354, 175340244, 159720882, 146893733, 130703798, 113689615, 102604841, 97591775, 92232731, 83817249, 77080514, 75920388, 76815238, 74120821, 68335405, 64622116, 64738842, 64850230, 61357944, 55188847, 49348126, 45220472, 42854038, 42559154, 44113484, 45717575, 45687647, 44450000, 43336140, 42203205, 39958729, 36962588, 35175210, 35957223, 39001216, 43211128, 47333800, 50053037]
35030E0053037R69266P20144K216398L300563K498849J303239J796424L618449
35022F6476369N080179N729540N901008N322057M292939M639698P148847R669215
35014A14259852J0288204J0572699J2622115J4801258J4262729J2282510J2666746
35007B01756113J5607339J7757698J8176447J9277039K1417195K1607500J8971394
35000C34570725J6793713J7106098J7243966J3917044P158268j685767j2239077
34993C92864970k3166046l1319452l5098865l5829783l4331799k9708488k3147626
34986A80262911j8608708j7312901j5804839j2248836j0085759j1809436j3527892
34979H0864540j0348382l772870Q91409J665858J42372k535309n455530o283178
$$ y = [50053037, 51022303, 51742447, 53958845, 57259408, 59758257, 61061496, 62857920, 66476369, 71556548, 77286088, 83187096, 88509153, 92802092, 97441790, 104590637, 114259852, 124548056, 135120755, 147742870, 162544128, 176806857, 189089367, 201756113, 217363452, 235121150, 253297597, 272574636, 293991831, 315599331, 334570725, 351364438, 368470536, 385714502, 399631546, 406789814, 405104047, 392864970, 369698924, 338379472, 303280607, 267450824, 233119025, 203410537, 180262911, 161654203, 144341302, 128536463, 116287627, 106201868, 94392432, 80864540, 70516158, 66743288, 67634697, 69300555, 69442927, 66907618, 61452088, 55168910]
34971E5168910m170297j920493j501595o95875J756090K091523j923833m955352
34963D3849078j659671L674595L316493j207860k033920J368293J947177j611597
34955D7642588k255005K714332O663273N026131K214268K424425K302946j291853
34947F5441105l912974r53832L556675K905044j951464m815130l579681q51149
34939E5838594J707010L572765K599160j910790n557456m124154n57541p79458
34931E0788130m265038n209035k194029M1987j046303k094965l29555J573483
34923C7264675P8513l412769m527847j791546J919915L014465Q58516j899299
34915C1504623k222859n4215J676460Q40712j211881j862327r16424l96845j293316
$$ y = [55168910, 50998613, 49078120, 47576525, 46880650, 48636740, 50728263, 48804430, 43849078, 42189407, 45864002, 49180495, 47972635, 45938715, 47307008, 49254185, 47642588, 45387583, 48101915, 54765188, 59791319, 62005587, 64430012, 66732958, 65441105, 61528131, 60574299, 64130974, 67036018, 65084554, 60269424, 56689743, 55838594, 57545604, 61118369, 63717529, 61806739, 56249283, 52125129, 51567588, 50788130, 46523092, 41314057, 39120028, 39162015, 38115712, 36020747, 35691192, 37264675, 37343188, 33930419, 29402572, 27611026, 29530941, 32545406, 33403922, 31504623, 29281764, 29227549, 30904009, 31744721, 30532840, 28670513, 27754089, 27357244, 26063928]
34906B6063928k226595j410906R70759K585814J413671j189916j181723K593686
34898B7618718N231260J870390m166997m768672J115732N481082L289333l60278
34890C5310568O80096L741596K787918j166704k345573K24788K648625L604284
34882D5485598M857751N727172L921692J093547Q80811K049577M65155k513780
34874F1967523j221783M085323O032686J256360m412479m830077j350694J416717
34866F2943576J935732M73602l131396o826077o383852j752222J291906n64825
34858D7986444l087449j770751P96907n4321l082044m004759k961481k957511
34850C0865035l397835j508493J368120J168467j880338l527215k573922j902791
$$ y = [26063928, 23837333, 22426427, 23397186, 25983000, 27396671, 26206755, 25025032, 27618718, 32849978, 34720368, 30553371, 25784699, 26900431, 32381513, 35670846, 35310568, 35990664, 39732260, 42520178, 41353474, 39007901, 39232689, 41881314, 45485598, 50343349, 56070521, 59992213, 61085760, 61966571, 64016148, 64481303, 61967523, 60745740, 64831063, 70863749, 72120109, 67707630, 62877553, 61526859, 62943576, 64879308, 65352910, 62221514, 55395437, 49011585, 47259363, 48551269, 47986444, 44898995, 43128244, 43925151, 43870830, 40788786, 36784027, 33822546, 30865035, 27467200, 25958707, 27326827, 28495294, 26614956, 23087741, 20513819, 18611028]
34842A8611028k139370l27903L613082M935796J404187k292088j319749J817304
34834B4302287J308441k618626l794634L00493M105347J734890m242960o045687
34826A5049551j604088K670099J453942j882157j202352K365889K471106j624703
34818A7697287l511077l41473K234883k17114k856594M69095O067308N310650
34810B4852965j583326n305542j276686M342119M726448J437578l88329j67773
34802B6637454k58888k93684J424542L183316J805648j593350k541504P1469K425049
34793C0860052J706236j23275j31824J003692O07404j613930l319220k961420
34785B6027715j346588R5755P94337N88835n31552j662698j468536l18941m50513
$$ y = [18611028, 16471658, 16143755, 19756837, 24692633, 26096820, 23804732, 22484983, 24302287, 25610728, 22992102, 19197468, 19497961, 23603308, 25338198, 21095238, 15049551, 13445463, 16115562, 17569504, 15687347, 14484995, 16850884, 19321990, 17697287, 14186210, 13844737, 16079620, 15862506, 13005912, 13475007, 19542315, 24852965, 23269639, 17964097, 16687411, 21029530, 25755978, 27193556, 26805227, 26637454, 26378566, 26084882, 27509424, 30692740, 32498388, 30905038, 28363534, 28435003, 30860052, 32566288, 32443013, 32311189, 33314881, 33922285, 32308355, 28989135, 26027715, 24681127, 24776882, 25571219, 26160054, 25628502, 23965804, 22497268, 22178327, 21727814]
34776B1727814k623021m097287k135065J510766K511732J10478k024929j675666
34768A3304822r66313j609573j314634J582400L350875j67464n763314o030576
34760B386223k22965M180923K336651j418593j178741J469580J074704k292768
34752F335014l297454K51L372576L061716N55596r65023j210743j418070j221212
34743E212651J50081J219048p1401k571667k711523M65729L489029K959185R9735
34734H240867j129632L91019J633021O9690k590059k937912p69026Q42166Q9094
34725C839228j321725j170419Q6564N67722l4668n20364m62763n43061q09312
34716c68798l57496R60146J913772J504308J84951r53687j296114n94146J211687
$$ y = [21727814, 19104793, 15007506, 12872441, 14383207, 16894939, 17005417, 14980488, 13304822, 12338509, 10728936, 9414302, 10996702, 14347577, 14180113, 8416799, 2386223, 2163258, 6344181, 8680832, 7262239, 6083498, 7553078, 8627782, 6335014, 3037560, 3037811, 6410387, 9472103, 10027699, 9062676, 7851933, 6433863, 5212651, 5362732, 6581780, 6510379, 3938712, 1227189, 1692918, 5181947, 8141132, 8240867, 7111235, 7502254, 9135275, 9204965, 6614906, 3676994, 2907968, 3750134, 3839228, 2517503, 1347084, 1433648, 2001370, 1966702, 1446338, 983575, 440514, -368798, -726294, 233852, 2147624, 3651932, 3836883, 2883196, 1587082, 992936, 2204623]
34707B204623L311843M010202K450313p80j134849o46409m54731j861912l353494
34698D524806k404589P60180K751998J222107j703531j960206Q02092K384642
34690F377499j56017l906235l602334J081713M608663K723952j903129l365551
34682A858561n88849J451996p05659l408427r51078N301859P495790K073129m618522
34673G908800m957190o39473P43403k350353l830378o58911K304635R97195j124236
34664a606508J62253K185026P51806j489586L88032L921822K656261k387500l651956
34655I29650M50638L065604N80416k144895j338177n48212k779474m203738j401239
34646g389427J952316J896179J426714M003125N637897J491984m426872m849929
$$ y = [2204623, 5516466, 9526668, 11976981, 11976201, 10841352, 10194943, 9740212, 7878300, 4524806, 2120217, 2880397, 5632395, 6854502, 5150971, 3190765, 3992857, 6377499, 6221482, 2315247, -1287087, -205374, 4403289, 7127241, 5224112, 1858561, 1269712, 2721708, 2016049, -1392378, -2343456, 2958403, 10454193, 12527322, 7908800, 2951610, 2312137, 3055540, 705187, -3125191, -3784102, -1479467, -482272, -1606508, -1444255, 740771, 1492577, 2991, 391023, 4312845, 6969106, 4581606, 929650, 1380288, 4445892, 5026308, 2881413, 1543236, 995024, -1784450, -5988188, -7389427, -5437111, -3540932, -2114218, 1888907, 7526804, 9018788, 4591916, -258013]
34638b58013q24566J204015P30426J992539L803847J186871l658465l042987K751361
34629C885028M674756j90067l797155j002852K230677J4660l560358k582405O27272
34620B99556J124008K53422J240863J837753n58536j806851K202387O219280K709553
34611A3521435m929532o471106p23628L101918L40227k881825q84880K948204
34603D020813L052033L01685j175242r01385r27548j154860j98448J111962P76785
34594D905795r21092j760426p86542P48193J349893J006386R58897J977693K831130
34585A0309927J364850k153306m255936k480359J125680K854055K211577J325034
34577A0301522R57619L81572J23339J192013K171455P81994j913383k501601l42647
$$ y = [-258013, -1082579, 121436, 851862, 2844401, 6648248, 7835119, 4176654, 1133667, 3885028, 8559784, 8369717, 4572562, 3569710, 5800387, 5815047, 2254689, -327716, 299556, 1423564, 1676986, 2917849, 4755602, 4197066, 2390215, 4592602, 10811882, 13521435, 8591903, 2120797, 1397169, 4499087, 4839314, 1957489, 1072609, 4020813, 7072846, 7374531, 6199289, 5297904, 4370356, 3215496, 3017048, 4129010, 4905795, 3984703, 2224277, 1437735, 2185928, 3535821, 4542207, 5501104, 7478797, 10309927, 11674777, 9521471, 5265535, 2785176, 3910856, 6764911, 8976488, 10301522, 11259141, 11640713, 11764052, 12956065, 15127520, 15909514, 13996131, 11494530, 11151883]
34568A1151883J837998K357006J912825P15172j621013l206571j348946K453241
34560A4251595L435199N28853k032090j411880J29722J87813K33356J809894K764040
34551A9896502Q91304j626316j189542J616545K676350k57918n055087p535608
34543I416230n278849p6226L236046K066499l38833N40224L184209K029106k995733
34534A1782673m998726m99045M692779L999777n74673k715416j411920n13360
34526I762089j378684j919578j518380j382763p94407J834157M587335L830295
34518A3020064M65827o14007J917214L698758J697585j183164j105040P48318
34510A8645555O60099j410644j856942Q51323L610944K705435j467076m972707
$$ y = [11151883, 12989881, 15346887, 17259712, 17974884, 16353871, 13147300, 11798354, 14251595, 17686794, 18215647, 16183557, 14771677, 14901399, 15089212, 15322568, 17132462, 19896502, 20787806, 19161490, 17971948, 19588493, 22264843, 22006925, 16951838, 9416230, 4137381, 4061155, 7297201, 9363700, 9024867, 9565091, 12749300, 14778406, 11782673, 6783947, 6284902, 10977681, 14977458, 14402785, 11687369, 10275449, 9762089, 8383405, 6463827, 4945447, 3562684, 2768277, 4602434, 9189769, 13020064, 13485891, 12871884, 14789098, 18487856, 20185441, 19002277, 17897237, 18645555, 19305654, 17895010, 16038068, 16889391, 20500335, 23205770, 21738694, 16765987]
34502A6765987m890922k052234O47195J386597L55017j241649j963710q27101
34494H179180J371007K153806L40274j959139k178272r39953k99519L14920K711758
34485I694062N330855M637886J147169r88926j027160k525136n634254n027566
34477E606930J133764O457186N395799J546577J045367K570199R29563l155412
34469B1529973m679220l406070l281233m009816j414449L761896N540855K541749
34461A6583685M79556K451984L905343Q47895l247484l394686r96411n98746k154614
34452A3876522j810298J313918L760188K777943n68858l432315m174110l182565
34444H560425j876607r46969M39929K897575M816075M016546J166882r03488j292446
$$ y = [16765987, 11875065, 9822831, 10470026, 11856623, 12211640, 10969991, 9006281, 8179180, 9550187, 11703993, 12044267, 10085128, 7906856, 6966903, 6667384, 6982304, 9694062, 15024917, 19662803, 20809972, 19821046, 18793886, 16268750, 10634496, 5606930, 6740694, 13197880, 18593679, 20140256, 21185623, 23755822, 24685385, 21529973, 16850753, 13444683, 10163450, 6153634, 4739185, 8501081, 14041936, 16583685, 17063241, 19515225, 23420568, 24268463, 21020979, 17626293, 16629882, 16031136, 13876522, 12066224, 13380142, 17140330, 19918273, 19349415, 15917100, 11742990, 8560425, 6683818, 5736849, 6176778, 9074353, 13890428, 17906974, 19073856, 18170368, 16877922]
34435A6877922j516542j713948n7224K861185K972850j459853o121115n832698
34427F010577j292427K508322L022226K040220J712986K027738K472135L322926
34419B1824703M100698K815700j262508m923559l563969K709089P588150N514801
34411C4803105j060001m733585l173377j484065l291412m994275k628362O91669
34403A4129697K6795k613794j882482J218459J353415r78514l89044K420828P41954
34394A4027314n227253o245112Q45744O290978K541955l308818j407011M435225
34386A1953022L620568l130354n316822m17639K621949j056245m781689k326716
34378A166074K326403K712242R704p70421N67609Q64295J76168Q90452K365416
$$ y = [16877922, 15361380, 13647432, 13590208, 16451393, 19424243, 17964390, 11843275, 6010577, 4718150, 7226472, 10248698, 12288918, 14001904, 16029642, 18501777, 21824703, 25925401, 28741101, 27478593, 22555034, 18991065, 21700154, 29288304, 34803105, 33743104, 29009519, 25836142, 24352077, 21060665, 16066390, 13438028, 14129697, 14156492, 11542698, 9660216, 10878675, 12232090, 11253576, 10864532, 13285360, 14027314, 8800061, 2554949, 3400693, 9691671, 12233626, 8924808, 7517797, 11953022, 15573590, 12443236, 7126414, 6708775, 9330724, 8274479, 3492790, 1166074, 3492477, 6204719, 6214423, 5444002, 6011611, 6875906, 7052074, 7942526, 10307942]
34369A0307942J887052r1753n49730O15598K98192k086303k919878k17788K437037
34360I680369Q43952l110882l529409J157704N866194O062062L585707K476535
34352B3032232K123661p67967m950800n210074q06209K368677L77174l118604
34344A3048090l140350p28139L26677J80926J249811K752856K317959Q13238K99458
34335A7120526o16091l608390n102605r68141M667282L492352l876695p486130
34327C622108k760918K883014K045836j788225j154843L564294N921902L361341
34319A5694509p65116k952468k307010O22708L555504K952981j364911m322848
34311A1113349k209273J388459Q05199k913695l728684K91579M892975O176361
$$ y = [10307942, 12194994, 12103241, 11553511, 12169109, 12467301, 10380998, 7461120, 7243332, 9680369, 10524321, 7413439, 3884030, 5041734, 10907928, 16969990, 20555697, 23032232, 25155893, 24387926, 19437126, 14227052, 13420843, 15789520, 16166694, 13048090, 9907740, 9179601, 9506278, 9687204, 10937015, 13689871, 16007830, 16821068, 17120526, 16504435, 12896045, 7793440, 6825299, 11492581, 14984933, 11108238, 3622108, 861190, 3744204, 5790040, 4001815, 2846972, 6411266, 12333168, 15694509, 14929393, 11976925, 9669915, 10292623, 13848127, 16801108, 15436197, 11113349, 8904076, 10292535, 11097734, 8184039, 4455355, 4746934, 9639909, 15816270]
34303A5816270M436844J521282j415817l323569l834644m177201m684951k976929
34295A361285J728158M781343J827583l435783l630569J031402L116192k0483
34287F759128k512075m08630K032282M76448k019159j015581J529460J647369
34279F489242J030361L486438O755209N039172j495989o283828n417686j635289
34271G967630J104576J973638J379114o69575k846863k826418p16476P71154M44858
34262F581638j21293j44941r25506k371871j860886J411124M073342L111238K70427
34253A0023272q06741J02398L28471j066980k191908j468308O24217K899402M399788
34244A2843611L895940O23869l814584o024463m309942n52934K107769K432293
$$ y = [15816270, 20253114, 21774396, 20358579, 17035010, 13200366, 9023165, 4338214, 1361285, 3089443, 7870786, 9698369, 6262586, 2632017, 3663419, 6779611, 6759128, 4247053, 3838423, 5870705, 6347153, 4327994, 3312413, 4841873, 6489242, 7519603, 11006041, 17761250, 22800422, 21304433, 15020605, 9602919, 7967630, 9072206, 11045844, 12424958, 11755383, 8908520, 6082102, 5365626, 6136780, 6581638, 6460345, 6315404, 5389898, 3018027, 1157141, 2568265, 6641607, 9752845, 10023272, 9216531, 9318929, 9647400, 8580420, 6388512, 4920204, 5544421, 8443823, 12843611, 16739551, 17363420, 13548836, 7524373, 3214431, 2661497, 4769266, 7201559]
34236G201559J220910l58982j222026k42031K238871L195520j70625n681005p146790
34227i64599k074346L897845L455325k684864o387505k678607M108390O400412
34219C072051K553337k508854l889486j327472K002382L222485K211500J034211
34211F370154P91099j48564k997053m803685j785024L556797L958369j953710
34203B988383o202488k655138L638465M237024J63442p27535L045818M604863
34195I092834K17514n109305n618602j970701K056336M495861M259259M68840
34187G892036m293918m658137M64321N396602N129831J417120j278763j895392
34179H173700j706848r80384j12173p03864k260399j291292K943014N496547K502025
$$ y = [7201559, 8422469, 8063487, 6841461, 6599430, 8838301, 12033821, 11863196, 6182191, -964599, -3038945, 858900, 4314225, 1629361, -4758144, -7436751, -3328361, 3072051, 5625388, 3116534, -772952, -2100424, -98042, 3124443, 5335943, 6370154, 7161253, 7012689, 4015636, -788049, -2573073, 983724, 4942093, 2988383, -3214105, -5869243, -2230778, 2006246, 2169688, 1442153, 4487971, 9092834, 9310348, 4201043, -1417559, -3388260, -1331924, 3163937, 7423196, 7892036, 3598118, -1060019, -595698, 4800904, 9930735, 11347855, 10069092, 8173700, 6466852, 5486468, 5374295, 4670431, 2410032, 1118740, 4061754, 9558301, 12060326]
34170A2060326k558004l754396r74520J302588J051811j59261j203785k071532
34162C693227j914943m12542K98052j367916l194451k406386p7019J316401K216831
34153a848746L736711L839898P33460k344702j259883J971116K004665j456393
34145E376126m022403m069803l550007k287669J663626O043010N779009J234009
34137F165898j586721l18192Q65318o75965j888450o72384k11552k838387n067209
34128f227644l145600P78393K438261J922286K040781K862487K109057m32436
34120B345585k268320j396396J704097M505272M171630L84584l457064m006907
34112A982481k489059k343624l140710j409745K596019M505393L059262J811495
$$ y = [12060326, 9502322, 5747926, 4773406, 6075994, 7127805, 6968544, 5764759, 3693227, 1778284, 1365742, 1663794, 295878, -2898573, -5304959, -5381978, -4065577, -1848746, 1887965, 5727863, 6461323, 4116621, 2856738, 4827854, 6832519, 5376126, 1353723, -2716080, -6266087, -8553756, -6890130, -847120, 4931889, 6165898, 4579177, 4260985, 5126303, 4450338, 2561888, 1889504, 1677952, -1160435, -6227644, -9373244, -8594851, -6156590, -4234304, -2193523, 668964, 2778021, 2345585, 77265, -1319131, 384966, 4890238, 9061868, 9446452, 5989388, 1982481, -506578, -2850202, -5990912, -7400657, -4804638, -299245, 2760017, 4571512]
34104D571512J997185K15536l900828m482163J404518P198614N407061j534336
34096A0877099n144078k655935J158115K051704N51357j054352j392471q7605
34088D303834J521466P69834k462029m179817j668648J878397J848146q66485
34080A144698j707676L33617J760881J86983k830885m329828k647050J646472
34072f442788N378365M867096N00954k865221k171620J42155J150817K134402
34064B694160M408314M669559O307n588757n823306j166331K560428K802655J472306
34055F035335o61001m038339n885978k855322K163030K947009j86299q60544K253455
34046a088654K999890j241127m268458j092627L764465L592274l15599j972319
$$ y = [4571512, 6568697, 6784233, 2883405, -1598758, -194240, 7004374, 12411435, 10877099, 5733021, 3077086, 4235201, 6286905, 6838262, 5783910, 4391439, 4303834, 5825300, 6595134, 4133105, -46712, -1715360, 163037, 2011183, 1144698, -562978, -229361, 1531520, 1718503, -1112382, -5442210, -8089260, -6442788, -1064423, 3802673, 4303627, 1438406, -733214, -591059, 559758, 2694160, 7102474, 11772033, 11778340, 6189583, 366277, -800054, 1760374, 4563029, 6035335, 5374334, 1335995, -4549983, -7405305, -5242275, -2295266, -2481565, -3342109, -1088654, 1911236, 670109, -3598349, -4690976, -926511, 2665763, 2350164, 377845]
34038C77845l36718P32873j00571l82577P29997J111680J14577J29711K539179
34029D915996N067924M594602R41493l149136m863791l555584p80269J362469
34021D533704J926519J314182L01834m98568n44691L04598J341655J605730Q50018
34012A1134981n19019j884346k281313r28176J176559J553839n18591k544804
34004E189130k230484p07309k94894q52275r60091r61600j649406j486227J143180
33995b809976M017198L439623o1972k398963j965152r86566r59414r06362l97445
33986c029029k17093L33967K695570N168147M043829n98052m306522m285184k069338
33977b263705L02815K422805L248428J462729j058242r72099O70464k63294l211367
$$ y = [377845, 41127, 774000, 673429, 290852, 1020849, 2132529, 2247106, 2376817, 4915996, 9983920, 14578522, 15520015, 12370879, 7507088, 3951504, 3171235, 4533704, 6460223, 7774405, 8076239, 7577671, 7032980, 7337578, 8679233, 10284963, 11134981, 10615962, 8731616, 6450303, 5522127, 6698686, 8252525, 7733934, 5189130, 2958646, 2251337, 1956443, 1104168, 144077, -817523, -2466929, -3953156, -2809976, 1207222, 4646845, 4584873, 2185910, 220758, -765808, -1725222, -2631584, -3029029, -3246122, -2912155, -216585, 4951562, 8995391, 8397339, 4090817, -194367, -2263705, -1960890, 461915, 3710343, 5173072, 4114830, 3142731, 3813195, 3549901, 338534]
33968C38534l116782K35552R03744k377194k673395K934713O358365J160730n523692
33959a759425l498907L829285M787492j681358m892058k72658L824924N32740
33951H70035m835106m296058O42388L382963L142916L819029N276637L549877
33943A1552681j125835l548020j861426n59447k604172l794073M32498O112490
33935D604696N081134k443055o544710j435553N604210M448081l177295o666221
33927e28713k236770K844976K468042l85144r69551k72910l81979P77068L978401
33918E293420M069421j811524o612777k771382M757818N113182j129409k872436
33910D036313K963416O274758Q84320m989306k498178L292881K264902m087643
$$ y = [338534, -2778248, -2542696, -1638952, -4016146, -6689541, -3754828, 2603537, 3764267, -1759425, -5258332, -1429047, 3358445, 1677087, -3214971, -3487629, 337295, 870035, -3965071, -8261129, -7618741, -4235778, -1092862, 2726167, 8002804, 11552681, 10426846, 6878826, 5017400, 4457953, 1853781, -1940292, -1507794, 4604696, 9685830, 7242775, 698065, -737488, 4866722, 9314803, 6137508, -528713, -2765483, 79493, 2547535, 2162391, 1192840, 919930, 537951, 1315019, 5293420, 9362841, 7551317, 938540, -1832842, 2924976, 8038158, 6908749, 4036313, 6999729, 13274487, 14158807, 9169501, 6671323, 9964204, 12229106, 8141463]
33902H141463n857691j153508J918435n60220k671464K12953L602518K020713
33894E653199j732181j630136J531091J903614j422179k899725L72373L809773
33886E585829K318178j963387k925021M77721K915890O42558l153255k976497
33878I22016J470130N209855M416579K21693l795773n403527m373408j614362
33870b946797R37466J098207j210117l172337k074239J428079M209206M235038
33862B504506J952767j145363l554468l709766j098437K180797L000762J156752
33854A287550k05065P88491J887247M89122j766832j341222J321810K120966j74425
33845D407642j690308M91521L452393K608317j464852l886197k214144R80794
$$ y = [8141463, 2283772, 1130264, 3048699, 2488479, -182985, 29968, 3632486, 5653199, 3921018, 2290882, 3821973, 5725587, 4303408, 1403683, 1776056, 5585829, 7904007, 5940620, 3015599, 3493320, 6409210, 7051768, 3898513, 922016, 2392146, 7602001, 12018580, 12240273, 8444500, 3040973, -1332435, -2946797, -2009331, -911124, -2121241, -5293578, -7367817, -5939738, -1730532, 2504506, 4457273, 3311910, -242558, -3952324, -5050761, -2869964, 130798, 1287550, 1082485, 1870976, 3758223, 4247345, 2480513, 1139291, 2461101, 4582067, 4407642, 2717334, 3208855, 6661248, 9269565, 7804713, 3918516, 1704372, 2685166]
33837B685166K265306J229039l20740q60761j58361P02018P0490k049178k860856
33828G02123M2197M559174N888905K878034m86267j108801j053842l348874o251218
33819A821431n425820p32703L021928K495619k48538j417564m50624O63515J076393
33810H03637J392622J221456m62566k285128j122626K660102L868326m81828n345586
33801B48409l601209L324432O651454K858535j303313M75466M371589K979118
33793A6004481k832602n615162k786501P06149Q04538j064676k404494k785211
33785B6522j539786K147488N561094M299055o47442l125205r00259J339605L83354
33776G544426n19580J303680K298363p67147m028117k432348J781599K941442
$$ y = [2685166, 4950472, 6179511, 5858771, 4998010, 4839649, 5541667, 5612157, 3562979, 702123, 744320, 5303494, 11192399, 14070433, 13584166, 12475365, 11421523, 8072649, 1821431, -3604389, -4337092, -1315164, 1180455, 931917, -485647, -936271, -272756, 803637, 2196259, 3417715, 2955149, 670021, -452605, 2207497, 6075823, 5593995, 248409, -3352800, -28368, 6623086, 9481621, 8178308, 8653774, 13025363, 16004481, 13171879, 7556717, 4770216, 5476365, 6280903, 5216227, 2811733, 26522, -1513264, 634224, 6195318, 10494373, 9846931, 6721726, 5821467, 7161072, 7544426, 7024846, 8328526, 10626889, 9859742, 5831625, 3399277, 5180876, 8122318]
33768H122318R72524l9085K71446r59717l059888k509329K50165J310461M36175
33759D795070J143710L322170K627367j363761l127426N3819L352415J960119
33751A2763483j760034k903038j593953j129749j584460m29901K005218K591013
33743G958579O77452p93322j2544J190668O65221q05500j069694J87264J284566
33734I282690P78238j189500l194561l444751j110241K331038L749286J622499
33726H824698j755201k772255r45026R90147J364225J309414J479991L44039k161187
33717F678845k630701O24251L298510Q27871l682699l248531K133911N211683
33709I213140K713856k94439M15143J747956p0506k616331k225939p45881j515353
$$ y = [8122318, 9094842, 9055757, 9327203, 8367486, 5307598, 2798269, 3048434, 4358895, 4795070, 5938780, 9260950, 11888317, 10524556, 7397130, 7450949, 10803364, 12763483, 11003449, 8100411, 6506458, 5376709, 3792249, 3362348, 5367566, 7958579, 8636031, 7842709, 7830165, 9020833, 9686054, 8880554, 7810860, 7998124, 9282690, 10060928, 8871428, 5676867, 2232116, 1121875, 3452913, 7202199, 8824698, 7069497, 4297242, 3352216, 4342363, 5706588, 7016002, 8495993, 8840032, 6678845, 4048144, 4672395, 7970905, 8798776, 5116077, 1867546, 4001457, 9213140, 11926996, 11632557, 12047700, 13795656, 13725150, 11108819, 8882880, 8136999, 6621646]
33700F621646k627836l74122L485668L997873P22658k221116k329510l30164K464779
33691I409876M041807J490111m318662o940746k771610K192751P41454l814875
33683C0106k762369L520214O180874K705324N24481L692767O046498K083496l757368
33674A8264023m436230o59534J884233R98703j527962m227710o064243n178599
33666i47319j546375J559076J888500J384616K398268L781753L488286K008333
33658A4015138M84682j529139l709091l545703k97908K517747J620883j537045
33650H019564l408319k933978j059569J584380L959818M188720K275050P74507
33642A3400173P89856K68358j773883k873244j409818K89192p7776j110514q30474
$$ y = [6621646, 3993810, 3619688, 7105356, 11103229, 11825887, 9604771, 7275261, 6945097, 9409876, 13451683, 14941794, 10623132, 3682386, 910776, 3103527, 3844981, 30106, -2732263, 787951, 6968825, 9674149, 10198630, 13891397, 19937895, 22021391, 18264023, 13827793, 13168259, 15052492, 16051195, 14523233, 10295523, 4231280, -947319, -2493694, -934618, 953882, 2338498, 4736766, 8518519, 12006805, 14015138, 14499820, 12970681, 9261590, 5715887, 5417979, 7935726, 9556609, 8019564, 4611245, 1677267, 617698, 2202078, 6161896, 10350616, 12625666, 13400173, 14190029, 14458387, 12684504, 9811260, 8401442, 8690634, 8612858, 7502344, 6671870]
33633F671870n8519K13713J276669L455989M025178J627161q10857q48933l68940
33624A5183331j211849j276802R84310K583437J143963l59600Q30304J490467
33616A9367561j667790m660429k093376L074827L646772k55628k047567J77327
33608A5541697J773556O73385K16802J871005K502774N20946j600724k298811
33600A9200630k567523j855915J498816N089237M406320Q15942K32634K678117
33592B9498258J599832m024506o223155j161992L420260O10796m035162k038289
33584A7646042L273379K224139m611045o661866o9761O311750M316563k486793
33576A9942408n476981k718109J003294K226017J963213K153786K698449K209328
$$ y = [6671870, 6613351, 6827064, 8103733, 11559722, 15584900, 17212061, 16401204, 15552271, 15183331, 13971482, 12694680, 13678990, 16262427, 17406390, 17046790, 17877094, 19367561, 17699771, 13039342, 10945966, 14020793, 17667565, 17411937, 15364370, 15541697, 17315253, 17988638, 18205440, 20076445, 22579219, 23100165, 21499441, 19200630, 16633107, 14777192, 16276008, 21365245, 25771565, 26587507, 26820141, 29498258, 31098090, 27073584, 20850429, 19688437, 23108697, 23719493, 19684331, 17646042, 20919421, 23143560, 18532515, 11870649, 11800888, 18112638, 22429201, 19942408, 14465427, 11747318, 12750612, 14976629, 16939842, 19093628, 21792077, 24001405]
33568B4001405k2319k925609m170617k535538K65406J509835J120013J321453
33560A8564029K499858K232521m11191k566375j801900j45600q23483k860413
33552A4687446k747595m62541O65009J96403J642753N558309O656564J490702
33544B7687050n131418o408108l170814j259999j404904P68840M844283M348987
33536B0273917j925697n583270r10838N375080L911793k915482n082526n17301
33528A2625676K960164R72258j518775J76144L126978K942512Q21000j28825n40132
33519B1437000j922713k216578O37091L652104K561761j250179k602180l10414
33511A9985892J598798L50480k125660k831630j387650Q49308K667874K995720
$$ y = [24001405, 23979086, 21053477, 16882860, 14347322, 14612728, 16122563, 17242576, 18564029, 21063887, 23296408, 22885217, 20318842, 18516942, 18371342, 17547859, 14687446, 11939851, 11477310, 12142319, 12338722, 13981475, 19539784, 26196348, 27687050, 22555632, 16147524, 12976710, 11716711, 10311807, 11080647, 15924930, 20273917, 18348220, 12764950, 11854112, 17229192, 21140985, 18225503, 13142977, 12625676, 15585840, 16558098, 15039323, 15215467, 18342445, 21284957, 22105957, 21977132, 21437000, 19514287, 17297709, 17934800, 21586904, 24148665, 22898486, 20296306, 19985892, 21584690, 21935170, 19809510, 16977880, 15590230, 16439538, 19107412, 22103132]
33503B2103132J145705j816337l363011k068557Q59713K886885K443005K06753
33495B2397288j311403k20271K054070J945705j174299l091530k77150M471928
33487B4794338N400026J873736j028288j87376J691816J418700M30297J682026
33479C6075275M367091N214071L410200J004547o20444j708817k172547j519243
33471D4050133n16259l84424n55546K23669R09367o26377l349858l605115p94252
33462C5351338J092852o53147l445063l663389j899695q94599p85953L259J008234
33453B6113837O74404j98276K29030J041310L3563j800003j572821M9742n28404
33444B4042382l444943m601961k342956J31313P25133J635038M005568M590801
$$ y = [22103132, 23248837, 21432500, 18069489, 16000932, 16860645, 19747530, 22190535, 22397288, 21085885, 20865614, 22919684, 24865389, 23691090, 20599560, 20322410, 24794338, 30194364, 32068100, 31039812, 30852436, 32544252, 33962952, 34393249, 36075275, 40442366, 45656437, 49066637, 50071184, 49450740, 47741923, 45569376, 44050133, 43533874, 43149450, 42593904, 42817573, 43726940, 43100563, 39750705, 36145590, 35351338, 36444190, 35791043, 32345980, 28682591, 26782896, 25888297, 25102344, 25105603, 26113837, 26788241, 26589965, 26818995, 27860305, 27893868, 26093865, 24521044, 24570786, 24042382, 20597439, 15995478, 13652522, 13783835, 14508968, 16144006, 20149574, 24740375]
33436B4740375J443925j733273j410717k58496k137322m652811k932090J556550
33428A4616141K718119n40209k937615j291721J687024K990965L070901K521718
33420B2835323L07836k649568k952977k49897J159851j050002l323521k222113
33412A1854932j37388o58340j670921J406898P174295Q803806L534045l023708
33404B7283619l872214J011446N361284M226805q09952l827985j281443L899896
33396C1991456N604531J888555k678549l045001o5161J463787k33053k162739
33388C2763826j629408L27317J555053J923186K094985J525013j19720j359511
33380C7080741j141561j087144k641957l450662m74020L918660L867596j024777
$$ y = [24740375, 26184300, 24451027, 23040310, 22781814, 20644492, 15991681, 13059591, 14616141, 17334260, 16794051, 13856436, 12564715, 14251739, 17242704, 20313605, 22835323, 23143159, 20493591, 17540614, 17290717, 18450568, 17400566, 14077045, 11854932, 11717544, 11059204, 9388283, 10795181, 17969476, 26773282, 30307327, 27283619, 23411405, 24422851, 29784135, 34010940, 33200988, 29373003, 28091560, 31991456, 37595987, 39484542, 36805993, 33760992, 33695831, 35159618, 34926565, 32763826, 31134418, 31461735, 33016788, 34939974, 37034959, 38559972, 38440252, 37080741, 35939180, 34852036, 32210079, 28759417, 28285397, 32204057, 36071653, 35046876]
33372C5046876l872337l91133M259472L051953k344449m548960j729678R02365
33364C0374109K80457q36126m14702o47004k468473k715275j89165R19119k105513
33355B2197427n014711k897035J949181L711333J534550j022604k411761l447912
33347A4598468l219296k98440L126040L546656J656826P70530R66988m5863j459340
33338A9642569m78459J844342J886989K47611R12713L386358K484454k555932
33330B7370645n479474k317205K469912K716004j058664l675007k519058N06319
33322A8013472K200958J130207j048671q50417K496960M760402K328816j512439
33314B7519288j140232J963964J319968l275985m869521j153214J666796q3065
$$ y = [35046876, 31174539, 30783406, 35042878, 38094831, 35750382, 31201422, 29471744, 30374109, 30654566, 29818440, 29403738, 28756734, 26288261, 23572986, 23383821, 24302940, 22197427, 17182716, 14285681, 16234862, 19946195, 21480745, 20458141, 18046380, 14598468, 11379172, 11080732, 14206772, 17753428, 19410254, 20180784, 21147772, 21101909, 19642569, 19164110, 21008452, 22895441, 23143052, 24055765, 27442123, 29926577, 27370645, 21891171, 19573966, 22043878, 24759882, 23701218, 20026211, 17507153, 18013472, 20214430, 21344637, 20295966, 19445549, 21942509, 26702911, 29031727, 27519288, 26379056, 28343020, 29662988, 26387003, 21517482, 20364268, 22031064, 21947999]
33306B1947999j520454R88344K608957q17502m108995j293166L463723K581598
33298B3850504j959976k182351K107240L094097j915266o226423m130504J571716
33290A4209037M671284L156585j78357j367873J304027N195805N416632J258243
33282C3665383j977678p33447R55928j663614n232721l358996K152026L448061
33274B7254942q31677l631832q81978L129872L766905K312500J505812R68770
33266C3593314J22299M12997J756828J527915l37945j17688L035697M232412K89528
33257D4515357m403435l826629J103937M330428K961963k11555j517745n31569
33249D2420752N02906l06738k078262j808266J452056M065526K228663j841389
$$ y = [21947999, 20427545, 21415889, 24024846, 23207344, 19098349, 17805183, 21268906, 23850504, 21890528, 19708177, 21815417, 24909514, 22994248, 16767825, 12637321, 14209037, 18880321, 22036906, 21858549, 20490676, 21794703, 26990508, 32407140, 33665383, 31687705, 30954258, 31910186, 30246572, 25013851, 21654855, 23806881, 27254942, 26423265, 22791433, 21909455, 25039327, 28806232, 31118732, 32624544, 33593314, 33715613, 34128610, 35885438, 37413353, 37075408, 36957720, 39993417, 44225829, 44515357, 40111922, 36285293, 37389230, 41719658, 44681621, 44470066, 42952321, 42420752, 42923658, 42616920, 40538658, 38730392, 40182448, 44247974, 46476637, 44635248]
33241D4635248k260098J792645M512723K084121j963215k610161l24769J254636
33233D7121130J310021J615890K310522J535549j323345m334193m721066j223713
33225D2290795M094974O487123L255336k173148l873429j103826J390460Q88579
33217E1256864k92691k78845p10728k195469k040298N09062J873065L36867n85788
33208D7872039J105982J427238k192445m624069q93369M359099L282362k571808
33200D7765029m755482j321900J328943r8858j476434L0253J213998k89474j649573
33191D0746502j027092j582033m884359o124511j318590N204122O438909K719342
33183D0172290J08899P67337J106558q80540k337263q34737J690354K422473J813971
$$ y = [44635248, 42375150, 44167795, 48680518, 50764639, 48801424, 46191263, 45866494, 47121130, 48431151, 50047041, 52357563, 53893112, 52569767, 48235574, 43514508, 42290795, 46385769, 52872892, 56128228, 53955080, 50081651, 48977825, 50368285, 51256864, 50964173, 50685328, 49974600, 47779131, 45738833, 46247895, 48120960, 48457827, 47872039, 48978021, 50405259, 48212814, 43588745, 42695376, 47054475, 50336837, 47765029, 43009547, 41687647, 43016590, 42917732, 41441298, 41471551, 42685549, 42396075, 40746502, 39719410, 38137377, 33253018, 27128507, 25809917, 31014039, 37452948, 40172290, 40281189, 41048526, 42155084, 41274544, 38937281, 38102544, 39792898, 42215371, 44029342]
33174D4029342J861625K442324J861158j7110j344121q20871P54326J588761P89619
33165E1145053q22027j349710M04064L299103M512747K622007n00390j985587
33157E7325260j612531j384918j702761o47400J982587K975545N14163j920921
33149E5529024k32211L391004L068544j618863m504295k141311J184284O24124
33141E5300300j924582j963937l1222Q9544j593013j625517M86289J489549m4251
33132E0183160k013470k892758l174789k398227O79370M152081L899577j05441
33124D8329503k910033j822097j2962n17132j334987N561J291912m41852l167746
33115C9420167l092744j142067q16580j415533M95632L553303K250539l752007
$$ y = [44029342, 45890967, 48333291, 50194449, 50177339, 48833218, 48012347, 48766673, 50355434, 51145053, 50323026, 48973316, 49377380, 52676483, 57189230, 59811237, 59310847, 57325260, 55712729, 54327811, 52625050, 51977650, 53960237, 56935782, 57449945, 55529024, 55296813, 58687817, 61756361, 60137498, 55633203, 53491892, 54676176, 55300300, 53375718, 51411781, 51380559, 51470103, 49877090, 48251573, 48737862, 50227411, 50183160, 48169690, 45276932, 42102143, 39703916, 40383286, 44535367, 48434944, 48329503, 45419470, 43597373, 43584411, 43067279, 41732292, 41737853, 43029765, 42587913, 39420167, 36327423, 35185356, 34368776, 32953243, 33448875, 37002178, 39252717, 35500710]
33107C5500710p392792m090684J613732L176708J195585M73875J483820Q80585
33099C2841539j204056r91099J590729J752749j960528m097638n74893M182785
33091C1539588L501395j231765k619380J452238M934421L126965o98249j176311
33083C8828902J050874J364290j247867l203584k196405o3758O99521K53353J51033
33074C5636359Q27992J554147J699937J172775L03758k72519k18811p7292o20749
33065D0005597j703855k433449k260555j205466N50643K386165L107685K285280
33057D0732045J227440J270787J606337N19002j502901j982068q8634J929743
33049D3711751J785624L0703j144786q05193J51138N64609J60185o11053j260171
$$ y = [35500710, 28107918, 24017234, 25630966, 28807674, 30003259, 30477134, 31960954, 32841539, 31637483, 30646384, 32237113, 33989862, 32029334, 27931696, 27356803, 31539588, 35040983, 33809218, 31189838, 32642076, 37576497, 40703462, 40005213, 38828902, 39879776, 41244066, 39996199, 36792615, 34596210, 34532452, 35231973, 35485326, 35636359, 36464351, 38018498, 39718435, 40891210, 41194968, 40922449, 40703638, 40626346, 40005597, 38301742, 35868293, 33607738, 32402272, 32952915, 35339080, 38446765, 40732045, 41959485, 43230272, 44836609, 45355611, 43852710, 41870642, 41782008, 43711751, 45497375, 45528078, 44383292, 43578099, 43729237, 44293846, 44454031, 43842978, 42582807]
33040D2582807j709178j953444j315683R77899L776826L996982M35776l566204
33032D3225781l921573j608153j278183l835976m485838m7312N495312O073828
33024C9617886J728262k118768k312337r06720n84626r51623m95421O96614J795746
33015C6469013K715724L108296J653398j651406l794039j876481K319774L478511
33007D2422790o25119n691105n940283j462128J946694M19786l016106k667865
32999B5386664K281145O822845O408387K006157j722222j759164P47934K495457
32991D2667203J617054o49399j616817l87563J104088P23845j079904k256088
32983D0122419k130113j735442j612934j266901p83930q92211j112088l4247J929235
$$ y = [42582807, 40873629, 38920185, 37604502, 38582401, 42359227, 46356209, 46791985, 43225781, 39304208, 37696055, 36417872, 32581896, 28096058, 28048746, 33544058, 39617886, 41346148, 39227380, 36915043, 36008323, 35423697, 34472074, 33976653, 34673267, 36469013, 39184737, 42293033, 43946431, 42295025, 38500986, 36624505, 38944279, 42422790, 41797671, 36106566, 30166283, 28704155, 30650849, 31070635, 28054529, 25386664, 27667809, 34490654, 40899041, 42905198, 41182976, 39423812, 40171746, 42667203, 44284257, 43634858, 42018041, 41630478, 42734566, 43458411, 42378507, 40122419, 37992306, 36256864, 34643930, 33377029, 32593099, 31700888, 30588800, 30554553, 32483788]
32974C2483788K343713M31368j145016J81503L091287L915810J194948k614080
32966C9883321l632215l59685M353331N476492J452534k974210k237818K213960
32958D4175710L606237o3067k763593J40449M325360L114536k099970m053442
32950D6382220m45146L478342L040328m85181l354874l716933j420271K557543
32942D6036028N146693L149277k231153n659656l939472L97995K975443K679145
32934D8554300J511521J243270J628521J016699j685732m954848n387019j936671
32926C9990041K037583L185800K734696L437094M088210J744357k034221k757451
32918E2426109l68456Q23006l28219n69567Q49404Q35261o75677J59384K920382
$$ y = [32483788, 34827501, 35258869, 34113853, 34295356, 37386643, 41302453, 42497401, 39883321, 36251106, 35891421, 40244752, 45721244, 47173778, 44199568, 41961750, 44175710, 47781947, 47718880, 44955287, 45095736, 49421096, 52535632, 50435662, 46382220, 45937074, 49415416, 52455744, 51970563, 48615689, 44898756, 43478485, 46036028, 51182721, 54331998, 52100845, 46441189, 42501717, 42899712, 45875155, 48554300, 50065821, 51309091, 52937612, 53954311, 52268579, 47313731, 41926712, 39990041, 42027624, 45213424, 47948120, 51385214, 55473424, 57217781, 55183560, 52426109, 52057653, 52880659, 52552440, 51982873, 52832277, 53667538, 52991861, 53151245, 56071627]
32909E6071627J880318l380573m792651J434250P125134M442221j598189j841924
32901E9340213K032316J847508k058837j830046L577320O563068L974247J511564
32893G4957353K974694M520569K834662Q84020J716862L361803L757430M864298
32885I9871691Q083685J0647558J0045465P681681N444351L090855J246073K037265
32877A48148624M430740M164070P52561j034320O15222J017206k820437o744830
32869A48528836o644844n113715n782053o659954m990672l513803n337921p203805
32861A03282069m964726j731061k824188n932457m734444j42233J014888k162089
32853H1805759l093175R40139M169870J651271l538372n676357l879830j129549
$$ y = [56071627, 57951945, 54571372, 49778721, 51212971, 58338105, 62780326, 61182137, 59340213, 61372529, 63220037, 61161200, 59331154, 62908474, 69471542, 73445789, 74957353, 77932047, 82452616, 85287278, 86171298, 87888160, 91249963, 95007393, 99871691, 107955376, 118602934, 128648399, 136330080, 141774431, 144865286, 146111359, 148148624, 152579364, 156743434, 157495995, 156461675, 157076897, 158094103, 155273666, 148528836, 141883992, 136770277, 130988224, 124328270, 119337598, 115823795, 110485874, 103282069, 98317343, 96586282, 93762094, 87829637, 83095193, 82952960, 83967848, 81805759, 78712584, 79652723, 83822593, 85473864, 81935492, 76259135, 72379305, 71249756]
32845G1249756K96382j65996j892844k828077j324708R48225Q16713j451077k482746
32836F3165628j236057o2531R7554J155338L446389M201900K072099n85737j506634
32827G0747949j149177k55584J595788L618677L588516J440349k91482p45941
32819G8549095j721155l333331k993094k94034J511295R50278Q27898K922179
32811G6419131M670684M050580L422064N073169O865661O014921L709834K361655
32803A12587699J729320J429033L491736Q059079J0137687N746318j517387n137756
32795A36525729m365986l099939k749281k210787k891648o979726j1492676j0782378
32787I1953308n218963j117059j363909k407072j843139k452648n934518q417520
$$ y = [71249756, 71546138, 71380142, 69487298, 66659221, 65334513, 66282738, 67099451, 65648374, 63165628, 61929571, 61867040, 61964594, 63119932, 66566321, 70768221, 72840320, 72254583, 70747949, 69598772, 69343188, 70938976, 74557653, 78146169, 79586518, 79295036, 78549095, 76827940, 73494609, 70501515, 70207481, 71718776, 72669054, 73496952, 76419131, 81089815, 85140395, 88562459, 93635628, 100501289, 106516210, 110226044, 112587699, 114317019, 115746052, 119237788, 127296867, 137434554, 143180872, 141663485, 136525729, 132159743, 129059804, 126310523, 124099736, 121208088, 114228362, 102735686, 91953308, 86734345, 85617286, 84253377, 81846305, 80003166, 77550518, 71616000, 63198480]
32779F3198480o146081j425811J020681M62043o48413j183484j496812j173406
32771E2607197m3702Q1375k187180m803748m502777j236840K013088L125016K338143
32762D7390572O44646j041733j581711n85519N58198M15916j45523P15827K462801
32753D8833474K419709k78960l058033l195416j236725J64240q5067m76190N60110
32744D3647142K331166K780287J162431j072834k162410j987785j619234j535537
32736D1543226j264853o54409m47190j180137k156596k104430p07981Q94525J273806
32727C5195961K72979q95416j285173j341349j628625j228155P68259K455781
32719C2314262O62667l736235n305431j376845L017733J555607l939998n646510
$$ y = [63198480, 57052399, 55626588, 56647269, 57109312, 56460899, 55277415, 53780603, 52607197, 52563495, 52644870, 50457690, 45653942, 41151165, 39914325, 41927413, 45052429, 47390572, 48035218, 46993485, 45411774, 44826255, 45384453, 45800369, 45654846, 46370673, 48833474, 51253183, 50974223, 47916190, 44720774, 43484049, 43648289, 43563222, 43087032, 43647142, 45978308, 48758595, 49921026, 48848192, 46685782, 44697997, 43078763, 41543226, 40278373, 39623964, 39176774, 37996637, 35840041, 33735611, 33027630, 33922155, 35195961, 35468940, 34573524, 33288351, 31947002, 30318377, 29090222, 29858481, 32314262, 32976929, 29240694, 23935263, 22558418, 25576151, 27131758, 23191760, 17545250]
32711A7545250j014012L794408L280955j3731q66724M01844m0806k079464j916058
32702A9091662Q73094J915365j233913n193329n544138k416385Q74799K326006
32694A0693161J951234r3094l166535m842502k889113J363402M039848L537862
32686A0594263K168649K293936L056259K339769R6914k161315l740296m464986
32678A0183193l234912M09362L921197L999329J212842p44727p55755j573077
32670A3417452m214699n121016j663064K855363L424510L23395j986593j407598
32662E627750L01032J521093K223997J936889J92761j203052j73589J612789Q54804
32653A2894474j419421q61259K654680L854423K68599l450783k274117K370363
$$ y = [17545250, 16531238, 20325646, 23606601, 23592870, 22726146, 23127990, 23087184, 21007720, 19091662, 19964756, 21880121, 20646208, 15452879, 9908741, 7492356, 8367155, 10693161, 12644395, 12551301, 9384766, 4542264, 1653151, 3016553, 7056401, 10594263, 12762912, 15056848, 18113107, 20452876, 20549790, 18388475, 14648179, 10183193, 6948281, 7357643, 11278840, 15278169, 16491011, 15746284, 14990529, 13417452, 9202753, 4081737, 2418673, 5274036, 8698546, 9021941, 7035348, 5627750, 5928782, 7449875, 9673872, 11610761, 11803522, 10600470, 10426881, 12039670, 12894474, 11475053, 10613794, 13268474, 17122897, 17391496, 13940713, 11666596, 14036959]
32645A4036959N633925N459533K654102j654980n177703m424364O42236M705459
32637B1875167L526308m71217k634353k822672l323829l318141r26823J664593
32629A3569033J083369r43333k86917J944078J129538k157788k462566J001937
32621A2877351K593316j08587k165977L665K444038O58813k708722k505311N73502
32612A1662088J662879o92815l407861l780981j772950J324592L497466K785286
32604A1277704p3051j657780o26811K58247q05090j170245J272927L360321J531070
32595A3367292j718528j704015N31107K43784k514703k976633j26361J330518
32587F432461j236793m152707l160422Q52262M015633M186066J879215q55524
$$ y = [14036959, 19670884, 25130417, 27784519, 26129539, 20951836, 16527472, 17169708, 21875167, 25401475, 24930258, 22295905, 19473233, 16149404, 12831263, 11904440, 13569033, 14652402, 13709069, 13422152, 15366230, 16495768, 14337980, 11875414, 12877351, 15470667, 15362080, 13196103, 13199768, 15643806, 16302619, 13593897, 11088586, 11662088, 13324967, 12632152, 9224291, 5443310, 3670360, 4994952, 8492418, 11277704, 11204653, 9546873, 8920062, 9178309, 8373219, 7202974, 8475901, 11836222, 13367292, 11648764, 9944749, 10475856, 10719640, 8204937, 5228304, 5101943, 6432461, 5195668, 1042961, -2117461, -1265199, 2750434, 6936500, 8815715, 7960191]
32579G960191j581450K3888Q27416j585755m152516k110561K952285M482345J012767
32570G828610j509947N21462K819506J082218j527667l1258L710685L946334m9422
32561A6790521l560747l423586p53224K149139L536789J998923j743049l932325
32553A1062441k093111J095998J571289k28465r90069k62288k94192j440499k013526
32544F407578j754617j502852o58404J044993J066746j992129m098821j149368
32536b636874L363940K939648j083408j419778K681226M114819N98651j164141
32528G394083K302489M488619K39546m726245l255552J384813J852754o72152
32520I008355Q3075L365784L009275p49633j323458K431400M200050J389029p17586
$$ y = [7960191, 6378741, 6402629, 7230045, 5644290, 1491774, -618787, 2333498, 6815843, 7828610, 6318663, 6840125, 9659631, 10741849, 9214182, 9182924, 12893609, 16839943, 16790521, 13229774, 9806188, 9052964, 11202103, 14738892, 16737815, 14994766, 11062441, 8969330, 10065328, 11636617, 11408152, 10418083, 10155795, 9861603, 8421104, 6407578, 4652961, 3150109, 2491705, 3536698, 4603444, 2611315, -1487506, -2636874, 727066, 3666714, 2583306, 1163528, 3844754, 7959573, 8558224, 7394083, 9696572, 14185191, 14424737, 9698492, 6442940, 7827753, 9680507, 9008355, 9091430, 12457214, 15466489, 14716856, 13393398, 15824798, 20024848, 21413877, 20696291]
32511B0696291J293012L161892Q06921k750762k820745k29583J261920O79366
32503B2098312p56151k388256l160909j431254J524838J743265r90541j558430
32495A5080874K190242M617789P08029n165575n114787O08479M452270K541068
32487A9918389j549196l616588l606163k954987j965779q12991L45549K459790
$$ y = [20696291, 21989303, 25151195, 25958116, 23207354, 20386609, 20157026, 21418946, 22098312, 21342161, 18953905, 15792996, 14361742, 15886580, 17629845, 16639304, 15080874, 17271116, 21888905, 22596934, 17431359, 12316572, 12925051, 17377321, 19918389, 18369193, 14752605, 11146442, 8191455, 6225676, 5412685, 5758234, 8218024]
$$ [...]
##END NTUPLES=NMR SPECTRUM
##END=
