##TITLE=31Pdec_AT-44x_T2
 DMSO-d6+CD3ONa, 324 sc
 25.8.2022
##JCAMPDX= 6.0         $$ Bruker NMR JCAMP-DX V2.0
##DATA TYPE= NMR SPECTRUM
##DATA CLASS= NTUPLES
##ORIGIN= UXNMR, Bruker Analytische Messtechnik GmbH
##OWNER= root
$$ XWIN-NMR		Version 3.5
$$ Thu Aug 25 12:52:20 2022 Russian Standard Time (UT+4h)  she@DPX200
##.OBSERVE FREQUENCY= 81.013821
##.OBSERVE NUCLEUS= ^31P
##.ACQUISITION MODE= SIMULTANEOUS
##.ACQUISITION SCHEME= undefined
##.AVERAGES= 324
##.DIGITISER RES= 16
##SPECTROMETER/DATA SYSTEM= spect
##.PULSE SEQUENCE= zgpg30
##.SOLVENT NAME= DMSO
##.SHIFT REFERENCE= (INTERNAL, DMSO, 0, 248.564)
##AUDIT TRAIL= $$ (NUMBER, WHEN, WHO, WHERE, WHAT)
$$ ##TITLE= Audit trail, XWIN-NMR		Version 3.5
$$ ##JCAMPDX= 5.01
$$ ##ORIGIN= Bruker BioSpin GmbH
$$ ##OWNER= she
$$ F:/spectra/data/she/nmr/P31/1/pdata/1/auditp.txt
$$ ##AUDIT TRAIL=  $$ (NUMBER, WHEN, WHO, WHERE, WHAT)
(   1,<2022-08-25 12:51:28.70 +0400>,<she>,<DPX200>,
      <created by zg, POWCHK disabled, PULCHK disabled
       configuration hash MD5:
       00 E9 B6 7A A2 85 ED C7 34 08 36 98 17 FE 4E 26
       data hash MD5: 32K
       0E B5 C2 FD E9 97 13 EC 9E 25 D0 7F 19 B8 EE 1E>)
(   2,<2022-08-25 12:51:31.26 +0400>,<she>,<DPX200>,
      <Start of raw data processing
       efp BC_mod = 2 LB = 1 FT_mod = 6 PKNL = 1 PHC0 = -10285.38 PHC1 = 88.85633 SI = 64K 
       data hash MD5: 64K
       94 DE E7 20 DA 92 59 85 74 B1 C8 FA 97 E7 67 32>)
$$ ##END=
$$ 
$$ hash MD5
$$ B4 49 89 B5 6F E6 A5 7F 0D A8 59 DD 1D 4A 59 B1
##$RELAX= 
##$RELAX= 
##$RELAX= 
##$RELAX= 
##$RELAX= 
##$RELAX= 
##$RELAX= 
##$RELAX= 
$$ Bruker specific parameters
$$ --------------------------
##$DU= <F:/spectra>
##$EXPNO= 1
##$NAME= <P31>
##$PROCNO= 1
##$TYPE= <nmr>
##$USER= <she>
##$AMP= (0..31)
100 100 100 100 100 100 100 100 100 100 100 100 100 100 100 100 100 100 
100 100 100 100 100 100 100 100 100 100 100 100 100 100 
##$AQSEQ= 0
##$AQ_mod= 1
##$AUNM= <au_zg>
##$AUTOPOS= <>
##$BF1= 81.014009
##$BF2= 200.13
##$BF3= 200.13
##$BF4= 200.13
##$BF5= 200.13
##$BF6= 200.13
##$BF7= 200.13
##$BF8= 200.13
##$BYTORDA= 1
##$CFDGTYP= 0
##$CFRGTYP= 5
##$CHEMSTR= <none>
##$CNST= (0..31)
1 1 145 1 1 1 1 1 1 1 1 1 1 1 1 1 1 1 1 1 1 1 1 1 1 1 1 1 1 1 1 1 
##$CPDPRG= <waltz16>
##$CPDPRG1= <>
##$CPDPRG2= <waltz16>
##$CPDPRG3= <>
##$CPDPRG4= <mlev>
##$CPDPRG5= <mlev>
##$CPDPRG6= <mlev>
##$CPDPRG7= <mlev>
##$CPDPRG8= <mlev>
##$CPDPRGB= <>
##$CPDPRGT= <>
##$D= (0..31)
0 1 0 0 0 0 0 0 0 0 0 0.03 2e-05 3e-06 0 0 0 0 0 0 0 0 0 0 0 0 0 0 0 0 
0 0 
##$DATE= 1661417488
##$DBL= (0..7)
120 120 120 11 120 120 24 19 
##$DBP= (0..7)
150 150 150 150 150 150 150 150 
##$DBP07= 0
##$DBPNAM0= <>
##$DBPNAM1= <>
##$DBPNAM2= <>
##$DBPNAM3= <>
##$DBPNAM4= <>
##$DBPNAM5= <>
##$DBPNAM6= <>
##$DBPNAM7= <>
##$DBPOAL= (0..7)
0.5 0.5 0.5 0.5 0.5 0.5 0.5 0.5 
##$DBPOFFS= (0..7)
0 0 0 0 0 0 0 0 
##$DE= 6
##$DECBNUC= <off>
##$DECIM= 3
##$DECNUC= <off>
##$DECSTAT= 4
##$DIGMOD= 1
##$DIGTYP= 9
##$DL= (0..7)
0 0 52 120 120 21 21 25 
##$DP= (0..7)
$$ [...]
##$SUBNAM2= <"">
##$SUBNAM3= <"">
##$SUBNAM4= <"">
##$SUBNAM5= <"">
##$SUBNAM6= <"">
##$SUBNAM7= <"">
##$SUBNAM8= <"">
##$SUBNAM9= <"">
##$SW= 501.771253377433
##$SWIBOX= (0..15)
0 1 3 0 0 0 0 0 0 0 0 0 0 0 0 0 
##$SW_h= 40650.406504065
##$TD= 32768
##$TD0= 1
##$TE= 0
##$TE2= 300
##$TE3= 300
##$TEG= 300
##$TL= (0..7)
0 120 53 12 22 120 120 120 
##$TP= (0..7)
150 150 150 150 150 150 150 150 
##$TP07= 0
##$TPNAME0= <>
##$TPNAME1= <>
##$TPNAME2= <>
##$TPNAME3= <>
##$TPNAME4= <>
##$TPNAME5= <>
##$TPNAME6= <>
##$TPNAME7= <>
##$TPOAL= (0..7)
0.5 0.5 0.5 0.5 0.5 0.5 0.5 0.5 
##$TPOFFS= (0..7)
0 0 0 0 0 0 0 0 
##$TUNHIN= 0
##$TUNHOUT= 0
##$TUNXOUT= 0
##$USERA1= <user>
##$USERA2= <user>
##$USERA3= <user>
##$USERA4= <user>
##$USERA5= <user>
##$V9= 5
##$VALIST= <valist>
##$VCLIST= <CCCCCCCCCCCCCCC>
##$VD= 0
##$VDLIST= <DDDDDDDDDDDDDDD>
##$VPLIST= <PPPPPPPPPPPPPPP>
##$VTLIST= <TTTTTTTTTTTTTTT>
##$WBST= 1024
##$WBSW= 4
##$XGAIN= (0..3)
0 0 0 0 
##$XL= 0
##$YL= 0
##$YMAX_a= 57986
##$YMIN_a= -36869
##$ZGOPTNS= <>
##$ZL1= 120
##$ZL2= 120
##$ZL3= 120
##$ZL4= 120
##$ABSF1= 0
##$ABSF2= 0
##$ABSG= 0
##$ABSL= 0
##$ALPHA= 0
##$AQORDER= 0
##$ASSFAC= 0
##$ASSFACI= 0
##$ASSFACX= 0
##$ASSWID= 0
##$AUNMP= <proc_1d>
##$AZFE= 0.1
##$AZFW= 0.5
##$BCFW= 0
##$BC_mod= 2
##$BYTORDP= 0
##$COROFFS= 0
##$CY= -3
##$DATMOD= 1
##$DC= 0
##$DFILT= <>
##$DTYPP= 0
##$F1P= 0
##$F2P= 0
##$FCOR= 1
##$FTSIZE= 65536
##$FT_mod= 6
##$GAMMA= 0
##$GB= 0
##$INTBC= 1
##$INTSCL= 5.30512e-09
##$ISEN= 30
##$LB= 1
##$LEV0= 0
##$LPBIN= 0
##$MAXI= 10000
##$MC2= 0
##$MEAN= 0
##$ME_mod= 0
##$MI= 50
##$NCOEF= 0
##$NC_proc= -5
##$NLEV= 6
##$NOISF1= 182.463
##$NOISF2= 159.3651
##$NSP= 0
##$NTH_PI= 0
##$NZP= 0
##$OFFSET= 248.5645
##$PC= 4
##$PHC0= -10285.38
##$PHC1= 88.85633
##$PH_mod= 1
##$PKNL= yes
##$PPARMOD= 0
##$PSCAL= 0
##$PSIGN= 0
##$REVERSE= no
##$SF= 81.0140089999908
##$SI= 65536
##$SIGF1= 159.3651
##$SIGF2= -187.1042
##$SINO= 113.3802
##$SIOLD= 16384
##$SREGLST= <1H.CDCl3>
##$SSB= 0
##$STSI= 65536
##$STSR= 0
##$SW_p= 40650.406504065
##$SYMM= 0
##$S_DEV= 0
##$TDeff= 32768
##$TDoff= 0
##$TI= <>
##$TILT= no
##$TM1= 0
##$TM2= 0
##$TOPLEV= 0
##$USERP1= <user>
##$USERP2= <user>
##$USERP3= <user>
##$USERP4= <user>
##$USERP5= <user>
##$WDW= 1
##$XDIM= 65536
##$YMAX_p= 291056173
##$YMIN_p= -10554296
$$ End of Bruker specific parameters
$$ ---------------------------------
##NTUPLES= NMR SPECTRUM
##VAR_NAME=  FREQUENCY,     SPECTRUM/REAL,   SPECTRUM/IMAG
##SYMBOL=    X,             R,               I
##VAR_TYPE=  INDEPENDENT,   DEPENDENT,       DEPENDENT
##VAR_FORM=  AFFN,          ASDF,            ASDF
##VAR_DIM=   65536,         65536,           65536
##UNITS=     HZ,            ARBITRARY UNITS, ARBITRARY UNITS
##FACTOR=    0.620285442955139, 1,           1
##FIRST=     20137.2065510736, 0,            0
##LAST=      -20513.1999529914, 0,           0
##MIN=       -20513.1999529914, -10554296,   0
##MAX=       20137.2065510736, 291056173,    0
$$ Real data points
##PAGE= N=1
##DATA TABLE= (X++(R..R)), XYDATA
$$ [...]
37611d547802j869021Q72744M004720L391375k51726k526495j942438q96605o74650
37602d439898k0295J247855J396997J09094q54458p95075q09480j137620p14164
37593f017044M82316J375753J981595K900775L017146Q24424k168660k693614
37585b97309n51538J000480Q7370j545454j703307m66894R09543J570849J061941
37576F5681l30901j150868m46652N14854R3298r77911r19222Q226L16516J62318
37566b664661N63245Q14423j78520j070142m5558J443495P93582q39889j45193
37557a329218K377713K855656N15129j210150o95403l52619j623060k432262j370064
37548c264278j59088o0968K47619J332887J423663J66780N7482J838747K356690
$$ y = [-4547802, -6416823, -5544079, -1539359, 1852016, 1600290, -926205, -2868643, -3765248, -4439898, -4460193, -3212338, -1815341, -1706247, -2560705, -3355780, -4165260, -5302880, -6017044, -5534728, -4158975, -2177380, 723395, 3740541, 4564965, 2396305, -297309, -848847, 151633, 239003, -1306451, -3009758, -3476652, -2567109, -996260, 65681, -265220, -1416088, -1862740, -1347886, -1254588, -2232499, -3151721, -3143495, -2826979, -2664661, -2101416, -1286993, -1465513, -2535655, -2581213, -1137718, -344136, -1184025, -1329218, 1048495, 3904151, 4419280, 3209130, 2513727, 2161108, 538048, -1894214, -3264278, -3423366, -3484334, -3236715, -1903828, -480165, -313385, -255903, 1582844, 3939534]
37539C939534k41241k809286j951896O39432J162025m11073j103175J6750J042953
37530B84023P14848j69414n93681n86496o88000j175429j542907o80896J373884
37521c064068K331103L94839k290020j954468J036789K440386P17438q63443o4325
37512a315769Q83316j3303p48508N36973J580993J0554j989597j248824Q51275
37503a452890Q81383o90774p02789R54117J414317L252r85136n43637j08524l10874
37493a541555j05443M84132R212j390162j557065J93723J656679R31940q44808
37484b163347j131287Q03480L110995L282127O86349k479520l279937j446136
37476b617276L75395L29427l66371M5708R93156J018756L21714k74058j224322
$$ y = [3939534, 3698293, 889007, -1062889, -423457, 738568, 327495, -775680, -758930, 284023, 998871, 829457, 235776, -350720, -1038720, -2214149, -3757056, -4437952, -3064068, -732965, -338126, -2628146, -4582614, -3545825, -1105439, -388001, -1251444, -1315769, -432453, -445756, -1194264, -657291, 923702, 934256, -1055341, -2304165, -1452890, -571507, -1262281, -1965070, -1010953, 403364, 406616, -578520, -1122157, -1230681, -1541555, -1646998, -1162866, -1153654, -2543816, -4100881, -3907158, -2250479, -1318539, -2163347, -3294634, -2491154, 619841, 3901968, 4588317, 2108797, -1171140, -2617276, -2241881, -1912454, -2278825, -2233117, -1239961, -221205, 100509, -173549, -1397871]
37467a397871k704113k776636q4356K893502K615046k13888j571237j14708J340977
37458b013284P02332o18084r12798r55022j735370j943139j1099K832043L772898
37449h81523K030929m66345j751706j718079j270052q14055k51794J63803o9484
37440e028306o71540n53113O08549J566923J231495M34375N65668J102068M43002
37431c00879j125962j671637q80008m24056o21080K52897K264740K692315M44135
37422F30465j473146m40407J523605J046840j250600k109926q31889L29105J36347
37413b439606m14908m69955k65024Q454J95166l59959j470576j318375R23973
37404e610810K987661K378127K9652j390210j379053j071962l82897J142775J993021
$$ y = [-1397871, -4101984, -6878620, -6962976, -4069474, -1454428, -1668316, -3239553, -3354261, -2013284, -1310952, -1929036, -2841834, -3796856, -5532226, -7475365, -7486464, -4654421, -881523, 1149406, 683061, -1068645, -2786724, -4056776, -4870831, -5122625, -4958822, -5028306, -5699846, -6252959, -5644410, -4077487, -2845992, -2411617, -1845949, -743881, -300879, -1426841, -3098478, -3978486, -4402542, -5023622, -4770725, -2505985, 186330, 630465, -842681, -1283088, 240517, 1287357, 36757, -2073169, -2905058, -2575953, -2439606, -2854514, -3324469, -3589493, -3581039, -3385873, -3745832, -5216408, -6534783, -5610810, -2623149, -245022, -215370, -1605580, -2984633, -4056595, -4439492, -3296717, -1303696]
37395a303696O67668j138393q71291M90683K17275j074593m58336J796992K417952
37386G44261P46840n17165m74928j092541k381615j536364J613006L091020Q86213
37377A078727j731347j489722J90246N43179j0823K44917Q08832M21891k82095
37368b26195l55751o23340j636712j758106M0605J589695O41492j255007j084799
37359d668118Q34642J569476K90366p51779J17350J781371K106862M22579j950008
37350b47259k867239j408471Q25683J364932J11678n85628M46559J573268J272497
37341D86020M31633K91644K80324l27472o12699J27960N71087m65505j733196
37332i50204j596035p34525n55620n18041M87115J545869J131382j27404o73281
$$ y = [-1303696, -636028, -1774421, -2645712, -2155029, -1937754, -3012347, -3470683, -1673691, 744261, 1491101, 973936, 499008, -593533, -2975148, -4511512, -2898506, 192514, 1078727, -652620, -2142342, -1952096, -1408917, -1419740, -1174823, -365991, 55900, -226195, -581946, -1205286, -2841998, -4600104, -4559499, -2969804, -2328312, -3583319, -4668118, -3833476, -2264000, -1973634, -2725413, -2608063, -826692, 1280170, 1702749, -247259, -3114498, -4522969, -3697286, -2332354, -2220676, -2806304, -2359745, -786477, 486020, 917653, 1209297, 1489621, 1162149, 549450, 677410, 1248497, 782992, -950204, -2546239, -3280764, -3836384, -4354425, -3867310, -2321441, -1190059, -1317463, -1990744]
37323a990744q02299j528909j911229n32622J353136J415391K70005M82523J977782
37314a266966K124407M65280m43423M16003Q63190l47050j266790m49232K90780
37305C86199q25433k143632j250492R41582J713120P82207R3923K19685m4420
37296a27261p43292l84451J072489J510507n3919j697333j491033l49744k29960
37287b493997q58747m10798J196110J928473P18246r68584j263902j86574R11284
37278a428489J076560K72617q56527j184799q6779J332778J280034K1876j79015
37269B48256J219259J595039p78199l378105k837293r0672J162666J55333n07089
37260c210805J63250J50414j230103j545382N22887K528099K048282L48712j83501
$$ y = [-1990744, -2793043, -4321952, -6233181, -6765803, -5412667, -3997276, -3727271, -3244748, -1266966, 857441, 1322721, 879298, 1295301, 2158491, 1811441, 544651, 95419, 386199, -439234, -2582866, -3833358, -2891776, -1178656, -396449, -302526, -82841, -127261, -870553, -1255004, -182515, 1327992, 1274073, -423260, -1914293, -2264037, -2493997, -3352744, -3763542, -2567432, -638959, 79287, -889297, -2153199, -2339773, -1428489, -351929, -79312, -935839, -2120638, -2207417, -874639, 405395, 427271, 248256, 1467515, 3062554, 2284355, -1093750, -3931043, -4021715, -2859049, -2703716, -3210805, -3047555, -2897141, -4127244, -5672626, -5149739, -2621640, -573358, -224646, -408147]
37251d08147J20414l18202r33902j73978J132183O85859j344681k103111j42521
37242c486086K394531K530375J57614j879863j144743J395324K291765J1717k567842
37233b97208j789084J338425K176818p52663l429174k290471P70832J901006R63108
37224a408411M30161O68017P5881j162679j161661J27837O96484j10211p35430
37215b580012j77293Q24536J566728K142387K297218J592746P45220Q12835J180563
37206H404928M59067q00195o31254J073340K148031J233020q53975k894212m226290
37197C912460l974620j802425M30108L68438j196698j148376J064190K411771
37189F4848J081447q45324j021966k37487k03303m83704k643M15942m20449j452497
$$ y = [-408147, -287733, -605935, -1539837, -1713815, -581632, 104227, -1240454, -3343565, -3486086, -1091555, 1438820, 1596434, -283429, -1428172, -32848, 2258917, 2270634, -297208, -2086292, -747867, 1428951, 676288, -2752886, -5043357, -4272525, -2371519, -1408411, -978250, -310233, -234352, -1397031, -2558692, -2430855, -1734371, -1844582, -2580012, -2757305, -1932769, -366041, 1776346, 4073564, 5666310, 6411530, 7224365, 8404928, 8863995, 8063800, 7432546, 8505886, 10653917, 11886937, 11032962, 8138750, 3912460, -62160, -1864585, -1434477, -1066039, -2262737, -3411113, -2346923, 64848, 1146295, 300971, -720995, -958482, -1161785, -1645489, -1648132, -1232190, -1652639, -3105136]
37179c105136q10797J051023J972490J253755J58315l73825o30191q37992n89347
37170a911705K36316J037577J137916L19621j051065k014348j672778k92333R23926
37161c286873J449117J776077J842483P25848j223500j735275L09140K595304
37153B452321K142679o12908k584636k263381r99181k71133R1285N93944R06208
37144e44802P54907N86330O00751K65591n09300p55887J34791J160712Q42400
37135B535493p57673j989910j566615j0450R78853L94045r56893j295591M1554
37126b627187J603855J420011m38342j673728o36765J320981J455403o04012k190028
37117b369812j353694K30655j96640k011309j851659J140241L616033K870841
$$ y = [-3105136, -3915933, -2864910, -892420, 361335, 519650, 145825, -484366, -1322358, -1911705, -1675389, -637812, 500104, 819725, -231340, -2245688, -3918466, -4210799, -3286873, -1837756, -61679, 1780804, 2506652, 1283152, -452123, -142983, 2452321, 4595000, 3982092, 1397456, -865925, -1865106, -2136239, -2044954, -1451010, -544802, 210105, 796435, 1397186, 1662777, 1153477, 397590, 532381, 1693093, 2535493, 1777820, -212090, -1778705, -1789155, -810302, -416257, -1373150, -2668741, -2627187, -1023332, 396679, -41663, -1715391, -2352156, -1031175, 424228, -179784, -2369812, -3723506, -3492851, -3689491, -5700800, -7552459, -6412218, -2796185, 74656]
37109G4656O86691L4930L18690p50235k189617r59495K261239L141888M45386
37100C064133j756134n42921J361803N18923j471280j088163R52540J226887l05997
37091A959791m80591J351889K366981J360276N68191J428115K299462J813509
37083A2667623J161394J405256J485234O58900J63165N99402L82445j126435j655802
37074A5741182L15412K488704K241637Q37649P58380R50946j120849m082393m027395
37065A4103273j015943N40665j277345l142547k147873j51266m6540j081616r11273
37056D869535J51112J37978r10128j304520p70172m95553p51813p55706l88602
37047b17869o5952M38003J115538O30444j626405l339494j895689J378210K663386
$$ y = [74656, 761347, 796277, 1114967, 364732, -1824885, -2784380, -523141, 2618747, 3064133, 1307999, 765078, 2126881, 2645804, 1174524, 86361, 1038901, 2265788, 1959791, 1479200, 2831089, 5198070, 6558346, 7126537, 8554652, 10854114, 12667623, 13829017, 15234273, 16719507, 17378407, 17541572, 18140974, 18523419, 17396984, 15741182, 16056594, 18545298, 20786935, 21624584, 22382964, 23333910, 22213061, 18130668, 14103273, 13087330, 13627995, 12350650, 9208103, 7060230, 6908964, 6862424, 5780808, 4869535, 5020647, 5158625, 4248497, 2943977, 2173805, 1678252, 926439, 170733, -217869, -283821, 154182, 1269720, 1900164, 273759, -3065735, -4961424, -3583214, -919828]
37038i19828J154185k00917K23202N45662n17630r35037R96805L150447K588547
37029F085436J32285j108073n09120j51762q24704q88479N41984J877275J467180
37020F622022r2112j130198j120393o95649l02106J48919O60375R59618Q73502
37011E923978M62888k03262j108819k030561k417136j840419o36730K83268N33757
37002a033036O84865J113556J103258N2263j072699r67090k37193m80468j255597
36993b092141m94113J529002J613418j329310l514683j379600K671955L247275
36985B51803k99339l039999j624557J459738K174198M84145o01157K79541J521720
36976F06093J300038k70819j778387k135829j336561k23996K98870O9729k94756
$$ y = [-919828, 234357, 33440, 256642, 802304, 284674, -650363, 346442, 3496889, 6085436, 6217721, 5109648, 4600528, 4448766, 3624062, 2735583, 3277567, 5154842, 6622022, 6529910, 5399712, 4279319, 3583670, 3281564, 3430483, 4090858, 5050476, 5923978, 6386866, 6183604, 5074785, 3044224, 627088, -1213331, -1850061, -1566793, -1033036, -348171, 765385, 1868643, 1920906, 848207, -118883, -356076, -836544, -2092141, -2586254, -1057252, 556166, -773144, -4287827, -5667427, -2995472, 251803, -47536, -3087535, -4712092, -3252354, -1078156, -594011, -1195168, -915627, 606093, 1906131, 1635312, -143075, -2278904, -3615465, -3839461, -3540591, -3470862, -3765618]
36967c765618j87794L39123P78951Q53339Q80491J353305K033706J854362M19085
36958D558950p46483J71762K282749K531628J04469j803353l98000K422550K831001
36949A1955273Q31469n6606J450808K528561R52636j485748k009253r38479n86551
36940A2642110j525402k163709j526109o44339r43995k196992k571190p93342
36932B77032J833130K375137p7582k755911k675497p06355J33911l39688M44106
36923a491717K598666K670267n79575l127214j496936J456330P56997k596226
36915a809408k784466J680761N059028K558105k652342l993834o31132K057044
36907e16244O62033j739350q26315K322427K995782L3411k417749j044764J900408
$$ y = [-3765618, -3953412, -3614289, -2835338, -1981999, -1101508, 251797, 2285503, 4139865, 4558950, 3812467, 3984229, 6266978, 8798606, 8903075, 7099722, 6701722, 9124272, 11955273, 12786742, 12730136, 14180944, 16709505, 17662141, 16176393, 14167140, 13228661, 12642110, 11116708, 8952999, 7426890, 6782551, 5838556, 3641564, 1070374, 277032, 2110162, 4485299, 4407717, 1651806, -1023691, -1730046, -1596135, -1935823, -1491717, 1106949, 3777216, 3197641, 70427, -1426509, 29821, 786818, -1809408, -4593874, -2913113, 2145915, 4704020, 2051678, -1942156, -2573288, -516244, 145789, -1593561, -2419876, -97449, 2898333, 2931744, 513995, -530769, 1369639]
36898A369639K183545k23123j560011p9207J739359J177847j155862k821699k643414
36889b012926j108173Q11943K025240J678613K65581n21828J05709R86529P53631
36880B984319l88664j347200j573162j092459r3843Q39239J013300O19903M48300
36871A409733M25799j60579q86352n57570L27634j41326j832597k119093j46388
36862c680739J365497M98787o49327K24818J440579M46026j209792k73155K300006
36853D62700K491648j41824j668851j81585J424365N43687j126263r12556M60754
36844A352075M95709r44525j692876o45773Q83300J017514n18274k049211j602886
36835c704947P15985K436419J728477o8686n05204K78486K98451m34689R511J432274
$$ y = [1369639, 3553184, 3330061, 1770050, 1690843, 3430202, 4608049, 3452187, 630488, -2012926, -3121099, -2309156, -283916, 1394697, 1660278, 1138450, 1244159, 2230688, 2984319, 2595655, 1248455, -324707, -1417166, -1511009, -671770, 341530, 961433, 1409733, 1835532, 1674953, 788601, 231031, 558665, 417339, -1415258, -3534351, -3680739, -2315242, -1816455, -2465782, -2240964, -800385, -354359, -1564151, -1837306, 462700, 2954348, 2812524, 1143673, 962088, 2386453, 2930140, 1803877, 891321, 1352075, 1847784, 903259, -789617, -1435390, -552090, 465424, -52850, -2102061, -3704947, -2988962, -552543, 1175934, 1107248, 602044, 880530, 1178981, 744292, 753803, 2186077]
36825B186077J082071j650064l546448k365074j93170L04198R2578J261512K675268
36816a53052J699587j100686k558806j649166m21333l17762n36264l51036l44604
36807e733122o10301k1408J692958K883895K079278j5696j485090j396485m59997
36798c065968k5454o72075j490788j062634M67406J168520L4607j243691o93928
36789f584005Q91843J378439Q15620R32903J624652J017909q02457j396754j05405
36780b227255O78742k34018n73826J242319K773917J364467j163716j213820Q40409
36771A487219J508109o9183j215943n32301K44013j63482o28662l71151m22454
36762a63835r76759l79803J522488K085267J35570j399508p281J930542Q46456
$$ y = [2186077, 3268148, 1618084, -1928364, -4293438, -4486608, -4182410, -4089832, -2828320, -153052, 1546535, 445849, -2112957, -3762123, -4183456, -4501218, -5037482, -5388518, -5733122, -6343423, -6364831, -4671873, -1787978, 291300, 275604, -1209486, -2605971, -3065968, -3091422, -3763497, -5254285, -6316919, -5849513, -4680993, -4646386, -5890077, -6584005, -5692162, -4313723, -3498103, -2565200, -940548, 77361, -725096, -2121850, -2227255, -1548513, -1782531, -2356357, -1114038, 1659879, 3024346, 1860630, 646810, 1487219, 2995328, 2926145, 1710202, 1177901, 1421914, 1258432, 629770, 258619, -163835, -1140594, -1520397, 2091, 2087358, 2222928, 823420, 816139, 2746681, 3593137]
36753C593137j848670j755751J259589K606004K21450k287516j478664Q46339
36745A155918J089274n02148r54375K95642Q07101o46728k182311j759289l35
36736b697251J001732N55147q7387K61757J118981J202461N25503N93426K000058
36727D474427K910442J370460j495227k607592j276764j14941q72751j764306
36719F23748n77006J552667J806404o1127j629478j520849q32019p00267n18319
36710a856246O43633K186867K519066R90402j190335k000409p56451Q48420O25709
36701B010656j141632j951060o97145Q13391R75931Q39167J578800J697465m05038
36692C720535k721677k060488O79778J525916m04552j798449q24746K17943n27723
$$ y = [3593137, 1744467, -11284, 1248305, 3854309, 4075759, 1788243, 309579, 1155918, 2245192, 1743044, 788669, 1084311, 1891412, 1244684, -937627, -2696916, -2697251, -1695519, -1140372, -1227759, -966002, 152979, 1355440, 1880943, 2474369, 4474427, 7384869, 8755329, 7260102, 4652510, 3375746, 3260805, 2388054, 623748, 46742, 1599409, 3405813, 3344686, 1715208, 194359, -637660, -1337927, -1856246, -1212613, 974254, 3493320, 4483722, 3293387, 1292978, 536527, 1384947, 2010656, 869024, -1082036, -1779181, -965790, 10141, 849308, 2428108, 4125573, 3720535, 998858, -1061630, -381852, 1144064, 739512, -1058937, -1883683, -1665740, -2193463]
36683b193463j138703M10143K396607K115345J51677j047513j050104j011207
36675a367218q96019p1833M82749m96883j822546j276642P72468J907852J415858
36666a352214P96219P92377O78215M40645Q46133J176730j61052k296656k234155
36657a313758M63110K308334Q21287j783708j916056M19283K269637J957608M08934
36648C634671q79847j183891l37586J127112J853897R32225r07853k172767k160889
36639i4928j034274O87741J894612J344398n39259j532191n02625Q75865P38757
36630A838096j35638J2136Q85332J110491J006861J608682J879156R3773k494820
36621E804069k875257j179911o36386k025153k183389M69757K836736K018052
$$ y = [-2193463, -3332166, -2922023, -525416, 1589929, 1741606, 694093, -356011, -1367218, -2263237, -2335070, -1852321, -2349204, -4171750, -5448392, -4675924, -2768072, -1352214, -555995, 236382, 914597, 1355242, 2201375, 3378105, 3217053, 920397, -1313758, -850648, 1457686, 2278973, 495265, -1420791, -1001508, 1268129, 3225737, 3634671, 2754824, 1570933, 1233347, 2360459, 4214356, 5146581, 4238728, 2065961, -94928, -1129202, -441461, 1453151, 2797549, 2258290, 726099, 223474, 1099339, 1838096, 1702458, 1714594, 2599926, 3710417, 4717278, 6325960, 8205116, 8298889, 5804069, 2928812, 1748901, 1112515, -912638, -3096027, -2626270, 210466, 2228518]
36613B228518j23047m09730M10436m13779k397325k523200l46934J353085R74028
36604a247948m0036k538J007730K279445L285184L096271J150756j158410j719604
36595F650850o80460j45208q46553j358053q14375p5961K38506O05288R27056
36586D501090J93754j528801k737600k621968j674772r8966K058349L198858J598977
36577B888921j097449j230972J195958J981969o25060k781849j058429K172061
36569A445150K723108Q50276l64012m46162j144572k223297j817417j25878R61907
36560a40897J255585J849444K073763M45446j857589k121566m89889K95676n36402
36551G73571j014874l06918K04445N3186L79901J004956L37699j149527r71855
$$ y = [2228518, 2105471, 1695741, 2106177, 1692398, -704927, -3228127, -3575061, -2221976, -1247948, -1287984, -1290522, -282792, 1996653, 5281837, 8378108, 9528864, 8370454, 6650850, 5970390, 5825182, 4978629, 3620576, 2806201, 2730240, 2968746, 3574034, 4501090, 4694844, 3166043, 428443, -2193525, -3868297, -3967263, -1908914, 1289944, 2888921, 1791472, 560500, 1756458, 3738427, 3113367, 331518, -726911, 1445150, 4168258, 5018534, 4654522, 4208360, 3063788, 840491, -976926, -1102804, -140897, 1114688, 2964132, 5037895, 5483341, 3625752, 1504186, 1014297, 1309973, 773571, -241303, -548221, -343776, -290590, 89311, 1094267, 1431966, 282439, -689416]
36542f89416R31376J481365n16846k210151j242224Q46043J652586J279133O71013
36533B202879m36741j728267j287811J218981K910362J706083m59621r94092p26131
36524B405642j639382k747770j719130Q37417K120119J329221J21471m47622o68907
36515d08941m55043M79086J143153M12604p89497p47016J69377K68076l88507
36506c16708l03552M08311J20633j058280r53969J080226K680252J691264r12391
36497B435786k473121j834189j36163Q42821M77403l12734l30657K72454L21082
36488g37318k85150j89908R56708J361218j72075j991140j927330m09050P79796
36479b614249J318873J577560O81507j673055k946546q76918K198539K199751
$$ y = [-689416, 241960, 1723325, 1206479, -1003672, -2245896, -1399853, 252733, 1531866, 2202879, 1766138, 37871, -1249940, -30959, 2879403, 4585486, 4125865, 3131773, 2405642, 766260, -1981510, -3700640, -2863223, -743104, 586117, 707588, 259966, -408941, -863984, -384898, 758255, 1170859, 381362, -365654, -196277, 71799, -316708, -620260, -211949, -91316, -1149596, -2103565, -1023339, 1656913, 3348177, 2435786, -37335, -1871524, -2007687, -1164866, -687463, -1000197, -1330854, -1058400, -737318, -1022468, -1212376, -255668, 1105550, 933475, -1057665, -2984995, -3394045, -2614249, -1295376, 282184, 963691, -709364, -3655910, -4532828, -2334289, -134538]
36471a34538j73938m69162J872493K225358j329257m094728j859187K405208L084138
36462A526387J72816j582885j63392J645510J353820k9788o50669o50983j041583
36453E79233j639829j493191m40953O93956J127563Q67722N03771L25401j15620
36444D08053j090221j639039n64207J462474K258566J119724j12507J18767P66137
36435B727747P3760j547511k307415j831242j311108j278238j000674j21752O05167
36426e991266N65457K32089M49430J301809J920922J289159n55771k091666j730541
36417d610378J60132J532919J250556K98604l6262J67852L91680P67697J116198
36408A038998M01206j349948k049256l96626J545003R76564j315451j927924K02039
$$ y = [-134538, -308476, -777638, 1094855, 3320213, 1990956, -2103772, -3962959, -1557751, 1526387, 1699203, 116318, -47074, 1598436, 2952256, 2922468, 2271799, 1620816, 579233, -1060596, -2553787, -2994740, -2300784, -1173221, -305499, 198272, 523673, 408053, -682168, -2321207, -2885414, -1422940, 835626, 1955350, 1842843, 1961610, 2727747, 2801507, 1253996, -1053419, -2884661, -4195769, -5474007, -6474681, -6596433, -5991266, -5425809, -5193720, -4744290, -3442481, -1521559, -232400, -788171, -2879837, -4610378, -4450246, -2917327, -1666771, -1368167, -1404429, -1236577, -844897, -77200, 1038998, 1440204, 90256, -1959000, -2355626, -810623, 165941, -1149510, -3077434, -2875395]
36399b875395K540657K835101J603663J73873j196207k190212j781545k01587
36391a091652L80955j132163k659292j719514R27388K489152K128574J481408
36383H04856J483896J013126p83328k666185k869664j404542J98887Q38329P03766
36374b680859N26024O58486R05527R33690P71316P94531J027125P63224m95947
36365C203117j908084k008093o70434O45089Q91172N27480J46193n29548j288489
36356i91597p08405J481553K796619J212415j145999p37400J543104J302333k048637
36347B703986l579393n31155K786825J473384k285247k850484J12810K051988
36339a17286J335534P48059J339196P35399j402880j899638R6393J052602p33828
$$ y = [-2875395, -334738, 2500363, 4104026, 4277899, 3081692, 891480, -890065, -1091652, -710697, -1842860, -4502152, -6221666, -5294278, -2805126, -676552, 804856, 2288752, 3301878, 2518550, -147635, -3017299, -4421841, -4222954, -3384625, -2680859, -2154835, -1496349, -590822, 342868, 1114184, 1908715, 2935840, 3699064, 3203117, 1295033, -713060, -1383494, -738405, 152767, 680247, 826440, 296892, -991597, -1700002, -218449, 2578170, 3790585, 2644586, 1907186, 3450290, 4752623, 2703986, -875407, -1406562, 1380263, 2853647, 568400, -2282084, -2169274, -117286, 1218248, 1966307, 3305503, 4040902, 2638022, 738384, 834777, 1887379, 1153551]
36330A153551j918882j56008J535139K54573j481750m89215J151611K08686j193268
36321i35563P19246L790652K784555j632827l620461j515042L08253n18624j103531
36312a723342L32999J074373n68038j791020l98115J287682P88425l54347j0796
36303a362179O52515M3187n04131L52347Q43047n93604j813628m92780J516107
36294a359119J220152m77863p52501K43498N45256N42383J654758K438406O05799
36285D660769k191074k320985k45227K01950j573574k013747L07158K305015J650406
36276G80691J20801j30170P0733o03571j272262q27572j02616k8645K01029J257310
36266e34272J906133R00652r37454j975452j687059l54628J456319K366099J167383
$$ y = [1153551, -765331, -921339, 613800, 868373, -613377, -1102592, 49019, 257705, -935563, -216317, 3574335, 6358890, 4726063, 1105602, -409440, -101187, -619811, -1723342, -1390343, -315970, -884008, -2675028, -3073143, -1785461, -997036, -1351383, -1362179, -709664, -666477, -1170608, -818261, 24786, -568818, -2382446, -2875226, -1359119, -138967, -616830, -1369331, -1125833, -580577, -38194, 1616564, 4054970, 4660769, 2469695, 148710, -96517, 105433, -1468141, -3481888, -3174730, -869715, 780691, 901492, 771322, 842055, 238484, -1033778, -1861350, -1963966, -1992611, -1791582, -534272, 1371861, 2272513, 1335059, -640393, -2327452, -2682080, -1225761, 1140338, 2307721]
36257B307721q70460j022712P10709J234630o21076j944665o13104R46371j96307
36248f8893k439692k287796l3641J127881M93205L61350J512726J963649O35795
36239A264584r47022j367959j049882n24006N84518J926859J990089M11939j043421
36230A245699r16435K9307L14562j80722o60348p70568n19678J97065J046908
36221b14210J032389k77574j859683k310022j348429K56922J698571K496173K344236
36212A818373J236632l88512j887312k633586k102022l09896J710994K508797
36204d6532J616977L2851q72318o46282M5693K06862m53694j076109n83695O89549
36194a086698J051760k03039j419181p78413Q86795J227962k75n38037Q40018
$$ y = [2307721, 1437261, 414549, 1125258, 2359888, 1738812, -205853, -818957, 127414, -68893, -2508585, -4796381, -4830022, -3702141, -3208936, -2847586, -1334860, 628789, 1264584, 317562, -1050397, -2100279, -2624285, -2039767, -112908, 1877181, 2289120, 1245699, 329264, 358571, 673133, 492411, -167937, -938505, -1458183, -1261118, -214210, 818179, 540605, -1319078, -3629100, -4977529, -4720607, -3022036, -525863, 1818373, 3055005, 2666493, 779181, -1854405, -3956427, -4266323, -2555329, -46532, 1570445, 1603296, 730978, 84696, 130389, 337251, -116443, -1192552, -1776247, -1086698, -34938, -237977, -1657158, -2435571, -1548776, -320814, -321089, -859126, -19108]
36185a9108K430462K176426M48163j003100j562128j774027j728322r30677N09476
36176a452835J684454J812623P90536p86738j712241j011440O59472J303830Q1317
36167A368978j419418j431065m84749j74600l90174J96074J312549J118906o11804
36158e15303j592747l17781J575812J651284K6105j222292j082133l24434L14319
36149a487170R14598J343258J038552K17720j1258O54033R86668m802j428699
36140B222900j624974m73149M68744J29238o68934l79220J153498K317505J581718
36131D727326n63200j915238r88700J193470K195336R24227j294105k437183j903719
36122f1786o28179K71256M13505J11108m5341K88713Q06659R00579N54982L94999
$$ y = [-19108, 2411354, 4587780, 5035943, 4032843, 2470715, 696688, -1031634, -1962311, -1452835, 231619, 2044242, 2834778, 2048040, 335799, -675641, -16169, 1287661, 1368978, -50440, -1481505, -1966254, -2140854, -2531028, -2334954, -1022405, 96501, -515303, -2108050, -2425831, -850019, 801265, 827370, -394922, -1477055, -1801489, -1487170, -572572, 770686, 1809238, 2026958, 2015700, 2669733, 3656401, 3651599, 2222900, 597926, 124777, 593521, 722759, 53825, -325395, 828103, 3145608, 4727326, 4164126, 2248888, 1260188, 2453658, 4648994, 5573221, 4279116, 1841933, -61786, -689965, -418709, -5204, 105904, 60563, 349276, 1155935, 2056514, 2611496, 3006495]
36112C006495O07985N22842k19610p77427j76574J196671J964151J309085m48812
36103F984806k366981l317735k527787n40343R04381P98877K4680k79645m54048
36094g73795j062716j076571O00770K549069K279038L9559j443111j150739q41207
36085h79703j331843q40034J461707L091677J771959q14308j392864J74144J194483
36076B435218M21962n67120k71805N73240L30369j222298k480926j683817R38484
36067a526693K870964K043079l28754j191348L936O65186n88096j641414n08494
36058b01634J341615J521407M17241j90227k92536o87186n98038O71973J248240
36049C230855p24398l166626k466958Q47629K652578J293324o26561q02258K1967
$$ y = [3006495, 3614480, 4137322, 3917712, 3140285, 2963711, 4160382, 6124533, 7433618, 6984806, 4617825, 1300090, -1227697, -1768040, -863659, -64782, -40102, -319747, -773795, -1836511, -2913082, -2312312, 236757, 2515795, 2555354, 1112243, -38496, -879703, -2211546, -3051580, -1589873, 1501804, 3273763, 2459455, 1066591, 1240735, 2435218, 2857180, 2290060, 2018255, 2591495, 2921864, 1699566, -781360, -2465177, -1526693, 1344271, 3387350, 3058596, 1867248, 1871184, 2536370, 1948274, 306860, -201634, 1139981, 2661388, 3078629, 2888402, 2595866, 1908680, 1310642, 1982615, 3230855, 2506457, -660169, -3127127, -2279498, 373080, 1666404, 1039843, 237585, 259552]
36040B59552N35318Q15118R07360L17417l26869J94827J029028O1564k138388
36031A654927k501029l78012J204892M39834o22405k0963Q71768K32712r85700
36022a03976j079588m16393J3612O31480J689092J835339M72214n45004J76581
36013B673357R78598j16030j930772j935418l1335J833725K527416K116526Q21670
36004F937737l82459K84523K731007L962900K049251o37192p73184R99403J539131
35995A6711117K47285p00442m41858m18938j329424j974351j501648n86581q2659
35986I922501j78091q36983j619994j496720k85059M69418l72220j496967j023899
35977C081986O06942J591890J503590R36699l57552k453490l467131j689910J189781
$$ y = [259552, 794870, 1609988, 2517348, 2834765, 2507896, 2702723, 3731751, 3793315, 1654927, -846102, -1224114, -19222, 420612, -201793, -222756, 649012, 881724, -103976, -1183564, -1599957, -1586345, -954865, 734227, 2569566, 3041780, 2496776, 2673357, 3651955, 3535925, 1605153, -330265, -361600, 1472125, 3999541, 6116067, 6937737, 6555278, 6839801, 9570808, 13533708, 15582959, 14945767, 14172583, 15171986, 16711117, 16958402, 16257960, 15816102, 15397164, 14067740, 12093389, 10591741, 10005160, 9922501, 9744410, 8907427, 7287433, 5790713, 5505654, 5975072, 5602852, 4105885, 3081986, 3688928, 5280818, 6784408, 7721107, 7363555, 4910065, 1442934, -246976, 942805]
35968I42805J935377L92612o60301n605P38545M15589j11703j79607l89110p93849
35958B284753m10085P60056J295192N69397l96246o77244l73823K63215Q96176
35949D211391N24525j149280k177914o25100J944312K084858l79436j952397p55197
35940A725762R89928R20684l9366k561N90184J79690j023551j463137p00848J77057
35930A353842K24443l47024o12518P1501J286307J808178J070309m1087m88779
35921D325172m56040n15999m23572M0288J85707j28794M22877K186484K813577
35912H449700N65659k242227k286938m26888j42817j686932j962360k3161J591907
35903A835943J436204R86213J142765P87181k02481k03945Q22811Q48284l67076
$$ y = [942805, 2878182, 3270794, 2610493, 2604888, 3343433, 3759022, 3647319, 3467712, 3078602, 2284753, 1874668, 2634724, 3929916, 4499313, 4103067, 3425823, 3052000, 3315215, 4211391, 4735916, 3586636, 1408722, 783622, 2727934, 4812792, 4433356, 2480959, 1725762, 2715690, 3636374, 3597008, 3594447, 4184631, 4364321, 3340770, 1877633, 1176785, 1353842, 1578285, 1231261, 618743, 690244, 1976551, 3784729, 4855038, 4813951, 4325172, 3869132, 3353133, 2929561, 2969849, 3155556, 3026762, 3449639, 5636123, 8449700, 9015359, 6773132, 4486194, 4059306, 3916489, 2229557, 267197, 244036, 1835943, 3272147, 4258360, 5401125, 6188306, 5985825, 5781880, 6604691, 7452975, 7085899]
35894G085899n93227O19466Q53789p15776j685507p64615J38139j92159k70680
35885D475329M40956O8588j457748j129704J680727K962200L50374k627237k129541
35876B633944K35512J113974J002831J811826K325203P79861r90393o70968K5810
35867H267600j261592k404154l20328K681992J928256j743627l031084m56320
35859C660743K023886J708488K46575m46082p09948q28219j95032N36621m8503
35850E948529j235792j133953l09282p87177j745669l94299K764863L920632J825315
35841H853167m43249n04010L98471N42636J98061k01917j056053j733149q45941
35832E208016Q03794P63692q96551j395987m434P09123m74675j269255L7343J774569
$$ y = [7085899, 6492672, 7112138, 7965927, 7250151, 5564644, 4800029, 4938168, 4746009, 4475329, 4916285, 4984873, 3527125, 2397421, 4078148, 7040348, 7390722, 4763485, 2633944, 2869456, 3983430, 4986261, 6798087, 9123290, 9903151, 8912758, 8241790, 8267600, 7006008, 4601854, 4281526, 6963518, 8891774, 7148147, 4117063, 3660743, 5684629, 7393117, 7639692, 7193610, 6483662, 5655443, 5460411, 5997032, 5948529, 4712737, 3578784, 3269502, 2482325, 736656, 342357, 3107220, 7027852, 8853167, 8409918, 7905908, 8304379, 8847015, 9045076, 8843159, 7787106, 6053957, 5208016, 6011810, 6775502, 5878951, 4482964, 4478530, 5187653, 4712978, 3443723, 3481066, 5255635]
35822E255635J934959R83985O316j012458j591128n11565J357859J236524r85685
35813F674442j817363K71263K033642P24132j374189r10774J100235J471941J13421
35804H286750o87074n55700q78355j449628q11541O14771R03720n7519l73342
35795D992082O99351J698715J218085n55192k484221l175471j506734J843591
35787B730206L912728K439602r12276k275007n12799J559701J289528m42594j042648
35778F746441M2983J036631P89666K58887M81103N54648q32598k629663k378384
35769D069714j15128J144724j52854j725153j314265k93935o84903j068202P09651
35760E69649K687969J371950j866796k223429P60164K339093L63916j608977p86535
$$ y = [5255635, 7190594, 8174579, 8180895, 7168437, 5577309, 5065744, 6423603, 7660127, 6674442, 4857079, 5128342, 7161984, 7886116, 6511927, 5601153, 6701388, 8173329, 8286750, 7599676, 7043976, 6165621, 4715993, 3904452, 4519223, 5422943, 5365424, 4992082, 5691433, 7390148, 8608233, 8053041, 5568820, 2393349, 886615, 2730206, 6642934, 9082536, 8170260, 5895253, 5382454, 6942155, 8231683, 7789089, 6746441, 6789424, 7826055, 8615721, 8874608, 9355711, 9910359, 9077761, 6448098, 4069714, 3954586, 5099310, 4946456, 3221303, 1907038, 1613103, 928200, -140002, 569649, 3257618, 4629568, 2762772, 539343, 1299507, 3638600, 4002516, 2393539, 1607004]
35751A607004O75617N35913L84582J432255J240081j340871k421312R47761M784420
35742G845450L525569j417679l969133k281519J55545R76396J056650P77092o21063
35733F047308j926902r28392J245885J148706j260553k242790k70164J849075
35725C662173J856443J023218Q36114M15640r46287j826597j210913m38981p91344
35716B579466j313624p50995K08593K43669m55053o44424L56763K143032L330377
35707E697804K271816q70918l186274k185771N39570J397231J14148k65197J266654
35698D779063K120047P80394p50901p48053m34946q67400n49763J312522K306216
35689G947179N94458j456005q52753R69628M62156k125098l141875j302962P55999
$$ y = [1607004, 2282621, 2818534, 3203116, 4635371, 5875452, 4534581, 2113269, 3061030, 7845450, 11371019, 9953340, 5984207, 3702688, 3858233, 4834629, 5891279, 6668371, 6047308, 4120406, 3192014, 4437899, 5586605, 4326052, 2083262, 1813098, 3662173, 5518616, 6541834, 7377948, 7793588, 6847301, 5020704, 3809791, 3370810, 2579466, 1265842, 514847, 723440, 967109, 512056, -132368, 224395, 2367427, 5697804, 7969620, 7098702, 3912428, 1726657, 2266227, 3663458, 3777606, 3512409, 4779063, 6899110, 7679504, 6928603, 6180550, 5745604, 4878204, 4328441, 5640963, 7947179, 8541637, 7085632, 6232879, 7202507, 7664663, 5539565, 2397690, 1094728, 1850727]
35680A850727R25178K52258L01143O82801M97041K04970O90659J719444K403079
35671I527300K393969J952323J474960J329048J596427J922671K208720L145779
35663B5551197N087775O717042O234718L938885K147782K151929K632750J800738
35655E6262816j62704j805293k570101l054635l681587m297666m794148n029036
35647C0867646m365535k511171p46494q58752k515477l248808j846664j81755
35639A4592990l20303j335789j098159q0250n01765k040243j800544P08447K055008
35630A0179392J78748j976153r54350J642138J716095q34525k262341r87592O23197
35621G324609P34126L84214M12112l26415k070097k640953q67473J047576P59261
$$ y = [1850727, 2775905, 3028163, 3329306, 4012107, 4509148, 4714118, 5404777, 7124221, 9527300, 11921269, 13873592, 15348552, 16677600, 18274027, 20196698, 22405418, 25551197, 30638972, 37356014, 43590732, 47529617, 49677399, 51829328, 54462078, 56262816, 56100112, 54294819, 51724718, 48670083, 44988496, 40690830, 35896682, 30867646, 26502111, 23990940, 23244446, 22385694, 19870217, 16621409, 14774745, 14592990, 14272687, 12936898, 11838739, 11758489, 11256724, 9216481, 7415937, 8124384, 10179392, 10358140, 8381987, 7427637, 9069775, 10785870, 9951345, 7689004, 6701412, 7324609, 8058735, 8442949, 8855061, 8528646, 6458549, 3817596, 2950123, 3997699, 4756960]
35612D756960p63103j239842o69164n15095p87026m16419M20807O45397K77259
35603A709774J25193J26927j58983j36520Q02572J509088M58137j515099k035995
35594H85094o19243Q36061J063159Q18205Q34079M47554p64620j577775o74819
35585A247695J211349J919195M98541j496434j662067L64863K125008J170709
35577E378859j532300k496627m42578J767836J289347n29908n16382J174014J483243
35568E575504l37885j439983o5284J652463J224760l90885o98728L91591Q92024
35559F803577L3872r40821r14605j05171O91035P91755r1898j108601m16158K429374
35549G172359M778388L516661o09387l288735j837895J668202L424015K520851
$$ y = [4756960, 3993857, 2754015, 2084851, 1569756, 782730, 366311, 787118, 1432515, 1709774, 1834967, 1961894, 1802911, 1666391, 2468963, 3978051, 4436188, 2921089, 885094, 265851, 1101912, 2165071, 2983276, 3817355, 4264909, 3500289, 1922514, 1247695, 2459044, 4378239, 4876780, 3380346, 1718279, 2083142, 4208150, 5378859, 3846559, 1349932, 907354, 2675190, 3964537, 3434629, 2918247, 4092261, 5575504, 5237619, 3797636, 3732352, 5384815, 6609575, 6218690, 5519962, 5911553, 6803577, 6837449, 5896628, 4982023, 4876852, 5567887, 6359642, 6267744, 5159143, 4742985, 7172359, 11950747, 15467408, 14858021, 11569286, 9731391, 11399593, 14823608, 17344459]
35541A7344459J099219Q92752J435397J622224J526739K023979L287894M300625
35533C3533288L906821K301389J237611K142169L932702L778945P69236k348635
35525D9253526k569596q67666q10574l194635m851601l624254j696779k027902
35517B9610519l810576m237825l155628k676525l016298k322278o35178l20467
35509I435744j742372k106325j50513J430974N00520p64973K95167J887576N74971
35500I360769k626616l309869m07101K309093J974265J55815n49966k17872j56243
35491F532275k67288K05982R78023J375625J382306R27107l32201j519679p71396
35482H510754J643755K469818k62749l816685m034636q67235J985346K258405
$$ y = [17344459, 18443678, 19336430, 20771827, 22394051, 23920790, 25944769, 29232663, 33533288, 37440109, 39741498, 40979109, 43121278, 47053980, 50832925, 51602161, 49253526, 46683930, 45816264, 45005690, 41811055, 36959454, 33335200, 31638421, 29610519, 25799943, 21562118, 18406490, 15729965, 12713667, 10391389, 9756211, 9435744, 7693372, 5587047, 5436534, 6867508, 7368028, 6603055, 6898222, 8785798, 9360769, 6734153, 3424284, 3017183, 5326276, 7300541, 7456356, 6906390, 6688518, 6532275, 6264987, 6470969, 7448992, 8824617, 10206923, 11134030, 10801829, 9282150, 8510754, 10154509, 12624327, 12361578, 8544893, 4510257, 3643022, 5628368, 7886773]
35474G886773J202110N46324J11494p59882j475452j140580p9144N77133K27274
35465G096050p20619j207644l55880J356399J992820L00173k243419k900754j226925
35456B090201M36689L75091l32622K0015R77341P93731p67545k053893j733450
35447a94442k42112R97514J042255J19918o12525j00016J416467K445864J840452
35438F713375M2027j566845k075768j421757j223J412063J875046J180292K02522
35429F359732k92285o21394j151384j032910O40008K754852K933571O36905j905156
35420H321939k402083r72980O57254J295789Q85472j8203n29698k3245Q09492
35411H023737M24661j230346k012028m89342J575049J477835m34738j277732k0851
$$ y = [7886773, 9088883, 9635207, 9746701, 8986819, 7511367, 6370787, 6291643, 6868776, 7096050, 6375431, 5167787, 4811907, 6168306, 8161126, 8461299, 6217880, 3317126, 2090201, 2526890, 2901981, 2569359, 2589374, 3566715, 4360446, 3592901, 1539008, -194442, -436554, 560960, 1603215, 1723133, 1110608, 1010592, 2427059, 4872923, 6713375, 6755402, 5188557, 3112789, 1691032, 1689809, 3101872, 4976918, 6157210, 6359732, 6067447, 5446053, 4294669, 3261759, 3901767, 6656619, 9590190, 10227095, 8321939, 5919856, 4946876, 5604130, 6899919, 7785391, 7767188, 7237490, 7214245, 8023737, 8448398, 7218052, 5206024, 4716682, 6291731, 7769566, 7334828, 6057096, 6036245]
35402F036245J054636K689j850990k043502n60276M07524m16257j955717k237170
35393a562818l81766K554083M163336K794433k54906j604015J44736K281506J467608
35384I602197j568192k975994j187148J085546R41147q26108j456265l28881O46632
35375C932934K04414o21708l59100P30148J169930L67652o84359q38755k67942
35366C633214j9373l90149n23714J77762J030027J058533L96577j22186k78824
35357D961867l69800j54141Q32785J929510J635141l59873k450446k887532j545322
35348A592189K94649J167583M20844j052860j162907J024533L339700K632851
35340H256582q70192l325815k179240O82735J919880R81703l07354p79187n43950
$$ y = [6036245, 7090881, 7093570, 5242580, 3199078, 2638802, 3046326, 2630069, 674352, -1562818, -1944584, 609499, 4772835, 7567268, 7312362, 5708347, 5853083, 8134589, 9602197, 8034005, 5058011, 3870863, 4956409, 5897556, 5071448, 3615183, 3286302, 3932934, 4137348, 3515640, 3156540, 3886688, 5056618, 5424270, 4739911, 3901156, 3633214, 3613841, 3223692, 2699978, 2877740, 3907767, 4966300, 5362877, 5240691, 4961867, 4592067, 4437926, 5270711, 7200221, 8835362, 8475489, 6025043, 3137511, 1592189, 1886838, 3054421, 3475265, 2422405, 1259498, 2284031, 5623731, 8256582, 7386390, 4060575, 1881335, 2564070, 4483950, 5465653, 5158299, 4379112, 3835162]
35331C835162K21500J085573Q66038p71571k073385j452139o9224o9568j105651
35322D66735j025578N39272J793809J742106J117210M84303k23116m09839N08589
35313D993491J307493M41287q71091p9337K169876K437772k0074j902207j186319
35304G290891n2080o23615j353693j74746J768559K332805J810345J402556N86427
35295A2987449j162845k168925r97847Q21587J318857J266629J941922K031707
35287A6038534K10439j454678o22878Q66163Q6853j321823K03437L159353K541191
35278A9706591j771602m238025k184048O36354P29048k59050K08983J192632J067633
35269A5088516O60734O97878k15806k210990k369121N37943K934413J525435j553818
$$ y = [3835162, 4056662, 5142235, 6008273, 5236702, 3163317, 1711178, 1641954, 1572386, 466735, -558843, -19571, 1774238, 3516344, 4633554, 5117857, 4894741, 4484902, 4993491, 6300984, 6742271, 5871180, 5791843, 7961719, 10399491, 10379417, 8477210, 7290891, 7238811, 6615196, 5261503, 5086757, 6855316, 9188121, 10998466, 12401022, 12987449, 11824604, 9655679, 8657832, 9479419, 10798276, 12064905, 14006827, 16038534, 16248973, 14794295, 14171417, 15037580, 15124433, 13802610, 14006047, 17165400, 19706591, 17934989, 13696964, 11512916, 12149270, 12878318, 12619268, 12828251, 14020883, 15088516, 15749250, 16447128, 16231322, 14020332, 11651211, 12189154, 15123567, 16649002, 15095184]
35260A5095184k312712q90702j21213m52365l11359K34194J1614m66291j77943
35251A0608407n5940r77609j109695J114144L247631K176262m66555p71626Q93682
35242A4658701P92790j482805k502108j167974j50300n19386o4889J792692K279801
35233A3636522K63528j400913n69298J087871J740448K300080L396003L243505
35225B3697746J225569J28864J818828L787911L178757J428657J458438K591205
35217C9315975J923032q91361l588655m772747m516662k804063k16735J088375
35209B5537159j12890j812070j575630j94781K40409J90823J207143K117045O27969
35200B6225177k104974k612184n72275Q50114K77016k63076L69698M21387j166887
$$ y = [15095184, 12782472, 11891770, 11770557, 11318192, 11006833, 11241027, 11252641, 10786350, 10608407, 10552467, 9574858, 8465163, 9579307, 12826938, 15003200, 14536645, 13765019, 14658701, 15451491, 13968686, 11466578, 10298604, 10148304, 9628918, 9564029, 11356721, 13636522, 13900050, 12499137, 11929839, 13017710, 14758158, 17058238, 20454241, 23697746, 24923315, 25052179, 26871007, 30658918, 33837675, 35266332, 36724770, 39315975, 41239007, 40347646, 36758991, 31986244, 27469582, 24665519, 24448784, 25537159, 25424269, 23612199, 22036569, 21841788, 22082197, 22273020, 23480163, 25597208, 26225177, 24120203, 21508019, 20935744, 21785858, 22062874, 21799798, 22169496, 22590883, 21423996]
35191B1423996k578958k176052r23675j95871L29942J062546J143595K77059k17664
35182A8144918L19240N81304l10178j144766q26553j99194j29282J49943J086241
35173A7671673J324949J32860p59573M0662R35606N0728j228462m69382J444459
35164A9143520J529957m62238j814165j216571p8604P04014J945039L368409K841383
35155B5960744m9235k248080j001099K428887M635745M256088K544649R04659
35147C7432358l29258j239512j995714k911656l815599l826731k653628j442510
35139A9217750j284905j576196j116043k46915l55550j458992j914744q29575
35131A0434830O32799R74039L34394q0039J41197K81449j45525n57814j88123
$$ y = [21423996, 18845038, 16668986, 15745311, 15549440, 15879382, 16941928, 18085523, 18362582, 18144918, 18464158, 19045462, 18735284, 17590518, 16763965, 16564771, 16435489, 16585432, 17671673, 18996622, 19129482, 18369909, 18410571, 19346177, 19396905, 18168443, 17699061, 19143520, 20673477, 20211239, 18397074, 17180503, 17101899, 17805913, 19750952, 23119361, 25960744, 25911509, 23663429, 22662330, 25091217, 29726962, 33983050, 36527699, 37432358, 37103100, 35863588, 33867874, 30956218, 27140619, 23313888, 20660260, 19217750, 17932845, 16356649, 15240606, 14993691, 14638141, 13179149, 11264405, 10434830, 11067629, 12041668, 12376062, 12296023, 12437220, 12718669, 12573144, 12015330, 11827207]
35122A1827207N88212M36532j184825k924281k885450r88939Q61984J174524M54523
35113G359487r5634l50058p00303o71829L92330J743238J945639J059722M86967
35104A1169559O07935L85432l27074j08499J456255K465172J504864J85662Q68150
35095A8207456K913344L509610J885459L95927J040746K822754L461641K481107
35087C6718044J595135K565238N284342P837650Q468612P676947P799775R940124
35079H7885867J2272375J2656297J1973073J2844422J5525041J7574268J7806996
35072A88538339J7865535J8832582J8717463J4985617P815187q06566r610956
35065B56337201j7829056k3826939k6107316k5054715k2172639j8414897j4609971
$$ y = [11827207, 12415419, 12851951, 11667126, 8742845, 5857395, 4868456, 5730440, 6904964, 7359487, 7263853, 6913795, 6213492, 5541663, 5933993, 7677231, 9622870, 10682592, 11169559, 11777494, 12162926, 11835852, 11727353, 13183608, 15648780, 17153644, 17339306, 18207456, 21120800, 24630410, 26515869, 26911796, 27952542, 30775296, 34236937, 36718044, 38313179, 40878417, 46162759, 54000409, 62469021, 70145968, 77945743, 87885867, 100158242, 112814539, 124787612, 137632034, 153157075, 170731343, 188538339, 206403874, 225236456, 243953919, 258939536, 266754723, 265948157, 256337201, 238508145, 214681206, 188573890, 163519175, 141346536, 122931639, 108321668]
35058A08321668j2216865j1723183j1309125r130301o070876m249555l823057
35051D9798706l566955l558427m472123n016275l336499o72462j44193j742831
35043B7288941k191202m44382N70104q64041k174301r31790R82425O29736j157463
35034B1708027j470782n953J197763J406009J438774J144602l08523j989124j844303
35025B1276490J61081J818594J701939N80514j45851J75066J414638K604411K415211
35016C2002093R95956L83308J599611K723746J801645P8398k02675M33758L72991
35007D0188831Q67700M184990Q509238R338898O366249M531347P101552J1701867
34999I2790672J4636046J5395009J5257840J5006910J5780948J8707651K1955825
$$ y = [108321668, 96104803, 84381620, 73072495, 63942194, 57871318, 53621763, 49798706, 46231751, 42673324, 38201201, 33184926, 29848427, 29175965, 29031772, 27288941, 25097739, 24653357, 25223461, 24359420, 22185119, 21253329, 22235754, 22865490, 21708027, 20237245, 20231292, 21429055, 22835064, 24273838, 25418440, 25109917, 23120793, 21276490, 21437571, 23256165, 24958104, 25538618, 25392767, 25567833, 26982471, 29586882, 32002093, 32998049, 33381357, 34980968, 37704714, 39506359, 39584757, 39382082, 39815840, 40188831, 41056531, 45241521, 53750759, 63089657, 69455906, 73987253, 81088805, 92790672, 107426718, 122821727, 138079567, 153086477, 168867425, 187575076, 209530901]
34992B09530901K1814584J8416652J6019112J5227054J0047870l239490j8772845
34985B69043838k7814281k9282109k8122945k6379069k2479821j7467860j4717014
34978A02780739j3707527j0718821o118109m472390o404028o956668m059703k122299
34970D8221194m111637o148443m232459j094233j213320l171089k646738m7878
34962B5555397P62281m52133l10303J828491K952407J916527R53310J105667P22339
34953C5033983n03130l59332J466253J864062o09570k692387j261464J659247
34945C4597662K012442j71188j320664n1132J152134J75464j701617k093133r07220
34936C1692748r7033r02997k459322k979182j791191j39283O9588j547726l194682
$$ y = [209530901, 231345485, 249762137, 265781249, 281008303, 291056173, 287816683, 269043838, 241229557, 211947448, 183824503, 157445434, 134965613, 117497753, 102780739, 89073212, 78354391, 72236282, 67763892, 61359864, 54403196, 50343493, 48221194, 44109557, 37961114, 33728655, 32634422, 31421102, 28250013, 25603275, 25555397, 26317678, 25865545, 25555242, 27383733, 30336140, 32252667, 33205977, 34311644, 35033983, 34530853, 34171521, 35637774, 37501836, 36892266, 34199879, 32938415, 34597662, 36610104, 36438916, 35118252, 35067120, 36219254, 36394718, 34693101, 32599968, 31692748, 31595715, 30692718, 28233396, 25254214, 23463023, 23323740, 23393328, 21845602, 18650920]
34927A8650920k885473q64665O67281K65639j126549j651034r55685l28991o18127
34918A1153316r87341k49147J171715J539684J48742j502292j502247j3692R39626
34909A0698364J73750j114590j045309L83637J369028P84921m23298p21118o4203
34900A0041182K89248l49397j319785j668520j135372N6084J513656K422919J885175
34891A1735190J96273r42208l53350J030134J457012P34528J49652L36244O41170
34882A4984645P12094J255664K621920L810285L771919K946277K588273K988900
34874C5679977L226569K603157J642880J401444K019659K312032J070785j341754
34866D8614749l288326l876546l831411l893588l496541k134567r72098j392671
$$ y = [18650920, 15765447, 14900782, 15568063, 15833702, 14707153, 13056119, 12100434, 11771443, 11153316, 10165975, 9916828, 11088543, 12628227, 12776969, 11274677, 9772430, 9758738, 10698364, 10872114, 9757524, 8712215, 9095852, 10464880, 11249801, 10826503, 10105385, 10041182, 10330430, 9981033, 8661248, 6992728, 5857356, 5913440, 7427096, 9850015, 11735190, 11931463, 10989255, 10635905, 11666039, 13123051, 13857579, 14007231, 14343475, 14984645, 15696739, 16952403, 19574323, 23384608, 27156527, 30102804, 32691077, 35679977, 38906546, 41509703, 43152583, 44554027, 46573686, 48885718, 49956503, 48614749, 45326423, 41449877, 37618466, 33724878, 30228337, 28093770, 27121672, 25729001]
34858B5729001k615854k715858j647113j087903j389897j184053l66061p17323
34850A4004939k498144l089028p98173K148179K548749N40462j216612j422695
34842A0217677r48122n63437q0226M67656N25451q3313j020367j907005k247836
34833D360478j665332q39343r54022j499624m79333K043093K949617O09425j946627
34824B578332j211339J455690K129464M42734n82751P796J39048q00946q26564
34815C331464N34474J087977K06107K91371K195508K932546N18144k158829j472026
34806G466736J392174K472945R77092l44760O1949Q38599P57366N59795J093069
34797A5274965J793689J904208J669790J520210J206729M98314j42232l41771
$$ y = [25729001, 23113147, 20397289, 18750176, 17662273, 16272376, 15088323, 14722262, 14004939, 11506795, 8417767, 7619594, 9767773, 12316522, 12856984, 11640372, 10217677, 9269555, 8706118, 8625892, 9093548, 9618999, 9535686, 8515319, 6608314, 4360478, 2695146, 1855803, 901781, -597843, -1077176, 965917, 3915534, 4524959, 2578332, 1366993, 2822683, 4952147, 5394881, 4812130, 4819926, 4958974, 4158028, 3331464, 3865938, 4953915, 5160022, 5451393, 7646901, 10579447, 11097591, 8938762, 7466736, 8858910, 11331855, 12308947, 11964187, 12026136, 12864735, 13622101, 14181896, 15274965, 17068654, 18972862, 20642652, 22162862, 23369591, 23867905, 23725673, 23383902]
34789B3383902o70719j866106l395738l652164j947183K36880P46721o15700j900637
34780A0319256j661247o68822l02469m04293M3029R86602J458730J005536l28325
34771A0447997k508533m460352l824850j28830K972624J803706j638941j956618
34763G06203J587582L730225J257304k161250j930215O33542J302479j40202n86513
34754D399155M01189J11258k015020l038631j372388O76735P23803k20379J9940
34745c14338J207110J451790K77975j037781j549940j401960q01802K44061J114761
34736h10124Q70936j76972l55037J098179K548087J952245k25954j602732j204527
34727B094101m11537l00462j67469L92071K43590p94841n59675J880429L442291
$$ y = [23383902, 22713183, 20847077, 17451339, 13799175, 11851992, 12088872, 12835593, 12219893, 10319256, 8658009, 7989187, 7686718, 7282425, 7325454, 8312056, 9770786, 10776322, 10447997, 7939464, 3479112, -345738, -474568, 2498056, 4301762, 2662821, 706203, 2293785, 6024010, 7281314, 5120064, 3189849, 3823391, 5125870, 4985668, 4399155, 4800344, 4911602, 2896582, -142049, -1514437, -837702, -113899, -334278, -314338, 892772, 2344562, 2622537, 1584756, 34816, -1367144, -2168946, -1924885, -810124, 60812, -116160, -471197, 626982, 3175069, 5127314, 4901360, 3298628, 2094101, 1682564, 1382102, 1214633, 1606704, 1850294, 1055453, 495778, 2376207, 5818498]
34718E818498J233754k186688k066480R67177J665261j317856l195564j000246
34710h2144J654114Q77811j119410k32963K462148K717743N4811k087684k046770
34701B197656j382584j061081k09080J137399J472405N17217k53640j54889J7403
34692B280806j6536L15611O25123k38861j851520k247941p59235J058483J732006
34683H97936J424498Q60701K76883k05095m53208p50740j266631j296892k23477
34674g36025J131318J422216O63304r8274m48910n88949l43867K75888K81526
34665A558227q33748j614590n16578J414345J758426J44022j483148j599991l57462
34656a530497J307757K084397P23960j969514k740064J07248L438437K967254
$$ y = [5818498, 7052252, 4865564, 2799084, 3766261, 5431522, 4113666, 918102, -82144, 1571970, 2449781, 1330371, 1097408, 3559556, 6277299, 6332110, 4244426, 2197656, 815072, -246009, -455089, 682310, 2154715, 2671932, 2418292, 2263403, 2280806, 2264270, 2579881, 3205004, 2966143, 1114623, -1133318, -1892553, -834070, 897936, 2322434, 3183135, 3460018, 3254923, 2801715, 2050975, 784344, -512548, -736025, 395293, 1817509, 2480813, 2382539, 1933629, 1344680, 1000813, 1276701, 1558227, 724479, -890111, -1406689, 7656, 1766082, 1910104, 426956, -1173035, -1530497, -222740, 1861657, 2585617, 616103, -2123961, -2016713, 1421724, 4388978]
34648D388978o60193k775678j297515J067701J429926J69694q91884q78553L28703
34639H81179K136252K615798L92691k536391k688694j66896J294632N0305j116254
34630H62622J95152K074581J424329j315664k959944j782687R19272K673817K084547
34621D176025j04749j648946j175409K25553P73412N67798O51039N22652q11429
34612C175946k055833j061363J269634J923086N63256k87364J6411n12631j897291
34603A133851j414031J178855K229654J59536j589148l53721J231868O0760j867798
34594G69826r91883J547369J875524j44404j049760L33264J367776J94432j566771
34585B335373j549366J86508J617206J259899k21264o45423J031279K844045K037495
$$ y = [4388978, 3728785, 953107, -344408, 723293, 2153219, 2322913, 1431029, 552476, 881179, 3017431, 5633229, 6025920, 3489529, 800835, 633939, 1928571, 1978876, 862622, 1057774, 3132355, 4556684, 3241020, 281076, -1501611, -582339, 2091478, 4176025, 4071276, 2422330, 1246921, 1472474, 2245886, 2813684, 3464723, 3987375, 3175946, 1120113, 58750, 1328384, 3251470, 3814726, 3527362, 3543773, 3031142, 1133851, -280180, 898675, 3128329, 3287865, 1698717, 1344996, 2576864, 2637624, 769826, -222057, 1325312, 3200836, 3056432, 2006672, 2339936, 3707712, 3902144, 2335373, 786007, 972515, 2589721, 3849620, 3628356, 2982933, 4014212, 6858257, 8895752]
34576H895752q64029k461211j393999o0317l76373q87073J08295J464693J536001
34567E961739J088531J399745J646698O40452q00244j423034j488003j237357
34559E788527R2100J740241R85869k218467l555320n70235K787072J887281j454084
34550E482984k350894o79526q5576j028260o75873J106210J442018P9703j04477
34541C186309J293490J298364p93398j791774j33301J482654Q91714j12086N49021
34532E870993J498429M52629j853617k686907q72893K206723M114019L180080
34524A1909456O7091k359518k157124q68500j023379j954174j020314J532459
34516D125997K535128R61391n75409j72482R31935J353848J680614K161861J364760
$$ y = [8895752, 8031723, 5570512, 4176513, 4116196, 3739823, 2852750, 2961045, 4425738, 5961739, 7050270, 8450015, 10096713, 10737165, 9936921, 8513887, 7025884, 5788527, 5880627, 7620868, 8606737, 6388270, 2832950, 2262715, 5049787, 6937068, 5482984, 3132090, 2452564, 2366988, 1338728, 662855, 1769065, 3211083, 3290786, 3186309, 4479799, 5778163, 4984765, 3192991, 3059690, 4542344, 5434058, 5321972, 5870993, 7369422, 7822051, 5968434, 3281527, 2408634, 4615357, 8729376, 11909456, 11976547, 9617029, 7459905, 6591405, 5568026, 3613852, 2593538, 4125997, 6661125, 7622516, 7047107, 6874625, 7806560, 9160408, 10841022, 13002883, 14367643]
34507A4367643j057959k823430k106182j38055Q47662M51269m24509j194256j513776
34498F408407j143591o96927r90930j358743n45140O87281M06328q70336n01315
34489A395034J718609K709315J012476q28535n18336N51804L06471m02966K25715
34480F169587J544770J637072L88106p83231j049418m18491Q33905J721707J061026
34471A1105033n71981j222604o94868r19817k233734k233085R8759K156903J671421
34462G156027K4455o68966q83567j470975j097187R20476J953575p5332k511738
34453C346768j705208R73869J271286j076795k249863o53376J189159J304364
34445B400204P16030N04597P6343o30503m21737N65618M30304j177647j958013
$$ y = [14367643, 13309684, 10486254, 8380072, 8242017, 9089679, 9540948, 9116439, 7922183, 6408407, 5264816, 4567889, 3576959, 2218216, 1673076, 2360357, 2766685, 1896349, 1395034, 3113643, 5822958, 6835434, 6006899, 5488563, 6040367, 6346838, 5943872, 6169587, 7714357, 9351429, 9739535, 8956304, 7906886, 7488395, 8322300, 10044007, 11105033, 10533052, 9310448, 8615580, 7695763, 5462029, 3228944, 3327703, 5484606, 7156027, 7180482, 6511516, 5627949, 4156974, 3059787, 3980263, 5933838, 5858506, 3346768, 1641560, 2615429, 3886715, 2809920, 560057, -93319, 1095840, 2400204, 3116234, 3620831, 3697174, 3066671, 2644934, 3210552, 3640856, 2463209, 505196]
34436E05196m66540J641239K241800J563539R93662Q48633P30463O73659O88035
34427I419686L18362l84086n76618m5288L31831K10393M52449J346460J627785
34418A2700974M20906j070125j126391P8485Q69952L18992r41583j767416j555324
34409G928470n51730K95667R9649r69480j832639j818772j210597l86758N95536
34400B149346J268393Q29392l82780p28872L94043J215355J010k122219k541257
34391H2411q75579O80979P63695M61680Q84400J156167K41981q05256l32424J082395
34381C340449J334147j702j179730j105629o75293p65020p45275K2134P57395
34372I81476N71991J1387J5295L21053J99622n9837K47034P96122O89487j04580
$$ y = [505196, 38656, 1679895, 3921695, 5485234, 6478896, 7327529, 8057992, 8731651, 9419686, 9738048, 9353962, 8777344, 8732056, 9063887, 9274280, 9726729, 11073189, 12700974, 13121880, 12051755, 10925364, 11003849, 11873801, 12192793, 11251210, 9483794, 7928470, 7376740, 7672407, 7772056, 6802576, 4969937, 3151165, 1940568, 1553810, 2149346, 3417739, 4247131, 3864351, 3135479, 3529522, 4744877, 4745887, 2623668, 82411, -793168, -112189, 651506, 1113186, 1997586, 3153753, 3395734, 2590478, 2258054, 3340449, 4674596, 4672894, 3493164, 2387535, 1712242, 947222, 201947, 224081, 981476, 1553467, 1564854, 1580149, 1901202, 2100824, 2040987, 2288021, 3084143, 3773630, 3669050]
34362C669050q11995q45121K0144J551960K415024J077023j537240k183177K03055
34353C558723K269670J023875j295004o29607K265793L006523O62218j158592
34345I703599n66617J54596n21616p78267K71072K65286j806984k872825q76290
34336B971954J163560N88k234692j653743Q12244J291462l70640q90002M18211
34327A508942R00994j95322n48773N08548N61201j247396k176435m51394J535490
34318C95855R80432j048756j671819n44506N07800Q37942J272401J713951R85939
34309C429239q22773j880051j028822P14553J668560J430799P24723K33758L06864
34300D776850J007389J567582O16408j761056k967752r20281K181119J918506
$$ y = [3669050, 2857055, 2011934, 2032078, 3584038, 5999062, 7076085, 5538845, 3355668, 3558723, 5828393, 6852268, 5557264, 4927657, 7193450, 10199973, 10862191, 9703599, 9136982, 9291578, 8769962, 7991695, 8262767, 8528053, 6721069, 3848244, 2971954, 4135514, 4136102, 1901410, 247667, 1059911, 2351373, 1980733, 1090731, 1508942, 2409936, 2214614, 1665841, 2174389, 2735590, 1488194, -688241, -1139635, 395855, 1376287, 327531, -1344288, -1888794, -1380994, -543052, 729349, 2443300, 3429239, 2606466, 726415, -302407, 412146, 2080706, 3511505, 4236228, 4469986, 4776850, 5784239, 7351821, 7968229, 6207173, 3239421, 2319140, 4500259, 6418765]
34292F418765j843254l851742r01922K984725K433074r85229j445453J588542
34284D397506K705646j75113k319508k95624K299593J103043j782803j659975
34276D272765J058990K168170N60404j112408j403191j233312q97439Q5724P83556
34267D283259J73383j78310J496914L064489J030393l316061m851364j961580
34259b58877J377952J617061k31113j520349j462162m32833J125699J965563Q98962
34250C079903q52088q90579M41340N66897o29285m51742J491350K067703N9880
34241D883379j415608k19203J084829j89468k085785j459325O25808R94865j09435
34232B110057J67802J950392K234821p5839k284773j933989q6232O68681k61152
$$ y = [6418765, 4575511, 723769, -178153, 2806572, 5239646, 4254417, 2808964, 4397506, 7103152, 6928039, 4608531, 4312907, 6612500, 7715543, 5932740, 4272765, 5331755, 7499925, 8060329, 6947921, 5544730, 4311418, 3413979, 3499703, 4283259, 4456642, 4278332, 5775246, 8839735, 9870128, 6554067, 1702703, -258877, 1119075, 2736136, 2505023, 984674, -477488, -910321, 215378, 2180941, 3079903, 2227815, 1337236, 1778576, 2345473, 1716188, 1264446, 2755796, 4823499, 4883379, 3467771, 3248568, 4333397, 4143929, 2058144, 598819, 1224627, 2219492, 2110057, 2277859, 4228251, 6463072, 6387233, 4102460, 2168471, 2082239, 2750920, 2489768]
34223B489768j284440j095194j15351N38143P79011J480973K577680K335930l18407
34214G388113l517432m274347k334304k29819M92524P67147J307790J039542n30646
34205A08568j673436q92044P00727J182465O00573K84315N65160Q25083Q78637
34196B580048P99583J61326j168608k134087j625308k9502J245367J279900J24459
34187A233178j424914k053594r47077R19992J614749P63090q5239K0900K04695
34178B45780l11412q03509m92083J81971O22676R20864R15486J02310q45253m11853
34168A24977J135075J623393L78241o58244k96087J09456l29750j83458J132693
34159C036296J326302r98628l249271k608124n16034r783o96200j72487J230489
$$ y = [2489768, 1205328, 110134, -5217, 532926, 1311937, 2792910, 5370590, 7706520, 7388113, 3870681, -403666, -2737970, -2967789, -2475265, -1708118, -400328, 639214, 108568, -1564868, -2456912, -1756185, -573720, 26853, 311168, 876328, 1701411, 2580048, 3379631, 3540957, 2372349, 238262, -1387046, -1416548, -171181, 1108719, 1233178, -191736, -2245330, -3192407, -2272415, -657666, 105424, 20185, 41085, 245780, -65632, -869141, -1361224, -1179253, -556577, 364287, 1279773, 1382083, 536830, 124977, 1260052, 2883445, 3261686, 2603442, 2307355, 2416811, 2087061, 1903603, 3036296, 4362598, 3363970, 114699, -2493425, -3009459, -3019242, -3715442, -3887929, -2657440]
34150b657440J281962L61511Q45870K398982K130329k87633j678435l80994J364342
34141C378494J270240J30268l92462m69474r07179j276998r29203m39028o01566
34132b36908r97821p03646K54018R44078O48034l72377r84431l43336P59741O09558
34122d23090p64029j106984O15228K066144R10377j310477j484897J18142N61486
34113h18100p17982j250254o0509P68095q1988j004462m19268Q04436J225614
34104a554418Q83468L04663m71423r12150j32326J132617R16549p62025j465879
34095b060924r7587J435574J492843J005061J052142Q08066k66476p18213K93105
34086B943591J020809N4262j012769l77197O04066k59245k039194k195624p19885
$$ y = [-2657440, -1375478, -1013967, -168097, 2230885, 4361214, 4073581, 2395146, 2014152, 3378494, 4648734, 4779002, 4386540, 3917066, 3009887, 1732889, 803686, 364658, -236908, -1234729, -1938375, -1684357, -740279, -92245, -464622, -1449053, -1792389, -1032648, -423090, -1187119, -2294103, -1678875, 387269, 1297646, -12831, -1497728, -1379586, -818100, -1536082, -2786336, -2846845, -2078750, -2160738, -3165200, -3584468, -2780032, -1554418, -670950, -366287, -837710, -1749860, -1882186, -749569, 166980, -595045, -2060924, -2158511, -722937, 769906, 1774967, 2827109, 3635175, 3368699, 2650486, 2943591, 3964400, 4018662, 3005893, 2628696, 3232762, 2973517, 934323, -1261301, -1981186]
34077a981186L86856P35987J390116J845220O41265j274300j265341O82505J683971
34068B845093N34747o99197n98172n92472j671114j966113K8040K229659J789523
34059A899994m14248j049362O40380J962713J033546o27642o31345R24976J862101
34050E601113Q23061j245588k294779j369528L64998Q41251m73384j794766j325363
34041h72985J83346M19019j094913k233401j389557L13282J045026J032383J601110
34032i96690K477075K155897O01011n71402p10921q62369j458576j376635j20821
34023h63431J007636R97909N50474K55881o09021j942090j723208P09691K425532
34014H09373R10813j457868o50042K466484L184067L92480j776681p45382P75815
$$ y = [-1981186, -1594330, -858343, 531773, 2376993, 3018258, 1743958, 478617, 1161122, 2845093, 3379840, 2680643, 2082471, 1489999, -181115, -2147228, -2119188, 110471, 1899994, 1485746, 436384, 1076764, 3039477, 4073023, 3445381, 2814036, 3739012, 5601113, 6424174, 5178586, 2883807, 1514279, 1879277, 2720528, 2247144, 452378, -872985, -689639, -270620, -1365533, -3598934, -4988491, -4675209, -3630183, -2597800, -996690, 1480385, 3636282, 4237293, 3665891, 2954970, 2092601, 634025, -742610, -863431, 144205, 1142114, 1692588, 1948469, 1339448, -602642, -2325850, -1616159, 809373, 1720186, 262318, -387724, 2078760, 5262827, 5655307, 3878626, 3133244, 3909059]
34005C909059N4130r82325K68902J862626M08504k753537l189488l93684J403391
33996E87578j37862k164756j449546Q16260J367929j27563j037394J08141J761116
33987b76097J818118L60188q43092q51961n92355j176893j952605j216507J158257
33978c572947L018063K517394M64659r05598p92806k43748j20903n6962M24528
33969G31680Q71752M98941o76851j626910j214581M86779J794907J045290j148850
33960G62157k275696j118134O41151R35462J05547k35822J24271L49234N91532
33951a20298J458088K081927J151277m78052p79598m4907m92071k116892k167283
33942a507809K28116K138985J300429m30259m08681N77130K88093p98668n76263
$$ y = [3909059, 3963189, 2980864, 3249766, 5112392, 5520896, 2767359, -422129, -815813, 587578, 449716, -1715040, -3164586, -2348326, -980397, -1107960, -2145354, -2037213, -276097, 1542021, 1902209, 1059117, 207156, -385199, -1562092, -3514697, -4731204, -3572947, -554884, 1962510, 2427169, 1521571, 728765, 485017, 364114, 307152, 731680, 1603432, 2102373, 1425522, -201388, -1415969, -929190, 865717, 1911007, 762157, -1513539, -2631673, -1990522, -1055060, -949513, -1185335, -1061064, -711830, -120298, 1337790, 3419717, 4570994, 4092942, 3313344, 3268437, 2776366, 659474, -1507809, -1279693, 859292, 2159721, 1729462, 1320781, 1897911, 2186004, 1387336, 811073]
33933H11073P52853J164546N09357M41882R56884K78283j587681k349540j157227
33924a79570O6266q044j50617O91952J213241P9298j543946j716973n19099O23739
33914a443753J128964J126986L74590r30747j305264J65952J906000J682033j41670
33905B563091j071682k5987J341442J025772r74111k953750l240375j554248P02614
33896d187234J692591J170636P06631J352640K082742J459956k50308j817493
33888B210161k740249k815093j340139J406004L127441K156261Q9436n58110j66644
33879A369068o66089j573382r69193L41841r0779j285656K70339L883575M227198
33870E506922k28863l745174j785078J934415J653512j240626j253847J650037
$$ y = [811073, 1563926, 2728472, 3237829, 3679711, 4636595, 4914878, 3327197, 977657, -179570, -113304, -121348, -271965, 419987, 1633228, 1712526, 168580, -1548393, -2067492, -1443753, -314789, 812197, 1186787, 256040, -1049224, -883272, 1022728, 2704761, 2563091, 1491409, 1465422, 2806864, 3832636, 2858525, -95225, -3335600, -4889848, -4187234, -2494643, -1324007, -617376, 735264, 2818006, 4277962, 4027654, 2210161, -530088, -3345181, -4685320, -3279316, -151875, 2004386, 2093822, 1535712, 1369068, 702979, -870403, -1839596, -1497755, -1588534, -2874190, -2603851, 1279724, 5506922, 5278059, 1532885, -252193, 1682222, 3335734, 2095108, 841261, 2491298]
33862B491298K319507n69077k487472q91308R68127J36009j281555m22974J263648
33853A526203P64343j381026k139042o18806J213932J574810M75230j001059j504699
33844a090114l25840J414164J668768M67327K03283J681370K193127k98070l213613
33835B700402k693772M93567J924904J2713k036625j324884Q74509J721366P91389
33826B463569l16729o54698m22572J24417P09689O98344k4464n16600k14074n4506
33816A792376q45855j376107K6713K443413K963825O52898j988478k322741p06774
33807F39270P76744J270756J298395J028794K57691l41759J82366J207395J002424
33798G322076o63769j988758j727879p90034m77023n71563k77661J25286p8376
$$ y = [2491298, 4810805, 4241728, 1754256, 862948, 1831075, 1967084, 685529, 262555, 1526203, 2290546, 909520, -1229522, -1848328, -634396, 940414, 1415644, 414585, -1090114, -1415954, -1790, 1666978, 2134305, 2337588, 4018958, 6212085, 5914015, 2700402, 6630, 500197, 2425101, 2437814, 401189, -923695, -49186, 1672180, 2463569, 2146840, 1492142, 1069570, 1193987, 1903676, 2602020, 2577556, 2060956, 1846882, 1792376, 946521, -429586, -402873, 2040540, 5004365, 5657263, 3668785, 1346044, 639270, 1416014, 2686770, 3985165, 5013959, 5271650, 4929891, 5112257, 6319652, 7322076, 6658307, 4669549, 2941670, 2151636, 1674613, 1103050, 825389, 950675, 872299]
33789H72299n38811l53008L63897O72087L54294J64811N68342J113328J114057
33780D331296L65736p42678j391775q92482M39966J324639R09607k59416j076288
33771C008605j127480o33015J84232J011913J314757R31618K95666l60233j239220
33762C386843j996084j624284o5412J185006R98019R1697l05248j01809K96917
33753A865645R17880J372781O04170j144726j762121l52586Q82724l4088j441294
33744I08385o36716J574402K070575K61490j427349j447801n14570N49185J432555
33735B770156J149874p97537k412856j423772Q77342J304149j57989p01146J79872
33726G88093K03602q62834n47439J317574J723252K6444n11370J263961J806798
$$ y = [872299, 333488, -19520, 344377, 1016464, 1370758, 1535569, 2103911, 3217239, 4331296, 4697032, 3954354, 2562579, 1670097, 2110063, 3434702, 4344309, 4084893, 3008605, 1881125, 1248110, 1432342, 2444255, 3759012, 4690630, 4986296, 4626063, 3386843, 1390759, -233525, -298937, 886069, 1884088, 1975785, 1670537, 1568728, 1865645, 2783525, 4156306, 4760476, 3615750, 1853629, 1501043, 2383767, 2349679, 908385, 271669, 1846071, 3916646, 4178136, 2750787, 1302986, 788416, 1337601, 2770156, 3920030, 3122493, 709637, -714135, 163207, 1467356, 1309367, 608221, 788093, 991695, 128861, -418578, 898996, 2622248, 2648692, 2137322, 3401283, 5208081]
33717E208081q82136l175511j647858J250672J618099N34830J230177K719954
33709F856308J622419j430178k517577q81001K42443o63142j224428L72530K277112
33700D654486J796882q30909k772489j777964J375154L341879J770222j475364
33692F081897k360061l05019R69375o58075k380001j278659R39484J228051K05625
33683B442617J07319L34737p67855j835908n94476J643070J961204P99192N30551
33674D620451P10839m71420j532883J79875K839385K329054n99265j386844L81395
33665G070587N75339j518209j733355J015262K216377k46734k097456r5056K429444
33656G616199J561617q24670j168275k71286o03603j348949p79308k35273j195292
$$ y = [5208081, 4325945, 1150434, -497424, 753248, 2371347, 2906177, 4136354, 6856308, 8478727, 7048549, 4530972, 3649971, 3892414, 3229272, 2004844, 2377374, 4654486, 6451368, 5620459, 2847970, 1070006, 2445160, 5787039, 7557261, 6081897, 3721836, 3416817, 4386192, 3728117, 1348116, 69457, 1008941, 2236992, 2442617, 2549936, 2884673, 2116818, 280910, -313566, 1329504, 3290708, 4089900, 4620451, 5331290, 4859870, 3326987, 3506862, 6346247, 8675301, 8076036, 6689192, 7070587, 7645926, 6127717, 4394362, 5409624, 7626001, 7379267, 5281811, 5186755, 7616199, 9177816, 8353146, 7184871, 6913585, 6309982, 4961033, 4181725, 3946452, 2751160]
33647B751160j581564L43381J621838o36109l115926r62670L605016M034546j79831
33638E879841k781282p96290J494477M56592j224198j0021K331107K231340N42203
33629H123769O88602K519510K496164l95022k843117k122335J75932Q71086l17637
33620I196952j027117j33118P48422l4618j590203j719869J7419J695963J428130
33611H581961m43972j740020p32004J840931L078989J038734k330907k892480
33603F401232K61743L081686J990487j028122j658354O6746L04369j904730l002634
33594D512423q51210J894822K203213R29006L68551M92125J56449k88517j24249
33585I292613o0451o20861n81233P60957J610135L11558j731190k161303j133037
$$ y = [2751160, 1169596, 1512977, 3134815, 2498706, -617220, -1579890, 2025126, 6059672, 5879841, 3098559, 2302269, 3796746, 4253338, 3029140, 3019119, 5350226, 7581566, 8123769, 8812371, 11331881, 13828045, 13433023, 10589906, 8467571, 8643503, 9514589, 9196952, 8169835, 8036717, 8785139, 8750521, 7160318, 5440449, 5457868, 7153831, 8581961, 8137989, 6397969, 5665965, 7506896, 10585885, 11624619, 9293712, 6401232, 6662975, 9744661, 11735148, 10707026, 9048672, 9115418, 9419787, 7515057, 4512423, 3661213, 5556035, 7759248, 8688254, 9056805, 9548930, 9705379, 9416862, 9292613, 9232162, 8611301, 8030068, 8791025, 10401160, 10712718, 8981528, 6820225, 5687188]
33576E687188k95090J74275J010718J668792J237530M90278O37091J052537N44142
33567A2207461k03385J33585Q40040K63128j158442j479983m17610L59237j35508
33558A0408523j173227j683153j208466K0673Q92946K81288r90734p18489J063549
33549F892910J401413r40742k912401j745034O27848Q99508l36086l71527O44044
33540D159933O54153M115M91780J304794K77347j665156j699581q2881M74586
33531C919090j50026K97796J561761J116784o62884o74046J101440J186683r98890
33522F697708j677108O56712K302031M94324k139783k157507l87349N62223N27678
33513D878929O10467O42652M33002Q91648J721465Q70186j613819k441208k20932
$$ y = [5687188, 5392098, 5566373, 6577091, 8245883, 9483413, 9973691, 10610782, 11663319, 12207461, 12004076, 12137661, 12977701, 13240829, 12082387, 10602404, 10184794, 10544031, 10408523, 9235296, 7552143, 6343677, 6364350, 7257296, 7538584, 6547850, 5829361, 6892910, 8294323, 7353581, 4441180, 2696146, 3323994, 4223502, 3887416, 3515889, 4159933, 4814086, 4818201, 5309981, 6614775, 6892122, 5226966, 3527385, 3444504, 3919090, 3769064, 4066860, 5628621, 6745405, 6082521, 5408475, 6509915, 7696598, 6697708, 5020600, 5677312, 7979343, 8473667, 6333884, 4176377, 3789028, 4351251, 4878929, 5489396, 6132048, 6565050, 7456698, 9178163, 10048349, 8434530, 5993322, 5772390]
33504E772390J710543N70957j145542Q9183K758340K733093j49612k260237j912760
33495H166355r27846p22065l29345J185756K836352K996753J341309p31744j188533
33486A2626992N21650K316565J824580j23667n73102Q12360J192705m56244j471165
33477A6670674k73599Q43395J38390k34246J455998K531433L23901k574285k189550
33468A6692111J62599K14383j963306k461224n63804K19375j479385k509715n24694
33459G786340K354767K935079J085626j051843j849171j092412K72603P29323
33451A1170312j84725j002680m30920M95505J64501q19227q72585l15417l89409
33442G815355n63521K08123O88047p78227k569030j763989Q40992J791838P10213
$$ y = [5772390, 7482933, 8053890, 6908348, 6997531, 9755871, 12488964, 12339352, 10079115, 8166355, 7238509, 6516444, 6187099, 7372855, 10209207, 13205960, 14547269, 13815525, 12626992, 13148642, 15465207, 17289787, 17166120, 16593018, 17405378, 18598083, 18141839, 16670674, 16397075, 17240470, 17378860, 17144614, 18600612, 21132045, 21455946, 18881661, 16692111, 16854710, 17069093, 15105787, 12644563, 12080759, 12300134, 10820749, 8311034, 7786340, 10141107, 13076186, 14161812, 13109969, 11260798, 10168386, 10440989, 11170312, 10985587, 9982907, 9551987, 10047492, 10211993, 9392766, 8520181, 8204764, 7815355, 7251834, 7459957, 8148004, 7369777, 4800747, 3036758, 3877750, 5669588, 6379801]
33433F379801N12206J711301J282348j679825l710194k258441O29897J978978
33425D846071J827583J391944M56170j024777j418347M1336J369340O88642r29167
33416G248795j418426o67422L14685J356939K384466K360155Q37550p45012r26740
33407A0744990k16444N3831l37244p89390r02984m05166O76971J313217M94714
33398A0632495q33275q28177K07113L74759j21866Q93435L116032L216991K49940
33389A6907447k149548j178115R74263J037892m16784j039660r29313j414134
33381A1792048j775683o01464J175874J625402Q07455j40780j169357k054015
33373I659480j163642J559518K722394J09699l009551k292928Q42340J495781
$$ y = [6379801, 6892007, 8603308, 9885656, 8205831, 4495637, 2237196, 2867093, 4846071, 6673654, 8065598, 8521768, 7496991, 6078644, 6119980, 7489320, 8177962, 7248795, 5830369, 5162947, 5477632, 6834571, 9219037, 11579192, 12416742, 11671730, 10744990, 10528546, 10582377, 10245133, 9455743, 8552759, 8147593, 8824564, 10137781, 10632495, 9799220, 8971043, 9178156, 9552915, 9431049, 10324484, 13440516, 16657507, 16907447, 14757899, 13579784, 14554047, 15591939, 15175155, 14135495, 13206182, 11792048, 10016365, 9414901, 10590775, 12216177, 13023632, 12882852, 11713495, 9659480, 8495838, 10055356, 12777750, 12887449, 9877898, 7584970, 8427310, 9923091]
33365I923091q41329j860911K90747K420225J836977J8263p65480p77354j013207
33356I231022j030098l20842L55576L75183K06961J76154o031j34738J98418K33799
33346I285404q37689j659703l87881J606760J106695j582004k426290J34064K640997
33337G880353K073391K15884N2299R40783N50252p07668o37829O72790R85310
33328A2025565m19088j887256k094373j425495n87100L84538J413247J886643
33320I296681J247460l66059j977315k214272o36559J268307J579338O41701O40653
33311I479935J976242K225999N0346k051719j179022J313146J471063j444741
33303A1841249l710486k277471J170041K631985Q93663j404796j497757J18853
$$ y = [9923091, 9081762, 7220851, 7511598, 9931823, 11768800, 11787063, 11021583, 10244229, 9231022, 8200924, 7880082, 8235658, 8610841, 8817802, 8993956, 8987925, 8853187, 9051605, 9285404, 8447715, 6788012, 6400131, 8006891, 9113586, 7531582, 5105292, 5239356, 7880353, 9953744, 10169628, 10221927, 11162710, 11712962, 11005294, 10367465, 11040255, 12025565, 11606477, 9719221, 7624848, 6199353, 5612253, 5996791, 7410038, 9296681, 10544141, 10178082, 8200767, 5986495, 5349936, 6618243, 8197581, 8839282, 9479935, 11456177, 13682176, 13732522, 11680803, 10501781, 11814927, 13285990, 11841249, 8130763, 5853292, 7023333, 9655318, 10548981, 9144185, 7646428, 7765281]
33295G765281P84786m35952j367767Q3300K533921K687856P278k303894j611716
33286H143093Q21026K100458J658129J103957J148949Q26355l44325j273017q85312
33277A3299313L99362J368662J466860J031733N56849K29601L2211j32000m84665
33268A7767926j176873j744575j153454Q30518K493442J711188r70738k365336
33260A5392098p80678J515432J645003L16450J95516J346338J526410M69223J89592
33251B1815384P82442j43533k694286l288414j79579L075723K557247l80510j685794
33242A9858680o81153N8398m51082n95688L98563J283905J237456R00865O81754
33233B2691698J35642p05590j157157j125889r89608m30245R67388K200591J715412
$$ y = [7765281, 8550067, 8114115, 6746348, 6829648, 9363569, 12051425, 12058703, 9754809, 8143093, 8964119, 11064577, 12722706, 13826663, 14975612, 15801967, 15457642, 14184625, 13299313, 13698675, 15067337, 16534197, 17565930, 18122779, 18352380, 18384591, 18252591, 17767926, 16591053, 14846478, 13693024, 14523542, 17016984, 18728172, 17757434, 15392098, 14611420, 16126852, 17771855, 18088305, 18283821, 19630159, 21156569, 21625792, 21815384, 22597826, 22454293, 19760007, 16471593, 16292014, 19367737, 21924984, 21544474, 19858680, 19177527, 19235925, 18784843, 18189155, 18587718, 19871623, 21109079, 22009944, 22691698, 22827340, 22121750, 20964593, 19838704, 18849096, 18418851, 19386239, 21586830, 23302242]
33224B3302242k63194j888835k118267j458453m57054R04667K255434K747674
33216B3024214K141507R81229j73654q74109p44382k78382p29381k015672k036278
33207A9295092K17163K270333J262340j633252k689523r85711O92213L42495p75714
33198A7995436p94934J10635P24583O41397K25345p8822L1608K73781k17792j439171
33188A7472066j873664o96544N50457L65968o9358Q32418J690016L86328j542650
33179A7115037p71650K160428L392177J869947M15035L07795l49777j850825j475473
33170B0812694J303415K955616J561228j56418m7308j75088k053899k845159l88327
33161B0966754K080399R58928j460878r23281J495985J634239l45777p12131Q69892
$$ y = [23302242, 23039048, 21150213, 19031946, 17573493, 17116439, 18021106, 20276540, 23024214, 25165721, 26146950, 25973296, 25099187, 24354805, 24076423, 23347042, 21331370, 19295092, 19512255, 21782588, 23044928, 21411676, 18722153, 17736442, 18428655, 18771150, 17995436, 17200502, 17311137, 18035720, 18677117, 18902462, 18823640, 18855248, 19129029, 18911237, 17472066, 15598402, 14901858, 15452315, 15818283, 15748925, 16581343, 18271359, 18657687, 17115037, 16343387, 18503815, 21895992, 23765939, 24180974, 24488769, 24138992, 22288167, 20812694, 22116109, 25071725, 26632953, 26476535, 26429227, 26254139, 24200240, 21355081, 20966754, 23047153, 24006081, 22545203, 21621922, 23117907, 24752146, 24406369, 23694238, 24564130]
33152B4564130J089761n75616r47541P85987J473130k58671j520604k89115J182630
33143B5504091L90949j360733j430361J03111J140103O27513p98502j918776j602069
33134B0655326K70141J911392J259427j055392k222646j149818K56364K67284
33126B0192078m79580q30414r46839j161716r29063p2923N53696N68102N81354
33117A7474695N71748l14536j637817j622812k44063J34991j344326k092046j33439
33108A0792395K251528J789555o05800j233973O34468J887974O83936q55129l59150
33099A4985804R84929N33058j434611k071423m46650R33960N1946j353163m87856
33090A1695994J877649K356010K77148j130002J70010J883218J322615l11186
$$ y = [24564130, 25653891, 25078275, 24130734, 24916721, 26389851, 26131180, 24610576, 24321461, 25504091, 25895040, 24534307, 23103946, 23207057, 24347160, 24974673, 24176171, 22257395, 20655326, 20925467, 22836859, 24096286, 23040894, 20818248, 19668430, 19924794, 20192078, 19712498, 18882084, 17935245, 16773529, 15844466, 15771543, 16325239, 16893341, 17474695, 18046443, 17731907, 16094090, 14471278, 14227215, 14362206, 13017880, 10925834, 10792395, 13043923, 14833478, 14227678, 12993705, 13628173, 15516147, 16200083, 15344954, 14985804, 15970733, 16503791, 15069180, 12997757, 12551107, 13485067, 13537013, 12183850, 11695994, 13573643, 15929653, 16206801, 15076799, 15246809, 17130027, 18452642, 18141456]
33082A8141456m31726M11650N6999q15283J71832K260111K231101P832q24047
33073B1209925R85784K125208K52172k164427k051359m90451k18386q83548k26175
33064A8538743J493219J637743n74127k649856k018249R17606L328563K936144
33056B3609786L94390j366388o50079Q18436N61465p46060n58929R10118Q33968
33047B3806707j132807j852807q6237J157079j79191j499705o0713K223572K067666
33038B4443564J27383q38070q34374j598265k498722j679402l4840Q8905p42920
33029A6433259o8867J737199J883547P4676j017880l14748M47523L35979L72756
33020A9883444O06376l70753k290895k956635j812607n57637K90532J887303L486049
$$ y = [18141456, 17709730, 18121380, 18178379, 17363096, 17534928, 19795039, 22026140, 22033972, 21209925, 22195709, 24320917, 24573089, 22408662, 20357303, 19866852, 19648466, 18764918, 18538743, 20031962, 21669705, 21095578, 18445722, 16427473, 17345079, 20673642, 23609786, 24004176, 22637788, 21987709, 22806145, 23367610, 22621550, 22062621, 22972739, 23806707, 22673900, 20821093, 20734856, 21891935, 21712744, 20213039, 20152326, 22375898, 24443564, 24570947, 23732877, 22898503, 21300238, 18801516, 17122114, 17087274, 17176179, 16433259, 16364392, 18101591, 19985138, 20059814, 19041934, 18727186, 19174709, 19510688, 19883444, 20489820, 20119067, 17828172, 14871537, 13058930, 12501293, 12791825, 14679128, 18165177]
33011A8165177K372187j294230l485047k059119J13748N0499p97153K22976K144144
33002A5433182K225709O11966k49515L16964P13918M0678q52454r62885r0387
32993A7187176J299331J977911P67693j392947j749830M02953K000994M52128
32985B0945409k162687j903999J207288L289237K067475p44515k594774k806871
32977A7296563j670036N12956K461774K272888J05005j264088m3321J899549J695663
32968B3266953l55143j406901l85571O65182J9303j085189n84287J135969J977629
32959B3247945J341776N02359K0664q73051j920789j369307R06883K128318M09128
32950B4393926k029272j837523O66947K332388J781751L47914q89254j905158
$$ y = [18165177, 20537364, 19243134, 15758087, 13698968, 13812716, 13863215, 13066062, 13289038, 15433182, 17658891, 18270857, 18021342, 18338306, 19052224, 19092902, 18240448, 17277563, 17187176, 18486507, 20464418, 21232111, 19839164, 18089334, 18492287, 20493281, 20945409, 18782722, 16878723, 18086011, 21375248, 23442723, 22698208, 20103434, 17296563, 15626527, 16139483, 18601257, 20874145, 20979150, 19715062, 19671741, 21571290, 23266953, 22911810, 21504909, 21119338, 21784520, 21803823, 20718634, 20134347, 21270316, 23247945, 24589721, 25092080, 25112744, 24239693, 22318904, 20949597, 21856480, 23984798, 24393926, 22364654, 20527131, 21194078, 23526466, 25308217, 25656131, 24766877, 22861719]
32942B2861719j879719J48551K558720K370358j77228j485802M1344J752916J185545
32933B7376404m71950j151999j152549j414739j207290L1523Q02395l6077r85101
32924B1790617m83348K32165n43347j688601j167515L80731R46818O61825R24947
32915B1054292J222228J03012j492561j240449O24760J565965P71722j48271m37426
32906B2023272j002118j694159r62041J047809J952673P69814m49786J14909J355691
32897B3156064J256061r6243j013699o11988N23868J426931J709373J755402K110503
32888C0216272K444189J787169M77341O08762L036262N257912M566418K294145
32880E0688470K087439M513576O578427O566488N901136N572623M253806J432383
$$ y = [22861719, 20982000, 21130551, 23689271, 26059629, 25882401, 24396599, 24437943, 26190859, 27376404, 26904454, 25752455, 24599906, 23185167, 21977877, 22009400, 22811795, 22775718, 21790617, 21307269, 21539434, 20996087, 19307486, 18139971, 18520702, 19467520, 20129345, 21054292, 22276520, 22379532, 20886971, 19646522, 20271282, 21837247, 22608969, 22460698, 22023272, 21021154, 19326995, 18364954, 19412763, 21365436, 22135250, 21685464, 21800373, 23156064, 24412125, 24315882, 23302183, 22690195, 23214063, 24640994, 26350367, 28105769, 30216272, 32660461, 34447630, 34924971, 35533733, 38569995, 43827907, 48394325, 50688470, 52775909, 57289485, 63867912, 70434400, 76335536, 81908159, 86161965, 87594348]
32872H7594348p09821o05365o9379j558634m468384o290089o157132n313262m918260
32863E7504022m927917m610138l294163j258014j04779j007090k543266k186066
32855C7572589j11461R57503J96532p9406J216312J696436k80030k326763j864534
32846C6977178n08955j145115k792464k388332l16017J10182j739485k787468
32838B5409524j230557J018364J721008J149736N19180J31486J28119Q83561J674961
32829C1405382R66661j089232k357786j741400n39262K8139N07215J308364J298946
32820B9787027j06127j305362q06829L35713L30984l54380J9419J300285J585551
32811C0786281L75432n13106M07583K315568L385341L038396K274395K326403
$$ y = [87594348, 86884527, 86279162, 86209783, 84651149, 80182765, 73892676, 67735544, 62422282, 57504022, 52576105, 47965967, 44671804, 43413790, 43309011, 42301921, 39758655, 37572589, 37461128, 38418631, 38615163, 38535757, 39752069, 41448505, 41168475, 38841712, 36977178, 36468223, 35323108, 32530644, 30142312, 29826295, 29936477, 28196992, 25409524, 24178967, 25197331, 26918339, 28068075, 28587255, 28718741, 28846860, 29730421, 31405382, 32372043, 31282811, 28925025, 27183625, 26644363, 26672502, 27179717, 28488081, 29787027, 29680900, 28375538, 27568709, 27904422, 28235406, 27881026, 27900445, 29200730, 30786281, 31161713, 30648607, 31056190, 33371758, 36757099, 39795495, 42069890, 44396293]
32803D4396293L378377M388518M220236L145157K752863L865440N180478M875861
32795G6203223L000238J060804l80464k137570m350895n682920n283213m264322
32787E8164881m219619n115446n601381m798084k953571r24629J71944n47246
32779C4176849k556791l752925k603422j56796J203361P15900k76691n86673m63363
32770B5699449n06227p22819j023725j409287j361300l48743Q16847O97485l54285
32761B1487395m26782O41902N52634j471675k517832k05344L004092K933625j35984
32752B3862031k017826r17621N63414J80723q19664o64313n5402k68568o01740
32743A9261034J40109J254137J206863l7914j288338j688663r12207Q57170K114803
$$ y = [44396293, 47774670, 52163188, 56383424, 59528581, 62281444, 66146884, 71327362, 76203223, 79203461, 80264265, 79883801, 77746231, 73395336, 67712416, 62429203, 58164881, 53945262, 48829816, 43228435, 38430351, 35476780, 34552151, 34724095, 34176849, 31620058, 27867133, 25263711, 25106915, 26310276, 27026176, 26749485, 26162812, 25699449, 25193222, 24470403, 23446678, 22037391, 20676091, 20327348, 21144195, 21841680, 21487395, 21060613, 21702515, 22255149, 20783474, 18265642, 18060298, 21064390, 23998015, 23862031, 21844205, 20926584, 21489998, 21670721, 20851057, 20186744, 20131342, 19862774, 19261034, 19401143, 20655280, 21862143, 21824229, 20535891, 18847228, 17935021, 18792191, 20906994]
32734B0906994R83705j733956k548791j25636K126300Q42699k033934k197660
32726A6219721L07249J449805j34861j265068J55150J697305O00379j791887k405022
32717A4832771j075946r5010m44126j080057j250181j144550n04300J213695L071040
32708A3523336K979886M92414k145045k588110j098083K17296J95584l61253k61480
32699A0954545M57775Q47511M43123k20454m24508j68028o3152m96293j076713
32690A0253806r79364P5132J184057R88884n88767j758149q36355J357133K259123
32681A1955500R64663n19394k56670P59937K88505j541443k368372j246876l9834
32672G996016m97452j692461j553140K06785J989004K443355J501747k15805j772797
$$ y = [20906994, 21890699, 20156743, 17607952, 17482316, 19608616, 20451315, 18417381, 16219721, 16526970, 17976775, 17841914, 16576846, 16731996, 18429301, 19029680, 17237793, 14832771, 13756825, 13661815, 13217689, 12137632, 10887451, 9742901, 9238601, 10452296, 13523336, 16503222, 16995636, 14850591, 12262481, 11164398, 11381694, 11577278, 11216025, 10954545, 11412320, 12259831, 12702954, 12482500, 12057992, 11889964, 11826812, 11330519, 10253806, 9274442, 9349574, 10533631, 11522515, 10933748, 9175599, 8339244, 9696377, 11955500, 12920163, 12400769, 12144099, 12904036, 13192541, 11651098, 9282726, 8035850, 7996016, 7498564, 5806103, 4252963, 4459748, 6448752, 8892107, 10393854, 10178049, 8405252]
32663H405252j946715k45992J907852K217765K71427j669430j363618O49730J894614
32654A0120885J069891p77954k006703k059050j183487K29376J337638R98861
32646G729457o84429j778022p53613J250036J852197P65406j0791O08886J275085
32637A0254212N54891q46878j333311o91487P9537L67758K30769k60676q56160
32628G498655q00886K65568J412469J358534J19400j024272j048215j38114O88672
32619H331811N94471j83820m68857K47726O69104n48946k172979j645102O96154
32610E519562J358482r99396k840665q19618K791546L178837M7407k285060j451826
32601D499269K43548K90830m29632k8590J175071J701154J302753O17163k18269
$$ y = [8405252, 6458537, 6212545, 8120397, 10338162, 10609589, 8940159, 7576541, 8226271, 10120885, 11190776, 10412822, 8406119, 6347069, 5163582, 5392958, 6730596, 7729457, 7045028, 5267006, 4513393, 5763429, 7615626, 8381032, 8370241, 8979127, 10254212, 10809103, 9962225, 8628914, 7937427, 8016964, 8384722, 8615491, 8354815, 7498655, 6697769, 6963337, 8375806, 9734340, 9853740, 8829468, 7781253, 7643139, 8331811, 8926282, 8742462, 8273605, 8521331, 9190435, 8641489, 6468510, 4823408, 5519562, 6878044, 5878648, 3037983, 2218365, 5009911, 8188748, 8236155, 5951095, 4499269, 4742817, 5033647, 4604015, 4575425, 5750496, 7451650, 8754403, 9371566, 9153297]
32592I153297j171665j613104j186446m98094p8653L72228R60509R31821n5343
32583F814550r54078o26354N24584J064057L07210r28328j173883R7101J506251
32574F631110R98799j332574k706072j245546J098025J307934j18505k73351J106020
32565E465840J341903j71704o70431R80212J896774K0715k109588j354088J066580
32556F466213J876751Q04301r5780m27893j175341j694515o67207P10156J49368
32547E946053j490967j093410J497714K875538J392707n00028n65965j34820j104787
32538F822035k270236j285991J309544K678690J659371l3524n32275k2288J87686
32529H513012l29859p66445l86704M00803N76206o4609o10057l89283Q2716R9482
$$ y = [9153297, 7981632, 6368528, 5182082, 4683988, 4605335, 4977563, 5938072, 6869893, 6814550, 5860472, 5234118, 5758702, 6822759, 7129969, 6201641, 5027758, 5124859, 6631110, 7629909, 6297335, 3591263, 2345717, 3443742, 4751676, 4633171, 4359820, 5465840, 6807743, 6636039, 5965608, 6945820, 8842594, 8863309, 6753721, 5399633, 6466213, 8342964, 9147265, 9051485, 8623592, 7448251, 5753736, 5086529, 5796685, 5946053, 4455086, 3361676, 4859390, 7734928, 9127635, 8627607, 8061642, 7926822, 6822035, 4551799, 3265808, 4575352, 7254042, 8913413, 8879889, 8347614, 8325326, 8513012, 8183153, 7416708, 7030004, 7430807, 8007013, 7942404, 7332347, 6943064, 7025780, 7125262]
32519G125262k7595L23519P88411O00295K9852p7202J02635k59212p56549M9011
32509G898427K111296L195040J673413r99763j769418L60881K973231K800973
32501A8244080m96620l589349l212701m00340O34566j624735l534768j622543
32493D397590J816517J892330j273274k555616J43424K546743Q01819k470545
32485E298988k468454L58281J550269j44017j421050k96534J005279L28453q16729
32476C394486j47965J399938J231811p25924j972107j125439M77919J025574M33957
32467C992250j33621J30383R94499J465420O35152j142433k076221q22865J549152
32458D591716K572096J411815l77620j354142j831730k243563j572817R47817
$$ y = [7125262, 7097667, 7421186, 8209597, 8809892, 8839744, 8762542, 8865177, 8605965, 7849416, 7898427, 10009723, 13204763, 14878176, 13878413, 12108995, 12469876, 15443107, 18244080, 17747460, 14158111, 10945410, 10545070, 11179636, 9554901, 6020133, 4397590, 6214107, 8106437, 6833163, 4277547, 4420971, 6967714, 7769533, 5298988, 2830534, 3188815, 4739084, 4595067, 3174017, 2877483, 3882762, 4211215, 3394486, 3246521, 4646459, 5878270, 5152346, 3180239, 2054800, 2532719, 3558293, 3992250, 3858629, 3989012, 4983511, 6448931, 7084083, 5941650, 3865429, 3042564, 4591716, 7163812, 8575627, 8198007, 6843865, 5012135, 2768572, 1195755, 2143572]
32450B143572L687320M161977K328903N09713J36847L50389q335p33931j059544
32441A1516911o72464N45733K438815L808734L177855Q88190r45054j125942n68469
32432A9064309k98362n5806L04311l2347j079453j341785l33119J10663j166752
32423A5171659k266282j177228O47253N34630q61335n84629J565128K420456K46854
32414A5696506k818384l929491k704969m05315J863571L144672K697106J109378
32406A4653074l8344k38359l80343p39062m71150L78416L65016r58373j893609
32397A0677266r10406J295615K933431L031391J638046m42456j631975r47200
32389A5643712J81765n85122k725380l079315p62803J019672j78541k153350j548127
$$ y = [2143572, 5830892, 9992869, 12321772, 12831485, 12968332, 13318721, 13310386, 12576455, 11516911, 10844447, 11390180, 13828995, 17637729, 20815584, 21703774, 20758720, 19632778, 19064309, 18765947, 18710141, 19014452, 18982105, 17902652, 16560867, 16227748, 16338411, 15171659, 12905377, 11728149, 12375402, 12910032, 12048697, 11464068, 13029196, 15449652, 15696506, 12878122, 8948631, 6243662, 5838347, 7701918, 10846590, 13543696, 14653074, 14614730, 14376371, 13996028, 13256966, 12785816, 13164232, 13529248, 12570875, 10677266, 9766860, 11062475, 13995906, 17027297, 18665343, 18222887, 16590912, 15643712, 15825477, 15240355, 12514975, 9435660, 8672857, 9692529, 9513988, 7360638, 5812511]
32380E812511J013020K364420J793981J258992J432803Q89186p86264k023541
32372A1755108j874935j194379o70897J79589J386460J794104Q37164m20003q27795
32363A0964416n78090m39721n62646n94067k32728N73219J283111Q23864r35355
32354A0302003k125135r07215J521497J954629l51155k334342j327018J289927
$$ y = [5812511, 6825531, 9189951, 10983932, 12242924, 13675727, 14564913, 13778649, 11755108, 9880173, 8685794, 8014897, 8194486, 9580946, 11375050, 12212214, 11792211, 10964416, 10386326, 9946605, 9383959, 8789892, 8557164, 9130383, 10413494, 11237358, 10302003, 8176868, 7269653, 8791150, 10745779, 10394624, 8060282, 6733264, 8023191]
$$ [...]
##END NTUPLES=NMR SPECTRUM
##END=
