##TITLE=31Pdec_AT-44x_T
 DMSO_CD3ONa, 324 sc
 25.8.2022
##JCAMPDX= 6.0         $$ Bruker NMR JCAMP-DX V2.0
##DATA TYPE= NMR SPECTRUM
##DATA CLASS= NTUPLES
##ORIGIN= UXNMR, Bruker Analytische Messtechnik GmbH
##OWNER= root
$$ XWIN-NMR		Version 3.5
$$ Thu Aug 25 12:40:59 2022 Russian Standard Time (UT+4h)  she@DPX200
##.OBSERVE FREQUENCY= 81.013821
##.OBSERVE NUCLEUS= ^31P
##.ACQUISITION MODE= SIMULTANEOUS
##.ACQUISITION SCHEME= undefined
##.AVERAGES= 324
##.DIGITISER RES= 16
##SPECTROMETER/DATA SYSTEM= spect
##.PULSE SEQUENCE= zgpg30
##.SOLVENT NAME= DMSO
##.SHIFT REFERENCE= (INTERNAL, DMSO, 0, 248.564)
##AUDIT TRAIL= $$ (NUMBER, WHEN, WHO, WHERE, WHAT)
$$ ##TITLE= Audit trail, XWIN-NMR		Version 3.5
$$ ##JCAMPDX= 5.01
$$ ##ORIGIN= Bruker BioSpin GmbH
$$ ##OWNER= she
$$ F:/spectra/data/she/nmr/P31/1/pdata/1/auditp.txt
$$ ##AUDIT TRAIL=  $$ (NUMBER, WHEN, WHO, WHERE, WHAT)
(   1,<2022-08-25 12:39:29.34 +0400>,<she>,<DPX200>,
      <continue with go, POWCHK disabled, PULCHK disabled
       configuration hash MD5:
       00 E9 B6 7A A2 85 ED C7 34 08 36 98 17 FE 4E 26
       data hash MD5: 32K
       EB DC 72 F0 BE 59 EB 51 66 2E 78 EC 7F 82 79 6F>)
(   2,<2022-08-25 12:39:31.17 +0400>,<she>,<DPX200>,
      <Start of raw data processing
       efp BC_mod = 2 LB = 1 FT_mod = 6 PKNL = 1 PHC0 = -10285.04 PHC1 = 88.85633 SI = 64K 
       data hash MD5: 64K
       DC C6 7A 3F 12 F0 90 3B 15 65 86 03 31 A0 FC DD>)
(   3,<2022-08-25 12:39:46.50 +0400>,<she>,<DPX200>,
      <pk PHC0 = -0.3409117 PHC1 = 0 
       data hash MD5: 64K
       D0 2C 4E B9 97 8C 64 2E D0 3C 3D BB 5F 4F EA 99>)
$$ ##END=
$$ 
$$ hash MD5
$$ 0D AF D9 11 16 C7 98 5E 0C 75 41 65 44 C4 AD 82
##$RELAX= 
##$RELAX= 
##$RELAX= 
##$RELAX= 
##$RELAX= 
##$RELAX= 
##$RELAX= 
##$RELAX= 
$$ Bruker specific parameters
$$ --------------------------
##$DU= <F:/spectra>
##$EXPNO= 1
##$NAME= <P31>
##$PROCNO= 1
##$TYPE= <nmr>
##$USER= <she>
##$AMP= (0..31)
100 100 100 100 100 100 100 100 100 100 100 100 100 100 100 100 100 100 
100 100 100 100 100 100 100 100 100 100 100 100 100 100 
##$AQSEQ= 0
##$AQ_mod= 1
##$AUNM= <au_zg>
##$AUTOPOS= <>
##$BF1= 81.014009
##$BF2= 200.13
##$BF3= 200.13
##$BF4= 200.13
##$BF5= 200.13
##$BF6= 200.13
##$BF7= 200.13
##$BF8= 200.13
##$BYTORDA= 1
##$CFDGTYP= 0
##$CFRGTYP= 5
##$CHEMSTR= <none>
##$CNST= (0..31)
1 1 145 1 1 1 1 1 1 1 1 1 1 1 1 1 1 1 1 1 1 1 1 1 1 1 1 1 1 1 1 1 
##$CPDPRG= <waltz16>
##$CPDPRG1= <>
##$CPDPRG2= <waltz16>
##$CPDPRG3= <>
##$CPDPRG4= <mlev>
##$CPDPRG5= <mlev>
##$CPDPRG6= <mlev>
##$CPDPRG7= <mlev>
##$CPDPRG8= <mlev>
##$CPDPRGB= <>
##$CPDPRGT= <>
##$D= (0..31)
0 1 0 0 0 0 0 0 0 0 0 0.03 2e-05 3e-06 0 0 0 0 0 0 0 0 0 0 0 0 0 0 0 0 
0 0 
##$DATE= 1661416299
##$DBL= (0..7)
120 120 120 11 120 120 24 19 
##$DBP= (0..7)
150 150 150 150 150 150 150 150 
##$DBP07= 0
##$DBPNAM0= <>
##$DBPNAM1= <>
##$DBPNAM2= <>
##$DBPNAM3= <>
##$DBPNAM4= <>
##$DBPNAM5= <>
##$DBPNAM6= <>
##$DBPNAM7= <>
##$DBPOAL= (0..7)
0.5 0.5 0.5 0.5 0.5 0.5 0.5 0.5 
##$DBPOFFS= (0..7)
$$ [...]
##$SUBNAM2= <"">
##$SUBNAM3= <"">
##$SUBNAM4= <"">
##$SUBNAM5= <"">
##$SUBNAM6= <"">
##$SUBNAM7= <"">
##$SUBNAM8= <"">
##$SUBNAM9= <"">
##$SW= 501.771253377433
##$SWIBOX= (0..15)
0 1 3 0 0 0 0 0 0 0 0 0 0 0 0 0 
##$SW_h= 40650.406504065
##$TD= 32768
##$TD0= 1
##$TE= 0
##$TE2= 300
##$TE3= 300
##$TEG= 300
##$TL= (0..7)
0 120 53 12 22 120 120 120 
##$TP= (0..7)
150 150 150 150 150 150 150 150 
##$TP07= 0
##$TPNAME0= <>
##$TPNAME1= <>
##$TPNAME2= <>
##$TPNAME3= <>
##$TPNAME4= <>
##$TPNAME5= <>
##$TPNAME6= <>
##$TPNAME7= <>
##$TPOAL= (0..7)
0.5 0.5 0.5 0.5 0.5 0.5 0.5 0.5 
##$TPOFFS= (0..7)
0 0 0 0 0 0 0 0 
##$TUNHIN= 0
##$TUNHOUT= 0
##$TUNXOUT= 0
##$USERA1= <user>
##$USERA2= <user>
##$USERA3= <user>
##$USERA4= <user>
##$USERA5= <user>
##$V9= 5
##$VALIST= <valist>
##$VCLIST= <CCCCCCCCCCCCCCC>
##$VD= 0
##$VDLIST= <DDDDDDDDDDDDDDD>
##$VPLIST= <PPPPPPPPPPPPPPP>
##$VTLIST= <TTTTTTTTTTTTTTT>
##$WBST= 1024
##$WBSW= 4
##$XGAIN= (0..3)
0 0 0 0 
##$XL= 0
##$YL= 0
##$YMAX_a= 60658
##$YMIN_a= -40540
##$ZGOPTNS= <>
##$ZL1= 120
##$ZL2= 120
##$ZL3= 120
##$ZL4= 120
##$ABSF1= 0
##$ABSF2= 0
##$ABSG= 0
##$ABSL= 0
##$ALPHA= 0
##$AQORDER= 0
##$ASSFAC= 0
##$ASSFACI= 0
##$ASSFACX= 0
##$ASSWID= 0
##$AUNMP= <proc_1d>
##$AZFE= 0.1
##$AZFW= 0.5
##$BCFW= 0
##$BC_mod= 2
##$BYTORDP= 0
##$COROFFS= 0
##$CY= -3
##$DATMOD= 1
##$DC= 0
##$DFILT= <>
##$DTYPP= 0
##$F1P= 0
##$F2P= 0
##$FCOR= 1
##$FTSIZE= 65536
##$FT_mod= 6
##$GAMMA= 0
##$GB= 0
##$INTBC= 1
##$INTSCL= 5.30512e-09
##$ISEN= 30
##$LB= 1
##$LEV0= 0
##$LPBIN= 0
##$MAXI= 10000
##$MC2= 0
##$MEAN= 0
##$ME_mod= 0
##$MI= 50
##$NCOEF= 0
##$NC_proc= -6
##$NLEV= 6
##$NOISF1= 182.463
##$NOISF2= 159.3651
##$NSP= 0
##$NTH_PI= 0
##$NZP= 0
##$OFFSET= 248.5645
##$PC= 4
##$PHC0= -10285.38
##$PHC1= 88.85633
##$PH_mod= 1
##$PKNL= yes
##$PPARMOD= 0
##$PSCAL= 0
##$PSIGN= 0
##$REVERSE= no
##$SF= 81.0140089999908
##$SI= 65536
##$SIGF1= 159.3651
##$SIGF2= -187.1042
##$SINO= 113.3802
##$SIOLD= 16384
##$SREGLST= <1H.CDCl3>
##$SSB= 0
##$STSI= 65536
##$STSR= 0
##$SW_p= 40650.406504065
##$SYMM= 0
##$S_DEV= 0
##$TDeff= 32768
##$TDoff= 0
##$TI= <>
##$TILT= no
##$TM1= 0
##$TM2= 0
##$TOPLEV= 0
##$USERP1= <user>
##$USERP2= <user>
##$USERP3= <user>
##$USERP4= <user>
##$USERP5= <user>
##$WDW= 1
##$XDIM= 65536
##$YMAX_p= 424797277
##$YMIN_p= -67645761
$$ End of Bruker specific parameters
$$ ---------------------------------
##NTUPLES= NMR SPECTRUM
##VAR_NAME=  FREQUENCY,     SPECTRUM/REAL,   SPECTRUM/IMAG
##SYMBOL=    X,             R,               I
##VAR_TYPE=  INDEPENDENT,   DEPENDENT,       DEPENDENT
##VAR_FORM=  AFFN,          ASDF,            ASDF
##VAR_DIM=   65536,         65536,           65536
##UNITS=     HZ,            ARBITRARY UNITS, ARBITRARY UNITS
##FACTOR=    0.620285442955139, 1,           1
##FIRST=     20137.2065510736, 0,            0
##LAST=      -20513.1999529914, 0,           0
##MIN=       -20513.1999529914, -67645761,   0
##MAX=       20137.2065510736, 424797277,    0
$$ Real data points
##PAGE= N=1
##DATA TABLE= (X++(R..R)), XYDATA
$$ [...]
37491a635005J15916N78861L04581o04850L62490K724648K879984k65324l628886
37482H32415m491480l319969j616937q4262O19085J54919j18460J246858K759671
37473d018160J557208j883651l868180k738526o60297N07933J596591L196672
37465f310410L785705K477661P16781l53037j296628j722743K82619L921743M574141
37456F075832P4669n081115n533542k328649j85263M7450J012919K467480J349240
37447b100979j637133j610762K505491N060665J828995l438375m663349k146014
37439f201461p49390j619459j289966J367611K805100Q04340j739333j533743
37431h156301J55354M18651j42564R58992K933479K508093l84385j948610l85273
$$ plain form
37491 -1635005 -1519089 -940228 -635647 -1240497 -878007 1846641 4726625 4461301 832415
37482 832415 -3659065 -6979034 -8595971 -8680233 -8061148 -7906229 -8024689 -6777831 -4018160
37473 -4018160 -2460952 -4344603 -8212783 -10951309 -11611606 -11103673 -9507082 -6310410
37465 -6310410 -2524705 -47044 669737 316700 -979928 -2702671 -2420052 1501691 6075832
37456 6075832 6150501 1069386 -4464156 -6792805 -6978068 -6930618 -5917699 -3450219 -2100979
37447 -2100979 -3738112 -5348874 -2843383 2217282 4046277 607902 -4055447 -6201461
37439 -6201461 -6950851 -8570310 -9860276 -8492665 -5687565 -4883225 -6622558 -8156301
37431 -8156301 -8000947 -7582296 -7724860 -6765868 -3832389 -1324296 -1708681 -3657291 -4042564
37422d042564J513050J270818N36158J406767K272965R34143p10983M23865K563162
37413F167381J115421l395652m912297q60573L428059K307246k110429l479764
37405a740608l75654K455251J248664k188466l628449j662809J215756J709735
37397b966580o19800k709414j514221K066077M352409L889130K654717J768294
37389F920612l37201l586035m160997l03699L239624J393759l070310l185277
37381c089524J626726M765884K501492j217390j694420J0605K49201j483622k973738
37372a304786k842405j319260O39523J604325R15612J57496R96428J834489J84924
37363H66346k074119r07433K217604J358132l596075n020013M59294N553535L483308
$$ plain form
37422 -4042564 -2529514 -1258696 -722538 684229 2957194 3891337 3180354 3604219 6167381
37413 6167381 7282802 3887150 -1025147 -1885720 1542339 3849585 1739156 -1740608
37405 -1740608 -2116262 338989 1587653 -600813 -4229262 -5892071 -4676315 -2966580
37397 -2966580 -3586380 -6295794 -7810015 -5743938 -1391529 2497601 5152318 6920612
37389 6920612 6583411 2997376 -1163621 -1467320 1772304 3166063 95753 -3089524
37381 -3089524 -1462798 3303086 5804578 4587188 2892768 2903373 3152574 1668952 -1304786
37372 -1304786 -4147191 -5466451 -4826928 -3222603 -2306991 -2149495 -1153067 681422 866346
37363 866346 -1207773 -2115206 102398 1460530 -2135545 -7155558 -6696264 -1142729 2340579
37354B340579j366152j404385J433411J40494m224904m224252Q17818L703130
37346b784261J635436j85027J204135J983258m3750j157243N05379Q72368j997594
37337C2701l248318K32142L492724J651186j840240j620806L83474n09369k568058
37328c994564r39034L164782M521764K826754J747873R33919k778568p128902
37320a645976o055742l9153L430250J175144j644610q97997P41380L23511l40526
37311d953719O2925j118854m211311l965903J849000O507017L651851k261294
37303d440288k467444K614665M736527J035714k618721j911917J29570k13470
37295c135364j422718o56894J292757K297806K439876K211559L83735l174673
$$ plain form
37354 2340579 974427 -429958 1003453 1143947 -3080957 -7305209 -6487391 -2784261
37346 -2784261 -1148825 -1333852 -129717 1853541 1809791 652548 1157927 2030295 32701
37337 32701 -3215617 -2983475 509249 2160435 320195 -1300611 -917137 -1426506 -3994564
37328 -3994564 -4933598 -1768816 2752948 5579702 7327575 8261494 5482926 -1645976
37320 -1645976 -7701718 -7740871 -4310621 -3135477 -4780087 -5678084 -4936704 -4613193 -4953719
37311 -4953719 -4890794 -6009648 -10220959 -14186862 -12337862 -5830845 -2178994 -4440288
37303 -4440288 -6907732 -4293067 443460 1479174 -1139547 -3051464 -2921894 -3135364
37295 -3135364 -4558082 -5214976 -3922219 -1624413 815463 3027022 3410757 236084
37287B36084n214234l045260J015046K359176J89829j988125j444757P82864K079278
37278e030099J544647O03437J095959K840483L204042K33924l765835m052329
37270c325771J34353L627853K042845k034615k950651k95790J168409n03733j529760
37261c666860J079647M525685M563498J512186j442529l364689n006605m922767
37253f722434r47272M645433O192927K127151k504049k865906k34323J355874
37245A047401J125190P70673J14711k130148m302998l060258R10012K557049o56112
37236c624480m855937m862360p17535L331585M653030M283090L830595K980196
37228E018184P64311k120251l392562j655546J570015K990284J226152j459129
$$ plain form
37287 236084 -4978150 -8023410 -7008364 -4649188 -4459359 -6447484 -7892241 -7109377 -5030099
37278 -5030099 -3485452 -2882015 -1786056 1054427 4258469 4492393 726558 -3325771
37270 -3325771 -3191418 436435 2479280 444665 -2505986 -2801776 -1633367 -2137100 -3666860
37261 -3666860 -2587213 1938472 6501970 8014156 6571627 3206938 -1799667 -6722434
37253 -6722434 -7669706 -3024273 3168654 5295805 2791756 -74150 -308473 1047401
37245 1047401 2172591 2943264 3057975 927827 -3375171 -6435429 -5525417 -2968368 -3624480
37236 -3624480 -8480417 -13342777 -14060312 -10728727 -6075697 -1792607 2037988 5018184
37228 5018184 5782495 3662244 269682 -1385864 184151 3174435 4400587 2941458
37220B941458k213559j365046j140690j445540K4671L321149N301621M213262
37212I637326J975313M72607r32021k186914p35272L924583P398533O091458K657321
37203B8302934J321947R27349j736660m438735k522122J950212K106858k433692
37195B3478091m616898k069934j266217n669682q448544l538870L257095K709790
37187C834831l236995m708413P22674N311627L657399n61687j911023k33701J856432
37178D731144K830905J517165k445450n652025l515731K366976M796213J195985
37170E825182k419669r01076K397268K011512p56422j258130K8219r26122l828407
37161A72355m345489j484985J249708K012506K424875K877627J431635j477203
$$ plain form
37220 2941458 727899 -637147 -1777837 -3223377 -3198706 122443 5424064 9637326
37212 9637326 11612639 12085246 11153225 8966311 8231039 12155622 19554155 25645613 28302934
37203 28302934 29624881 30552230 28815570 24376835 21854713 23804925 25911783 23478091
37195 23478091 18861193 16791259 15525042 9855360 1406816 -2132054 1125041 3834831
37187 3834831 597836 -4110577 -3387903 1923724 5581123 5019436 3108413 2874712 4731144
37178 4731144 7562049 9079214 6633764 981739 -2533992 -167016 4629197 5825182
37170 5825182 3405513 2504437 4901705 6913217 6156795 4898665 4926884 4000762 172355
37161 172355 -4173134 -5658119 -4408411 -2395905 28970 2906597 4338232 2861029
37153B861029k264483J14354K116444J230726m57522n43194j48822p47070q34479
37144A326983Q95084K240323J098113l16167R55496K945201J437640k818345m632055
37135C132273k213807L15973n18972k703256k570977k15275J599563J773182J471240
37126F9944J561972J623302R87207n65429k540469l381419j582396J901622L825572
37117A899906K522310J04919p42427n19012j238833k402003j628701J081151K765404
37108A842714J689603m47400j400718j227473j000731o04487N38911J865005K449697
37099C705121K498264K560979K114526O30905n89855J99757J946567J272833k698460
37090A1640637n914294l871041K350901O985994O679450M122138L345378L937542
$$ plain form
37153 2861029 596546 710900 2827344 4058070 3600548 3057354 2908532 2161462 1326983
37144 1326983 2222067 4462390 5560503 5244336 6199832 9145033 10582673 7764328 3132273
37135 3132273 918466 1234439 715467 -1987789 -4558766 -4774041 -3174478 -1401296 69944
37126 69944 1631916 3255218 4242425 3676996 1136527 -2244892 -3827288 -1925666 1899906
37117 1899906 4422216 4527135 3784708 3265696 2026863 -375140 -2003841 -922690 1842714
37108 1842714 3532317 3084917 1684199 456726 -544005 -1148492 -609581 1255424 3705121
37099 3705121 6203385 8764364 10878890 11509795 10919940 11119697 13066264 14339097 11640637
37090 11640637 5726343 1855302 4206203 11192197 17871647 21993785 25339163 29276705
37082B9276705K813782K08064k37112K288053L686181J201407j898826j224302
37074C6113952J948299L065616J654138J180226K106348P96290l449124n860650
37066C7555095l648709j192520l388732p311354o075453M51318M587539J257518
37058B2234702n228270p041843k475461K958715L663357k05225l956131l861078
37050F088766o71813J987445J837902k05002j974053k397778j600602k22147N55756
37041C398474k24116j540338j039621J370279K527618M03777k502584k584858
37033a91369j62214J865229K830839M074209M819293K593288j939900m636811
37025I252564l499132j173261m96006q62404p81467r18738k189832l216529k229694
$$ plain form
37082 29276705 32090487 32298551 32061439 34349492 38035673 39237080 37338254 36113952
37074 36113952 38062251 41127867 42782005 43962231 46068579 46864869 43415745 37555095
37066 37555095 33906386 32713866 29325134 22013780 15938327 16389645 20977184 22234702
37058 22234702 17006432 9964589 7489128 10447843 14111200 13905975 9949844 6088766
37050 6088766 5416953 7404398 9242300 9037298 7063245 4665467 3064865 2842718 3398474
37041 3398474 3174358 1634020 594399 1964678 4492296 4896073 2393489 -191369
37033 -191369 -353583 1511646 4342485 8416694 13235987 15829275 13889375 9252564
37025 9252564 5753432 4580171 4084165 3221761 2440294 1521556 -668276 -3884805 -6114499
37016f114499J52542K214634L664529M773829M520045J998419j264334k678733
37008G266432j791388l18192M88863P74285P72594K87218m66265p25941j44117
36999F143489O25432K97531j919250m821436n279225j576497L349621M486411
36991A306076J216835j666942q09600J135702M11020j524827p56711J946514J842239
36982C100306k062922m889097k857501J598629L834444K944957J106478n42792
36974B232502k128445k555652l32309L154017M269015J956252n20038j15631J755620
36965G715331J697960m11972j630959r88622q19252k159395k420226J2287K106880
36956C102032Q38259r64583J557121O762952P766327K913221j121974P16476M468300
$$ plain form
37016 -6114499 -5961957 -3747323 -82794 4691035 9211080 11209499 9945165 7266432
37008 7266432 5475044 5156852 5645715 6420000 7192594 7479812 7013547 6287606 6143489
36999 6143489 6768921 7066452 5147202 325766 -4953459 -6529956 -3180335 1306076
36991 1306076 2522911 855969 46369 1182071 1593091 68264 -688447 1258067 3100306
36982 3100306 1037384 -3851713 -6709214 -5110585 -1276141 1668816 2775294 2232502
36974 2232502 104057 -2451595 -2783904 370113 4639128 6595380 6075342 5959711 7715331
36965 7715331 9413291 9001319 7370360 6381738 5562486 3403091 982865 995152 3102032
36956 3102032 3940291 2975708 4532829 11295781 19062108 21975329 20853355 21569831 26038131
36947B6038131L958852M04254m36336K145114L261005N17609l073887m536099
36939B8278643m323976l474330j826308l56769j222632l781188m236089j271012
36931G786339J365472L87794k002984j808280M36381Q50774j457891l244125k437564
36922a24084r70222r80347j138907Q27386L687784L829614O29120k201823j669543
36913A888978N24201R81057l34531q34742P312J68880p60056n67847J398483K428167
36903D899902O36618j887747k262484p36757O73674J187534Q36301n03975j548333
36894A294733P5652L536416M252450P68343j764510O51713L719778J520288l160780
36885A0894083k932861J767295L225573o25704l158347r17333O79638k315317
$$ plain form
36947 26038131 29996983 30401237 29964901 32110015 35371020 35888629 32814742 28278643
36939 28278643 23954667 20480337 18654029 18297260 17074628 13293440 9057351 7786339
36931 7786339 9151811 9539605 7536621 5728341 6164722 7015496 5557605 2313480 -124084
36922 -124084 -1094306 -2074653 -3213560 -2386174 1301610 5131224 5760344 3558521 1888978
36913 1888978 2413179 3394236 3059705 2224963 2232275 2401155 1641099 1073252 2471735 4899902
36903 4899902 5536520 3648773 1386289 649532 1323206 2510740 3347041 2843066 1294733
36894 1294733 1370385 4906801 9159251 9927594 8163084 8814797 12534575 14054863 10894083
36885 10894083 7961222 9728517 12954090 12328386 9170039 8252706 8932344 6617027
36877F617027m715254j139652L938940K687135l685678o723418k964936K513521
36869c472315M270486K364720k90160j660582q65363J605063L115887J178708
36861F246444k907041n063776l445042l47035J173089P08592L3911M84481J337762
36852a778615O40821j969032l641738j291071L638951N983505L461583l69848
36844D674556j514653r07524j632519l282695k742234N78365L666771L864855
36836B704922J503278j266704k540987j860265n03708j6999j8934J009868K466722
36827A477193J805311j058023k656471j000937J455078J941847J154362M74781
36819C593141r83523l403356l852605o71841K762492K622969J44265j384350k017161
$$ plain form
36877 6617027 1901773 762121 4701061 7388196 3702518 -3020900 -5985836 -3472315
36869 -3472315 798171 3162891 2872731 1212149 346786 1951849 5067736 6246444
36861 6246444 3339403 -1724373 -5169415 -5516450 -4343361 -3634769 -3600858 -3116377 -1778615
36852 -1778615 -1137794 -3106826 -6748564 -8039635 -4400684 1582821 5044404 4674556
36844 4674556 3159903 2252379 619860 -2662835 -5405069 -4826704 -1159933 2704922
36836 2704922 4208200 2941496 400509 -1459756 -1963464 -1980463 -1999397 -989529 1477193
36827 1477193 3282504 2224481 -431990 -1432927 22151 1963998 3118360 3593141
36819 3593141 2609618 -793738 -4646343 -5318184 -2555692 67277 211542 -1172808 -3189969
36810c189969l120969l145673n33269J997371J477934K32630J600626L059068
36802a622251M79235l201554j543986M275833O168800J200704m759622o331176
36794e334017m326932j134112K419537M189722J790970j788414o51973M201381
36786f33838M972899p14224n442726l314998J647531K735082j47171k893609l516652
36777g307706k059297Q57205K344672m56231m050277j386736O341327Q966778
36769C249735K457050m210483k934481J829685K528094Q16862J522937K354450
36761G613849j61115j574450K467940N515839J09886p141405m374847N238361
36753G694058P334554o74653o267142k894090J182969p20923l011029o5858L295028
$$ plain form
36810 -3189969 -6310938 -9456611 -9989880 -7992509 -6514575 -6281945 -4681319 -1622251
36802 -1622251 -1143016 -4344570 -5888556 -1612723 4556077 5756781 997159 -5334017
36794 -5334017 -9660949 -10795061 -8375524 -4185802 -2394832 -4183246 -4835219 -633838
36786 -633838 4339061 3624837 -1817889 -5132887 -3485356 -750274 -897445 -3791054 -7307706
36777 -7307706 -9367003 -8509798 -6165126 -6621357 -10671634 -12058370 -5717043 3249735
36769 3249735 5706785 1496302 -1438179 391506 2919600 3736462 5259399 7613849
36761 7613849 7452734 5878284 8346224 13862063 13971949 6830544 2455697 7694058
36753 7694058 15028612 14353959 8086817 5192727 6375696 5654773 2643744 2577886 5872914
36744E872914J566788j428304m99166J548632O17505k74084K423370M584668J392697
36735A5805020l218467k820189O26975R40251j250294p38287J880492J360462
36727A2585963k071137k664435Q30531L213330J817151J49486Q29420J307792
36719A5998101p81517l110593k514309J82401J898529J496784J08670j198686
36711A2079380k391542l615731m133471k541581R67585K941823M5205n145275
36703a793607n564825P42532O458261M337147k735581o089381l111818J086896
36695f670376K455896K214317K162332J540581q9870j294125j468041j537983
36687b687269j190271R43543L598569L224384p02792m100945l531037l56635J610212
$$ plain form
36744 5872914 7439702 6011398 5512232 7060864 7678369 7404285 9827655 14412323 15805020
36735 15805020 12586553 9766364 10393339 11333590 10083296 9345009 11225501 12585963
36727 12585963 10514826 7850391 8680922 11894252 13711403 13860889 14690309 15998101
36719 15998101 15216584 12105991 9591682 9774083 11672612 13169396 13278066 12079380
36711 12079380 9687838 6072107 1938636 -602945 364640 3306463 3351668 -1793607
36703 -1793607 -7358432 -6615900 -157639 4179508 1443927 -4645454 -7757272 -6670376
36695 -6670376 -4214480 -2000163 162169 1702750 1612880 318755 -1149286 -2687269
36687 -2687269 -3877540 -2933997 664572 3888956 3186164 -914781 -4445818 -4802453 -3192241
36678c192241N10199k263507l453172p38527M117470O078309L131624k93225K63695
36669D160625K120729J04396l891061l391857J253767K497993j943078m991810
36661d080296j987923J841009R65203j010177J367819M759992K309204m142129
36653B2702o049712j058996M246406M701213K467864J271211R75244L21117K66499
36644G163548J624210K454562M91587l461591o244189n499405j554707K820458
36636b205527M472043K736797L4640j156079q74964k90169M66185J415114J618506
36627F216546J060045J648447L931305M991418K514358j251399k864729k690811
36619A3555180k791820k391319j15344J595895j07521k532470j212086J764207
$$ plain form
36678 -3192241 -2682042 -4945549 -8398721 -9137248 -5019778 1058531 4190155 3896930 4160625
36669 4160625 6281354 6385750 2494689 -897168 356599 2854592 911514 -4080296
36661 -4080296 -6068219 -4227210 -3262007 -4272184 -2904365 1855627 4164831 22702
36653 22702 -6027010 -7086006 -2839600 1861613 4329477 5600688 6575932 6897049 7163548
36644 7163548 8787758 11242320 11733907 8272316 2028127 -3471278 -5025985 -2205527
36636 -2205527 2266516 5003313 5037953 3881874 3006910 2716741 3182926 4598040 6216546
36627 6216546 7276591 8925038 12856343 17847761 20362119 19110720 16245991 13555180
36619 13555180 10763360 8372041 8256697 9852592 9745071 7212601 6000515 7764722
36611G764722N64504l627538l105637L604760Q086805M644512j274736k242083
36603A4415309M56762J469455J005911K505459M569482K908378j527847l352263
36595B2450646j087761J227140P16244j177489k374625k544058j675553k01724
36587A5332820l10265l254561n955766m556550o36182J075668O25016K411048
36579D731228O354873O436683N74815m622435l303496Q81638R88341k492289l672569
36570E876789j471907n40412k444281l030561j64953K144873N25432j860258n14293
36561a479571K782581K613671j563563m636866l375299j63142J642998K000154
36553b179037K063662J249182r58733k613577j578384J082141K368304J165962
$$ plain form
36611 7764722 8329226 4701688 1596051 5200811 13287616 17932128 16657392 14415309
36603 14415309 14872071 16341526 17347437 19852896 24422378 27330756 25802909 22450646
36595 22450646 21362885 22590025 23306269 22128780 19754155 17210097 15534544 15332820
36587 15332820 15022555 11767994 5812228 1255678 619496 1695164 2320180 4731228
36579 4731228 11086101 17522784 18097599 13475164 10171668 11053306 12041647 9549358 5876789
36570 5876789 4404882 3864470 1420189 -1610372 -1775325 369548 894980 -965278 -1479571
36561 -1479571 1303010 3916681 2353118 -2283748 -5659047 -5822189 -4179191 -2179037
36553 -2179037 -115375 1133807 175074 -2438503 -4016887 -2934746 -566442 599520
36545E99520j059204k431208j847131P77834L617208L698065O73356j707224l90785
36536A930431K379737K395613j24820j380069k57932O47215Q5032l35728j25411
36527E214068q83649k366140k057871K5683O12663j123787j835863j31233M95912
36518b050217k041710l929980j357802L020639M157005K110250P65548J351604
36510B025337J867965J405361Q29173K72120n66449q72780l99331q11532k452007
36501A297857k374174Q69881L410586J437405k270897k263204J234972L265642
36493D608068J906674l19543j716864k741657k782738p45201J669217J942269
36485A820225J088774J450700J805179p7849k037733r12914P21373j454415m525195
$$ plain form
36545 599520 -459684 -2890892 -4738023 -3960189 -342981 3355084 4028440 2321216 1930431
36536 1930431 4310168 6705781 6580961 5200892 4942960 5590175 5675207 5339479 5214068
36527 5214068 4330419 1964279 -93592 -67909 544754 -579033 -2414896 -2546129 -2050217
36518 -2050217 -4091927 -8021907 -9379709 -6359070 -2202065 -91815 673733 2025337
36510 2025337 3893302 5298663 6127836 6399956 5833507 4960727 4561396 3749864 1297857
36501 1297857 -1076317 -206436 3204150 4641555 2370658 107454 1342426 4608068
36493 4608068 6514742 6195199 4478335 1736678 -1046060 -1791261 -122044 1820225
36485 1820225 2908999 4359699 6164878 6087029 4049296 3136382 3857755 2403340 -2121855
36476b121855k071463L846009M278910k066585o066648k585818K338197K722558
36468a726695J399232K144596K056667j440355l791890j059355K146428L72465
36460A01093k774794q33424M039471M549700M9864l539161l479203k165325q81811
36451d933590J171490K698992J741520K88974J393258L023513J027211l156717
36443C254651m314331j935379j70566r5302R74926K707865J597130j794856k533874
36434b309736M29884K445849J325545N95617K080222J821869k726417o904208
36426c241375n025876J249474N250118L819834j77846k490554j649956P92477
36418a473704K235992J534002J70549K06996J303675J399057O508j322884j626928
$$ plain form
36476 -2121855 -4193318 -347309 3931601 1865016 -4201632 -6787450 -4449253 -1726695
36468 -1726695 -327463 1817133 3873800 2433445 -1358445 -2417800 -271372 101093
36460 101093 -2673701 -3507125 532346 5082046 5131910 1592749 -1886454 -4051779 -4933590
36451 -4933590 -3762100 -1063108 678412 967386 2360644 5384157 6411368 3254651
36443 3254651 -1059680 -2995059 -3165625 -3260927 -2286001 421864 2018994 224138 -2309736
36434 -2309736 -1879852 565997 1891542 2487159 4567381 6389250 3662833 -3241375
36426 -3241375 -8267251 -7017777 -1767659 2052175 1874329 -616225 -2266181 -1473704
36418 -1473704 762288 2296290 2466839 2673835 3977510 5376567 5383075 4060191 2433263
36409B433263j319378n99920M76846P26691o59579j800095l80500K167985K208405
36400C253718m76236k257010j150729Q90946J751597J665559J112941m87410k833246
36391A470130m126595l278022p78794K376513M451899K988813j646827m368301
36383b911184j409694L288454L192026o28380j248149K467107L973909K96195
36375G020284l067243j724563Q38867N68318k12042J241088J643826k016931n108746
36366h17142k015932L725155M125691q88247m101738k813874j509515k266150
36358f561752r41674M280636P663044L866076l539095o505113k936365J816884
36350b857359K816298Q74961l52093M13799J380265Q92438l82399o42265N97240
$$ plain form
36409 2433263 1113885 513965 990811 1717502 1057923 -742172 -1122672 1045313 3253718
36400 3253718 2777482 520472 -630257 260689 2012286 3677845 4790786 4303376 1470130
36391 1470130 -2656465 -5934487 -6713281 -4336768 115131 3103944 1457117 -2911184
36383 -2911184 -4320878 -1032424 2159602 1531222 283073 2750180 6724089 7020284
36375 7020284 3953041 2228478 3067345 3635663 3423621 4664709 6308535 4291604 -817142
36366 -817142 -2833074 892081 5017772 4129525 27787 -2786087 -4295602 -6561752
36358 -6561752 -7503426 -3222790 4440254 8306330 4767235 -1737878 -4674243 -2857359
36350 -2857359 -41061 833900 481807 895606 2275871 3168309 2785910 2143645 2740885
36341B740885J896464J560891n23981k718817l130832j497773M25665R40902O95407
36332C88811J512102K834743J767614k139893m969533l691842o31992O42629J176568
36323c110793L728458O229409M180245j228541l943700k384940j217352k487604
36315b34818k241026J150235K546285j285995m799414j723989M567496N699313
36307C678087O01038l695180k613282P62182J563944n42859k311158j306773J772552
36298b091449L882424K711739m45532k027699q40696P71451R78456O67699M99866
36289D106259o34202k433753k235233M84464K394547J519774J81859J64756n06171
36280C042300k736767l184181P113K951146K061211j90632l74108j53688j756199
$$ plain form
36341 2740885 4637349 6198240 5674259 2955442 -175390 -1673163 -1247498 -306596 388811
36332 388811 1900913 4735656 6503270 4363377 -606156 -4297998 -4929990 -4287361 -3110793
36323 -3110793 617665 6847074 11027319 9798778 5855078 3470138 2252786 -234818
36315 -234818 -2475844 -1325609 1220676 -65319 -4864733 -6588722 -2021226 3678087
36307 3678087 4279125 583945 -2029337 -1267155 296789 -246070 -2557228 -3864001 -2091449
36298 -2091449 1790975 4502714 4057182 2029483 1188787 1960238 2938694 3606393 4106259
36289 4106259 3472057 1038304 -1196929 -712465 1682082 3201856 3383715 3548471 3042300
36280 3042300 305533 -2878648 -2871535 79611 2140822 1950190 1576082 1422394 -333805
36271c33805k337905O91413L402213J582687j159331N35737L722815K092773k439118
36262E757479k859941O30697J664816m68115o71301R58028q75847n157277m433461
36253e454922J922994N442480K440025o54175M71020J274825j242842j969660
36245B229745K124591M748443O47541m902287m599859j45683K628520L165630
36237E896641L366152J621645k716210m734316j501091J506538o68359l243400
36229d72400k91486L570693P31425n123687m302999K303416M523884j65159l575903
36220b802216j647950j50544k543339l362056J286151N896489M250650j046281
36212a19096l497452j821310R59248L023106L778698K226557p46894j863059l90947
$$ plain form
36271 -333805 -2671710 -1980297 1421916 3004603 1845272 2381009 6103824 8196597 5757479
36262 5757479 2897538 3528235 5193051 4724936 4053635 5011663 4135816 -1021461 -5454922
36253 -5454922 -3531928 1910552 4350577 3696402 4167422 5442247 4199405 2229745
36245 2229745 4354336 9102779 9750320 4848033 248174 102491 2731011 5896641
36237 5896641 9262793 10884438 8168228 3433912 1932821 3439359 2771000 -472400
36229 -472400 -763886 2806807 3538232 -1585455 -5888454 -3585038 938846 773687 -2802216
36220 -2802216 -4450166 -4600710 -7144049 -10506105 -9219954 -3323465 927185 -119096
36212 -119096 -3616548 -5437858 -4478610 -1455504 2323194 4549751 3802857 1939798 1548851
36203A548851J25348k075567l476472j135932K324236L355650K883253K906311
36195F455678J904673j405077l470801q36899L084761K316242k336534m468330
36187A243713j901366Q58775M30300r77012m89962R00693J049639K22187l89913
36178I47054r23382j545623j259014R2001O92366n10864j753276r82048J047010
36169d195776J994115J112838l81255j199380r48548o5492L21031m08801o99744
36160d471012J718915N653314O311689J590923l882981m265688l45777K064074
36152D373457O63854j016661j36265J444992J405647Q83379J368136J271059r06868
36143I350730k815727j676905O18717K55529j956458j590080K109977M857428
$$ plain form
36203 1548851 1674199 -401368 -3877840 -5013772 -2689536 666114 3549367 6455678
36195 6455678 8360351 6955274 3484473 2647574 5732335 8048577 5712043 1243713
36187 1243713 -657653 201122 631422 -345590 -835552 65141 1114780 1336967 947054
36178 947054 23672 -1521951 -2780965 -2688964 -1996598 -2507462 -4260738 -5242786 -4195776
36169 -4195776 -2201661 -1088823 -1470078 -2669458 -3618006 -3683498 -3362467 -3771268 -4471012
36160 -4471012 -2752097 2901217 9212906 10803829 6920848 2655160 2309383 4373457
36152 4373457 5037311 4020650 3884385 5329377 6735024 7618403 8986539 10257598 9350730
36143 9350730 6535003 4858098 5476815 5732344 3775886 2185806 4295783 9153211
36135I153211M027861K002596J097147l11220l664180o066786m295728m88159
36127A454742O19131j061819j047465K235436M432173J572820l742954n351428
36119h89364j401926L520757M281234J129797j408427n58308J552841J235519
36111G462123j624417l376049j407659K506423M445539K846113k77584j980187
36103H594302j205160P06639J378778n51992l882137n445933l176154J355688
36095b225969M293977L619390J124410j11663O16611J356910M14662j557385k514462
36086E016481j209469J770500M254591L592991r84987o181359o536064o47885
36078i25201N648108N222101j503958o905562n810109j104411J831129K300548
$$ plain form
36135 9153211 13181072 15183668 16280815 15969595 12305415 6238629 1942901 1454742
36127 1454742 2073873 1012054 -35411 2200025 6632198 8205018 4462064 -889364
36119 -889364 -2291290 1229467 5510701 6640498 5232071 4673763 6226604 7462123
36111 7462123 5837706 2461657 1053998 3560421 8005960 10852073 10574489 8594302
36103 8594302 7389142 8095781 9474559 8922567 5040430 -405503 -3581657 -2225969
36095 -2225969 2068008 5687398 6811808 6700145 7316756 8673666 9088328 7530943 5016481
36086 5016481 3807012 5577512 9832103 13425094 12440107 6258748 -277316 -925201
36078 -925201 4722907 9945008 8441050 1535488 -4274621 -5379032 -3547903 -1247355
36070a247355K683667K882822J032600j687388j747739J104717K972810J425875
36062G420009j314741k001426n11495R83599J053273J7381p90555j42609J711995
36053F425431K891981K191216P89191K07993q1329q90132r52347N44342R44621
36044A2070967k038730m921758k382689L787674N846164J092398m575571n932758
36036B945697m783349m084418k302985J744884M219781K242759p5841K023312
36028A929840N347534L587606j892263l829355n60823K037029O09264j134883
36020F093949l2979J013956j247968m265296l697662m21400R96891o17838j522007
36011c700354J238634N477589O508158K980433j316627j822788J500711M560020
$$ plain form
36070 -1247355 1436312 4319134 5351734 3664346 1916607 3021324 5994134 7420009
36062 7420009 6105268 4103842 3592347 4575946 5629219 5646600 4856045 4713436 6425431
36053 6425431 9317412 11508628 12297819 12505812 12424483 11534351 10582004 11126346 12070967
36044 12070967 10032237 5110479 2727790 6515464 12361628 13454026 8878455 2945697
36036 2945697 -1837652 -5922070 -8225055 -6480171 -2260390 -17631 -93472 1929840
36028 1929840 7277374 10864980 8972717 5143362 4582539 6619568 7228832 6093949
36020 6093949 6060970 7074926 5826958 1561662 -2136000 -2557400 -1560509 -2178347 -3700354
36011 -3700354 -2461720 3015869 9524027 12504460 11187833 9365045 10865756 15425776
36003A5425776M559019K863771J685510O18868j245010k021820O63927N027103
35995B7577144O339075K944106j826237m106994l350644j369751j1904m51561
35987B5743234k630971m563195l874487p11166K248731K958415J771358M7300
35979B0989219j280551j562808o57821K22800n75829k864975m489191l933462
35971E847382k015628o47778p14101j335737p67728J669323M222342M230890J585554
35962A2074519q12980r93421l58110o36259p38124P16411J779549l12015m070907
35953F648663m975569j589145K816080M741845L539719J90372l588771m823935
35945B959259j482545L878415N809940K513077j961437l093905r10096J479033
$$ plain form
36003 15425776 19984795 22848566 24534076 25152944 23907934 21886114 22550041 27577144
35995 27577144 33916219 36860325 35034088 30927094 27576450 26206699 26194795 25743234
35987 25743234 23112263 18549068 14674581 13963415 16212146 19170561 20941919 20989219
35979 20989219 19708668 18145860 17488039 17710839 17135010 14270035 9780844 5847382
35971 5847382 3831754 3183976 2469875 1134138 366410 2035733 6258075 10488965 12074519
35962 12074519 11261539 10268118 9910008 9273749 8535625 9252036 11031585 10719570 6648663
35953 6648663 1673094 83949 2900029 7641874 11181593 11371965 7783194 2959259
35945 2959259 1476714 5355129 11165069 13678146 11716709 8622804 7712708 9191741
35937I191741J900222M30709j263842r38823J931958M346573K707067j835915
35929A6469690l978181j470015J451049J23145l682283m173202M44001N572803
35921A0757007O052786K042608j992618k976314k289003k790500m241767l778775
35913G83424p55787J817655J955829J745112L191802M008415J425507k143775
35905A2028182k197433M96727J234551m29813j22370K891287L377904j072864
35897A6206171n029186l143849J725053L187576N60897j657725j132581M88334
35889A1204690J616505J976144P42381k217915l784230o62870M788188O132439
35881A9795332J479608l191310j602509M421189O972186J729811o830402j0603441
$$ plain form
35937 9191741 11091963 11522672 10258830 9320007 11251965 15598538 18305605 16469690
35929 16469690 12491509 11021494 12472543 12595688 8913405 4740203 5184204 10757007
35921 10757007 16809793 18852401 16859783 13883469 11594466 8803966 4562199 783424
35913 783424 27637 1845292 3801121 5546233 8738035 12746450 14171957 12028182
35905 12028182 9830749 10327476 11562027 11132214 11009844 13901131 17279035 16206171
35897 16206171 11176985 8033136 9758189 12945765 13506662 11848937 10716356 11204690
35889 11204690 12821195 14797339 15539720 13321805 9537575 8874705 13662893 19795332
35881 19795332 21274940 18083630 16481121 20902310 27874496 29604307 22773905 12170464
35873A2170464o890341p36804J724622L15738n24912J199922K567477Q58379k046908
35864H637637k510555l00812J622679J393310q9356j292593j682471j172214K75259
35855D880884K013347K798280J987898J18353j783822k916299k722223r09710
35847C466708J978277M150520L583803L45847k465704j628250K053763M299635
35839A5784599K875212L62550k04035K0838j697010m360226m352894j106850J991199
35830I313383K202383j15966l106787m270653q59713O407701J0984523P004388
35822B7559259k063288o862986m487671j059246j117420j874904o67247l81142
35814I045355k776449l373578Q57128M624446K283875k223945j545524K634757
$$ plain form
35873 12170464 5280123 4543319 6267941 6583679 6058767 7258689 9826166 10684545 8637637
35864 8637637 6127082 5826270 7448949 8842259 8752903 7460310 5777839 4605625 4880884
35855 4880884 6894231 9692511 11680409 11798762 10014940 7098641 4376418 3466708
35847 3466708 5444985 9595505 13179308 13525155 11059451 9431201 11484964 15784599
35839 15784599 18659811 19022361 18818326 18839164 17142154 12781928 8429034 7322184 9313383
35830 9313383 11515766 11399800 8293013 4022360 3162647 9570348 20554871 27559259
35822 27559259 25495971 18632985 14145314 13086068 11968648 10093744 9426497 9045355
35814 9045355 6268906 2895328 3752456 8376902 10660777 8436832 6891308 9526065
35806I526065K498926k312026l740567J310130N755268L513361j567521k456988
35798A2526648Q16840K816497J338247n85889k03468J344297J337312p14147k479368
35789A6196969j701525P61378J736018J05123j196522P03142L901649L802681
35781B4308913o30794n401840o327115l179786R59736K500062j78433m895564
35773G155179o740723l178799K519923N286409M546187L321538K336805k50991
35765A4995528l338671k763549J412279K906298j803924o888843m714489K781298
35757B585927O382488K604917j962944j030696K479347K029910k056076l618364
35749G414509p43116J545040j80092k363760q30532K248838K438189N68538M62006
$$ plain form
35806 9526065 12024991 9712965 5972398 7282528 13037796 16551157 14983636 12526648
35798 12526648 13343488 16159985 17498232 16912343 16708875 18053172 19390484 18676337 16196969
35789 16196969 14495444 15256822 16992840 17097963 15901441 16604583 20506232 24308913
35781 24308913 23678119 18276279 11949164 8769378 9729114 12229176 12050743 7155179
35773 7155179 414456 -2764343 -244420 5041989 9588176 12909714 15246519 14995528
35765 14995528 11656857 8893308 10305587 13211885 11407961 4519118 -195371 2585927
35757 2585927 8968415 11573332 9610388 8579692 11059039 13088949 11032873 7414509
35749 7414509 6671393 8216433 8036341 5672581 4842049 7090887 9529076 10097614 10559620
35740A0559620J368276p10969m812116n149955m60390L562545L295301K066957
35732I719269K862906K744892o96839l180360k00438M696304M804361M39411k486168
35723A8703338k077439j898317l615132m524348k708311M73855L358550N176084
35715A2888280M585100J250709j740942j414518J18383r59018l067373j504254
35707A0156367K716295L218604j450355m648563j419933M154256M888164k33513
35699A7381322o004333p413604l621316K189464N170876L048278j060138k152987
35691G537562L17848K484280K130862R60055O87143R28058J424038K378458K251893
35682B1100197n67245l715959l141800L82504K188961J344997J362229K706354
$$ plain form
35740 10559620 11927896 11216927 6404811 1254856 794466 4357011 7652312 9719269
35732 9719269 12582175 15327067 14630228 11449868 11249430 15945734 20750095 21189506 18703338
35723 18703338 16625899 14727582 11112450 6588102 3879791 4353646 7712196 12888280
35715 12888280 17473380 18724089 16983147 15568629 15687012 14727994 11660621 10156367
35707 10156367 12872662 16091266 14640911 9992348 8572415 12726671 17614835 17381322
35699 17381322 11376989 3963385 342069 2531533 7702409 10750687 9690549 7537562
35691 7537562 7855410 10339690 12470552 13430607 14117750 15045808 16469846 18848304 21100197
35682 21100197 20532952 16816993 13675193 14057697 16246658 17591655 18953884 21660238
35674B1660238J597987j979230k471534J981306N556531L992877J229210K293816
35666C3861201N768442Q198563R965191J1540396J0028172N344365L746290Q457062
35658I6909682J2649912R342764K558836n4009k44446m395785j0095929r551725
35650I7119300m316137l884835r390404j1351526o005662j686507m507609q818331
35642D7158289p994864m939864m491687l829664R45110N288283K717716l498373
35634C1354946m478739P78560M610630K528482j744914l294375j769739N63945
35626B8548796J596467j27372l608851m712605j411339J768332l89198n151110
35618A6513120n441887j062445J243785p64970j626130J459633L391856L77811
$$ plain form
35674 21660238 23258225 21278995 18807461 20788767 26345298 30338175 31567385 33861201
35666 33861201 39629643 47828206 57793397 69333793 79361965 84706330 88452620 96909682
35658 96909682 109559594 118902358 121461194 121407185 121162739 116766954 106671025 97119300
35650 97119300 92803163 88918328 79527924 68176398 62170736 60484229 55976620 47158289
35642 47158289 39163425 34223561 29731874 25902210 26847320 32135603 34853319 31354946
35634 31354946 26876207 27654767 32265397 34793879 33048965 29754590 27984851 28548796
35626 28548796 30145263 30017891 26409040 21696435 20285096 22053428 21664230 16513120
35618 16513120 11071233 10008788 11252573 10487603 8861473 10321106 13712962 14090773
35610A4090773l126569k165599M49211M6016j205198J088935M423446L040508
35602A6641523j874799l769217j158350J299500J479910J752282K314100N26145
35594A7211094k338427j691123J620177J431270k714672l581800J096630L275780
35586A4308929k232261p900691m852422K835796M645869l02922l624317j504138
35578A373843J517239J849856J179570J012143L78759j75457J218664L023706
35570A1378323J898755p24978j19104L242703L510954r52743m506902k814063
35562A0912945J482478L937411L790322K136732l54015j961092r19824P40750
35554A9765707n59444l090842j397878M141832O592042L401046K76042R55052
$$ plain form
35610 14090773 10964204 8798605 9247816 9293832 8088634 9177569 13601015 16641523
35602 16641523 14766724 10997507 9839157 11138657 12618567 14370849 16684949 17211094
35594 17211094 14872667 13181544 14801721 16232991 13518319 9936519 11033149 14308929
35586 14308929 12076668 4175977 -676445 2159351 6805220 6502298 2877981 1373843
35578 1373843 2891082 4740938 5920508 6932651 7311410 7135953 8354617 11378323
35570 11378323 13277078 12552100 12432996 15675699 19186653 18233910 13727008 10912945
35562 10912945 12395423 16332834 20123156 22259888 21905873 19944781 19024957 19765707
35554 19765707 19206263 16115421 14717543 18859375 25451417 28852463 29128505 30083557
35546C0083557J407417j071256j406851L905653Q511149N610314k27149P8583
35538D6891417N701149Q144259N367093L635123N767543P165044N051094L236074
35530I0958796M702410O243207M259091P97305k27302O44470k15026l739843p095896
35521I6327212p850739o884385o690819p890997q495485o897910m378405l036879
35513D4201593k331046o15381N17256k146622o911064p600509k647938J804476
35505B4270765J305255j67899K101802M669761J732813m253726n900683k509664
35497B1248424k2359l97188L12179K820238K318613k251779m556423o08937M187887
35488B3050655K836313k938732n571741k193797K768773M451527K692748O3834
$$ plain form
35546 30083557 31490974 30419718 29012867 32918520 41429669 47039983 46812834 46891417
35538 46891417 52592566 60736825 66103918 69739041 75506584 82671628 87722722 90958796
35530 90958796 95661206 101904413 106163504 106960809 106733507 107377977 107162951 103423108 96327212
35521 96327212 88476473 81592088 74901269 67010272 58514787 51616877 47238472 44201593
35513 44201593 41870547 41255166 41772422 39625800 32714736 25114227 22466289 24270765
35505 24270765 25576020 25408121 27509923 32179684 33912497 29658771 23758088 21248424
35497 21248424 21226065 20828877 21141056 23961294 26279907 24028128 19471705 18862768 23050655
35488 23050655 25886968 22948236 17376495 15182698 17951471 22402998 25095746 25159580
35480B5159580j973687l455985l982933k388625J040491L266118J462762k707894
35472A6419827m355256j834718R45841M69779j392120j214562L25418O01366K07985
35463A0173560J234353K313464O63045k070325j564539J791678K755684p57601
35455A4539319m400862l566791R37993M678489M258331j87219m658717m136783
35447G463760J376788N306227K742231k178557k492320M49684m68413n466943
35439F732457o637449p67277N222818M929796J032463q83376l64545O71349K642143
35430A2578379N016877L710020k477604p331625n191078K98626J717682q57453
35422G463824j010607L170144O370698M492266Q6k618115k415731j177747j08209
$$ plain form
35480 25159580 23185893 19729908 15746975 13358350 14398841 17664959 19127721 16419827
35472 16419827 12064571 10229853 11175694 11645473 10253353 9038791 9364209 9965575 10173560
35463 10173560 11407913 13721377 14384422 12314097 10749558 12541236 15296920 14539319
35455 14539319 10138457 6571666 7509659 12188148 16446479 16259260 11600543 7463760
35447 7463760 8840548 14146775 16889006 14710449 12218129 12667813 12199400 6732457
35439 6732457 95008 -672269 4550549 9480345 10512808 9629432 9264887 9936236 12578379
35430 12578379 17595256 21305276 18827672 11496047 6304969 6603595 8321277 7463824
35422 7463824 6453217 9623361 15994059 20486325 20486411 17868296 15452565 14274818 14166609
35413A4166609O11034N41530r07370l128150l897872j392242K736276L827924
35405A2557739K4252l739817j372691N238737P753181K911117l070169m039241
35397A6263108k096795k080987l009207r49632K920755L702350Q53539j150271
35389A4452860j33591J085326N9716j711005k014610j322876j226446j761411
35381G427963j897310j379120q70645p58842m41593J003503L200798M060875K170289
35372A2515918q92317k496145k642223k962550k645426M47009M319955L846817
35364I491038r36964l221542N14220M399549K083890l218246m065712m45681J496040
35355F096592L47674Q57154M309698N290838M43921n555393o123044j009173M397485
$$ plain form
35413 14166609 14777643 15319173 14411803 11283653 7385781 5993539 8729815 12557739
35405 12557739 12581991 8842174 7469483 12708220 20461401 23372518 20302349 16263108
35397 16263108 14166313 12085326 9076119 8126487 11047242 14749592 15603131 14452860
35389 14452860 14319269 15404595 15464311 13753306 11738696 10415820 9189374 7427963
35381 7427963 5530653 4151533 3280888 2522046 2080453 3083956 6284754 10345629 12515918
35372 12515918 11623601 9127456 6485233 3522683 877257 1324266 5644221 9491038
35364 9491038 8554074 5332532 5846752 10246301 12330191 9111945 5046233 4600552 6096592
35355 6096592 6444266 7301420 11611118 16901956 17345877 11790484 5667440 4658267 9055752
35346I055752N416975J851816k493908l068641O55983L661983J315123l722460
35338A2672623m533564M9929L552017J462493k489460k801465l57802M48495m98880
35329G504386K63851K616202K245792j917095m765348k222865K288513K522048
35321H535484j391229l087114N29240M590237L432919j175329k945598j83175
35313H305435K722974K523711R53651K78499m45020k279980l253981j380919J736637
35304I161007L302481L294856L292260L229329K118808M03083j006946k434212
35296B1360666l772230l104394K42463L227619K723260j58289k280326k893459
35288A5345310k628674o97649K746406L944957L49674l793924k459052K762439
$$ plain form
35346 9055752 14472727 16324543 13830635 10761994 11417977 15079960 16395083 12672623
35338 12672623 8139059 8188988 11741005 13203498 10714038 7912573 7554771 8003266 7504386
35329 7504386 7768237 10384439 12630231 10713136 5947788 3724923 6013436 8535484
35321 8535484 7144255 4057141 4586381 9176618 12609537 11434208 8488610 8305435
35313 8305435 11028409 13552120 14505771 14784270 14339250 12059270 8805289 7424370 9161007
35304 9161007 12463488 15758344 19050604 22279933 24398741 24801824 23794878 21360666
35296 21360666 17588436 14484042 14726505 17954124 20677384 20519095 18238769 15345310
35288 15345310 12716636 12018987 14765393 18710350 19060024 15266100 12807048 15569487
35280A5569487M623302J262039j548774o3761K476680K752253K606520L915058
35272C1592804M070872J064644j732907q81919Q89670q11879m229253m006055
35264B5955977J21550L077945K370570N58489o25371k870835o126441o182589
35256A6279295j067655M090747L380254r93765j531148L346837O704726L447770
35248C3657061k052278k617013J320046L368391J262104q55633k19074O05438
35240C4469042o92549k051325j390156m74173j020123j110781N75902R46043k266610
35231B6985270m877585j669718M869282P403836M209517P48006J134803L881514
35223D2684925O494828Q718826J0117967R305802O764886M252998J007516m696691
$$ plain form
35280 15569487 20192789 21454828 19906054 19842293 22318973 25071226 27677746 31592804
35272 31592804 35663676 36728320 34995413 34113494 35003164 34191285 29962032 25955977
35264 25955977 26077527 29155472 31526042 32084531 31459160 28588325 22461884 16279295
35256 16279295 15211640 19302387 22682641 21688876 20157728 23504565 30209291 33657061
35248 33657061 31604783 28987770 30307816 33676207 34938311 34082678 33863604 34469042
35240 34469042 33776493 31725168 30335012 29860839 28840716 27729935 28305837 29251880 26985270
35231 26985270 22107685 20437967 25307249 32711085 36920602 37668608 38803411 42684925
35223 42684925 49179753 57898579 68016546 77322348 84087234 88340232 89347748 84651057
35215H4651057r984388r297189l214913P62614j347775m721823m081010j448623
35207E1317950j044111j641507J27613K531879J266935k653273l791639p83665
35199D5330182J624799K5210k756214k328315Q23119K389638N30123j635016o29156
35190D3374370K006880J434508l165279o184815l090260K226775K055772m165421
35182C4492530q761685o389773m90223K834118K679585K090344K774170M454118
35174C3683184O573277P520942M820064r01224m769350l653923p45055p55583
35166D1772332l004190l220583m29758K171430K397704J403729R88028J484635
35158D3563327K400155L145901L294451L190966L352388K805038M00363j514063
$$ plain form
35215 84651057 74666669 65369480 62154567 62917181 61569406 56847583 52766573 51317950
35207 51317950 50273839 48632332 48759945 51291824 52558759 49905486 46113847 45330182
35199 45330182 46954981 46980191 44223977 41895662 42718781 45108419 45638542 44003526 43374370
35190 43374370 45381250 46815758 43650479 37465664 34375404 36602179 38657951 34492530
35182 34492530 25730845 19341072 18850849 21684967 24364552 26454896 29229066 33683184
35174 33683184 40256461 47777403 52597467 51696243 46926893 43272970 42527915 41772332
35166 41772332 38768142 35547559 35117801 37289231 39686935 41090664 42078692 43563327
35158 43563327 45963482 49109383 52403834 55594800 58947188 61752226 62152589 60638526
35150F0638526J388794Q174581J1354817O441664j357105m682790m329112n898692
35142G1730683r298512r264541n320349l185740n150620o334902l162406O66360
35134C0679973M19662k257592k533931K16745K495449K305713Q90545l38790j400646
35125C0477128k214745j887019k84077R94886K63755j837172k566943n74761J555356
35116B3926408K33776l631407m970968j629585K210211K206674J42962J74264
35108A8662335J703943J225401n71587L26691L662438M516989J502027o86761
35100C0341476J067080L613810L344111J783382K001231L643282N128720O957252
35092E7880344Q964836P986764K864063j331055O08378N804242O867399K735694
$$ plain form
35150 60638526 62027320 70201901 81556718 87998382 86641277 81958487 77629375 71730683
35142 71730683 62432171 53167630 47847281 44661541 39510921 33176019 30013613 30679973
35134 30679973 31099635 28842043 26308112 26524857 29020306 31326019 32216564 31877774 30477128
35125 30477128 28262383 26375364 26091287 27086173 27349928 25512756 22945813 22371052 23926408
35116 23926408 24160184 20528777 15557809 13928224 16138435 18345109 18488071 18662335
35108 18662335 20366278 21591679 21020092 21346783 25009221 29526210 31028237 30341476
35100 30341476 31408556 35022366 38366477 40149859 42151090 45794372 50923092 57880344
35092 57880344 66845180 74831944 77696007 76364952 76973330 82777572 89644971 92380665
35084I2380665O2542L283383Q804455J1074524R996458R241397J0092390J0453820
35076A55389634Q940467P105837P299218R779269J2490137J3288545J2174035
35069B26467142J1185457J1974263J3969368J5506596J6133831J6618387J6952797
35062C28807841J5875569J2796921R022528O345562N135290M409794L163529R09876
35054C86466910k661236p670468j3565649j9189687k3627034k6765671k8809078
35047B64178087k9475680k8151174k4895422k0821767j7178368j4415022j2452397
35040A16788257j1272113j0503133q919343n580861j571868N84829k37163k425486
35032G6863119l686393l488789k586097j092533J310505L460131K979126n46726
$$ plain form
35084 92380665 92443207 95726590 104531045 115605569 125602027 134843424 144935814 155389634
35076 155389634 164330101 171435938 178735156 188514425 201004562 214293107 226467142
35069 226467142 237652599 249626862 263596230 279102826 295236657 311855044 328807841
35062 328807841 344683410 357480331 366502859 372848421 377983711 382393505 385557034 386466910
35054 386466910 383805674 376135206 362569557 343379870 319752836 292987165 264178087
35047 264178087 234702407 206551233 181655811 160834044 143655676 129240654 116788257
35040 116788257 105516144 95013011 86093668 80512807 78940939 79525768 79288605 76863119
35032 76863119 73176726 69687937 67101840 66009307 67319812 70779943 73759069 73212343
35024G3212343l993138l916404q33412J464212R19195m35094O1099J870315K685444
35015G1034560K157417J681690J315029k9612j321758J98856M226809O302096
35007H5565087L798553L34140J110860N617304Q594748P684502O373520Q420678
34999A27499392J2304986J3341626J0116253O647426P562310J2207528J5248818
34992B04928339J3660657J1072504J2704220J7411451J9011625J5753986J3331153
34985C07873935J6145530K0520537K0685511J7386692J5148096J3952379R970214
34978D21682894L114383k527442n505228q263200j1529056j3636928j6047686
34971C67287737k2791119l2452890l7289836l3594660k7208786k4826882k5011524
$$ plain form
35024 73212343 69219205 65302801 64469389 65933601 66852796 66417702 66478801 68349116 71034560
35015 71034560 73191977 74873667 76188696 76159084 74837326 75036182 79262991 85565087
35007 85565087 89363640 89697780 90808640 96425944 105020692 112705194 119078714 127499392
34999 127499392 139804378 153146004 163262257 169909683 177471993 189679521 204928339
34992 204928339 218588996 229661500 242365720 259777171 278788796 294542782 307873935
34985 307873935 324019465 344540002 365225513 382612205 397760301 411712680 421682894
34978 421682894 424797277 422269835 416764607 408501407 396972351 383335423 367287737
34971 367287737 344496618 312043728 274753892 241159232 213950446 189123564 164112040
34964A64112040k2525919j7159447j2710338j0160740p420225m268730k636981
34957H7229660k656422k386854j067235M34250J744457K874928K861690J010323
34949I0044797j392566k729145l251198l785726l860060l023632k175292j714278
34941F8112900n83810J065854J157227l38700l85485J425829N56642n058695r748697
34932E6203065p778981k456153r80927l225495l208751K3038J211060j531112
34924C8255744l882044l254819k392479l135663l096875r10482R11179O91847
34916B3186408k837n07419k206328l838279j654039L511196N597076K505475n91947
34907B5999306m10455q06876m187718n109484O33461O754402M829107k285183
$$ plain form
34964 164112040 141586121 124426674 111716336 101555596 94135371 89866641 87229660
34957 87229660 84573238 82186384 81119149 81553399 83297856 86172784 89034474 90044797
34949 90044797 88652231 85923086 82671888 78886162 75026102 72002470 69827178 68112900
34941 68112900 67529090 68594944 69752171 69413471 69027986 70453815 71010457 65951762 56203065
34932 56203065 48424084 45967931 44987004 41761509 38552758 38575796 39786856 38255744
34924 38255744 34373700 31118881 28726402 25590739 22493864 21583382 22494561 23186408
34916 23186408 23183571 22676152 20469824 16631545 14977506 18488702 24085778 26591253 25999306
34907 25999306 25588851 24781975 20594257 15484773 16118234 22872636 27701743 25416560
34899B5416560m470031M04640M266060J614437l751389o090287m835884k183382
34891A0370724Q12553L134390L054940R84748J7718J789983M234418M665010K875438
34882C1939922M01853j206637r65255P56632K060531J993473K429399N112548
34874D2522466P995768P754857N089721L823319N091008O201197N232748K999966
34866H6711050K83921l064218n768883n585299k963955j154339k048826m575503
34858F1833948o979095p740692n253266m59025J565341k263970o634203m105341
34850B9963697K802135L861475l417149r501204p249435j784010o06262j917001
34842A2152246j47286L211866K811222o75496k136617p96321J13419K26122J380177
$$ plain form
34899 25416560 20946529 21351169 25617229 27231666 23480277 17389990 12554106 10370724
34891 10370724 11183277 14317667 17372607 18357355 18375073 20165056 24399474 29064484 31939922
34882 31939922 32341775 31135138 30169883 30926515 32987046 34980519 37409918 42522466
34874 42522466 50518234 58273091 63362812 67186131 72277139 78478336 83711084 86711050
34866 86711050 86994971 83930753 78161870 72576571 69612616 68458277 66409451 61833948
34858 61833948 54854853 47114161 41860895 41401870 42967211 40703241 34069038 29963697
34850 29963697 32765832 36627307 33210158 23708954 16459519 14675509 14069247 12152246
34842 12152246 12004960 15216826 18028048 17352552 15215935 14419614 14533033 14759155 16139332
34833A6139332K095983o2042k409262q55094J980463L91071l939232l977250M24205
34824I788174J936792j423270k775062J405511N059950L081869m97564m98823
34816A6077577P93917n70618k384099j237646L54341q65274j656490J822588N366885
34807A7701181K957845j770146m10027N554345N952665j407381o343602k254917
34799A9979963L514253J686853m302790m110583L518951R492330Q011165L470318
34791D1260460K178493L496792K721686j092659m405291m774457l435433k329274
34783C3620317j722725j711623l229018n570533n360296j106177K948599J722283
34775A9590827k725393l397253P59634K416581k666337p938156n464920J773955
$$ plain form
34833 16139332 18235315 18173273 15764011 14908917 16889380 17280451 13341219 9363969 9788174
34824 9788174 11724966 10301696 7526634 8932145 13992095 17073964 16576400 16077577
34816 16077577 16871494 16300876 13916777 12679131 13033472 12168198 10511708 12334296 17701181
34807 17701181 20659026 18888880 18478853 24033198 29985863 28578482 22234880 19979963
34799 19979963 23494216 25181069 20878279 16767696 20286647 29778977 37790142 41260460
34791 41260460 43438953 46935745 49657431 48564772 44159481 39385024 35949591 33620317
34783 33620317 31897592 30185969 26956951 21386418 16026122 14919945 17868544 19590827
34775 19590827 16865434 13468181 14227815 16644396 13978059 6039903 574983 2348938
34767B348938M502654J251638p81193J518151K662923r03941m039272j403961
34759E155937L492350L698786o62241l307838j227589K153125K652943k7378l373093
34750H555002m673523k559228J677737M399347L151593l94166k472138j505073
34742F179551R83774K707258K352266K0285k523645k936894q89671J417728K159627
34733I470279J743632R47349n77903k603733l466171k549588j348370o03240P70235
34724A782490K316277J377334j747774k322849J464895M144076J037380l504499
34716D547330k542628K114069K976146o09204j911107J206686K916149N9218k467351
34707F289308o59864J857205R30762o96528J179246M339701L810531p5036l056434
$$ plain form
34767 2348938 6851592 8103230 7322037 8840188 11503111 10599170 6559898 5155937
34759 5155937 8648287 12347073 11684832 8376994 7149405 9302530 11955473 11928095 8555002
34750 8555002 3881479 1322251 2999988 7399335 10550928 10156762 7684624 6179551
34742 6179551 7163325 9870583 12222849 12243134 9719489 6782595 5892924 7310652 9470279
34733 9470279 11213911 12161260 11583357 8979624 5513453 2963865 1615495 1012255 1782490
34724 1782490 4098767 5476101 3728327 1405478 2870373 7014449 8051829 4547330
34716 4547330 2004702 4118771 7094917 6485713 4574606 5781292 8697441 8756659 6289308
34707 6289308 5629444 7486649 8417411 7720883 8900129 13239830 17050361 16975325 13918891
34698A3918891l833838m186089m150865k306128K32378P26279p58106j515419
34690a872897k71482J849827L456113L355118M50766l975849n664144k235634
34682d908182K953531M888838L030047L15907j658172k794998k115793N62523
34674B73701K501973J799325J106106L022701M374232Q79809m613926n408809
34666C935112j307839J599943J120226J030652K326231R20554l468119m463576
34658A693184O83976N165423K348962m318891o901087l881894K61613K673911
34650b274803L519163K549402k10216k219373j441498K66257N74616P09630J912822
34641C386000J386773k779224n855501k363871M367378N903462J161855k445160
$$ plain form
34698 13918891 10085053 5898964 1748099 -558029 -325651 400628 -357478 -1872897
34690 -1872897 -2144379 -294552 3161561 6516679 6967445 2991596 -2672548 -4908182
34682 -4908182 -1954651 2934187 5964234 6280141 4621969 1826971 -288822 273701
34674 273701 2775674 4574999 5681105 8703806 13078038 13957847 9343921 3935112
34666 3935112 2627273 4227216 5347442 6378094 8704325 9624879 6156760 1693184
34658 1693184 2377160 7542583 9891545 5572654 -1328433 -5210327 -4948714 -2274803
34650 -2274803 1244360 3793762 3583546 1364173 -77325 188932 763548 1473178 3386000
34641 3386000 4772773 1993549 -3861952 -6225823 -1858445 4045017 5206872 2761712
34633B761712q91894J093386j103054m535199m023603K5907L349162M020830L129082
34624C826329J642449l3601r48443p38235p15421j884346l061410k568436o41849
34615e122963J133628J701818J007725j35953j84500J509306K971387J730728
34607D611176r85215j055994K481752N208270L043381k278545n675138m809442
34599E40245j602340R17650J379457O62500Q94305K790347L815281J298587k458482
34590H237550k024519K821820N212667Q50141m883875m446369O60157K595979
34582I023551o51102l017992o59403K612848K608685J271797J869497K534987
34574A5592868j11352l949260l801226K16295K421068J92072k245995p24492K437759
$$ plain form
34633 2761712 1869818 2963204 1860150 -2675049 -6698652 -6672745 -3323583 697247 3826329
34624 3826329 5468778 5435177 4486734 3748499 3033078 1148732 -1912678 -4481114 -5122963
34615 -5122963 -3989335 -2287517 -1279792 -1415745 -1600245 -90939 2880448 4611176
34607 4611176 3625961 2569967 5051719 10259989 13303370 11024825 5349687 540245
34599 540245 -1062095 -144445 1235012 1897512 2791817 5582164 9397445 10696032 8237550
34590 8237550 6213031 9034851 14247518 15097659 10213784 5767415 6427572 9023551
34582 9023551 8372449 5354457 4695054 7307902 9916587 11188384 13057881 15592868
34574 15592868 15481516 11532256 7731030 7947325 10368393 10560465 8314470 7589978 10027737
34565A0027737K415627m86060j666845J47042Q69869k069777m921804k864417
34557A451372K427825M610904J429351k540866k784379o30676R4932q64594q48642
34548B345227P13475J635249R09904l3259l47711j004184k080811j599979J253606
34539A791517L836420L069351l48312k607176j205616K584636N291749M413723
34531A6826292N90220k682515k328255O55084K076622L5518k265504j105612K070622
34522A3872472K699353J04365j431135N72844K747583R86821l228795n027479
34514A1296029l183865j154848j145256r12034J907930N072141M176027j055035
34506A5001089n596489m905004j99658L317759K733404K15401o92270L36057J205711
$$ plain form
34565 10027737 12443364 11957304 10290459 10437501 11307370 9237593 4315789 1451372
34557 1451372 3879197 8490101 9919452 7378586 4594207 3963531 4058463 3193869 2345227
34548 2345227 3058702 4693951 5603855 5570596 5222885 4218701 2137890 537911 1791517
34539 1791517 5627937 8697288 8348976 5741800 4536184 7120820 12412569 16826292
34531 16826292 17416512 14733997 12405742 13060826 15137448 15172966 12907462 11801850 13872472
34522 13872472 16571825 16676190 15245055 15817899 18565482 19552303 16323508 11296029
34514 11296029 8112164 6957316 5812060 4900026 6807956 11880097 16056124 15001089
34506 15001089 9404600 4499596 4299938 7617697 10351101 10566502 9874232 10210289 11416000
34497A1416000J516480K872042M800642L815178j305478o043183n372766r30122
34489A0768793J017045j646218m328361k753503J431608L934954L468653J744837
34481A3637808L14243j23953P85407J951664J063587j875263l304596j019017
34473A1429880J793047P74047k975412m414153j910173R92306J238247j39561
34465F788228r02372p55628l09714M61810J263609R55525o68174j958202j246192
34456C628890J301513L937225M579175K263813j394060l055386j604725N4217
34448I710662o51555j649094L07742L494680L293550k18565k126644n44287R85285
34439A2601774K68763k11412Q34130J91757l527259n586315k098601L007419L598390
$$ plain form
34497 11416000 12932480 15804522 20605164 24420342 23114864 17071681 11698915 10768793
34489 10768793 11785838 10139620 5811259 3057756 4489364 8424318 11892971 13637808
34481 13637808 13952051 13828098 14613505 16565169 17628756 15753493 12448897 11429880
34473 11429880 13222927 13996974 11021562 6607409 4697236 5689542 6927789 6788228
34465 6788228 5885856 5130228 4820514 5282324 6545933 7501458 6833284 4875082 3628890
34456 3628890 4930403 8867628 13446803 15710616 14316556 11261170 9656445 9710662
34448 9710662 9059107 7410013 7717755 11212435 14505985 14287420 12160776 11616489 12601774
34439 12601774 12870537 12659125 13493255 13685012 10157753 4571438 2472837 5480256 9078646
34430I078646O09649l17834J810749K716318O03229j600045j980601k165465l136415
34421E618231l193457j514006P0030L03368L62248J214241J895574J569035R09241
34412G234505N47532K69841K55310R47145J485686N90271r96979j477112j157255
34403G698944j653667k269786r28658J218614N84242k555279l402128k67048K033909
34394D59143l17865l635299k246618K671232M957439K382590j401516l035945
34386a66839k666679j028002J822396L977738K483856j569602k867163P66708
34378G52413M516133L348831n35071j317133J531112L103982J185046r56804q72277
34369A0756232p06257k111899k198118J308033M570897K666203k180195l410038
$$ plain form
34430 9078646 9688295 9370461 11181210 13897528 14500757 12900712 10920111 8754646 5618231
34421 5618231 2424774 910768 980798 1284166 1646414 2860655 4756229 6325264 7234505
34412 7234505 7782037 8051878 8307188 9254333 10740019 11330290 10333311 8856199 7698944
34403 7698944 6045277 3775491 2846833 4065447 4649689 2094410 -1307718 -1574766 459143
34394 459143 141278 -3494021 -5740639 -3069407 1888032 4270622 2869106 -166839
34386 -166839 -2833518 -3861520 -2039124 1938614 4422470 2852868 -14295 752413
34378 752413 5268546 8617377 8082306 6765173 8296285 11400267 12585313 11628509 10756232
34369 10756232 10049975 7938076 5739958 7047991 11618888 14285091 12104896 8694858
34361H694858l26822J122081j440729k733995J032304N117043L426662j729017
34353A3162385l206495J33565K513254M85596k804078l359977j377934J003181
34345F549497K956494L987455K866369k32870k691758k463752o19741M52092o3365
34336A0740421j389385k549119k726865j561156J1914M05724m92827j171030r26611
34327C41066p91499j367781j609215q08726j572p18L28061K065993L808639L341529
34317E305777J080601l18462K74769J162539Q22997K88252J139326K464717J911435
34308A4131951n70080k372550k247391k251987l953131m911194k022099K871588
34300a324893M561881J712922j354468j041895J121897K046277J422187L31726
$$ plain form
34361 8694858 8368036 9490117 8049388 5315393 6347697 11464740 14891402 13162385
34353 13162385 9955890 10089455 12602709 13088305 10284227 6924250 5546316 6549497
34345 6549497 9505991 13493446 16359815 16126945 13435187 10971435 10351694 10803786 10740421
34336 10740421 9351036 6801917 4075052 2513896 2525810 2931534 2438707 1267677 341066
34327 341066 -450433 -1818214 -3427429 -4236155 -4237727 -4238445 -3910384 -1844391 1964248 5305777
34317 5305777 6386378 6067916 6342685 7505224 8328221 8616473 9755799 12220516 14131951
34308 14131951 13561871 11189321 8941930 6689943 2736812 -2174382 -4196481 -1324893
34300 -1324893 3236988 4949910 3595442 2553547 3675444 5721721 7143908 7475634
34292G475634j089267k104188q54043J840548J808443j906252l761068L68213
34284A778020N700081M931237p07411l687911j826357r1020r64371r20156J796363
34275F008475L196231N92982k347441j528534J221156J723899j67146j624157
34267G075465j634979j212145o52664M69407J761355K467676K432986J567291
34259A2274392k35404k107626k854774k688552k386256j374544P16078J837242
34251C180556N69384j56538K571603N025335J378757n549235o289671J117127
34243A847318P498606O097430J240839q79963j580174l767779m551837j424687
34235D479753P62248k472812n983398k637131M137860N268266M90984k255816
$$ plain form
34292 7475634 6386367 4282179 3428136 5268684 7077127 5170875 1409807 1778020
34284 1778020 7478101 12409338 11701927 8014016 6187659 6096639 5132268 4212112 6008475
34275 6008475 9204706 9797688 7450247 5921713 7142869 8866768 8699622 7075465
34267 7075465 5440486 4228341 3575677 4045084 5806439 8274115 10707101 12274392
34259 12274392 12038988 9931362 7076588 4388036 2001780 627236 1343314 3180556
34251 3180556 3749940 3593402 6165005 11190340 12569097 7019862 730191 1847318
34243 1847318 9345924 15443354 16684193 15804230 14224056 10456277 5904440 4479753
34235 4479753 5242001 2769189 -3214209 -5851340 -1713480 3554786 4045770 1789954
34227A789954k85660J201787k45648r97932K13996j71307k458506j846913K374400
34218d25829L950282r7321l732809j271098L785954M801078J944822K18542J013613
34209A0187234J422634n440j861986l175662l974904l289481k82142K954070L090612
34200E064935K97287j580410l15791J640567Q60021j960967k884666m68039J991080
34191B644017J362796m94940O3438J958178Q24154k965761l631777M35298K724974
34182B920377j162185n192918j830101N107786N493486j153817m575177N55334
34174A62785P211641P348238K586087r97859k226237l440406m475728l715993
34166B452528k241483j990617j818621L86186L258738L457392O07169k351252
$$ plain form
34227 1789954 1504294 2706081 2460433 1462501 1676497 1505190 -953316 -2800229 -425829
34218 -425829 3524453 3427132 -305677 -1576775 2209179 7010257 8955079 9173621 10187234
34209 10187234 11609868 11604428 9742442 6566780 2591876 -697605 -979747 1974323 5064935
34200 5064935 5362222 3781812 3466021 5106588 5966609 4005642 1120976 652937 2644017
34191 2644017 4006813 3511873 3575311 5533489 6357643 3391882 -239895 195403 2920377
34182 2920377 1758192 -3434726 -5264827 -157041 5336445 4182628 -392549 162785
34174 162785 7374426 14722664 17308751 16310892 14084655 10644249 6168521 2452528
34166 2452528 211045 -1779572 -3598193 -3212007 46731 3504123 4111292 1760040
34158A760040l028533j518612O61601J828988J381896Q63406K098876L631909
34150G679571J902748k807354n319332k835087M71793l04728l235572k856266
34142g304227J121084L632980K173369j62101k61350O96653K85819j032866j206573
34133b057212j75288K06892p62758j497240l34071K164066L802532L309433J526214
34124F182568q6412j206442k184380k668653k024549p68875j65578l78980k56048
34115c557349R40299K538300L189259K006431m45399j802053k9588L089188K896109
34106H825197j646549n106039k715646K111987K363540k024552m284899j439019
34098c915980J784547J318017k87047N01416K018336J199483n34914J7408J961976
$$ plain form
34158 1760040 -1268493 -2787105 -2125504 -296516 1085380 1948786 4047662 7679571
34150 7679571 9582319 6774965 1455633 -1379454 -907661 -1212389 -4447961 -7304227
34142 -7304227 -6183143 -2550163 -376794 -538895 -800245 -103592 182227 -850639 -2057212
34133 -2057212 -2232500 -2025608 -2788366 -4285606 -4619677 -2455611 1346921 4656354 6182568
34124 6182568 6096156 4889714 2705334 36681 -1987868 -2756743 -2922321 -3301301 -3557349
34115 -3557349 -2617050 -78750 3110509 5116940 4671541 2869488 2839900 5929088 8825197
34106 8825197 7178648 2072609 -643037 1468950 3832490 1807938 -2476961 -3915980
34098 -3915980 -2131433 -813416 -1100463 -599047 1419289 2618772 2083858 2101266 4063242
34089D063242J767559r02383k801933j853882O90627K360764J737917n87478k057638
34080B416795o01071K032637J741413j961171m494381k556207J319933K961648
34072H59596K084094P40016n82088j886785j593016O57832J679457o91595l081086
34063a813575j243482K658493K710944j567839m060323p96162M566003N713534
34055F167593J328752l845148m270588O23169N366719L979820k645454o884006
34047a79143l564083L448600O510976L668667o48718k519120k013103p27082K44887
34038D221881Q8014r55808j130897O625j01965k761829m283393q90348M465974
34029a341746N531010J901138j119417j385686j994414l709929k490651K644171
$$ plain form
34089 4063242 5830801 4928418 2126485 272603 963230 3323994 5061911 4474433 2416795
34080 2416795 1815724 3848361 5589774 3628603 -865778 -3421985 -2102052 859596
34072 859596 2943690 3683706 3101618 1214833 -378183 279649 1959106 1267511 -1813575
34063 -1813575 -3057057 -398564 2312380 744541 -3315782 -4111944 454059 6167593
34055 6167593 7496345 3651197 -619391 3778 5370497 9350317 6704863 -179143
34047 -179143 -3743226 -294626 6216350 9885017 9236299 6717179 4704076 3976994 4221881
34038 4221881 4309895 3354087 2223190 2229815 2127850 -633979 -4917372 -5807720 -1341746
34029 -1341746 4189264 6090402 4970985 3585299 1590885 -2119044 -4609695 -1965524
34021a965524N817816K740590k224688k576202P35047J967434J08004o08809J243992
34012E237660J994427m04928k759415k086558m52345j041820k451929j108847
34004c073755K158077K729096l11223k003132R89696M745741L761681n67851k161494
33995F266836L43828K089920L17818j601286n53290J164570M69680j097482p51527
33986F649067K45967p08622k257499j400529P55540N59011j961212l213347j858564
33977c190188n3331Q89084J836111K773991K339527O63208p23679j682939k823358
33968B8426k767899j14185K492416J054498k932786l496497R72953N008485M098069
33959D343480O98083o07938k7271r48225l777419n117091k614809J851496M369267
$$ plain form
34021 -1965524 3852292 6592882 4368194 1791992 2527039 4494473 4602477 3993668 5237660
34012 5237660 7232087 6827159 4067744 1981186 1528841 487021 -1964908 -3073755
34004 -3073755 -915678 1813418 1502195 -500937 488759 5234500 8996181 8428330 6266836
33995 6266836 6610664 8700584 9018402 7417116 6863826 8028396 8498076 7400594 6649067
33986 6649067 6895034 6186412 3928913 2528384 3283924 3842935 1881723 -1331624 -3190188
33977 -3190188 -3243519 -2354435 -518324 2255667 4595194 5258402 4534723 2851784 28426
33968 28426 -2739473 -2853658 -361242 693256 -2239530 -5736027 -4763074 245411 4343480
33959 4343480 5041563 4433625 4406354 3458129 -319290 -5436381 -8051190 -6199694 -1830427
33950a830427L522981J985931K856779M920217M036499j19008k461950p9960K648903
33941A5479965O68660l733786n004361l284169k704969l118416j097967K138451
33933f56592J918208j097715j544437J020857J725544K25606J441924M885497
33925G918892L676753k559260m649702J140662N650056J343370n441976n348329
33917A730466o14003Q79021q14341m32701J570999J148632m67159K53777J128933
33908D383624j255504l169714J6953L423952m6051n620845k977677N367899O377878
33899F500515k339038q273512l950943K737755L244965P29946Q83344J451990
33891I85022r90905k825550k78083K736110J527195r95428l69081J010242q51457
$$ plain form
33950 -1830427 1692554 3678485 6535264 11455481 15491980 15372972 12911022 12831062 15479965
33941 15479965 16148625 12414839 7410478 4126309 1421340 -1697076 -2795043 -656592
33933 -656592 1261616 163901 -1380536 -359679 1365865 1591471 3033395 7918892
33925 7918892 11595645 9036385 4386683 5527345 11177401 12520771 7078795 1730466
33917 1730466 1116463 1995484 1181143 748442 2319441 3468073 3000914 3254691 4383624
33908 4383624 3128120 -41594 -24641 3399311 3353260 -2267585 -5245262 122637 6500515
33899 6500515 4161477 -4112035 -8062978 -5325223 -2080258 -1350312 -466968 985022
33891 985022 -5883 -2831433 -3109516 -373406 1153789 158361 -210720 799522 -51935
33882e1935l352188k170664M57464J06044j501812k23165K462641K907653K823387
33873A457425N129422O125551J059022n483249m847245J649978M346689N65123
33865A0002716k300611k17809J565293q19324k995696r65778J531916J6266k818491
33856B998482k189200O65212J310377n05707j591397q28465N16716J824192K740559
33847D940769J910863o93569k454742j934931j285022j999020j651468J491069
33839a676051M020030K198225j439559j492043J943388L546132P80211l188756
33831D691577m689384l542066j415859M32752J279221J298199J711256K577510
33823B343206J805179r65718j742561K271119O406362L658538m335271p993396
$$ plain form
33882 -51935 -3404123 -5574787 -5117323 -5011279 -6513091 -6736256 -4273615 -1365962 1457425
33873 1457425 6586847 12712398 13771420 8288171 3440926 5090904 9437593 10002716
33865 10002716 7702105 7484296 9049589 8230265 5234569 4268791 5800707 5816973 2998482
33856 2998482 809282 1474494 2784871 2279164 687767 -140698 376018 2200210 4940769
33847 4940769 6851632 6158063 3703321 1768390 483368 -1515652 -3167120 -1676051
33839 -1676051 2343979 4542204 3102645 1610602 3553990 7100122 7880333 4691577
33831 4691577 2193 -3539873 -4955732 -4522980 -3243759 -1945560 -234304 2343206
33823 2343206 4148385 3182667 1440106 3711225 10117587 13776125 9440854 1447458
33815A447458k940636L784791L875902j114434l374452j04287L980114M134168
33807I688624J083434j368513j260857J13594M53379p98789k074250k010148j264663
33798B561811r91885o32854Q12489K347273K506793K371168L532677L876742J88355
33789A6572569m962010m872380R51775M290442k80302o905909o658416R1880N504645
33780C732294N400003K191534j298169m227666m652286p41730M241278M173238
33772H818496j233176n232260l436487M92898J114385j130800j896872M09391
33764b094425L367408M317374K823711L75807q10950K17433J578240N98778k107424
33755H265952l033309j017060Q55635O0613j598747j149251J178874L080520L415375
$$ plain form
33815 1447458 -1493178 2291613 6167515 5053081 1678629 1574342 5554456 9688624
33807 9688624 10772058 9403545 8142688 8256282 8709661 7910872 5836622 3826474 2561811
33798 2561811 1569926 937072 1749561 4096834 6603627 8974795 12507472 16384214 16572569
33789 16572569 11610559 6738179 7689954 11980396 11700094 4794185 -1864231 -1772351 3732294
33780 3732294 9132297 11323831 10025662 5797996 1145710 403980 4645258 8818496
33772 8818496 7585320 2353060 -1083427 -590529 523856 -606944 -2503816 -2094425
33764 -2094425 1272983 5590357 8414068 8789875 7978925 8196358 9774598 10373376 8265952
33755 8265952 5232643 4215583 5071218 5131831 3533084 2383833 3562707 6643227 10058602
33746A0058602J964934j630877n832034o449015j623626M071291M560442L70911
33738E490628k418939r72013J258904R96192j95650R6386P02833k06547j014667
33729C737127M03933J862977k08734l954842l472801K198744O434242L758763
33721A0759409k681432n656568l030330J271237L526935L491658K284993P30172
33713A0696074k46738l66463p91005j790261j051841K375626M380980R40184m407946
33704I738610m521454J75603J881374j919853m159869l5532M863633L864472l58983
33695I528001j679206r48568k359831l968236j009044M112316M418263l16393
33687G777302l548910k659906j145224l41053K185375N268470M066754r02711
$$ plain form
33746 10058602 12023536 10392659 4560625 -1888390 -3512016 559275 5119717 5490628
33738 5490628 3071689 2099676 3358580 4354772 4159122 4255508 4958341 4751794 3737127
33729 3737127 4141060 6004037 5795303 1840461 -1632340 566404 7000646 10759409
33721 10759409 8077977 2421409 -608921 662316 4189251 7680909 9965902 10696074
33713 10696074 10449336 10082873 9291868 7501607 6449766 8825392 13206372 14146556 9738610
33704 9738610 5217156 5392759 7274133 5354280 1194411 1158879 6022512 9886984 9528001
33695 9528001 7848795 6900227 4540396 572160 -436884 3675432 8093695 7777302
33687 7777302 4228392 1568486 423262 82209 2267584 7536054 11602808 10700097
33679A0700097l110577o43230Q59921j327975k174154J538734M924357L342886
33671A4110059q4801p90929k36252j316940j985325M30782L191984K328329q88141
33662A4758766k685488k396940j131146R93531K467122K79208l887037l457200
33654D940816K386080N005573n45816o311849l653144K496873K035889l367003
33646B987419l850608J555272M192895J118790j221350L74172J097984j504686
33638D749888k736661J84863L126448K791074J648547J647812N11202k047970
33630I875203j709745K642909N193164J900748k934185l552223r85110L80701
33622A0811462K645P3904O78214M52000m31405j173647j840478j853842m9523
$$ plain form
33679 10700097 7589520 6946290 7806211 6478236 4304082 5842816 10767173 14110059
33671 14110059 14025258 13234329 12998077 11681137 9695812 10126594 13318578 15646907 14758766
33662 14758766 12073278 9676338 8545192 9538723 12005845 12285053 8398016 4940816
33654 4940816 7326896 12332469 11786653 5474804 1821660 4318533 6354422 2987419
33646 2987419 -863189 692083 4884978 6003768 4782418 5156590 6254574 4749888
33638 4749888 2013227 2198090 5324538 8115612 9764159 11411971 11923173 9875203
33630 9875203 8165458 10808367 16001531 17902279 14968094 11415871 10430761 10811462
33622 10811462 10814107 10888011 11566225 12018225 11586820 10413173 8572695 6718853 6669330
33613F669330K241002K059905J48417N63110L282658L066115j480904l959783
33605A2589850L21736O429265O716983J354746l459590m369425k732727m16334
33597A6434504J413927J456750J72946J76778J627081P51546l516409n828157
33589A2688966k095499L375516M151027J341662N11481J894170R49974k831205
33581A9986092m822312k856657Q8299J171309P69345J61334J80510J593189L250949
33572A9522058J736886l064586n113311n45808M534998K163677m326479m681954
33564A0225481J822916N090191O79691l511940j001013L207707K481636l85610
33556A8609059J96773J956495m06056m605049m115554O96796L335625J550496
$$ plain form
33613 6669330 8910332 10970237 11118654 11681764 14964422 18030537 16549633 12589850
33605 12589850 12911586 19340851 26057834 27412580 23952990 19583565 16850838 16434504
33597 16434504 17848431 19305181 19478127 19654905 21281986 22033532 18517123 12688966
33589 12688966 10593467 13968983 18120010 19461672 19973153 21867323 22817297 19986092
33581 19986092 15163780 12307123 12395422 13566731 14336076 14497410 14677920 16271109 19522058
33572 19522058 21258944 18194358 13081047 12535239 17070237 19233914 14907435 10225481
33564 10225481 12048397 17138588 17818279 14306339 13305326 16513033 18994669 18609059
33556 18609059 18805832 20762327 20356271 15751222 11635668 12332464 15668089 17218585
33548A7218585q61389j738834k468591k483640N16941M149029K680054l393270
33540A3618885o246161k044617L282293L378872L84893m83519J26564j358695
33532A0658515l308199j053780M289049O249530K601832j592972j898161j06639
33524A5839175J96691r19135j552256j627589j682114p94539J266061K174112
33516A2900406L78578j687615q64059J920245L289917K465364J260707K11800
33508A9875343j469967k599076o94563L618071O373203N233455J826290j367244
33500C0795512l440409l830236j947436Q89846K110437J521433J379256K065197
33492B9543600J312463r51139j165805J973682M086802J071770m469753o598713
$$ plain form
33548 17218585 16357196 14618362 12149771 9666131 10183072 14332101 17012155 13618885
33540 13618885 7372724 5328107 8610400 11989272 12374165 11890646 12017210 10658515
33532 10658515 7350316 6296536 10585585 16835115 19436947 17843975 15945814 15839175
33524 15839175 16035866 15116731 13564475 11936886 10254772 9460233 10726294 12900406
33516 12900406 13278984 11591369 10727310 12647555 15937472 18402836 19663543 19875343
33508 19875343 18405376 15806300 15111737 18729808 25103011 30336466 32162756 30795512
33500 30795512 27355103 23524867 21577431 22467277 24577714 26099147 27478403 29543600
33492 29543600 30856063 29904924 28739119 30712801 34799603 35871373 31401620 24802907
33484B4802907l699769Q60841L898274M524706K633910q46186l116113k475305
33476B6583265j264086k375697l960601j849203L197651N362720J759632l512747
33468B3940934m887897j788962K071421L398882J785160p10033j339170N23470
33460B2993805K026501J33291l745272m959300j826571K225023L620296K863476
33452B3331249K288462K138557J014110j343841l592360m281352k869743k86980
33444A6398102J121849k02134k557044k738273o12049P06260q5183n43484Q62404
33435A2350448J796324M50823n58176J347838L097012M616n861706p211075k034528
33426C381576L091230K568050l58657N98808M747533N811129K032539j182007
$$ plain form
33484 24802907 21103138 21963979 25862253 30386959 33020869 32174683 29058570 26583265
33476 26583265 25319179 22943482 18982881 17133678 20331329 25694049 27453681 23940934
33468 23940934 19053037 17264075 19335496 22734378 24519538 23809505 22470335 22993805
33460 22993805 25020306 25153597 21408325 16449025 14622454 16847477 20467773 23331249
33452 23331249 25619711 27758268 28772378 27428537 23836177 19554825 16685082 16398102
33444 16398102 17519951 17317817 14760773 12022500 11410451 12116711 12031528 11488044 12350448
33435 12350448 14146772 14597595 14039419 15387257 18484269 18488885 12627179 5416104 3381576
33426 3381576 6472806 9040856 8682199 9281007 14028540 19839669 21872208 20690201
33418B0690201L0597K008024k39845m632915m868463j67526L334771J701641j387465
33409A6469020r70523J588013J572870j037358j714909R37602K859837J222220
33401B0926772j068481l54141J644809N98219l204503m697717j393208K809413
33393A5261163L018641J09789p94117K136884M642374K432914k393858l962108
33385B0451682q30434K118997J037096j368970o12387K150727K043637j345168
33377B3645180k991007m67758K119409P52298k224836k298148j63866o3361k191843
33368A6116068k059334J999066N369986L470799j728439m477426k758308R0318
33360A6022730P28655k17987l64103N58439Q74342j8753q58794p51971l79407
$$ plain form
33418 20690201 20720798 22728822 22488977 17856062 12987599 12820073 16154844 17856485 16469020
33409 16469020 15498497 17086510 18659380 17622022 15907113 16844715 19704552 20926772
33401 20926772 19858291 19504150 21148959 21747178 18542675 13844958 12451750 15261163
33393 15261163 18279804 18389593 17595476 19732360 24374734 26807648 24413790 20451682
33385 20451682 19621248 21740245 22777341 21408371 20795984 22946711 24990348 23645180
33377 23645180 20654173 20186415 22305824 23058122 20833286 18535138 18371272 18307911 16116068
33368 16116068 14056734 16055800 21425786 24896585 23168146 18690720 15932412 16022730
33360 16022730 16751385 16533398 16169295 16727734 17602076 17583323 16724529 15972558 15593151
33351A5593151l49642L717J006340J319140K9400j087834K01837K708337L023606
33342B2448052O99589r34867L034J234988O24168o3246J418719L307670K499945
33333C1238052j56910j426502j343424k568166m440488l074185J533242L961043
33325B3722662J488933j331660r5787K082355R2384l770854k999369J943038L473455
33316B4605157r88776m393620j038335M421591M451396K51761j061973J774706
33308B8021907K895060l68137l240911j782905P06004o24644m382667n346934
33300A5876773k192997J543442L059043K967881K642280K137420J229227J82893
33292B7445962r99823k392250l071217j938408K41555J326473O55652j32285L59967
$$ plain form
33351 15593151 15243509 15247226 16253566 17572706 17602106 16514272 16716109 19424446 22448052
33342 22448052 23147641 22212774 22215808 23450796 24074964 24011718 25430437 28738107 31238052
33333 31238052 31081142 29654640 28311216 25743050 21302562 18228377 19761619 23722662
33325 23722662 25211595 23879935 23784148 25866503 25958887 22188033 19188664 21131702 24605157
33316 24605157 23616381 19222761 18184426 22606017 27057413 27309174 26247201 28021907
33308 28021907 30916967 30548830 27307919 25525014 26231018 25606374 21223707 15876773
33300 15876773 13683776 15227218 18286261 21254142 23896422 26033842 27263069 27445962
33292 27445962 26446139 24053889 20982672 19044264 19285819 20612292 21267944 21135659 21495626
33283B1495626J320207J070504n59668k021547j841772j51632J536418K038084
33275B2886220J870526K440102L857947M473104K946981j19392k993908m214541
33267C1147039l070893l81019R56469j305209m618079l478088K656769O968386
33259B8875375M229210j354208k250982J196033K252153p25650j935922J654580
33251C1940589N290848M704341K674458K827917K754385q35440m697174l720501
33243D0939423j4706J03964l216018l465633J059299L884928O67174l786580l024221
33234C3147630J489770L448493J164963j452483j893853j732109k175760j570143
33226C0426508J089966L459111K816466j92952k676767l040751j785017J08600
$$ plain form
33283 21495626 22815833 23886337 23326669 21305122 19463350 19311718 20848136 22886220
33275 22886220 24756746 27196848 31054795 35527899 38474880 38355488 35361580 31147039
33267 31147039 28076146 27695127 28651596 27346387 22728308 19250220 21906989 28875375
33259 28875375 33104585 31750377 29499395 30695428 32947581 32221931 30286009 31940589
33251 31940589 37231437 41935778 44610236 47438153 50192538 49357098 44659924 40939423
33243 40939423 40924717 41028681 37812663 34347030 35406329 39291257 39958431 36171851 33147630
33234 33147630 34637400 38085893 39250856 37798373 35904520 34172411 31996651 30426508
33226 30426508 31516474 34975585 37792051 37599099 34922332 31881581 30096564 30205164
33218C0205164J795794K307030J480604P81326J451573K166120O00748k614995
33210C8173364l964229j897145P71779Q88823p14243j138137o0408L26110o78199
33201C1707715j126153N67877L617504O085264O362075L543895j648053o241072
33193D2869052p307897n153340k558637j087436j74457N38232O57575P87281J899903
33184C0470276K799972J417751j032611r58913J631364K288722q22648l234229
33176C2559684n86373M760245P194878N356271K404949O59329l64335j609155
33168E0375493l167885m550315m309030r65593L905072N907168L345233k50324
33160E0289819j530118j739742k594165k038769J153640K714449r30001n113729
$$ plain form
33218 30205164 32000958 34307988 35788592 36569918 38021491 40187611 40788359 38173364
33210 38173364 34209135 32311990 33083769 33972592 33258349 32120212 32059804 32385914 31707715
33201 31707715 30581562 31149439 34766943 40852207 47214282 50758177 49110124 42869052
33193 42869052 35561155 30407815 27849178 26761742 26587285 27125517 27783092 28570373 30470276
33184 30470276 33270248 34687999 33655388 32696475 34327839 36616561 35793913 32559684
33176 32559684 31973311 36733556 43928434 49284705 51689654 52348983 51984648 50375493
33168 50375493 47207608 42657293 38348263 37382670 41287742 47194910 50540143 50289819
33160 50289819 48759701 47019959 44425794 42387025 43540665 46255114 45325113 40211384
33152D0211384k914553L564500N961005K562525j73971R01460J671382j62315
33144E1621417j032073M33594j16722l976406n102583m2675N044060L641696j043339
33135D9426969k260647o84803j452431m167871l963322l16052K527575K543930
33127D1653348J001300j798686n510016o266245j158051N014947M704686j168547
33119C6472736m276894j267848K448532K287190K99753p16948j830738l614202
33111B9801581l352408r2842K723102K802283K135384J809335n41797m564453
33103C0720185m691816J114424N813078K825115l559638m660864p48029N52329
33095B7364784k488197l200192J675924O160331M560202K25912k42732K863205
$$ plain form
33152 40211384 37296831 40861331 46822336 49384861 49210890 50112350 51783732 51621417
33144 51621417 50589344 51022938 50906216 46929810 41827227 41784552 46828612 50470308 49426969
33135 49426969 47166322 46481519 45029088 40861217 36897895 36581843 39109418 41653348
33127 41653348 42654648 40855962 35345946 29079701 27921650 32936597 37641283 36472736
33119 36472736 32195842 30927994 33376526 35663716 35963469 35246521 33415783 29801581
33111 29801581 26449173 26356331 29079433 31881716 34017100 35826435 35284638 30720185
33103 30720185 26028369 27142793 32955871 35780986 32221348 27560484 26812455 27364784
33095 27364784 24876587 21676395 23352319 29512650 34072852 34298764 34056032 36919237
33087C6919237L739015N00426k426473j571831O70981M90308j244358p26016K260436
33078C8611725L526365R96291j645798m20731K700835L007087P06837K09489K060820
33069D9752920J610436k588369n065363j822202K654360J926986k559713m164515
33061C9744540j352696R80080j30468j941454j324483R61514K597681K663644
33053D2198358J268028q39302j887290r95325m8948o84091o93556K351253N302750
33044D5971877L043534k561243m150550k71638K066907j150831m397046k051567
33036C6499443K301983K323023n41377l80465K585827K551072j890327n473419
33028C7975760m433395j087545Q23548O49312m83832j590696j395083P25010K735753
$$ plain form
33087 36919237 40658252 41158678 38732205 37160374 37831355 38321663 37077305 36351289 38611725
33078 38611725 42138090 43134381 41488583 41067852 43768687 46775774 47482611 47692100 49752920
33069 49752920 51363356 48774987 43709624 41887422 44541782 46468768 43909055 39744540
33061 39744540 38391844 39371924 39241456 37300002 35975519 36937033 39534714 42198358
33053 42198358 43466386 42627084 40739794 39744469 39695521 39011430 38317874 40669127 45971877
33044 45971877 49015411 46454168 42303618 42031980 44098887 42948056 38551010 36499443
33036 36499443 38801426 41124449 40583072 40202607 42788434 45339506 43449179 37975760
33028 37975760 33542365 32454820 33278368 33927680 33443848 31853152 30458069 31183079 33918832
33019C3918832K032644k50584n20252J406188J714049j136783l622777k597749
33011C0943568n7438K24619j571611j887989R45133M439742N037568K236349q70530
33002C9439411j201348O09455J407139M60233N04321K390880K258537k317001
32994D3551627o480706l969921K858319N463122J506082k234319q48231J970760
32986D1816733J499466l38968J05241J004922j070919l901330k867160Q24570
32978C7072555J782313o84369j672672J095957L934824L270844K20681k488499
32970D2531634l985903l877585j290820K386736L104774p07286m975448m805005
32962B8381097p85177K360683K284788J084988J031612J355195O08610l9713J634761
$$ plain form
33019 33918832 35951476 35700892 35180640 36586828 38300877 37164094 33541317 30943568
33011 30943568 30886130 31110749 29539138 27651149 28596282 33036024 38073592 40309941 39439411
33002 39439411 38238063 38847518 40254657 40714890 41219211 43610091 45868628 43551627
32994 43551627 37070921 33101000 35959319 41422441 42928523 40694204 39845973 41816733
32986 41816733 43316199 42977231 43082472 44087394 43016475 39115145 36247985 37072555
32978 37072555 38854868 38170499 36497827 37593784 41528608 44799452 45020133 42531634
32970 42531634 38545731 34668146 33377326 35764062 38868836 38161550 33186102 28381097
32962 28381097 27595920 29956603 32241391 33326379 34357991 35713186 36321796 36282083 37916844
32953C7916844M754448N550711K624902n06053l40901J076139q45388n443396
32945D4787306o635915j772912L861751M261669O60884j617446j290153j167001
32937D1088183j831213q18177J968496L203783J602738Q183L65853N48297j511119
32928D4625024l745788k901207M19851K341664N29005l270407n055373k410521
32920C0532248K611586M715225J287173l393239k872605K531007N565879K158014
32912D3135288k721243k304918K539385N368941L339861l30094k136085k050417
32904D4840718j270876p4047R69594N64844j073172j578554N70826L735690M938485
32895E1623508L202018K94632j355417j038220k22845n43397j372181n01712K194235
$$ plain form
32953 37916844 42671292 48222003 50846905 50340852 49999951 51076090 50230702 44787306
32945 44787306 38151391 36378479 40240230 44501899 45162783 43545337 42255184 41088183
32937 41088183 39256970 38438793 40407289 43611072 45213810 45221993 45587846 46136143 44625024
32928 44625024 40879236 37978029 38397880 40739544 41268549 37998142 32942769 30532248
32920 30532248 33143834 37859059 39146232 35752993 32880388 35411395 40977274 43135288
32912 43135288 40414045 38109127 40648512 46017453 49357314 49027220 46891135 44840718
32904 44840718 43569842 43495795 44465389 45030233 43957061 42378507 42949333 46685023 51623508
32895 51623508 54825526 55120158 53764741 52726521 52503676 51960279 50588098 50086386 52280621
32886E2280621L588417J652926n73728J496814O903632R288212N453452M63152
32878H0553498J329391P574514J1857320R918647O063647O654601J0844102J1635189
32870A46430909N782329j606383m348113l576862m910702r159147j1154040q252626
32862A09205365m668471m844550o955543o800172m764095m215247n182776m804887
32854F6969624l012253k478983l072371j788984J003440Q94590k920208m708652
32846E0886203m69139N280117N565029P73648k583079j278062J366239J252769
32838F0793725j702752n014262o511375n112566j333243K343176L512917K383545
32830D9359165P18599q27513k095370j563443J475264L899087K185902j498711
$$ plain form
32886 52280621 55869038 57521964 56948236 58445050 65348682 74636894 80090346 80553498
32878 80553498 81882889 89457403 101314723 111233370 117297017 123951618 134795720 146430909
32870 146430909 152213238 150606855 146258742 142681880 137771178 128612031 117457991 109205365
32862 109205365 104536894 99692344 92736801 85936629 81172534 76957287 71774511 66969624
32854 66969624 63957371 61478388 58406017 56617033 57620473 58515063 55594855 50886203
32846 50886203 50417064 55697181 61262210 62035858 59452779 58174717 59540956 60793725
32838 60793725 59090973 54076711 47565336 42452770 41119527 43462703 46975620 49359165
32830 49359165 50077764 49250251 47154881 45591438 47066702 50965789 53151691 51652980
32822E1652980j549792K313668M122134J124171j860401q39738N74048j964215
32814E3572855m954678k445512L200198M089044n81813k983378J009621N671112
32806E6577449M838036J021476M54897L681909O267494O044480M788930M297798
32798H7972469M975196P245280J0654644J2306642R594229M079224l10244k431986
32790A34085454m286577o689547p986707p469744o980547p977047r203100q548550
32782G4943635n926510l394748l027816m768378n933008l662619J157290L691791
32774E3079637O60347m970321o982186l038077L178779O365946M222927j453619
32766E1063433o092869n680649j111666J884087l30029m132659l807305N4474
$$ plain form
32822 51652980 50103188 52416856 56538990 57663161 55802760 54963022 55537070 53572855
32814 53572855 48618177 46172665 49372863 53461907 52880094 49896716 50906337 56577449
32806 56577449 61415485 62436961 62891858 66573767 72841261 78885741 83674671 87972469
32798 87972469 92947665 100192945 110847589 123154231 132748460 136827684 136517440 134085454
32790 134085454 129798877 123109330 115122623 107652879 100672332 92695285 83492185 74943635
32782 74943635 69017125 65622377 62594561 57826183 51893175 48230556 49387846 53079637
32774 53079637 53739984 48769663 41787477 38749400 41928179 48294125 52517052 51063433
32766 51063433 44970564 39289915 38178249 40062336 39732307 35599648 31792343 31846817
32758C1846817K122672J015182L87711J317484K67368l666078n903521l642759
32750B3744876p5969K004186M695556Q598799Q268668O85300o841357n493969
32742C5586090J507595L239310k298220n572887r09573M880266L530793k507733
32734C7455641n132025k888011j182558k428414k909852p980L034887K090694
32726B8032382j524543k930266n25676K176935J846181j57703k70462J813843
32718B8460691K711919K83696l391457m803353l000862J98050K522360K807259
32710B5788303J516995M81034R27742J617502O72657j023229j121396l26591j445222
32701B7087795l383706j594188L491229M841690m03940n089971k945478R66682
$$ plain form
32758 31846817 33969489 34984671 35372382 36689866 36957234 33291156 27387635 23744876
32750 23744876 23668907 25673093 30368649 38967448 47236116 47921416 41080059 35586090
32742 35586090 37093685 40332995 38034775 32461888 31552315 36432581 39963374 37455641
32734 37455641 32323616 29435605 28253047 25824633 22914781 22906801 25941688 28032382
32726 28032382 26507839 23577573 23051897 25228832 27075013 26917310 26646848 28460691
32718 28460691 31172610 31456306 28064849 23261496 20260634 20458684 22981044 25788303
32710 25788303 27305298 27786332 28714074 30331576 31004233 29981004 28859608 28533017 27087795
32701 27087795 23704089 22109901 25601130 30442820 30038880 24948909 22003431 22970113
32693B2970113j012163n318941k948068M037526M514221k899581o211400R21187
32685A4052894Q628212O163757k067145m645347k08636L201986J599540j347480
32677B5377781k317325k119217j851818j240395p64339j166041j537146j173642
32669A3207858j403518k276326n80125M495895P257625K802067m478392o241715
32661A2783369j986906J509025J196869N20966J240484M29976k648337l822273
32653I223173j014482J977176J894268J011917K191580L539741K130962m94504
32645B0459831r64101J42016n46368l322522m503779j581245L308858N819168
32637A8811858M082346L28745j913234j703739r99272j183612j199126j65654
$$ plain form
32693 22970113 21957950 16639009 13690941 17728467 22242688 19343107 13131707 14052894
32685 14052894 22681106 28844863 26777718 22132371 21923735 25125721 26725261 25377781
32677 25377781 23060456 20941239 19089421 17849026 17084687 15918646 14381500 13207858
32669 13207858 11804340 9528014 8947889 13443784 20701409 23503476 19025084 12783369
32661 12783369 10796463 12305488 13502357 14023323 15263807 15693783 13045446 9223173
32653 9223173 8208691 10185867 12080135 13092052 15283632 18823373 20954335 20459831
32645 20459831 19495730 19637746 19091378 15768856 11265077 9683832 12992690 18811858
32637 18811858 22894204 23222949 21309715 19605976 18606704 17423092 16223966 16058312
32629A6058312N02209k02803l80060J458742K772622Q18043j712660o6381M399587
32620B3647611N260175O76073l811123l636320r26406L67923N4583m18172j300731
32611A9913613k668579k925694k037594k561248m568818l612906K473304Q419546
32603A2431624P764699J688483l036901l159760j428269r07335j300708j252375
32595A0799458q31389o48149m51271M61816K039544K874489J226244k322750m110173
32586I037819j724674J667693J101063k332228k579383J432480L246596o45613
32578I203753m101854n00448O351341P320149J059410m944442n235207j872608
32570G280094R38627K064720K275028K040077J597984O04880k092596n864476
$$ plain form
32629 16058312 16560521 16357718 15977658 17436400 20209022 21027065 19314405 19248024 23647611
32620 23647611 28907786 29583859 25772736 22136416 21210010 21577933 21632516 21214344 19913613
32611 19913613 17245034 14319340 12281746 9720498 5151680 1538774 4012078 12431624
32603 12431624 20196323 21884806 18847905 15688145 14259876 13352541 12051833 10799458
32595 10799458 9968069 9319920 8868649 9330465 11370009 14244498 15470742 13147992 9037819
32586 9037819 7313145 8980838 10081901 7749673 5170290 6602770 9849366 9203753
32578 9203753 5101899 4601451 10952792 18272941 19332351 14387909 9152702 7280094
32570 7280094 8218721 10283441 12558469 14598546 16196530 16801410 14708814 8844338
32562H844338o794552k192826M542182P355404M983313J262455r98363k254669
32554A4747282k887544k017706j0620J325061J345232P46848k46975j210359m17766
32545A1373453K333296L489750J86151m680603n957253l200059J45242K503964
32537F193941M187598L839366O48135j800916j69016K092933q5072l734079j978156
32528I194734L420610L751566j919956m487660K76447N141636L873475K82078
32520A9532930n00041m68399k205925k556791Q6106K68395m815709p613754j263055
32511D63757Q029263R455408L454091r08192m59205M22005k6564O90374K109908
32502B3230845J231114o98576k38763P55307j643134m429296j678730L581593
$$ plain form
32562 8844338 2049786 -143040 4399142 11754546 16737859 18000314 17001951 14747282
32554 14747282 11859738 9842032 9831412 11156473 12501705 13248553 13001578 11791219 11373453
32545 11373453 13706749 17196499 17382650 12702047 6744794 3544735 3689977 6193941
32537 6193941 10381539 14220905 14869040 13068124 12899108 14992041 14906969 11172890 9194734
32528 9194734 12615344 16366910 14446954 9959294 10235741 15377377 19250852 19532930
32520 19532930 19032889 18564490 16358565 13801774 13887880 14156275 9340566 1726812 463757
32511 463757 8493020 17948428 21402519 20494327 20035122 20457127 20430563 21120937 23230845
32502 23230845 24461959 23763383 23524620 24279927 22636793 18207497 16528767 20110360
32494B0110360K505394m307030o417866n72412L827457N91276l382888p39309
32486A1614982L888783K673971j951231k295241J335797K066929j673427m540511
32478A1120052l448628q69270P34380J341145L27302l002724n542534k913272
32470b253549L078606N173897R66916k748339M48832O695159O632360j424909
32462A6568973q515553o479811J792248O712186M202902p02216k078249k32993
$$ plain form
32494 20110360 22615754 18308724 11890858 11318446 15145903 15737179 12354291 11614982
32486 11614982 15503765 18177736 16226505 13931264 15267061 17333990 15660563 11120052
32478 11120052 7671424 6802154 7536534 8877679 9204981 6202257 659723 -2253549
32470 -2253549 825057 5998954 6965870 4217531 4666363 11361522 17993882 16568973
32462 16568973 8053420 1573609 3365857 10078043 14280945 13578729 11500480 11267487
$$ [...]
##END NTUPLES=NMR SPECTRUM
##END=
