##TITLE=31Pdec_AT-44x
 DMSO_CD3ONa, 324 sc
 25.8.2022
##JCAMPDX= 6.0         $$ Bruker NMR JCAMP-DX V2.0
##DATA TYPE= NMR SPECTRUM
##DATA CLASS= NTUPLES
##ORIGIN= UXNMR, Bruker Analytische Messtechnik GmbH
##OWNER= root
$$ XWIN-NMR		Version 3.5
$$ Thu Aug 25 12:27:09 2022 Russian Standard Time (UT+4h)  she@DPX200
##.OBSERVE FREQUENCY= 81.013821
##.OBSERVE NUCLEUS= ^31P
##.ACQUISITION MODE= SIMULTANEOUS
##.ACQUISITION SCHEME= undefined
##.AVERAGES= 324
##.DIGITISER RES= 16
##SPECTROMETER/DATA SYSTEM= spect
##.PULSE SEQUENCE= zgpg30
##.SOLVENT NAME= DMSO
##.SHIFT REFERENCE= (INTERNAL, DMSO, 0, 248.564)
##AUDIT TRAIL= $$ (NUMBER, WHEN, WHO, WHERE, WHAT)
$$ ##TITLE= Audit trail, XWIN-NMR		Version 3.5
$$ ##JCAMPDX= 5.01
$$ ##ORIGIN= Bruker BioSpin GmbH
$$ ##OWNER= she
$$ F:/spectra/data/she/nmr/P31/1/pdata/1/auditp.txt
$$ ##AUDIT TRAIL=  $$ (NUMBER, WHEN, WHO, WHERE, WHAT)
(   1,<2022-08-25 12:25:45.54 +0400>,<she>,<DPX200>,
      <continue with go, POWCHK disabled, PULCHK disabled
       configuration hash MD5:
       00 E9 B6 7A A2 85 ED C7 34 08 36 98 17 FE 4E 26
       data hash MD5: 32K
       30 6F 8F A7 3E A6 8C 05 86 67 90 11 E3 AC E8 B7>)
(   2,<2022-08-25 12:25:52.32 +0400>,<she>,<DPX200>,
      <Start of raw data processing
       efp BC_mod = 2 LB = 1 FT_mod = 6 PKNL = 1 PHC0 = -10266.55 PHC1 = 88.85633 SI = 64K 
       data hash MD5: 64K
       92 A3 51 2B F3 AD 2A 95 15 21 44 B6 47 9F 6A 34>)
(   3,<2022-08-25 12:26:25.79 +0400>,<she>,<DPX200>,
      <pk PHC0 = -18.4891 PHC1 = 0 
       data hash MD5: 64K
       42 F3 E3 2B EA 9A 91 22 30 85 2E 19 EC 07 2E A5>)
$$ ##END=
$$ 
$$ hash MD5
$$ 5B B1 9E B4 19 AE 02 67 A8 E3 3C 10 1E EB 45 5E
##$RELAX= 
##$RELAX= 
##$RELAX= 
##$RELAX= 
##$RELAX= 
##$RELAX= 
##$RELAX= 
##$RELAX= 
$$ Bruker specific parameters
$$ --------------------------
##$DU= <F:/spectra>
##$EXPNO= 1
##$NAME= <P31>
##$PROCNO= 1
##$TYPE= <nmr>
##$USER= <she>
##$AMP= (0..31)
100 100 100 100 100 100 100 100 100 100 100 100 100 100 100 100 100 100 
100 100 100 100 100 100 100 100 100 100 100 100 100 100 
##$AQSEQ= 0
##$AQ_mod= 1
##$AUNM= <au_zg>
##$AUTOPOS= <>
##$BF1= 81.014009
##$BF2= 200.13
##$BF3= 200.13
##$BF4= 200.13
##$BF5= 200.13
##$BF6= 200.13
##$BF7= 200.13
##$BF8= 200.13
##$BYTORDA= 1
##$CFDGTYP= 0
##$CFRGTYP= 5
##$CHEMSTR= <none>
##$CNST= (0..31)
1 1 145 1 1 1 1 1 1 1 1 1 1 1 1 1 1 1 1 1 1 1 1 1 1 1 1 1 1 1 1 1 
##$CPDPRG= <waltz16>
##$CPDPRG1= <>
##$CPDPRG2= <waltz16>
##$CPDPRG3= <>
##$CPDPRG4= <mlev>
##$CPDPRG5= <mlev>
##$CPDPRG6= <mlev>
##$CPDPRG7= <mlev>
##$CPDPRG8= <mlev>
##$CPDPRGB= <>
##$CPDPRGT= <>
##$D= (0..31)
0 1 0 0 0 0 0 0 0 0 0 0.03 2e-05 3e-06 0 0 0 0 0 0 0 0 0 0 0 0 0 0 0 0 
0 0 
##$DATE= 1661415462
##$DBL= (0..7)
120 120 120 11 120 120 24 19 
##$DBP= (0..7)
150 150 150 150 150 150 150 150 
##$DBP07= 0
##$DBPNAM0= <>
##$DBPNAM1= <>
##$DBPNAM2= <>
##$DBPNAM3= <>
##$DBPNAM4= <>
##$DBPNAM5= <>
##$DBPNAM6= <>
##$DBPNAM7= <>
##$DBPOAL= (0..7)
0.5 0.5 0.5 0.5 0.5 0.5 0.5 0.5 
##$DBPOFFS= (0..7)
$$ [...]
##$SUBNAM2= <"">
##$SUBNAM3= <"">
##$SUBNAM4= <"">
##$SUBNAM5= <"">
##$SUBNAM6= <"">
##$SUBNAM7= <"">
##$SUBNAM8= <"">
##$SUBNAM9= <"">
##$SW= 501.771253377433
##$SWIBOX= (0..15)
0 1 3 0 0 0 0 0 0 0 0 0 0 0 0 0 
##$SW_h= 40650.406504065
##$TD= 32768
##$TD0= 1
##$TE= 0
##$TE2= 300
##$TE3= 300
##$TEG= 300
##$TL= (0..7)
0 120 53 12 22 120 120 120 
##$TP= (0..7)
150 150 150 150 150 150 150 150 
##$TP07= 0
##$TPNAME0= <>
##$TPNAME1= <>
##$TPNAME2= <>
##$TPNAME3= <>
##$TPNAME4= <>
##$TPNAME5= <>
##$TPNAME6= <>
##$TPNAME7= <>
##$TPOAL= (0..7)
0.5 0.5 0.5 0.5 0.5 0.5 0.5 0.5 
##$TPOFFS= (0..7)
0 0 0 0 0 0 0 0 
##$TUNHIN= 0
##$TUNHOUT= 0
##$TUNXOUT= 0
##$USERA1= <user>
##$USERA2= <user>
##$USERA3= <user>
##$USERA4= <user>
##$USERA5= <user>
##$V9= 5
##$VALIST= <valist>
##$VCLIST= <CCCCCCCCCCCCCCC>
##$VD= 0
##$VDLIST= <DDDDDDDDDDDDDDD>
##$VPLIST= <PPPPPPPPPPPPPPP>
##$VTLIST= <TTTTTTTTTTTTTTT>
##$WBST= 1024
##$WBSW= 4
##$XGAIN= (0..3)
0 0 0 0 
##$XL= 0
##$YL= 0
##$YMAX_a= 61596
##$YMIN_a= -42065
##$ZGOPTNS= <>
##$ZL1= 120
##$ZL2= 120
##$ZL3= 120
##$ZL4= 120
##$ABSF1= 0
##$ABSF2= 0
##$ABSG= 0
##$ABSL= 0
##$ALPHA= 0
##$AQORDER= 0
##$ASSFAC= 0
##$ASSFACI= 0
##$ASSFACX= 0
##$ASSWID= 0
##$AUNMP= <proc_1d>
##$AZFE= 0.1
##$AZFW= 0.5
##$BCFW= 0
##$BC_mod= 2
##$BYTORDP= 0
##$COROFFS= 0
##$CY= -3
##$DATMOD= 1
##$DC= 0
##$DFILT= <>
##$DTYPP= 0
##$F1P= 0
##$F2P= 0
##$FCOR= 1
##$FTSIZE= 65536
##$FT_mod= 6
##$GAMMA= 0
##$GB= 0
##$INTBC= 1
##$INTSCL= 5.30512e-09
##$ISEN= 30
##$LB= 1
##$LEV0= 0
##$LPBIN= 0
##$MAXI= 10000
##$MC2= 0
##$MEAN= 0
##$ME_mod= 0
##$MI= 50
##$NCOEF= 0
##$NC_proc= -6
##$NLEV= 6
##$NOISF1= 182.463
##$NOISF2= 159.3651
##$NSP= 0
##$NTH_PI= 0
##$NZP= 0
##$OFFSET= 248.5645
##$PC= 4
##$PHC0= -10285.04
##$PHC1= 88.85633
##$PH_mod= 1
##$PKNL= yes
##$PPARMOD= 0
##$PSCAL= 0
##$PSIGN= 0
##$REVERSE= no
##$SF= 81.0140089999908
##$SI= 65536
##$SIGF1= 159.3651
##$SIGF2= -187.1042
##$SINO= 113.3802
##$SIOLD= 16384
##$SREGLST= <1H.CDCl3>
##$SSB= 0
##$STSI= 65536
##$STSR= 0
##$SW_p= 40650.406504065
##$SYMM= 0
##$S_DEV= 0
##$TDeff= 32768
##$TDoff= 0
##$TI= <>
##$TILT= no
##$TM1= 0
##$TM2= 0
##$TOPLEV= 0
##$USERP1= <user>
##$USERP2= <user>
##$USERP3= <user>
##$USERP4= <user>
##$USERP5= <user>
##$WDW= 1
##$XDIM= 65536
##$YMAX_p= 291767137
##$YMIN_p= -21548009
$$ End of Bruker specific parameters
$$ ---------------------------------
##NTUPLES= NMR SPECTRUM
##VAR_NAME=  FREQUENCY,     SPECTRUM/REAL,   SPECTRUM/IMAG
##SYMBOL=    X,             R,               I
##VAR_TYPE=  INDEPENDENT,   DEPENDENT,       DEPENDENT
##VAR_FORM=  AFFN,          ASDF,            ASDF
##VAR_DIM=   65536,         65536,           65536
##UNITS=     HZ,            ARBITRARY UNITS, ARBITRARY UNITS
##FACTOR=    0.620285442955139, 1,           1
##FIRST=     20137.2065510736, 0,            0
##LAST=      -20513.1999529914, 0,           0
##MIN=       -20513.1999529914, -21548009,   0
##MAX=       20137.2065510736, 291767137,    0
$$ Real data points
##PAGE= N=1
##DATA TABLE= (X++(R..R)), XYDATA
$$ [...]
37545f251569j645880j16434o44488l24213K423926L464256M37815j761523Q06542
37536c611568L354855K03791m640776l373257K663318N181188K218014j95811
37528A799754P69407J236785n52590q45023J574721J994986j821741m818025k667720
37519c329446J264986J816633j20797p69660l21733j174857k516096k146967j314218
37510h612155k274732k892907N62297O116637P482295L105623j632501k497612
37502f43055j585454k224654l321099k239959O2856Q74947O02323J585361L120297
37493c768437K118875j094108k071733J068942M091794K590755j386737k407418
37485h58067K86041K078915K66342k166307j491832J318103K462551O45690j834054
$$ y = [-6251569, -7897449, -8013883, -8658371, -8982584, -6558658, -3094402, -2656587, -4418110, -3611568, -256713, -52922, -4693698, -8066955, -5403637, -222449, 1995565, 1799754, 2569161, 3805946, 3253356, 2408333, 3983054, 5978040, 4156299, -661726, -3329446, -2064460, -247827, -368624, -1138284, -1460017, -2634874, -5150970, -7297937, -8612155, -10886887, -13779794, -13217497, -7100860, 381435, 3487058, 1854557, -643055, -2228509, -4453163, -7774262, -10014221, -9951365, -9076418, -8474095, -6888734, -3768437, -1649562, -2743670, -4815403, -3746461, 345333, 2936088, 1549351, -858067, -572026, 1506889, 1773231, -393076, -1884908, -566805, 1895746, 2541436, 707382]
37476G07382k397131p78944J244510J660560K07288j097195m05107J073117N92279
37467H06759j617434k287534m29704Q16504m26094j347061M04577J850502l81794
37458b611279l169843r39886M759327O342158J336714l890922l584688j84459
37450a942878P46665j277433k513058j083048J607136L723327M125396K126653
37442E512760j163832k695472j158557P32384J54722j427712r47321P53684J49564
37433h9780k662978l249771M62089M517028M288241R06975p34596P76662J579848
37424E793718j338844n157187m854398n56005K139113r9512l499965k599858J867369
37415h305569M326554K613906L49713M91106J149148R752j165596K3027J643568
$$ y = [707382, -1689749, -2468693, -1224183, 436377, 643665, -453530, -858637, 214480, 806759, -810675, -3098209, -3527913, -2711409, -3137503, -4484564, -4079987, -2229485, -2611279, -5781122, -6721008, -1961681, 4380477, 5717191, 1826269, -1758419, -1942878, -1196213, -2473646, -4986704, -6069752, -4462616, -739289, 3386107, 5512760, 4348928, 1653456, 494899, 1227283, 1382005, -45707, -993028, -239344, -89780, -2752758, -6002529, -5540440, -1023412, 3264829, 4171804, 3437208, 4213870, 5793718, 4454874, -702313, -5556711, -6112716, -3973603, -4073115, -7573080, -10172938, -8305569, -3979015, -1365109, -1015396, -524290, 624858, 634610, -530986, -507959, 1135609]
37406A135609J91298l271818m162889j262487J500903Q85512j378295j622342
37398g984509O97842K721369K010697n62471j868831m49385J140644m32615l672117
37389h399376l150670K198083N668965J780891m717379m993495P03071L729304
37381g180606Q88333j216466J693139M052597P01155l199467p06260M225038K582160
37372A839623m407093o702191j622665K430330M43711j641312J553708N155712
37364b950177K721702k650906l819198r66897O87056O53391K081846L479788N35414
37355b27981m637595m941361L56778L999866K117444o68449j04993J308276N46703
37346b251312k10630J238228K150384K04135j411585K07302J620601j042118m359048
$$ y = [1135609, 1326907, -1944911, -6107800, -7370287, -5869384, -4983872, -6362167, -7984509, -7286667, -4565298, -2554601, -3117072, -4985903, -5435288, -4294644, -4727259, -8399376, -11550046, -9351963, -3682998, -1902107, -6619486, -11612981, -10909910, -7180606, -6292273, -7508739, -5815600, -1763003, -1061848, -4261315, -4967575, -742537, 1839623, -2567470, -9269661, -10892326, -8461996, -8018285, -9659597, -8105889, -2950177, -228475, -2879381, -6698579, -7665476, -6978420, -6325029, -4243183, -763395, -227981, -4865576, -9806937, -9450159, -5450293, -3332849, -4001298, -4106291, -2798015, -2251312, -2461942, -1223714, 926670, 1130805, -280780, -73478, 1547123, 505005, -3854043]
37337c854043k811688J558133K295798p04916j516914J407837K995207N06621
37329a23965k382170k201422k81783J212779K344282K583733K99820k868083k494888
37320c911697J403077L108793N2002k772091j079617J606891L44679k535966j561479
37311e345408K310220L264488L68806j107267J495868L977312J670122l979989
37303B654152p354022m952783J416738O311825N438200J81750l360320j530275
37295a194735K230817K380628r12790k760671j212691O75012M90689m22144n88891
37286a314776r50877j987658j886782J63178J775464Q61632j026728j239373J5539
37277e590381O15630p6962r49321j057587P3734K747815N708858N824358J580827
$$ y = [-3854043, -6665731, -5107598, -2811800, -3516716, -5033630, -3625793, -630586, -123965, -2506135, -4707557, -4989340, -3776561, -1432279, 1151454, 1451274, -1416809, -3911697, -2508620, 600173, 652175, -2119916, -3199533, -1592642, -1247963, -3783929, -5345408, -3035188, 229300, 598106, -509161, 986707, 4964019, 6634141, 2654152, -4699870, -9652653, -8235915, -1924090, 3514110, 3695860, 335540, -1194735, 1036082, 3416710, 2503920, -256751, -1469442, -794430, -303741, -725885, -1314776, -2265653, -4253311, -6140093, -5976915, -4201451, -3339819, -4366547, -5605920, -5590381, -4974751, -5051713, -6001034, -7058621, -6984887, -4237072, 1471786, 7296144, 8876971]
37268H876971l943660o033984l817663m94756J488783K680308L643756K787762
37260E187517q71070m606956m289870L41025M712421M414382m6366m314149n073393
37251d546459k711903K85265J928736J520112m80341k443412k571213r27777M63400
37242i483592M47425L89665J690009L105740K636334R71544M19718R33853J68150
37233A278846k349051m076763l273918j265022J42371R38026J341855N49466j207246
37224g921436j642694M95269L177458L846724K609825Q64187j092057k804400
37216b467124k294593J074684M224479M100381K179835J774649K525922J853450
37208A2971683N29900J516175L599751K237440k139855k988151K240627O688670
$$ y = [8876971, 4933311, -1100673, -4918336, -5413092, -3924309, -1244001, 2399755, 5187517, 4316447, -290509, -4580379, -4239354, 473067, 4887449, 4841083, 526934, -4546459, -7258362, -6973097, -5044361, -3524249, -4004590, -6448002, -9019215, -9946992, -9483592, -9036167, -8646502, -6956493, -3850753, -1214419, -242875, 176843, 1110696, 1278846, -1070205, -5146968, -8420886, -9685908, -9543537, -8605511, -7263656, -6714190, -7921436, -9564130, -9068861, -5891403, -2044679, 565146, 1429333, 337276, -2467124, -4761717, -3687033, 537446, 4637827, 6817662, 8592311, 11118233, 12971683, 13501583, 15017758, 18617509, 20854949, 18715094, 15726943, 17967570, 24656240]
37200B4656240L561307l496503n573414j413815J549285j304381n646562n386804
37192F945353j089404J920598R76399j688784k998713k607276k094146k091683
37184b727656j375160R06637K958982K094349r20703j828273J016361L207131
37176C331668M28239m055845l205050K900314N992093J317792n255707n702105
37168d248601r15472J941530L47476j392738j32895J791491J367352n68790j580063
37159c390710j127831M9577J439816K018781M89446k096682k389425P31548L980137
37150b95343M044055J832558j2699j408773l395807m419014k199867J527939K494807
37141a832144L01530q12327J433597M024390L743075J901585J232073J077393
$$ y = [24656240, 28217547, 24721044, 19147630, 17733815, 19283100, 17978719, 12332157, 6945353, 5855949, 7776547, 8752946, 7064162, 4065449, 1458173, -635973, -2727656, -4102816, -3196179, -237197, 1857152, 936449, -891824, 124537, 3331668, 3759907, -295938, -3500988, -600674, 5391419, 6709211, 1453504, -4248601, -5164073, -3222543, -2875067, -4267805, -4400700, -2609209, -1241857, -1810647, -3390710, -4518541, -4468964, -3029148, -1010367, -520921, -2617603, -5007028, -4275480, -295343, 3748712, 5581270, 5568571, 4159798, 763991, -3655023, -5854890, -4326951, -1832144, -1530614, -2342941, -909344, 3115046, 6858121, 8759706, 9991779, 11069172]
37133A1069172p69781l362368l571684j025336J358751J652943P20003l46952
37125E724748j595530k532336j954949m18608k79433k098747l438184k574369
37117i167408r02927M0656J213879L198864L340446n03468n002297m599562O15694
37108a1766123M763006M481850K729319K528523J784159j926128n260297l286458
37100e952149K051137L681411j07462k830327L24433M983338M074794j720546
37092D504629n218211k898426J459578L431062L300396L255497L457732L501523
37084A4793780M578455P029916Q025259N126877P37007n51155J650173L288065
37076D4678377J992388m1731p7502J303211J772591M54537j827407l794893m178801
$$ y = [11069172, 10299391, 6937023, 3365339, 2340003, 3698754, 5351697, 6071700, 5724748, 4129218, 1596882, -358067, -776675, -1056108, -3154855, -6593039, -9167408, -10070335, -10029679, -8815800, -5616936, -2276490, -2779958, -7782255, -12381817, -11766123, -7003117, -2521267, 208052, 2736575, 4520734, 2594606, -2665691, -5952149, -3901012, -219601, -327063, -3157390, -2832957, 2150381, 6225175, 4504629, -713582, -3612008, -2152430, 1278632, 4579028, 7834525, 11292257, 14793780, 19372235, 26402151, 34427410, 39554287, 40291294, 39740139, 41390312, 44678377, 46670765, 46629034, 46551532, 47854743, 49627334, 50081871, 48254464, 44459571, 40280770]
37067D0280770k573674o23031o19098k339603l358976k987634l104757m153334
37059B0520663l770494j323277j87809k452525m625435k703548J010587J014040
37051G482202k913285n431971l521903J53558K070196J604539n66896l465084
37043d588644m435856j267887L233038L550915j16945j074150L572524P486694
37035F359689M535956j261071j651487K965031M027312k076928q380110p012747
37027b494355N61561O235008N150090k42841m421556m323881j047830K014840
37019A431036K357741M62600r94816j50554J985136K653083N32772k369879k601363
37010C305756N07233L360601K321324j173885k160148Q75518L515377J517248
$$ y = [40280770, 37707096, 37084065, 36464967, 34125364, 30766388, 27778754, 24673997, 20520663, 16750169, 15426892, 15239083, 12786558, 8161123, 5457575, 6468162, 7482202, 4568917, -863054, -4384957, -4231399, -2161203, -556664, -1123560, -4588644, -9024500, -10292387, -7059349, -3508434, -3625379, -4699529, -1127005, 6359689, 10895645, 9634574, 7983087, 10948118, 14975430, 12898502, 4518392, -2494355, -1932794, 4302214, 9452304, 9209463, 4787907, 464026, -583804, 1431036, 3788777, 4251377, 3256561, 3106007, 5091143, 7744226, 8276998, 5907119, 3305756, 3812989, 7173590, 9494914, 8321029, 6160881, 7036399, 10551776, 12069024]
37002A2069024l249545n583184l825830r05150M82617M81697o0274j259538k718841
36993d569024k545642N48579M902886O852194M348159n40910l387525k307466
36985C301251k80987j001905l299139k709254J334832L827667J298164l183611
36977g12982m732764l035001p80846J193568L263903M051035K451650P28546J268251
36968C695360K103646K54320k412154k059866l4639q00160l436402k317025K996934
36959b009986N858867K873920o59689O65690M202162M421731J732406P08547K287412
36950B0081060L008497J051298j106160k22845L760382P331375O371072O80384
36942D0955063m560623m384085r16097p13006m793102o736795k891551J383560
$$ y = [12069024, 8819479, 3236295, -589535, -1494685, -1012068, -530371, -590645, -1850183, -4569024, -7114666, -6566087, -1663201, 5188993, 9537152, 8996242, 5608717, 3301251, 3020264, 2018359, -1280780, -3990034, -2655202, 1172465, 2470629, -712982, -5445746, -8480747, -9261593, -8068025, -4804122, -753087, 1698563, 2427109, 3695360, 5799006, 6053326, 3641172, 1581306, 1546667, 746507, -2689895, -5006920, -2009986, 3848881, 6722801, 6063112, 6728802, 10930964, 15352695, 17085101, 17793648, 20081060, 23089557, 24140855, 23034695, 22811850, 26572232, 33903607, 40274679, 40955063, 36394440, 32010355, 31094258, 30381252, 25588150, 18851355, 15959804, 17343364]
36934A7343364n6117m621179n412582j779155Q28258j82244j818590j421046k0179
36925B860530P99541J211794J461401R73089k27274j427641k425056k879440j557165
36916a210221J369299K777320M55346k898591l072223m50782J229920J109381
36908f90551J542849K723552K072906n10164j784414p42104k56285j455297j328132
36899d27640J417745K825645o3801l323962j574293L171620L924119o10868l753132
36890A585433q15560L878094L540669j100295l352112o73339K284447J653635
36882G000972P8088J308938L315377J826478j714110j880968J442908J981235
36874A3358918l013309p732953o225196j020338J290843l18358j346754M52694
$$ y = [17343364, 17287247, 12666068, 7253486, 5474331, 6302589, 6120345, 4301755, 2880709, 2860530, 3660071, 4871865, 6333266, 7306355, 7079081, 5651440, 3226384, 346944, -1210221, 159078, 2936398, 3391744, 493153, -2579070, -3029852, -1799932, -690551, 852298, 3575850, 5648756, 5138592, 3354178, 2612074, 2355789, 900492, -427640, 990105, 3815750, 3751949, 427987, -1146306, 2025314, 5949433, 5338565, 1585433, 769873, 4647967, 8188636, 7088341, 3736229, 3062890, 5347337, 7000972, 7079060, 8387998, 11703375, 13529853, 11815743, 9934775, 11377683, 13358918, 10345609, 2612656, -3612540, -4632878, -3342035, -3660393, -5007147, -4554453]
36866d554453K519411K364757P53306m14661l94093M83047R97760m42644l455251
36857b142821m800275k168377K187872M024196K194194j182640m069988n211270
36849a1169109l196567J652864N663316N576695K907185J186474L86939j756901
36841A250896m159851l156576J246403M632685M239867J668217q65084k834070
36833B022487l389973j273961K058981K850620r9158l786326m909332k856704
36825i383366J101155M634373M829112J223558k257117j987160q1409q35572l318808
36816f075234l130693l27349J063141Q33294K355309M452906K153102l007422
36808a682946k863963L865951P449041J827491n377745m638942J223290K926495
$$ y = [-4554453, -2035042, 329715, 1083021, 668360, 274267, 757314, 1755074, 1312430, -2142821, -6943096, -9111473, -6923601, -2899405, -705211, -1887851, -5957839, -11169109, -14365676, -12712812, -7049496, -1472801, 1434384, 2620858, 3007797, 1250896, -2908955, -6065531, -4819128, -186443, 4053424, 5721641, 4856557, 2022487, -1367486, -2641447, -582466, 2268154, 2168996, -1617330, -6526662, -9383366, -8282211, -3647838, 1181274, 2404832, 147715, -1839445, -1920854, -2756426, -6075234, -9205927, -9533276, -8470135, -7636841, -5281532, -828626, 1324476, -1682946, -4546909, -680958, 6768083, 8595574, 3217829, -1421113, -197823, 2728672]
36800B728672r05830m178283m141136l048565j566008J356795L603989K138264
36792d012102j067084j716800k22131K01047L36489K858581N308116L012881j953743
36783B745254k869376O94447K320038r0031j127955J974550M233978J604740k350986
36774G134659l030230k046975k773870l438891m49902M427202N835705K541249
36766H198947j128676j344086J006542K470036J299017j096735k296516j941250
36758E167279j745635k016184l66303L832084O144784K442773l873576n332923
36750D252299q34651L171571K736761J344789K532688L812873J922076j003230
36742A7935176j346905k19314o96160j878354r69131Q46876j1854l098158m162047
$$ y = [2728672, 1822842, -2355441, -6496577, -9545142, -11111150, -9754355, -6150366, -4012102, -5079186, -6795986, -7018117, -6817070, -6480581, -3622000, 1686116, 4698997, 2745254, -124122, 570325, 2890363, 2800332, 1672377, 3646927, 7880905, 9485645, 7134659, 4104429, 2057454, -716416, -4155307, -4605209, -178007, 5657698, 8198947, 7070271, 5726185, 6732727, 9202763, 10501780, 9405045, 7108529, 5167279, 3421644, 1405460, 1039157, 4871241, 11016025, 13458798, 9585222, 4252299, 3417648, 6589219, 9325980, 10670769, 13203457, 17016330, 18938406, 17935176, 16588271, 16368957, 15672797, 13794443, 12825312, 13672188, 13660334, 10562176, 6400129]
36733F400129j697762J166895J811730J369806J876698L156744L793892L317263
36725B1195395K523219K600511L867428M599598K257622k683660n733030l565682
36717B5061401J091859K623796k75344l657507m135447k346053m78158M13633
36709A8298180m5720j770003l084590k078872m446m51582l839177n823039l381480
36700b180729L65511O41194j685251j387544K960953O348959M224716j234752
36692H053057m265159k982842o97348l50480p68772N14727K935119L395522M01824
36683F235648l884366n781317l562216R17952L558410J754895k400819l783390
36675f945203l91848L580023L095591n88858j688838J463915L983487K076663
$$ y = [6400129, 4702367, 5869262, 7680992, 9050798, 10927496, 14084240, 17878132, 21195395, 23718614, 26319125, 30186553, 34786151, 37043773, 34360113, 28627083, 25061401, 26153260, 28777056, 28501712, 24844205, 20708758, 18362705, 17884547, 18298180, 18252460, 16482457, 13397867, 11318995, 11314549, 10862967, 7023790, 1200751, -2180729, -1815218, -1174024, -2859275, -4246819, -1285866, 5063093, 9287809, 8053057, 3787898, 805056, 107708, -242772, -1011544, -496817, 2438302, 5833824, 6235648, 2351282, -3430035, -6992251, -6074299, -2515889, -760994, -3161813, -6945203, -7337051, -3757028, -661437, -1250295, -2939133, -1475218, 2508269, 4584932]
36667D584932j308603j616691K13124K64673j156050k45593L079270M212231J079496
36658I106789k515761k771486r97974j64640J49723J828878L689303K839407n14066
36649A0650173l122564l162087j677143J18297J948392K831883J478548r32872
36641H132627j274640R62085K241592l4125l330771l302661P988K196655O65458
36632F264208j848312j105061K808468N353727L314883q02969j581128K394981
36624A4798797O414834N578536J053595j989810j563345n30122j040119j404535
36616B1317831k89847j92831l371091o959740o237068j433307K673362L280141
36608H787450J805047l356j872543k441066N70229N814628P830341L817110j816535
$$ y = [4584932, 3276329, 1659638, 1872762, 2137435, 981385, 735792, 3815062, 8027293, 9106789, 6591028, 3819542, 2821568, 2656928, 2806651, 4635529, 8324832, 11164239, 10650173, 7527609, 4365522, 2688379, 2806676, 4755068, 7586951, 9065499, 8132627, 6857987, 7820072, 10061664, 10027539, 6696768, 3394107, 3402095, 5598750, 6264208, 4415896, 3310835, 6119303, 11473030, 14787913, 13984944, 12403816, 14798797, 21213631, 26792167, 27845762, 25855952, 24292607, 23762485, 22722366, 21317831, 21027984, 20835153, 17464062, 10504322, 4267254, 2833947, 5507309, 8787450, 10592497, 10589141, 8716598, 6275532, 6845761, 12660389, 20490730, 24307840, 22491305]
36599B2491305k503709K621137Q268758R100768M481459j573646l793426n38296
36591C8554350L604446K265303m479383r342240p332794k505496j686837m606749
36583A4470600n326208j832121J443467Q23300j949065l435073k732171m65490
36575I97239K771462N124937L884557n89924l929874k985389J24930J312177q9264
36566F620851j522742j246105J82096J405599J229542r69424l917215m579011
36558b796409j701598J731769J992836p6733o7278L516907O678642N116406j73668
36549A4220874m365795m625282k449365o78823k29865k66113n4845M18773Q83168
36540B852727Q16268l97129k301909k907367q62743K085939K674993N61486r20639
$$ y = [22491305, 19987596, 22608733, 30877491, 39978259, 44459718, 42886072, 39092646, 38554350, 42158796, 44424099, 39944716, 30602476, 23269682, 20764186, 19077349, 14470600, 9144392, 7312271, 8755738, 9579038, 7629973, 4194900, 1462729, 997239, 3768701, 8893638, 12778195, 12188271, 8258397, 5273008, 5397938, 6710115, 6620851, 5098109, 3852004, 4034100, 5439699, 6669241, 5699817, 1782602, -2796409, -4498007, -2766238, -773402, -850135, -917413, 2599494, 9278136, 14394542, 14220874, 9855079, 5229797, 2780432, 2101609, 1871744, 1605631, 1550786, 1969559, 2852727, 3668995, 3271866, 969957, -1937410, -2800153, -714214, 1960779, 2522265, 1601626]
36531A601626L57564J803687k10814m523235o104240k735067K094647L767392
36523c948440J716614j128107k134311p19686K164141M561708M488147K010993
36515G011059l05553n04689K290j350340l881263m028744n85707K970849K940064
36506B267966K85031j130199Q474J418436J237657K19257n76157j459372k237336
36497C3757j317445J362828K871880J271937r88314o94776R95880Q19384o69768
36488C685363j23990K192206K282706o81371k671227j546701j92889n90573j72147
36479B181377K489630L619452N01308k811847j617502J403649N58067l311839
36471C012295m420690j390534J807414L177000M052274L677955k40878n167764
$$ y = [1601626, 1959190, 3762877, 3552063, -971172, -7075412, -9810479, -7715832, -3948440, -2231826, -3359933, -5494244, -6213930, -4049789, 511919, 5000066, 7011059, 6705506, 6200817, 6203107, 4852767, 971504, -3057240, -3642947, -672098, 2267966, 2552997, 1422798, 1431272, 2849708, 4087365, 4306622, 3730465, 2271093, 33757, -1283688, 79140, 2951020, 4222957, 3234643, 2539867, 3535747, 4355131, 3685363, 3561373, 5753579, 8036285, 7354914, 4683687, 3136986, 2944097, 2353524, 2181377, 4671007, 8290459, 8791767, 5979920, 4362418, 5766067, 6324134, 3012295, -1408395, -2798929, -991515, 2185485, 6237759, 9915714, 9674836, 4507072]
36463D507072n338071j068930Q67322j782773l011851R05793M654430K662004
36455B394996j833032k632261l74177K07950j027876o87803R59681P78566o55163
36446b869119P6706K353695J976592j186941k292806M16188K484795N53812k341302
36437h28380k092281M0979M21115n27119L58945K621562K157595j932324m879209
36428d659117k812971J390475K117960q66595k294886O69124M406099M366392
36420B316481J211183j308007j989523k182907j946018l13232J381196P05362
36412b125465j306184r79930J973731L413393R74836k602181l947169l052573
36404g651542r78293K372461N614436N011644j89570m764167l807294M41876K143180
$$ y = [4507072, -830999, -1899929, -1032607, -2815380, -5827231, -4921438, -267008, 2394996, 561964, -2070297, -2444474, -2236524, -3264400, -3952203, -2992522, -2213956, -2869119, -2792413, -438718, 1537874, 350933, -1941873, -1525685, 959110, 1512922, -828380, -2920661, -2879682, -2458567, -2985686, -2626741, -5179, 2152416, 220092, -4659117, -7472088, -6081613, -3963653, -4830248, -7125134, -6456010, -2049911, 2316481, 3527664, 2219657, 230134, -1952773, -3898791, -4212023, -2830827, -2125465, -3431649, -4411579, -2437848, 975545, 1950381, -651800, -4598969, -7651542, -8629835, -6257374, -642938, 4368706, 4179136, -585031, -4392325, -3950449, -1807269]
36395a807269K17451j261545R9744K279525K940923K435630J983726J702019J318001
36386I908205Q77301J26682j362702l090763l664070k116957J149922M267297
36378F094915M745149J812176j902124k944911j584594j196036k596282k556760
36370a28467M62911K985148J763339r84492j158165R61748J783592n7901k641184
36361B986529l834649k715620L76630K943493J983384j154673j090528L417852
36353B912418O042354K040524l786866m323367j130948o64813k710046j527515
36345c148259K927449M399068J269135j061206j82949q3803k101678j567170K580860
36336C031447L603909j963807o797544l414798L867876N582006J243002j616651
$$ y = [-1807269, -1589818, -2851363, -2751619, -472094, 2468829, 4904459, 6888185, 8590204, 9908205, 10785506, 10912188, 9549486, 6458723, 2794653, 677696, 1827618, 6094915, 10840064, 12652240, 10750116, 7805205, 6220611, 5024575, 2428293, -128467, 334444, 3319592, 5082931, 4098439, 2940274, 3902022, 5685614, 5627713, 2986529, -848120, -3563740, -3187110, -243617, 1739767, 585094, -505434, 2912418, 8954772, 10995296, 7208430, 2885063, 1754115, 1089302, -1620744, -3148259, -220810, 4178258, 5447393, 4386187, 4203238, 4119435, 2017757, 450587, 3031447, 6635356, 4671549, -2125995, -5540793, -1672917, 3909089, 5152091, 3535440]
36328C535440J05J415725o79233l425888l287577p94842J793764L443090L574499
36319E575083J651495j230188k817608k509094j668301j092671m51686j52945
36311b695915j152488k630741k395017k31770J385140Q19409l64074K85600K651903
36302d327953M114182K720021m04252k141271j082135M55387n35216k964744k470610
36293f636591K015912N577048L766622p53419j866530J119303K861264L61711
36285F445320k783512k342519L15258J072328m56659j081626L54023J260312k91809
36276B491116k379513j961531Q85058L147932K632167J79629j757672j824682
36268A412504q30497n13280j417100k125909r79850J589439L367111L258898K638983
$$ y = [3535440, 3535545, 4951270, 4272037, 846149, -2441428, -3236270, -1442506, 2000584, 5575083, 7226578, 5996390, 3178782, 669688, -998613, -2091284, -2542970, -2695915, -3848403, -6479144, -8874161, -9105931, -7720791, -6901382, -7265456, -6979856, -4327953, -213771, 2506250, 2101998, -39273, -1121408, -666021, -1201237, -4165981, -6636591, -4620679, 956369, 4722991, 3969572, 2103042, 3222345, 6083609, 6445320, 3661808, 1319289, 1634547, 2706875, 2250216, 1168590, 1522613, 2782925, 2491116, 111603, -1849928, -964870, 2183062, 4815229, 4994858, 3237186, 1412504, 582007, 68727, -1348373, -3474282, -4454132, -2864693, 502418, 3761316, 6400299]
36259F400299K918061L039772J035388k663463n353683n282440l038926r945K557298
36250c97639L061640N41628l234935m763507k683187R43091L439451L642048J399178
36241A947768k137969l552205j43503N230061O298349J873456k202116j843344
36233E470497m89096k391717n018488l567080N95564K284314J006062P04167K205702
36224G99925K307152K42225r22120j190M84169p70758j683066o42977J259564
36215A072924K550493K593082O84907k525072l643980q06590J994736P6344l841976
36206a845132l188534J644918L648034O76339j624118o026J643566O30511K36982
36197A816540K106918J818493k652334n379311j741421L181124K565236j269728
$$ y = [6400299, 9318360, 12358132, 13393520, 10730057, 5376374, 93934, -2944992, -2954937, -397639, 2664001, 3205629, -29306, -4792813, -7476000, -6532909, -3093458, 548590, 1947768, -190201, -3742406, -3885909, 1344152, 7642501, 9515957, 7313841, 5470497, 4981401, 2589684, -2428804, -5995884, -5400320, -3116006, -2109944, -1405777, 799925, 3107077, 3349302, 2427182, 2425992, 2910161, 2139403, 456337, -186640, 1072924, 3623417, 6216499, 6901406, 4376334, 732354, -74236, 1920500, 1996844, -1845132, -5033666, -3388748, 259286, 935625, -688493, -694519, 949047, 1579558, 1816540, 3923458, 5741951, 3089617, -2289694, -4031115, -849991, 1715245, 445517]
36189D45517j710123Q25459R12925j312548m05025M210877O209573J719519n159390
36180E736784p855781m465671J564322N084391L399686j097586l122285q89179
36172a645319J701411J146388n62599M2223K078137K465369J128734q4132j127482
36163E142730k299834j778670J051837K648980L53232k549008j831959P28176
36155A465484J070481K38265J399287K508592k02827l635501j655855L379931
36147D567857K667973m515460q211306k825835M316339M450100k64619k217821
36139b032772l64336N41898p24265o61726J752940K954683Q92497j303476J22244
36130A177687L957275N531194L047154p7437k33603R60741q69565n472371p087063
$$ y = [445517, -1264606, -439147, 473778, -838770, -1243795, 2967082, 9176655, 10896174, 5736784, -2118997, -6584668, -5020346, 64045, 3463731, 2366145, -756140, -1645319, 56092, 1202480, 639881, 682104, 2760241, 5225610, 6354344, 6270212, 5142730, 2842896, 1064226, 2116063, 4765043, 5118275, 2569267, 737308, 1465484, 2535965, 2774230, 4173517, 6682109, 6479282, 2843781, 1187926, 4567857, 7235830, 2720370, -5490936, -8316771, -4000432, 449668, 185049, -2032772, -2397108, -1855210, -2579475, -3241201, -1488261, 1466422, 2358919, 1055443, 1177687, 5134962, 10666156, 13713310, 13635873, 13402270, 14363011, 13493446, 8021075, 934012]
36121I34012k535325L597601M863568J065846k915422l800354j777217J773087
36113A205796M434188L071966j779022m391759j252196K938086J998473k152386
36105D073146l234099j097543o17110j952044o72615K912587L530818O08304o59915
36096B891529R73086R80534j416478j355316J533383J063316l620703m346131
36088c296780K320300P502638L610124l300110l545891J129566K246035j317654
36080E348228l943451l903055l515745j718353L673606Q229976N241641k869892
36072F542955o675730l258518J268753L079313M931824P271856M752673l841679
36064A4071447j0170345o944597J477013N255881K125774j785020j958870j85096
$$ y = [934012, -1601313, 1996288, 6859856, 7925702, 5010280, 1209926, -567291, 1205796, 5639984, 8711950, 6932928, 2541169, 1288973, 4227059, 6225532, 4073146, 839047, -258496, -875606, -2827650, -3500265, -587678, 2943140, 3551444, 2891529, 3864615, 4845149, 3428671, 2073355, 3606738, 4670054, 1049351, -3296780, -976480, 6526158, 10136282, 6836172, 3290281, 4419847, 6665882, 5348228, 1404777, -2498278, -6014023, -7732376, -4058770, 4171206, 9412847, 6542955, -132775, -3391293, -2122540, 956773, 5888597, 13160453, 17913126, 14071447, 3901102, -3043495, -1566482, 3689399, 5815173, 4030153, 2071283, 1886187]
36056A886187O04929Q73467J998922K750699J113989j770481k434312j45575J452840
36047F330665n20011l441359k614723J596821M069147K551215M09625J66234p82062
36038G765552m587963p425799m539891J885931N232995L393709J75080j363421
36030E36193j823333j780571k48137K220373L155804K149231J566390K171659
36022G947609J674145q87617k786200j666924Q58843J854947J006259k04975j237163
36013F558924k053111j560282Q34243K963779J998055j082888j726318K257259
36005H189661O955644O778720J817927j983966n24504L520239N308268M612815
35997C4674804M574078N512259M531338R61787k395664m004596n106244n675416
$$ y = [1886187, 2491116, 3364583, 5363505, 8114204, 9228193, 7457712, 5023400, 4877825, 6330665, 5810654, 2369295, -245428, 1351393, 5420540, 7971755, 8381380, 8547614, 7765552, 3177589, -4248210, -8788101, -6902170, -1669175, 1724534, 1899614, 536193, -1287140, -3067711, -3315848, -1095475, 2060329, 4209560, 5775950, 7947609, 9621754, 8734137, 5947937, 4281013, 5139856, 6994803, 8001062, 7796087, 6558924, 4505813, 2945531, 3779774, 6743553, 8741608, 7658720, 5932402, 8189661, 15145305, 21924025, 23741952, 21757986, 21233482, 24753721, 30061989, 34674804, 39248882, 44761141, 49292479, 50254266, 47858602, 43854006, 38747762, 33072346]
35989C3072346l771134l94940K77269k267343l381882j493959j552685n882514
35981A4605158q183448l144944L681562L755438j012315j862012K496685M944793
35973A5280917K319751j040873k500899m341636o290127m170407J353997L616874
35965D227597R73717J97616M403536O451759P40717o361746n916536q1094K515535
35956G151101O77843M64960L418224M393355J167929j962729j594026L60317J357860
35947A5434834J751633J762463j02755l416192m811086k863411m54688j60718
35939G140080n99054L76364J908682K159279J564103J354478Q59236r64676k937755
35930A0860737l364107k966886l171018k616363R85923N763918O495778J755716
$$ y = [33072346, 29301212, 28906272, 29183541, 26916198, 23534316, 22040357, 20487672, 14605158, 6421710, 3276766, 6958328, 10713766, 9701451, 7839439, 10336124, 15280917, 17600668, 16559795, 14058896, 9717260, 3427133, -743274, 610723, 4227597, 5201314, 5398930, 9802466, 16254225, 16994942, 10633196, 4716660, 4635566, 7151101, 7828944, 8293904, 11712128, 16105483, 17273412, 15310683, 13716657, 14076974, 15434834, 17186467, 18948930, 18846175, 15429983, 10618897, 7755486, 7300798, 7140080, 6541026, 6917390, 8826072, 10985351, 12549454, 13903932, 14763168, 13798492, 10860737, 7496630, 4529744, 1358726, -1257637, -271714, 5492204, 11987982, 13743698]
35922A3743698l246345l229827M78967K717130J809330M39217L10818J65465o22525
35913A2565928n64354N40394M23759j496078k296709n06812N49023j967869m705884
35904B541398k509774L220184N940538L384253J80910J90371J357486M13813j530598
35895A3188581j250714J431412L731215L618460J340117j459530k631341j000713
35887A6967487J771889K394215Q4457k324850k445185j246130n65940k05109N21410
35878A4952244O26439o25629j361976N48265L728570M446457J287312l168248
35870B0433434n229757l489542K79978K756146K138353L7171o16177M66829Q95628
35861A7672063k51109r00137K72820J289469l2595k616753l828764k889035p96649
$$ y = [13743698, 10497353, 7267526, 7746493, 10463623, 12272953, 12712170, 13022988, 13188453, 12565928, 12001574, 12541968, 12965727, 11469649, 9172940, 8666128, 9215151, 7247282, 2541398, 31624, 3251808, 9192346, 12576599, 12757509, 12947880, 14305366, 14719179, 13188581, 11937867, 13369279, 17100494, 20718954, 22059071, 20599541, 17968200, 16967487, 18739376, 21133591, 21218048, 18893198, 16448013, 15201883, 14635943, 14430834, 14952244, 15578683, 14953054, 13591078, 14139343, 17867913, 22314370, 23601682, 20433434, 15203677, 11714135, 11994113, 14750259, 16888612, 16925783, 16309606, 16776435, 17672063, 17420954, 16520817, 16793637, 18083106, 18050511, 15433758, 11604994, 8715959, 7919310]
35852G919310J356256K345834J115741j203818j785575k29438N18718q17751j380620
35843G838657O19422K095360L27089j666167L0040L079209K464327r75147k005665
35834A1807125K45129J720989J195732J550544K798419J198438k902645l645503
35826A3968228Q47984M370253K222687j255851r6888L513309L206569j316303
35818B5459988m512617l523389n93555J855717L238873K656939k63785k787067
35810B1531104j893866P58973J224521q7901N98895L025089K573131j499193l667892
35801B2562861o59844L100516K363940j057872j834543O51825K472092J634346
35793B9233321j83132j384863j881918j352596K13326O80459j806867m753147
$$ y = [7919310, 9275566, 11621400, 12737141, 11533323, 9747748, 9518310, 10037028, 9219277, 7838657, 8458079, 10553439, 10880528, 9214361, 9244401, 12323610, 14787937, 13812790, 11807125, 12052254, 13773243, 14968975, 16519519, 19317938, 20516376, 17613731, 13968228, 14816212, 19186465, 21409152, 20153301, 20056413, 23569722, 26776291, 25459988, 20947371, 17423982, 16830427, 18686144, 21925017, 24581956, 24318171, 21531104, 19637238, 20396211, 21620732, 21532831, 22131726, 25156815, 27729946, 26230753, 22562861, 21903017, 25003533, 27367473, 26309601, 24475058, 25126883, 27598975, 29233321, 29050189, 27665326, 25783408, 24430812, 24644138, 25324597, 23517730, 18764583]
35785A8764583l607448J380903M493241K036471k873129m823631k613744Q01967
35777A3559213K605854K132756K18202j402267j151650L99969Q12066p17942j803321
35768A4652880m31342J742710J859009J28165r00216l55316L11743K12608R897
35759A7230138N5995k70580j158428j921670j966443j017757R31187K609859J851334
35750A6343635j037116k160301O71602L413033Q93609m728066o116414j483480
35742E796502K939288K747398J296006K401267L230555j3248l982582k704682
35734A1710504K354215M017652N08893k226621k82658K606114J780971j274763
35726A9194307k162464j89071K000060L013157L348362K850713Q43440j660860
$$ y = [18764583, 15157135, 16538038, 21031279, 23067750, 20194621, 15370990, 12757246, 13559213, 16165067, 18297823, 18516025, 17113758, 15962108, 16362077, 17174143, 16456201, 14652880, 14221538, 15964248, 17823257, 17951422, 17051206, 16695890, 17007633, 17220241, 17230138, 17286133, 17015553, 15857125, 13935455, 11969012, 10951255, 11882442, 14492301, 16343635, 15306519, 13146218, 13817820, 17230853, 18124462, 13396396, 7279982, 5796502, 8735790, 11483188, 12779194, 15180461, 18411016, 18397768, 14415186, 11710504, 14064719, 18082371, 18591264, 16364643, 16081985, 18688099, 20469070, 19194307, 17031843, 16842772, 18842832, 21855989, 25204351, 28055064, 28898504, 27237644]
35718B7237644k550223j554940p03809j471197k710787j983321J401436M896940
35710B2561743M734965J71381m751751n218772j357656J997973J581215p15098
35702A9004000j616255j182802j460373k410784k258311j037574p14989j681976
35694F640936j782722M73136L730953N586684M998398K346300j271884m008776
35686A6713025m029485j416993J559346K736758J778889m78289k754145l034721
35678A1074385R5274M536511N509799J522625k634794j850440K165620L699154
35670B4118134J918112J765879N350092Q040364N969731K659160L739381Q352013
35662F1912866J0958111R831834Q346487Q441934Q229515O663927N538805N335431
$$ y = [27237644, 24687421, 23132481, 22428672, 20957475, 18246688, 16263367, 17664803, 22561743, 27296708, 27468089, 22716338, 17497566, 16139910, 18137883, 19719098, 19004000, 17387745, 16204943, 14744570, 12333786, 10075475, 9037901, 8322912, 6640936, 4858214, 5331350, 9062303, 14648987, 19647385, 21993685, 20721801, 16713025, 12683540, 11266547, 12825893, 15562651, 17341540, 16863251, 14109106, 11074385, 11169659, 15706170, 21215969, 22738594, 20103800, 18253360, 20418980, 24118134, 26036246, 27802125, 33152217, 41192581, 47162312, 49821472, 53560853, 61912866, 72870977, 82702811, 91049298, 99491232, 107720747, 114384674, 119923479, 125258910]
35654A25258910L608966l90398l553557l933663m217636p067469j0300519j0511026
35646H8893608q903551r133718j0856923j0046852n575390j325141p72206k553315
35638C9726512k937347q27393J253631N88881k241855l809068k199763n4324j155599
35629B8343675m315491m229800M16115L900912J495702l258133l674316N11219
35621A9189883L844215L570606J794739J51546j895469l371075k027572R12851
35613B2169724J450768p36980j713947l23911j42430k433393l120162p775K583878
35604A7725772P69669k137049j036635K539435L204322M02836j604581j187620
35596A8676149r87281k047890j569735J942722N106013L620053j872927n829219
$$ y = [125258910, 128867876, 128477478, 124923921, 120990258, 116772622, 109705153, 99404634, 88893608, 79990057, 70856339, 59999416, 49952564, 44377174, 43052033, 42279827, 39726512, 36789165, 35961772, 37215403, 37804284, 35562429, 31753361, 29553598, 29499274, 28343675, 24028184, 19798384, 20214499, 24115411, 25611113, 22352980, 18678664, 19189883, 23034098, 26604704, 28399443, 28550989, 26655520, 23284445, 21256873, 22169724, 23620492, 22883512, 21169565, 20845654, 20703224, 18269831, 15149669, 15141894, 17725772, 18495441, 16358392, 15321757, 17861192, 21065514, 21468350, 19863769, 18676149, 17688868, 15640978, 14071243, 16013965, 21119978, 24740031, 22867104, 17037885]
35588A7037885l839812J922914M466941M19166m816641l682343K642322N384969
35580A9535401J160510k882214n02042L624416J639556m721319p075074l409562
35572G369672K18108L12855J58923K256614L682526J643015j586425k122642N11331
35563A2443977L638389M230079J125361l051765l252579J427325M708686J418816
35555B2688289l918533l562902Q41086J214979k438918j517639N613569R325809
35547B8245740M464629r15831O76887M100141K101011j305024J182222O035956
35539D4585731M936496n7024l1945N068803P126492N033157O144086J1722877
35531H4528673J3778100R362884N940883P733292P849946O39779p665587q622907
$$ y = [17037885, 13198073, 15120987, 19587928, 20007094, 15190453, 11508110, 14150432, 19535401, 20695911, 17813697, 17311655, 20936071, 22575627, 17854308, 10779234, 7369672, 7587780, 7900635, 8059558, 10316172, 13998698, 15641713, 14055288, 11932646, 12443977, 16082366, 20312445, 21437806, 18386041, 15133462, 16560787, 21269473, 22688289, 18769756, 15206854, 16047940, 17262919, 14824001, 13306362, 18919931, 28245740, 32710369, 31794538, 32471425, 36571566, 38672577, 37367553, 38549775, 44585731, 49522227, 49465203, 49433258, 54502061, 61628553, 66661710, 72805796, 84528673, 98306773, 107669657, 113610540, 121343832, 129193778, 129833557, 122167970, 113545063]
35523A13545063m377246k416947l545702l897766m355004q430209j3162292j1553953
35515F1805944m067674N15295k709825q313759q675918l509619J615061K733401
35507C9392906N53734j980705k822925k079689j229747j098026j012456m25701
35499B9297391j50714p92581j325439q31513j87910j59821L87085J877726J619787
35490B9734011k369677o481306n005215J462936N664023L008893k714608n057563
35482A8241494k939448o9437J161059J570478J888527J075548j352814l622438
35474A5952969l620181j408630J252394L154856M142253L719197J060787k700891
35466B1552754m014458j009565K824698K164013k673761n320289k050687K691287
$$ y = [113545063, 109167817, 106750870, 103205168, 99307402, 94952398, 86522189, 73359897, 61805944, 57738270, 58253565, 55543740, 47229981, 38554063, 35044444, 36659505, 39392906, 39946640, 37965935, 35143010, 33063321, 31833574, 30735548, 29723092, 29297391, 29146677, 28354096, 27028657, 26197144, 26009234, 25849413, 26236498, 28114224, 29734011, 27364334, 20883028, 15877813, 17340749, 23004772, 26013665, 23299057, 18241494, 15302046, 15232609, 16393668, 17964146, 19852673, 20928221, 19575407, 15952969, 12332788, 10924158, 12176552, 15331408, 19473661, 23192858, 24253645, 21552754, 17538296, 16528731, 19353429, 21517442, 18843681, 13523392, 11472705, 14163992]
35458A4163992K647163j285171l022750p12457J249323p1051j792596p03536J373061
35449A1845978J054233q95201j193343M70507J418650N77420n13143j024528j684544
35440A0056029j997164j94547K848804L113853q38659m472001k888952J996775
35432G624138L887171J050336j626502m26186J837791R45058j838739k062033
35424I391034Q11825L166492L301338L038313K956250Q38716l409568n605839
35416A4488561k934515J446943K665529O13308j100992p75900K94841J113761
35408A5811536J888409K187738J176448o03142k069384l459969m903485m378550
35400E649601l22979M618636O041949L506546K53809k143774m525130n794784
$$ y = [14163992, 16811155, 15525984, 12503234, 11790777, 13040100, 12969049, 11176453, 10472917, 11845978, 12900211, 12005010, 10811667, 11282174, 12700824, 13278244, 12765101, 11740573, 10056029, 8058865, 7864318, 10713122, 13826975, 12988316, 8516315, 5627363, 7624138, 11511309, 12561645, 10935143, 10508957, 12346748, 13291806, 11453067, 9391034, 10202859, 13369351, 16670689, 19709002, 22665252, 23503968, 20094400, 14488561, 11554046, 13000989, 15666518, 16279826, 15178834, 14402934, 14697775, 15811536, 17699945, 19887683, 21064131, 20460989, 18391605, 14931636, 10028151, 5649601, 5326622, 9945258, 15987207, 19493753, 19747562, 17603788, 13078658, 7283874]
35392G283874l159094K093766M291901J264092k123933j377480J015565L78475
35384I667166k375618k690770J41694K505087K512479J880456J843904J370812
35376A4855210Q4016n07006K40265P37877l81814k351585l513882k992390r48206
35367E222485J315543J725982k66941k119986j056016J871137L102074J694813
35359A1489091M2044o44578j822781l524899k828637J103067L989588K065895
35351I868790j772371j762328K181911M440768K126881j191763j508130J81908
35343A2565666R85337J157612K439223L585113J756402k272532m210570k028932
35335A3977319J558542L239566K816473J592673p8932j768195j972844n17676
$$ y = [7283874, 4124780, 6218546, 10510447, 11774539, 9650606, 8273126, 9288691, 9667166, 7291548, 4600778, 4742472, 7247559, 9760038, 11640494, 13484398, 14855210, 14939226, 14432220, 14672485, 15410362, 15028548, 12676963, 9163081, 6170691, 5222485, 6538028, 8264010, 7997069, 5877083, 4821067, 6692204, 9794278, 11489091, 11531135, 10886557, 9063776, 5538877, 2710240, 3813307, 7802895, 9868790, 8096419, 6334091, 8516002, 12956770, 15083651, 13891888, 12383758, 12565666, 13551003, 14708615, 17147838, 20732951, 22489353, 20216821, 16006251, 13977319, 15535861, 18775427, 21591900, 23184573, 23105641, 21337446, 19364602, 18846926]
35327A8846926P3067j722751l133560q34362L178045L457472j011389m728687
35319A4124761k862989K596354N881651M416690N45777k258947k706992j737048
35311A7999257r26306r83982j304834j184619j130759j808093k081878k06361
35303H372425K897782M160265K921281K025934K836456K392817j644210n992603
35295A7970147n644230j200819J932878J150936p89327j035570j74213P20504
35287A2930306K470483M918122N112329J566743k101907j431245K419025M249197
35279C0133053K292846R8462M20719J251166j08815k327415k433770p56008M5235
35270B8615473k99129L21324J962503K185095O66664J66459J323263O99326l182073
$$ y = [18846926, 18919993, 17197242, 14063682, 13229320, 16407365, 19864837, 18853448, 14124761, 11261772, 13858126, 19739777, 24156467, 24702244, 22443297, 19736305, 17999257, 17072951, 16088969, 14784135, 13599516, 12468757, 10660664, 8578786, 8372425, 11270207, 15430472, 18351753, 20377687, 23214143, 25606960, 23962750, 17970147, 12325917, 11125098, 13057976, 14208912, 13419585, 12384015, 12209802, 12930306, 15400789, 20318911, 25431240, 26997983, 24896076, 23464831, 25883856, 30133053, 32425899, 32524361, 32945080, 34196246, 34087431, 31760016, 29326246, 28570238, 28615473, 28316344, 28637668, 30600171, 32785266, 33451930, 33618389, 34941652, 35640978, 32458905]
35261C2458905n864284l263378J269917J621636j430588j605049K429935M909958
35253C0527052K497570q01656j070213o67832k748735m710827k456700K333813
35245B2902472M614913L337810J476626O03722J35264K74938J094801L88205k848917
35236C1979834m745368j714881K670304K357679j098689p28564L867648N378341
35228C7966304J353008r34845L751135R841257R709303M931382K254344L168655
35220G2040543M461755N527055P804151R164239O007363n9912m073195n443816
35212I5428183p424273r409874p016097p71231K457800o80246m890181m381152
35204F3312929q91640N64724l43877m37771O87528N02889j592873l376293l306092
$$ y = [32458905, 26594621, 23331243, 24601160, 26222796, 24792208, 23187159, 25617094, 30527052, 33024622, 32222966, 31152753, 30484921, 27736186, 23025359, 20568659, 22902472, 27517385, 30855195, 32331821, 32935543, 33070807, 33345745, 34440546, 34828751, 31979834, 27234466, 25519585, 28189889, 30547568, 29448879, 28720315, 32587963, 37966304, 39319312, 38384467, 42135602, 51976859, 61686162, 66617544, 68871888, 72040543, 76502298, 82029353, 89833504, 98997743, 105005106, 104945194, 100871999, 95428183, 88003910, 78594036, 71577939, 70806708, 73264508, 72584262, 67694081, 63312929, 62421289, 62986013, 62642136, 62204365, 62891893, 63394782, 61801909, 58425616, 55119524]
35195E5119524j865974L6189J392841O50677k309310m482094k970363N28793J578673
35186D7678956o47167k191138l38293K351616J952490j193245l302191k497577
35178D1813451o97652j11515j60694R20925K852434L585201K611609J985939L077042
35169E5876740L940449J880276k186357m379915k989000n03804K40983m29916
35161E1449456p42030m66731k53620K79414J600862K763306K945997L093084L821152
35152F4490890L521370J545986J382195O287688J2688265J3167556O632548K10458
35144A09926956q57053l9204k913508q240884j0447344q159701n013491l296093
35136G0959678j924315o36492j363444m223022n893330l716865J064725N364400
$$ y = [55119524, 53253550, 53289739, 54682580, 55333257, 53023947, 48541853, 45571490, 46100283, 47678956, 47031789, 44840651, 44502358, 46853974, 48806464, 47613219, 44311028, 41813451, 41115799, 41004284, 40843590, 41764515, 44616949, 48202150, 50813759, 52799698, 55876740, 59817189, 61697465, 59511108, 55131193, 52142193, 51638389, 51879372, 51449456, 50707426, 50240695, 49987075, 50266489, 51867351, 54630657, 57576654, 60669738, 64490890, 68012260, 69558246, 70940441, 77228129, 89916394, 103083950, 109716498, 109926956, 109069903, 109030699, 106117191, 97876307, 87428963, 79269262, 74255771, 70959678, 69035363, 68398871, 67035427, 62812405, 56919075, 53202210, 54266935, 59631335]
35128E9631335P208598N737310J079238m056261n225882j265438L112567K467185
35120F8688652k358508n110656k147681K999071M342360R24389k484585j685453
35112F3167589K119935M601288L781440J542487L78860P33902J798729K992562
35104H1116792L708436L115009J416915J78517K68642N72751j08435j023792o13641
35095H8631194J394074M233046P114062Q679322P249160L599237J635978L588048
35087A26124121O107052M474637n07072l751435l400648k578853l236368l073664
35079A20157770m33340K066284J731789L22393R53615K868364L009979J333139
35071A32009993O47364J544645J277954j398328l389775j318443L356985N794969
$$ y = [59631335, 66839933, 72577243, 73656481, 69600220, 64374338, 63108900, 66221467, 68688652, 66330144, 61219488, 59071807, 62070878, 66413238, 67337627, 64853042, 63167589, 65287524, 69888812, 73670252, 75212739, 75591599, 76325501, 78124230, 81116792, 84825228, 87940237, 89357152, 89535669, 89804311, 90377062, 90268627, 89244835, 88631194, 90025268, 94258314, 101372376, 110051698, 117300858, 120900095, 122536073, 126124121, 132231173, 136705810, 136198738, 132447303, 129046655, 126467802, 123231434, 120157770, 119724430, 121790714, 123522503, 123844896, 124798511, 127666875, 130676854, 132009993, 132657357, 134202002, 135479956, 134081628, 130691853, 129373410, 132730395, 138525364]
35063A38525364M000038J189594J087154L021569L913392L664798M967851P656677
35055A68026437P526157K834886j802046j356512K755714N643114O058099N856722
35047A95542571M764888J619204n73882K390793P979564R045224M908509K955286
35039B28632157O938727J1262518J0703851Q446011Q900987R112413M565726j301681
35031B87260709j628100K549943L584585j183377o559470q410558q684997j0276295
35023B56652440j2607533j4269685j5562579j6401109j5191644j1582168p626188
35016A63411534m916314k861691o48034J240458K025753J322838j159276m712900
35008A53702368p012041o700272n729924o311407o601072l200928K520230N032179
$$ y = [138525364, 142525402, 143714996, 144802150, 147823719, 151737111, 155401909, 160369760, 168026437, 175552594, 178387480, 176585434, 175228922, 177984636, 183627750, 189685849, 195542571, 200307459, 201926663, 201352781, 203743574, 211723138, 220768362, 225676871, 228632157, 235570884, 246833402, 257537253, 265983264, 274884251, 283996664, 288562390, 287260709, 285632609, 288182552, 291767137, 290583760, 284024290, 275613732, 266928735, 256652440, 244044907, 229775222, 214212643, 197811534, 182619890, 171037722, 163411534, 158495220, 155633529, 154985495, 156225953, 158251706, 159574544, 158415268, 153702368, 146690327, 139990055, 134260131, 127948724, 121347652, 118146724, 120666954, 125699133]
35000A25699133K294729j352766j552901M11282O32771j417807k683686j124445
34992A20906310J698163K582712L07417k822937l264396m11821K411193K154464
34984A23561105O0851k84841J973387M041208L331899L18777k371540k230506
34976A28400340J369628O242923Q766607P552986N059217M394026N675002O831894
34968A74292623O572082N085804L335607K940753M834275O921267N881965K721272
34960B12585648K735868P593312J1750118J0259859N810207L560952L331841K403787
34952B60031592J904661L644510L951066j738652j0363299j4930392j4958074
34945B27541412j5459822j7210789j6695344j4749394j5766050j8158049j5505001
$$ y = [125699133, 127993862, 126641096, 125088195, 125499477, 126132248, 124714441, 122030755, 120906310, 122604473, 125187185, 125494602, 122671665, 119407269, 118995448, 121406641, 123561105, 123621956, 123337115, 125310502, 129351710, 132683609, 133002386, 130630846, 128400340, 129769968, 136012891, 144779498, 152332484, 157391701, 161785727, 167460729, 174292623, 180864705, 185950509, 189286116, 192226869, 197061144, 203982411, 209864376, 212585648, 215321516, 222914828, 234664946, 244924805, 250735012, 254295964, 257627805, 260031592, 261936253, 265580763, 269531829, 267793177, 257429878, 242499486, 227541412, 212081590, 194870801, 178175457, 163426063, 147660013, 129501964, 113996963]
34938A13996963q475688n427242q550856r713843m290118P69268j420313o649788
34930G0238383p308682m075771k423431k934620k626597j932359l284411n387532
34922D0264980m933654k173569j32640j50199j700139m183899n977437m743268
34914A6270175j233843Q38121P26704J606486L556723K050090l236054n400656
34906A5177746j098109K957203P13799k969469p82748M436900M931754J245391
34898B4612467O6944J733770L45839m534986o297143k367487J697906J216321
34890A6473631j477160k142191l94500J679843K485634J261480j141442j684962
34882A5060333J315731M755742M451290J129687j191543j278588p88349L2444
$$ y = [113996963, 105521275, 100094033, 91543177, 81829334, 77539216, 78308484, 76888171, 70238383, 62929701, 58853930, 56430499, 53495879, 50869282, 48936923, 45652512, 40264980, 35331326, 33157757, 33025117, 32874918, 31174779, 26990880, 21013443, 16270175, 15036332, 15874453, 16601157, 18207643, 21764366, 23814456, 20578402, 15177746, 14079637, 17036840, 17750639, 14781170, 13998422, 18435322, 23367076, 24612467, 24679411, 26413181, 26759020, 22224034, 15926891, 13559404, 15257310, 16473631, 14996471, 12854280, 12459780, 14139623, 16625257, 17886737, 16745295, 15060333, 16376064, 21131806, 25583096, 26712783, 25521240, 24242652, 23454303, 23486747]
34874B3486747J964057L613374L410668L182031M859411N816208L142631K42365
34866D9717492K365398P206941P443552J972712k981817m028763m164655n341448
34858E2189412n194863l141010k708370n141428o682224m842436k063316q32708
34850B1583057k55211L99358k24106j843476j845029l40733q96248m039190n159324
34841G379098j534573L279752M887567L554549J563010p26932l218388m161293
34833A1022790k789014r30781K2715O78500Q64710p57408k794728j375702L454388
34824G395470O064326K828015k576788m493077k380963M48277K000633K370934
34816A1656827J847851R16716K05751j033405l781124n753077l015472L311611
$$ y = [23486747, 25450804, 29064178, 32474846, 35656877, 40516288, 46332496, 49475127, 49717492, 52082890, 59289831, 66733383, 68706095, 65724278, 61695515, 57530860, 52189412, 46994549, 43853539, 41145169, 36003741, 29321517, 24479081, 22415765, 21583057, 21327846, 21727204, 21503098, 19659622, 17814593, 17473860, 16577612, 12538422, 7379098, 5844525, 9124277, 14011844, 17566393, 19129403, 18402471, 15184083, 11022790, 8233776, 7302995, 7325710, 8004210, 8868920, 8111512, 5316784, 3941082, 7395470, 13459796, 16287811, 13711023, 9217946, 6836983, 7285260, 9285893, 11656827, 13504678, 14421394, 14627145, 13593740, 9812616, 4059539, 1044067, 4355678]
34808D355678O456195K778315k935998m158314r44943J968940K254173J262439
34800A1036485M29099P7988N22017J616068K316084K422522L078261M179915L729705
34791B9408144J392181r5527Q48721J815723L74611j617589p87025K242622L187146
34782C6769007l64253n770475q000568m980213k33758O27769l238392o424178
34774H384939m484741o1077J565358L71507J58164J337152J156698j64898q8803
34765H174299K83949j985005m513696k361925K149741J757997k720415k435269
34757a650324L792349N673378j299430o645222j247957P458897P138920p65718
34749A2454893n503430m121817k198324j576177O79957L190247J350925l122879
$$ y = [4355678, 10811873, 13590188, 10654190, 6495876, 5550933, 7519873, 9774046, 11036485, 11465584, 11543572, 12065589, 13681657, 15997741, 18420263, 21498524, 25678439, 29408144, 30800325, 30704798, 31553519, 33369242, 33743853, 32126264, 31339239, 33581861, 36769007, 36404754, 30634279, 22633711, 17653498, 17419740, 18047509, 14809117, 8384939, 3900198, 3839121, 5404479, 5775986, 5934150, 7271302, 8428000, 8263102, 8174299, 8458248, 6473243, 1959547, -402378, 1747363, 3505360, 784945, -1650324, 2142025, 7815403, 6515973, -129249, -1377206, 6081691, 13220611, 12454893, 6951463, 2829646, 631322, -944855, -264898, 2925349, 4276274, 1153395]
34741A153395l733296j26435J664105j72267j232836K88789J436164J534290K875594
34732C687503L878369M52136m795016m054044K932002O997361L581230o76506
34724A2003035K04571K194549L4462k691470m01041L492408J597324m727388o773958
34715D932492j823975L140524K261271j586500k761899j061462M9444n0035Q43620
34706C943480K471817J648703j976661l792509o17965L673453L019642j730925
34698F639035l522662P13838N569029M844813n82284n370616o441085l960565
34690b110497Q10541M944411M414516n45904l565012j37726N237233N015265o59703
34681A3403124m882799m079842j249376J49774j85239j749607l834769l709191
$$ y = [1153395, -2579901, -2706336, -1042231, -1214498, -2447334, -2158545, -722381, 811909, 3687503, 7565872, 8018008, 3222992, -831052, 2100950, 9098311, 12679541, 12003035, 12207606, 14402155, 14436617, 11745147, 11344106, 14836514, 16433838, 11706450, 4932492, 3108517, 6249041, 8510312, 6923812, 4161913, 3100451, 3149895, 3099860, 3943480, 6415297, 8064000, 6087339, 2294830, 1676865, 5350318, 8369960, 6639035, 3116373, 3830211, 9399240, 14244053, 13661769, 8291153, 1850068, -2110497, -1299956, 3644455, 8058971, 7513067, 3948055, 3810329, 9047562, 14062827, 13403124, 8520325, 4440483, 3191107, 3340881, 3155642, 1406035, -2428734, -6137925]
34673f137925O64628N873050O030535R53587l373680k910389M06416K941783L102909
34664G550914P58503k434885k420454K518955P063449M802436j741500m090992
34656A2006426p86014R28762k241195m448286j677664J041446r35500l052773
34648H35202M30475N601303M552000j759120m833573j442786K591142J873231
34640G847874j580333k584732K17375L610513L885802N35486l196763l597484
34632E137738q41388J251364N25136p07740L54816K720567L523302K151130O9902
34623A4184827j770227l091009l333126k522574j688708r68519Q11799L310355
34615D932818L928639J684715p98989j241257q94212j438855j603841J17306J929701
$$ y = [-6137925, -5473297, 399753, 6430288, 7383875, 4010195, 1099806, 1506222, 4448005, 7550914, 8309417, 5874532, 3454078, 5973033, 13036482, 17838918, 16097418, 12006426, 11220412, 12149174, 9907979, 5459693, 3782029, 4823475, 3887975, 835202, 1265677, 6866980, 11418980, 9659860, 4826287, 3383501, 5974643, 7847874, 6267541, 3682809, 3900184, 7510697, 11396499, 11931985, 8735222, 5137738, 4296350, 5547714, 6072850, 5365110, 5719926, 8440493, 11963795, 14114925, 14184827, 12414600, 9323591, 5990465, 3467891, 1779183, 810664, 1622463, 4932818, 8861457, 10546172, 9747183, 8505926, 7611714, 6172859, 4569018, 4686324, 6616025]
34606F616025J303885q26711j621880n04041J043137K162705K431859Q56575k166440
34597I295114l789317k380009j97842L23959L72644J541950J777948j007727l682681
34588B254039j599236L688200N872113K853705q94145j455972j55962K14096k91105
34579A0485733k57505K00977O3692p83715j641030j823167r87175M26430J334204
34570G018444J448412J531908J260691j017178m500690m687215P27048O955694
34562H737114P349802K089981k686618l357489j768044l84200M99240N33495r88408
34553A0024873k601656j989779j25166J06781p39903K90377K155685N25712m033983
34544C612941n146605m09287M148374L047547p49138j379273J178457K833051
$$ y = [6616025, 7919910, 7093199, 5471319, 4967278, 6010415, 8173120, 10604979, 11461554, 9295114, 5505797, 3125788, 2927946, 3251905, 3624549, 5166499, 6944447, 5936720, 2254039, 654803, 4343003, 10215116, 13068821, 12174676, 10718704, 10562742, 10776838, 10485733, 10228228, 10429205, 10492897, 9709182, 8068152, 6244985, 5257810, 5684240, 7018444, 8466856, 9998764, 11259455, 10242277, 5741587, 1054372, 1781420, 8737114, 16086916, 18176897, 15490279, 12132790, 10364746, 9980546, 10479786, 11013281, 10024873, 7423217, 5433438, 5308272, 5415053, 4675150, 4965527, 7121212, 7646924, 3612941, -1533664, -1942951, 2205423, 5252970, 4503832, 3124559, 4303016, 7136067]
34536G136067K165905O32406j015748k006452j72038M171002N896496J525327
34528A8332965m646659o044863k955299n29904N9827J827519M494786L992544
34520A4530916j0522k602920j216268Q54291L75402j355646k039887j906262j535935
34511E093169j69406J716962J902234M14887K17438J990828K350732m13871l027975
34502A0074998k497662o27215l267N83248K851086M751963L775583J450667J71378
34493B0530779j390237m761659o524037k738566L337947M473914j57783m094270
34485H676088l323033p72049L2875r1496N01305Q72207J62573l90276l70331j319607
34475C978256k946220k260759J186847L423619K226740Q91728K265863L289231
$$ y = [7136067, 9301972, 9934378, 8918630, 6912178, 6740140, 10911142, 16807638, 18332965, 13686306, 7641443, 4686144, 4156240, 4216067, 6043586, 10538372, 14530916, 14520394, 11917474, 10701206, 11555497, 11930899, 10575253, 8535366, 6629104, 5093169, 4923763, 6640725, 8542959, 8957846, 9175284, 11166112, 13516844, 13102973, 10074998, 7577336, 6950121, 6946854, 7530102, 10381188, 15133151, 18908734, 20359401, 20530779, 19140542, 14378883, 7854846, 5116280, 8454227, 12928141, 12770358, 8676088, 5353055, 4581006, 4613881, 4522385, 5023690, 5895897, 6058470, 5668194, 5297863, 3978256, 1032036, -1228723, -41876, 3381743, 5608483, 6500211, 8766074, 12055305]
34467A2055305L52515l335300j810881L834672N999817J300530m685053n219103
34459H492502q81436K416000J458067j164449j467084O46654J699377k60961k667489
34450H271181k022521P71204J577275o30329k243720q50884J335798J911838K104548
34441A0224390L089529K480501j197506m020389k012000J710896J282131k302335
34433I255217k909258J30879R60449k215744l492702N99235M579927K684559j683553
34424G909009j413049L171092N236761J736004l312193n436140m379244j759268
34416A752972J376032L488967K695817l92008k447706j401652J194419K638890
34408H905731K108723M11540j464727k454784j555089Q47812K676384K227405
$$ y = [12055305, 12407820, 9072520, 7261639, 11096311, 17096128, 18396658, 13711605, 8492502, 7611066, 10027066, 11485133, 10320684, 8853600, 9500254, 11199631, 10938670, 8271181, 6248660, 7019864, 8597139, 7966810, 5723090, 4872206, 6208004, 8119842, 10224390, 13313919, 15794420, 14596914, 10576525, 8564525, 10275421, 11557552, 9255217, 6345959, 6476838, 7437287, 5221543, 1728841, 2328076, 6908003, 9592562, 7909009, 6495960, 9667052, 14903813, 16639817, 13327624, 7891484, 3512240, 1752972, 3129004, 6617971, 9313788, 8921780, 6474074, 5072422, 6266841, 8905731, 11014454, 11425994, 9961267, 7506483, 5951394, 6799206, 9475590, 11702995]
34400A1702995o567k178187l057739k593801j262301L32489J580392K199592K253551
34391H970424J626806O4868j859021k569148j202590Q35776J103760r37739l117207
34382B915929l123394j140317P89976J469977J516585J675840J427443M6706j669156
34373C909589j911321j91859J733848J829141J69092j382152j716277j647065
34365G92996k090415k244099r22759R96662J428084L37457j44908N73677M39993
34356h33312j248764j735086P21307L060201J853455p47107k35099K579584K753081
34347F168260l83585k199859q38484J94346p80796p02873J058788j49210n405773
34338c039186p624529k187221M212448L287707j660478j696973K685596L430942
$$ y = [11702995, 11696428, 9518241, 6460502, 3866701, 2604400, 2936889, 4517281, 6716873, 8970424, 10597230, 10662098, 8803077, 6233929, 5031339, 5867115, 6970875, 6033136, 2915929, -207465, -1347782, -557806, 912171, 2428756, 4104596, 5532039, 5578745, 3909589, 1998268, 1806409, 3540257, 5369398, 5538490, 4156338, 2440061, 792996, -1297419, -3541518, -4464277, -3467615, -2039531, -1702074, -1846982, -1273305, -833312, -2082076, -3817162, -3095855, -35654, 1817801, 1070694, 835595, 3415179, 6168260, 5784675, 3584816, 2746332, 2940678, 2159882, 1457009, 2515797, 2366587, -3039186, -10663715, -12850936, -8638488, -5350781, -7011259, -8708232, -6022636, -2591694]
34330b591694j13948r4621N118709O914415P70817n834631n255270o81647R96200
34321g71670j6950J79042Q77389o29175k397633j031120J615513J666152M40497
34312f7955J665504L712675J864369k757682l844683J81504L584546K076432j578760
34303D835950k857046j645032n35161m99324q68335j275785j595323j505469j148226
34294g093751o93201Q43639M025209O337312M445540k52725k149855Q04230L670066
34285I936464J729211k265247k306043J521857L160528o5090l444633k173918
34277F093129J577232K287878q98750l806936l726188k268993j651399j683547
34269d077574j319277l05347J552153L994106M660800J410913k817805k092304
$$ y = [-2591694, -2705642, -2800263, 2318446, 9232861, 10003678, 4169047, -1086223, -1767870, -771670, -788620, -609578, 267811, -361364, -2758997, -3790117, -2174604, -508452, -67955, 1597549, 5310224, 7174593, 4416911, 572228, 753732, 4338278, 6414710, 4835950, 1978904, 333872, -201289, -700613, -1568948, -2844733, -4440056, -5945525, -7093751, -7786952, -6943313, -2918104, 3419208, 7864748, 7612023, 5462168, 6266398, 9936464, 11665675, 9400428, 7094385, 8616242, 11776770, 11711680, 8267047, 6093129, 7670361, 9958239, 9059489, 5252553, 1526365, -742628, -2394027, -4077574, -5396851, -5702198, -4150045, -155939, 4504861, 5915774, 3097969, 1005665]
34261A005665L407718N595213k29526p355530o821870m82157K585447J27034j499390
34252c667396R42523L031305J551958l12610K66126R33230k45038p03321J065883
34243B862660J762763n33095j996822K86092K574265Q36772j911525p31525K729476
34234E879061L239348M51105j869620k573006l000553k384936M82772K888698
34226C112869J627147r07846k76558K041672J024666k756891l758866r71785P34657
34217a30935n10627q95555J117720J485139j739207l949910j250752L109130L964432
34208A199435J764609L88476N49656p3729j928362k824476j505496P45319J866517
34199A81949R72783r03575j478641K21245J960096R52856j643915j796372J382216
$$ y = [1005665, 4413383, 10008596, 9779070, 2423540, -4398330, -4880487, -2295040, -2168006, -3667396, -2724873, 306432, 1858390, 1545780, 1811906, 2745136, 2500098, 1796777, 2862660, 4625423, 4092328, 2095506, 2381598, 4955863, 5792635, 3881110, 3149585, 5879061, 9118409, 9569514, 7699894, 5126888, 2126335, -258601, 224171, 3112869, 4740016, 3832170, 3555612, 5597284, 6621950, 3865059, 106193, -865592, -130935, -641562, -1537117, -419397, 1065742, -673465, -4623375, -5874127, -2764997, 1199435, 2964044, 3352520, 3902176, 3828447, 1900085, -924391, -2429887, -1684568, 181949, 1154732, 251157, -1227484, -1006239, 953857, 1906713, 262798, -1533574, -151358]
34190a51358M037585L242798Q81124r4979j64990j283491k773403k327450J7917
34181A383753J656272R25078j021747j939726j054573K41128N7903j534843k375571
34172c662326j273050L2969l27149r75517N02531K930856K772908r9063j830529
34163a928370n46528J080975P88194M67491K476159N139008M873305J098079l330762
34154A0117551n418838m214761j040419J254655P72287q55065k99546K379431
34146B695295L273627O04560j977578n82369K944110L433716n50598n099709n994570
34137a253516l006274Q99665K966168K744390J425970k82446k584337m399332
34129c489712k898950K202490N779383L024574k768088l585388J639965N004216
$$ y = [-151358, 3886227, 7129025, 8010149, 7915170, 7750180, 6466689, 3693286, 1365836, 1383753, 3040025, 3965103, 2943356, 1003630, -50943, 190185, 248088, -1286755, -3662326, -4935376, -4902407, -5229556, -6205073, -5702542, -2771686, 1222, -97841, -1928370, -2474898, -1393923, -605729, -138238, 2337921, 7476929, 12350234, 13448313, 10117551, 4698713, 483952, -556467, 698188, 1470475, 615410, 315864, 2695295, 5968922, 6573482, 4595904, 4013535, 6957645, 10391361, 9840763, 4741054, -1253516, -4259790, -3360125, -393957, 2350433, 3776403, 3493957, 909620, -3489712, -6388662, -4186172, 1593211, 4617785, 1849697, -1735691, -95726, 4908490]
34121D908490J535336l378392k845922R65232J370845j726934k517535P57632
34113i31248L550095K683982L23773o18611k79424j5485n57793k530271n360396
34104c735378n759574j211559N075738P002265L579048l55467j663640k026720
34096I04713k716890k015462J23142N11149j215849n35058M078326O685168K613085
34087H432324l131275k849865J976757L471829Q495k317477p34793L10390j723422
34078C442963k652632J94889K145363q04066m029086j408544L733826L029269
34070C651982l412807o435255j494690M973614N600344J873631l32932R0025O4598
34061D578510j199482j764509j418711j616133j630252O30076L952250M413558
$$ y = [4908490, 6443826, 3065434, 219512, 1184744, 2555589, 828655, -1688880, -931248, 2618847, 5302829, 5626602, 5007991, 4728567, 4713082, 4155289, 1625018, -3735378, -9494952, -10706511, -5630773, 1371492, 4950540, 4595073, 2931433, 904713, -1812177, -3827639, -3704497, -3193348, -4409197, -4944255, -865929, 5819239, 8432324, 5301049, 2451184, 4427941, 7899770, 7908265, 5590788, 4855995, 5166385, 3442963, 790331, 985220, 3130583, 2326517, -1702569, -3111113, 622713, 3651982, 239175, -6196080, -7690770, -2717156, 2883188, 4756819, 4423887, 4513912, 4578510, 3379028, 1614519, 195808, -1420325, -3050577, -2420501, 1531749, 5945307]
34053E945307J432204r47141k99250O72907o61340j838714N89542M252894L187441
34044A2333850l269094q402161o645872p43073K390603P53681j341387l23094
34036e246547K004370K200731N88337J25378J226151R88475j946606m510100k995668
34027g565479J740261N111306M538363K166267J128852J080814m94514l406449
34019D299421m145370j133206K069585J347345j854616k528556L05465K271017
34011F31085Q39179p09040P86888K635569Q19669k788818l148045l48291P27586
34002e54218j184927j743096J312312M149140L095866K00808p04112J82400K14475
33993D968648j050043k072878k193506j518584K29617K439859L062228J381124
$$ y = [5945307, 7377511, 6430370, 6131120, 6804027, 6142687, 4303973, 4893515, 9146409, 12333850, 9064756, 662595, -5983277, -6726350, -4335747, -3582066, -4923453, -5246547, -3242177, -1041446, -453109, -327731, 898420, 1886895, -59711, -4569811, -7565479, -5825218, -713912, 3824451, 5990718, 7119570, 8200384, 7705870, 4299421, 154051, -979155, 1090430, 2437775, 583159, -1945397, -1639932, 631085, 1470264, 761224, 1548112, 4183681, 5003350, 2214532, -933513, -1281804, -554218, -1739145, -3482241, -2169929, 1979211, 5075077, 5275885, 4571773, 4754173, 4968648, 3918605, 1845727, -347779, -1866363, -1636746, 803113, 3865341, 5246465]
33985E246465o38418j455244j883700k249374r14493J953151K709227l52870l202263
33976g87519j665058J992487K580609k0485j194753J164940M193958M551424J872541
33967A2688144k002891m514845l777903p93598R19299j66622j535618j096833
33959b80867n32492j306386j076420J840249M022825J904267j986045l039519
33951d54388j787786j369121r13423J883550M322330K327041j509386j436905
33943A061912J382923Q22990k999231l616392L45194K967946J748213J220164
33935B933719L335540L217540j743624o567405o615021l810577j187525J714124
33927h723229M225854K721202k173064l773499L96453L718505J206705k192464
$$ y = [5246465, 4608047, 3152803, 1269103, -980271, -1894764, 58387, 2767614, 2414744, -787519, -2452577, -460090, 2120519, 2100034, 905281, 2070221, 6264179, 10815603, 12688144, 10685253, 6170408, 2392505, 1598907, 2518206, 2351584, 815966, -280867, -813359, -2119745, -3196165, -1355916, 2666909, 4571176, 2585131, -454388, -2242174, -3611295, -4524718, -2641168, 1681162, 4008203, 2498817, 1061912, 2444835, 3267825, 268594, -3347798, -3002604, -34658, 1713555, 2933719, 6269259, 9486799, 7743175, 1175770, -5439251, -9249828, -10437353, -8723229, -4497375, -1776173, -3949237, -7722736, -7326283, -3607778, -2401073, -4593537]
33919d593537m48286L289330K804667n83844j578785m18445o97748j356198J010192
33910b572654M457272M103740N33121j216015K50980J849804J959494J412959
33902A0778701o1696k946897m915180l630473p66822J116836K710335M290905
33894F575709K314776m032151p555763k471583M925410M616842j215149j825843
33886A332248L904753N503198j298090p233512m540064J478343K400552n15310
33878A032118j013793J200267K012211J037426R65642J619446R61105q4762N91614
33869H321274J453977m18093l557745l822954j234580k7566j632286k361553M80129
33860b799397L960492L359012j412005n458164m398199J034174N790103N481537
$$ y = [-4593537, -5041823, -1752493, 1052174, 468330, -1110455, -1528900, -2226648, -3582846, -2572654, 1884618, 5988358, 6521479, 5305464, 5556444, 7406248, 9365742, 10778701, 10717005, 7770108, 2854928, -775545, -1542367, -425531, 2284804, 6575709, 8890485, 4858334, -2697429, -5169012, -243602, 4373240, 3158091, 1332248, 5237001, 10740199, 9442109, 2208597, -2331467, -853124, 1547428, 1032118, 18325, 1218592, 3230803, 4268229, 5233871, 6853317, 7814422, 7729660, 8321274, 9775251, 9357158, 5799413, 1976459, 741879, 714313, -917973, -3279526, -2799397, 1161095, 4520107, 3108102, -2350062, -6748261, -5714087, 76016, 5557553]
33852E557553O72616l823237m124354j276613O45754r6208j087999J29320J973160
33843a430008J101559j875875k312968J526023M775191K525288k362806k875503
33835i29099J639345M400392J565791k368945k308028o2094K25270n67237O80353
33826B275748K616665J688151r24580r16488J506139J717418j501180l941643
33818B520230k749927k25861O34911J86493L9261L21317N95359Q97466Q97237
33809C116486K72648Q0504J274954K253753Q90247j544219j966376m01848N75809
33800D551958O49423J393775J608112j392745n406457m453213J904930O251990
33792E107773L296323k923783n316035k861561L71417J750731J614080Q68221
$$ y = [5557553, 6230169, 2406932, -1717422, -2994035, -2348281, -2444489, -3532488, -3403168, -1430008, -328449, -2204324, -4517292, -2991269, 1783922, 4309210, 1946404, -929099, 710246, 5110638, 6676429, 4307484, 1999456, 1937362, 2162632, 1595395, 2275748, 4892413, 6580564, 5655984, 4739496, 6245635, 7963053, 6461873, 2520230, -229697, -455558, 179353, 365846, 405107, 726424, 1321783, 2219249, 3116486, 3389134, 3469638, 4744592, 6998345, 7888592, 6344373, 4377997, 3976149, 4551958, 5201381, 6595156, 8203268, 6810523, 1404066, -3049147, -1144217, 5107773, 8404096, 5480313, 164278, -2697283, -2325866, -575135, 1038945, 1907166]
33784A907166N14512J538183K829132J778463j018423j254922K241213M348197
33776A2883521J112148l720486m427945j894796p32814r35277O90886K688580
33768E663817M50259m479756m724133J275628N485417J997388l991322m298852
33760b621554J89201K178953m24461k704937j538702O26617J478343K161901L043023
33751B388384J689695k011443l554531m04202L172610K288007j015703j596062
33743I56755K39901K84958j143620M44207M775805N625402O13271m502884m600165
33734B693630k262731j870735k008157P83981M712731N216218K299463k21513
33726I342887j184126k492118m049100l326546P2582L401722M324658K623986
$$ y = [1907166, 2421678, 3959861, 6788993, 8567456, 7549033, 6294111, 8535324, 12883521, 13995669, 10275183, 5847238, 3952442, 3219628, 2284351, 2975237, 5663817, 6114076, 1634320, -3089813, -1814185, 3671232, 5668620, 1677298, -2621554, -2432353, -253400, -677861, -3382798, -4921500, -4294883, -2816540, -654639, 2388384, 4078079, 2066636, -1487895, -1892097, 1280513, 3568520, 2552817, 956755, 1196656, 1481614, 337994, 782201, 5558006, 11183408, 11796679, 7293795, 2693630, 430899, -1439836, -3447993, -2664012, 2048719, 7264937, 9564400, 9342887, 8158761, 5666643, 1617543, -1709003, -1636421, 1765301, 6089959, 8713945]
33718H713945o69583l104974j656212K958351N160275J686695k791051k107711
33710H189735K067273L392372J055818m11267k18761k041849n424977m943160
33702A665184P1310K941168N9859l256486j508382K660569L743170J741791K8914
33693H147097r43157k419053l043365j027533J670182K013959P81131M12662j5754
33684E576169k767410n679872l865203K433928O545894L839127j952201l581113
33676E49319M43969M606052M223615J257242K30248Q75579p77010m440105m532521
33667B436388N03280L760283j38935n538958l528174M084585P356481L434418
33659A2369368m46368Q5142N98806k086294l494897l63075K307232l29485m088230
$$ y = [8713945, 8044362, 4939388, 3283176, 6241527, 11401802, 13088497, 10297446, 8189735, 10257008, 13649380, 14705198, 14293931, 14075170, 12033321, 6608344, 1665184, 1736494, 4677662, 4737521, 1481035, -27347, 2633222, 6376392, 8118183, 8147097, 7203940, 4784887, 1741522, 713989, 2384171, 4398130, 5179261, 5591923, 5576169, 2808759, -2871113, -6736316, -4302388, 2243506, 6082633, 4130432, 549319, 993288, 5599340, 9822955, 11080197, 11310445, 12186024, 11409014, 6968909, 2436388, 2939668, 6699951, 6561016, 1022058, -2506116, 1578469, 8934950, 12369368, 11923000, 12008142, 12606948, 10520654, 7025757, 6662682, 8969914, 8640429, 4552199]
33650D552199k576807K220804L729656J429882K24398J558785K231755Q79584
33642A4250256m19952m51405j0159L49651j11693k971973o876445o191361J290727
33633a142354Q337502O596820j145150m410588J40539N148453M460879Q25870
33625A8811971p78312p00046j544956k528233j376225J068674J970704N80971
33617A5504548j526259k995394l386975k442582m15876J467115J970510R85379
33609I160466m10377m97738J771816M801203M832085N36889l942445l558832N94305
33600A3287372K536123O3044k065509M69739M760404M796779R3681m031209m274912
33591A5635512l156369l650670l752980Q6986N864906O997653J330082m880643
$$ y = [4552199, 1975392, 4196196, 7925852, 9355734, 9580132, 11138917, 13370672, 14250256, 13830304, 13378899, 13368740, 13718391, 13606698, 10634725, 3758280, -2433081, -1142354, 7195148, 13791968, 12646818, 8236230, 8376769, 13525222, 17986101, 18811971, 18033659, 17333613, 15788657, 13260424, 11884199, 12952873, 14923577, 15504548, 13978289, 10982895, 7595920, 5153338, 4737462, 6204577, 8175087, 9160466, 8750089, 8252351, 10024167, 14825370, 19657455, 20194344, 16251899, 12693067, 13287372, 15823495, 15886539, 13821030, 14290769, 19051173, 23847952, 23941633, 19910424, 15635512, 12479143, 8828473, 5075493, 5162479, 11027385, 18025038, 19355120, 14474477]
33583A4474477m749292L68057L545029J935056q23751j235609q5846P66661J283641
33574A5478423J558696J137723J247059L535096N435107K040992n196607p673589
33566A7562900j563651N222536L807925k727770m490768L76873M295093K671340
33558B5154478n93363j211383p99830k203392m086441l711164j446516N09467
33550A1611856J318753J207806K87014n91950j1495J526780J584981l42584j414505
33541A5176656L23871K601435K109076o44270k188971j024229O27314P8026k431488
33532A4627420m149982k938217L82600K657066J477727k146417m462283k822179
33524B625735J144213K977844O27119k606361k008806K006769M083733J552518
$$ y = [14474477, 9725185, 10093242, 13638271, 15573327, 14749576, 13513967, 13428121, 14194782, 15478423, 17037119, 18174842, 19421901, 22956997, 28392104, 30433096, 25236489, 17562900, 15999249, 21221785, 25029710, 22301940, 17811172, 18188045, 22483138, 25154478, 24561115, 23349732, 22549902, 20346510, 16260069, 12548905, 11102389, 11611856, 12930609, 14138415, 14425429, 13833479, 13821984, 15348764, 16933745, 16591161, 15176656, 15500527, 18101962, 20211038, 19566768, 17377797, 16353568, 16980882, 17058908, 14627420, 10477438, 7539221, 7921821, 10578887, 12056614, 9910197, 5447914, 2625735, 3769948, 6747792, 7374911, 4768550, 2759744, 4766513, 8850246, 10402764]
33516A0402764j592945r98783J241239O24485j604802n63670L148934L612818
33508A4270040m73804l286464j354481J535330J923409K058252L628129L234916
33500B1535327n26480k310486J075875L465899r84093o638968m477750K917187
33492A4056511N153708M49428k931410j257120o5806k518424l567280L56491M609403
33483A4285501M132459J056741k95525k47261q91013j255266j5202Q67321m90274
33474A7147481k078465j341622M74993P73620q6927j36658O11604P79641K53875
33465A6397542q1029J206J37949j09699j332411l172355l350920l79906L092530
33456A1202907L014808r9972j756219p3349K428414L776105M405123L560367n55601
$$ y = [10402764, 8809819, 7811036, 9052275, 9676760, 8071958, 7508288, 10657222, 14270040, 13796236, 10509772, 9155291, 10690621, 12614030, 14672282, 18300411, 21535327, 21008847, 18698361, 19774236, 23240135, 22256042, 15617074, 11139324, 14056511, 19210219, 19659647, 16728237, 15471117, 15405311, 12886887, 9319607, 9676098, 14285501, 18417960, 19474701, 19179176, 18931915, 18040902, 16785636, 16770434, 17637755, 17147481, 15069016, 13727394, 14202387, 14976007, 14889080, 14752422, 15364026, 16143667, 16397542, 16316513, 16317719, 16455668, 16345969, 15013558, 11841203, 8490283, 8110377, 11202907, 14217715, 14117743, 12361524, 12288175, 14716589, 18492694, 22897817, 26458184, 25902583]
33447B5902583n552544n589018K6489M279181J800899l870773o009653l598525
33439G388639n93854M81144L93983Q20273K835575N821877O517386K209445m100766
33430B1773702n975683k452713L71816j196104l188585j550315R51724K79554
33422I013396j474561j6299L562108M825690K827879j59705k992531m917449l517536
33413G150992J401497M700955K201340k406784k628349J136568L078050J460486
33405A6094755J15094J034343J668392J19082k044500k965202k694803j945801
33397I381360j525911k183754k492793O88649O354862P664671J201378n890035
33389A3198427m840197J800719M307967P24779j735276L04494K053487P02133
$$ y = [25902583, 20350039, 14761021, 14787510, 19066691, 20867590, 16996817, 10987164, 7388639, 6794785, 7275929, 7669912, 8490185, 11325760, 17147637, 23665023, 25874468, 21773702, 15798019, 13345306, 13717122, 12521018, 9332433, 7782118, 8733842, 9013396, 7538835, 7522536, 11084644, 15910334, 18738213, 18578508, 15585977, 10668528, 7150992, 8552489, 13253444, 15454784, 13048000, 10419651, 11556219, 14634269, 16094755, 16209849, 17244192, 18912584, 19031666, 16987166, 14021964, 11327161, 9381360, 7855449, 5671695, 3178902, 3867551, 10222413, 17887084, 19088462, 13198427, 8358230, 10158949, 14466916, 15191695, 13456419, 13760913, 15814400, 16516533]
33381A6516533N9328J895530J765585k161063m381260j420918J547518n60119
33373A3261134m027352l007320Q14253K347462K058672L285181M529413K341499
33365B1602942r68577n25490K118441J264025k673095l413450M99414L348189
33357B1252399J975597K33523J183892J840239o88321l709709l820401k431920
33349A5835299k022138j026659K636487O160615N250502J044194j351534l23540
33341B6203226Q15399l04013j907524j380651J387801M743227O913884O356298
33333D2827647K671203k096565m762622m219910k241563j110320j640156l135303
33325B6292411l862058k136320J398650L340751J382554k225813l437697j721376
$$ y = [16516533, 16575861, 18471391, 20236976, 18075913, 13694653, 12273735, 13821253, 13261134, 9233782, 6226462, 7040715, 9388177, 11446849, 14732030, 19261443, 21602942, 20634365, 20108875, 22227316, 23491341, 20818246, 17404796, 17904210, 21252399, 23227996, 23461519, 24645411, 26485650, 25797329, 22087620, 18267219, 15835299, 13813161, 12786502, 15422989, 21583604, 26834106, 27878300, 26526766, 26203226, 27018625, 26714612, 24807088, 23426437, 24814238, 29557465, 36471349, 42827647, 45498850, 43402285, 38639663, 34419753, 32178190, 31067870, 29427714, 26292411, 22430353, 20294033, 21692683, 25033434, 26415988, 24190175, 20752478, 19031102]
33317A9031102L42735J880574M168038O336855N254965R55738k116714j308256
33309C4545037O77971P09519k43198m46952j281751l790265m851931j739576K075900
33300B5654754J175649l287275n044487k138001R09106Q13417k78076O4282L93920
33291A8263289r31832k016433n86759J927499K470996O04727j717836l000999
33283A5012652k857449j315816P78692J973542K089729K434373L247758K987969
33275B4351450J327567N68165K409468N270312O411719M876755J138814l651225
33267D2703025o613331m604205P27319K604034k514555q907821q403952j336833
33259A3653681M435306M614498K856798L336003M548821L230337K19698j177526
$$ y = [19031102, 19373837, 21254411, 25422449, 31759304, 37014269, 37970007, 35853293, 34545037, 35223008, 35932527, 35689329, 35242377, 33960626, 30170361, 25318430, 23578854, 25654754, 26830403, 23543128, 18498641, 16360640, 17269746, 18083163, 17805087, 17869369, 18263289, 17331457, 15315024, 14728265, 16655764, 19126760, 19731487, 18013651, 15012652, 12155203, 10839387, 11618079, 13591621, 15681350, 18115723, 21363481, 24351450, 25679017, 26247182, 28656650, 33926962, 40338681, 45215436, 46354250, 42703025, 36089694, 31485489, 32212808, 34816842, 32302287, 23394466, 14990514, 13653681, 18088987, 22703485, 25560283, 28896286, 33445107, 36675444, 36895142, 35717616]
33251C5717616j50102J597937L067464M160475L946356J804599m39753n01588
33243D9203004N95436k60097l242363m997772l793160j966797j667381j321254
33235C2549616R89136L160892J700860k548196n017173l481609k23279J912364
33227B9042611K350168J351735q29770k498665j502775J180239K028174L19995
33219C1441712o39911Q53554K058220Q21771o78807k85045J66446r93091j201708
33210C1543141J530473L602705J327612j854212l60586L786858L730887r69946
33202D2336932l817821k120444k47460r37016j185508P75523J662241l85970j933141
33193C4147336n94090M48194j755917m649470m660300k458132j08353K483564
$$ y = [35717616, 35567514, 37165451, 40232915, 44393390, 48339746, 50144345, 49704592, 49203004, 49798440, 49538343, 46295980, 41298208, 37505048, 35538251, 33870870, 32549616, 33538752, 36699644, 38400504, 35852308, 30835135, 27353526, 27130247, 29042611, 31392779, 32744514, 31914744, 29416079, 27913304, 29093543, 31121717, 31441712, 30801801, 31655355, 33713575, 34535346, 33856539, 33571494, 33737940, 32744849, 31543141, 33073614, 36676319, 38003931, 36149719, 35789133, 39575991, 43306878, 42336932, 38519111, 36398667, 36151207, 35214191, 34028683, 34804206, 36466447, 36080477, 34147336, 33553246, 34001440, 32245523, 27596053, 22935753, 20477621, 20369268, 22852832]
33185B2852832M728751L748819m44089k839408o47527K025715J044556j099141
33177B9370508l89220J808547K458249K799184M476052M226914o18968n276890
33169C8854376l790686R52554J561070j902254k858348K39506K089629K34540
33161C5380387j768444j670303j308783r63282J571995M798491L801047j266536
33153C8574572m120620k107732O8119q73072j585870N94344K220229L95514j496003
33144C1669481k02638R84331j556563m150363j530268L551947M074246p2878k294733
33135C0472562Q5404K781369K669846K060598K946459L008594M06611k188275
33127D2243168j966892q07183j805183l617823k629283O94210K254478J009723
$$ y = [22852832, 27581583, 31330402, 30886313, 28046905, 27399378, 29425093, 30469649, 29370508, 28981288, 30789835, 33248084, 36047268, 40523320, 44750234, 44131266, 38854376, 35063690, 36016244, 37577314, 35675060, 32816712, 33056218, 35145847, 35380387, 33611943, 31941640, 30632857, 29669575, 31241570, 36040061, 39841108, 38574572, 34453952, 32346220, 32414339, 31541267, 29955397, 30549741, 32769970, 33165484, 31669481, 31466843, 32451174, 30894611, 26744248, 25213980, 28765927, 32840173, 32767295, 30472562, 30557966, 33339335, 36009181, 38069779, 41016238, 44024832, 44431443, 42243168, 40276276, 39469093, 37663910, 34046087, 31416804, 32111014, 34365492, 35375215]
33119C5375215N28413K471319L025663q29991m943169k977213L546481O059838
33111D2256556Q70913n242969m483288J341605M208406J075139l529182m913146
33103C1584034l100761k04374K487361L779450K622087J55284j116516q78242
33095C5328323q76299j008333P73414L851768M342311R26910k423766j984645
33087C8929683O39127J652089N32700n99241q50983p50786k07898R61973J815544
33078D2122208J909337K548896M105059M087288Q01487k974560l474236j591839
33070D7533640j074122k086713j201112K145293L985207K025459o93360o84228
33062D9950064P87388L08657k216943l789426k698754r5377J947834J866325q16745
$$ y = [35375215, 35903628, 38374947, 41400610, 40570619, 35627450, 32650237, 36196718, 42256556, 43127469, 37884500, 33401212, 34742817, 38951223, 40026362, 36497180, 31584034, 28483273, 28278899, 30766260, 34545710, 37167797, 37323081, 36206565, 35328323, 34452024, 33443691, 34217105, 38068873, 42411184, 43338094, 40914328, 38929683, 39568810, 41220899, 41753599, 41154358, 40303375, 39552589, 39344691, 40306664, 42122208, 44031545, 46580441, 50685500, 54772788, 55574275, 52599715, 49125479, 47533640, 46459518, 44372805, 43171693, 45316986, 49302193, 51327652, 50634292, 49950064, 50737452, 51046109, 48829166, 45039740, 42340986, 42245609, 44193443, 46059768, 45243023]
33053D5243023m198907m534084o25090L484048L291161K95990k91068K087170
33045D4752243K331330j685873m825324k264157L109971N372483M077664K663524
33037E3531861J059536l351726q348570p857140j605645K978514J234011k347347
33029C5293494j879174J126706J578052p26799j951660q77078N78744J656878
33021C4799163K616832J844268j789609m766830k566786K755012M146952m55271
33013C6583731m924960l619006J184278L345542J223913j288939p05849J848941
33005C3647651K669761N81414j067378J292548N519480N226232j210783o800621
32997C9858304m869063J325426L428363M06981q58968K669113N449542K763329
$$ y = [45243023, 41044116, 36510032, 35884942, 39368990, 42660151, 42956141, 42665073, 44752243, 47083573, 45397700, 40572376, 38308219, 41418190, 46790673, 50868337, 53531861, 54591397, 51239671, 42891101, 35033961, 33428316, 36406830, 37640841, 35293494, 33414320, 34541026, 36119078, 35392279, 33440619, 32563541, 33142285, 34799163, 37415995, 39260263, 37470654, 32703824, 30137038, 32892050, 37039002, 36583731, 31658771, 28039765, 29224043, 32569585, 33793498, 32504559, 31798710, 33647651, 36317412, 36898826, 35831448, 37123996, 42643476, 47869708, 46658925, 39858304, 34989241, 36314667, 39743030, 40150011, 39291043, 41960156, 47409698, 50173027]
32989E0173027j922315l117646j482200q08461q54981J092668L860487L417195
32981E0357774l09459k739555j390519Q23849M62619j485536j672922M88132K238107
32972D6772490J594812m0730k65339O37812J68261k359649m318179l309138m56438
32963C8423902J437511J546586Q97475j7658j153329j621693j066671j142126
32955C7303997k737091l137569K89813M703286M715873M13090k645164j943573
32947C6962662j073890k702625m008143k095947Q07368J375093O25350J247265
32939C1137133K400985J455378r96148j832041n6113K399732L637184L060466
32931D1206576P87636j974648l152070k261222j164007q87253n0555J664201J557037
$$ y = [50173027, 48250712, 45133066, 43650866, 42842405, 41987424, 43080092, 46940579, 50357774, 50048315, 47308760, 45918241, 46742090, 47204709, 45719173, 44046251, 44534383, 46772490, 48367302, 48326572, 48061233, 48699045, 48867306, 46507657, 42189478, 38880340, 38423902, 39861413, 41407999, 42305474, 42287816, 41134487, 39512794, 38446123, 37303997, 34566906, 31429337, 31719150, 36422436, 41138309, 41551399, 38906235, 36962662, 35888772, 33186147, 29178004, 27082057, 27889425, 29264518, 29889868, 31137133, 33538118, 34993496, 33997348, 32165307, 32109194, 34508926, 38146110, 41206576, 41994212, 40019564, 36867494, 34606272, 33442265, 32555012, 32504457, 34168658, 35725695]
32922C5725695j633764m288307k763564P28370J494380k57731l67980J963745
32914C0600844L133320J540267j27689j91657p67045l033529l818159j86569N232218
32905C2382001P060721M019126j69803k115362j952728j007354O49441K738208
32897D1604250L189355O64478k431461k488060q3100O04247j414421j804948J918973
32888C9759313N152002K655702k710743l691904L51986K930770J197419O0896
32880D5705441L262229O976335O263605K635911O66777J217448K569708M661253
32872G3958707P467936Q294893N513074K317260J989896K091812j395661o545102
32864I3692815q053560n832351m779561o381869o674079l330834O18669J689454
$$ y = [35725695, 34091931, 29803624, 27040060, 27768430, 29262810, 29005079, 28637099, 30600844, 33734164, 35274431, 35146742, 34955085, 34188040, 31154511, 27336352, 27149783, 32382001, 39442722, 43461848, 43292045, 41176683, 39223955, 38216601, 38866042, 41604250, 44793605, 45458083, 43026622, 40538562, 40455462, 41059709, 39645288, 37840340, 39759313, 44911315, 47567017, 44856274, 41164370, 41516356, 44447126, 45644545, 45705441, 48967670, 55944005, 62207610, 64843521, 65510298, 66727746, 69297454, 73958707, 81426643, 89721536, 95234610, 97551870, 99541766, 101633578, 100237917, 93692815, 85639255, 79806904, 75027343, 68645474, 61971395, 58640561, 59259230, 60948684]
32856F0948684K60752j560547k920627l651331l428967k495427j320508K57112
32848D6089141J600299M81995l234489n121046j783519K830764K316319k109718
32840D1069746l131363R34277L432805L68551l291874k119779J378595J915028
32832D0555986r6086q56249k04253m80495j056684J85400J718378N12345j697391
32823C8580951k02845M540770O395767K562365k084352k243987M50523Q43282
32815D8842474j830179l468022j396031K456050M681880L911311Q19009k889472
32807E1127020m682327k693617J556262L808166K243644L70162K345921O755879
32799F0831110Q301156N295952J768553J320995K551574K454390J215605R20864
$$ y = [60948684, 61209436, 59648889, 56728262, 53076931, 49647964, 47152537, 45832029, 46089141, 47689440, 48171435, 44936946, 39815900, 38032381, 40863145, 43179464, 41069746, 37938383, 38872660, 42305465, 42674016, 39382142, 37262363, 38640958, 40555986, 40459900, 39603651, 39399398, 38918903, 37862219, 38047619, 39765997, 40278342, 38580951, 38378106, 42918876, 49314643, 51877008, 49792656, 47548669, 47999192, 48842474, 47012295, 43544273, 42148242, 44604292, 49286172, 53197483, 54016492, 51127020, 46444693, 43751076, 45307338, 49115504, 51359148, 51729310, 54075231, 60831110, 69132266, 74428218, 76196771, 77517766, 80069340, 82523730, 83739335, 84660199]
32791H4660199J692247J892162P15158j645301m813095p219689o456841l059231
32783F5765609j406368l740107o000267l736850L68201K50123l863307n732599
32775D1904435k887183K17529l400j299855p56132K48021o68760k644078l620156
32766C0490421l397338k201123M73492L229666K583232j782201n012881l465710
32758B0917558J24133J231972K12492M81255K521013L779038K814979K4642l932094
32749B8174988p065631n780855K81343N398558M524114R52191J631683O085988
32741C4202379O720471P08452n324558n102104j258065K5750j558903j654482
32733B6758940O24949J401755j233557l893446k872030O07373K361522R34396
$$ y = [84660199, 86352446, 88244608, 88959766, 87314465, 82501370, 75281681, 68824840, 65765609, 64359241, 60619134, 54618867, 50882017, 51250218, 51500341, 47637034, 41904435, 39017252, 39234781, 39231381, 37931526, 37175394, 37423415, 36754655, 34110577, 30490421, 27093083, 24891960, 25365452, 28595118, 31178350, 29396149, 24383268, 20917558, 21041691, 22273663, 22486155, 22967410, 25488423, 29267461, 32082440, 32107082, 28174988, 21109357, 15328502, 15609845, 21008403, 25532517, 26484708, 28116391, 34202379, 40922850, 41631302, 36306744, 31204640, 29946575, 29972325, 28413422, 26758940, 27383889, 28785644, 27552087, 23658641, 20786611, 21393984, 23755506, 24689902]
32725B4689902r94702p07855R75500J154281j164059l931722m744486l298881
32717A1977978q71570J286159K247906J360128p81325k002260n70989K644261
32709A5290288M970297M612837J871066j642575l962882l585061p07902K375581
32701A9221649L101804R34699k493724m979081n037600k596523O73142K462916
32693A1287282K087516Q93868K7636o64518q36975Q92505L982591M905004J756078
32684B4330987k058287k111831N63872J214427j284773l230079k349214p87457
32676A4287645p64437j308239r97098m24477n0932J151865K879357K474767q78536
32667A6369915l808307l209456n12439J097309J174094R12531J54268j200760
$$ y = [24689902, 23695200, 22987345, 23962845, 25117126, 23953067, 20021345, 15276859, 11977978, 11106408, 12392567, 14640473, 16000601, 15219276, 13217016, 12646027, 15290288, 20260585, 24873422, 26744488, 25101913, 21139031, 17553970, 16846068, 19221649, 22323453, 23258152, 20764428, 15785347, 10747747, 8151224, 8824366, 11287282, 13374798, 14268666, 14296302, 13631784, 12794809, 13687314, 17669905, 22574909, 24330987, 22272700, 20160869, 20724741, 21939168, 20654395, 17424316, 15075102, 14287645, 13523208, 12214969, 11217871, 10793394, 10742462, 11894327, 14773684, 17248451, 16369915, 12561608, 9352152, 8839713, 9937022, 11111116, 12023647, 12177915, 10977155]
32659A0977155j149492J347037L285716J591312j629211k122130j71113O26126
32651A2755400k8627N55097J662262l45184m256421l679441K764114P410222M163397
32642B1000819k275730l491935L82020K175414p56666l561677k444417K08553
32634A1236381Q99783J42373L0997M15798J92859k07107r8983l03910j353994
32625A0954197j671331P3235K165737K052316N02664O68521K981545L985941J422354
32616B3135179k070576k578256o25082k61089k776276m667258l012261J67139
32608G311520J288499N68389O86872J665332J169422n95634q33055M64980j07396
32599A1618929k947230l360162R73025M985895L194693j828977l323292l38518
$$ y = [10977155, 9827663, 11174700, 14460416, 16051728, 14422517, 12300387, 12129274, 12755400, 12726773, 13281870, 14944132, 14598948, 10342527, 6663086, 9427200, 16837422, 21000819, 18725089, 15233154, 15615174, 17790588, 17033922, 13472245, 11027828, 11236381, 12136164, 12278537, 12309534, 12725332, 12918191, 12711084, 12612101, 12308191, 10954197, 9282866, 9356101, 11521838, 13574154, 14076818, 14745339, 17726884, 21712825, 23135179, 21064603, 18486347, 17861265, 17600176, 14823900, 10156642, 7144381, 7311520, 8600019, 9168408, 9855280, 11520612, 12690034, 12094400, 11261345, 11726325, 11618929, 8671699, 5311537, 6284562, 11270457, 14465150, 12636173, 9312881, 8974363]
32591H974363J952901Q05081j185616j727303j717015j564478J34295K703295
32583H375523K916744L45624j209894J94567J418005k01897k116194q93666J994049
32574A0822861K649099P55072p36543n26951j03929o87576j884594k998763l570818
32565C717858l064400j551949Q042J232780K722579M035630L317287M98091j355526
32556I560392k1771K443587K576786K25557j873103j838054J20785K755511M054165
32547A8003855K096751k181263m697000k962163M54393J470571j88016j673527
32539A0323601j395551o9187J271144J832687Q99758p77233j006274N22489J137333
32530A2738767n04235j884736j083260l62694j684438k221074Q54681M317008
$$ y = [8974363, 10927264, 11732345, 10546729, 8819426, 7102411, 5537933, 5672228, 8375523, 11292267, 11637891, 10427997, 10622564, 12040569, 11838672, 9722478, 8828812, 10822861, 13471960, 14227032, 13490489, 12963538, 12859609, 12172033, 10287439, 7288676, 3717858, 653458, -898491, -890449, 342331, 3064910, 7100540, 10417827, 10915918, 9560392, 9538621, 11982208, 14558994, 14784551, 12911448, 11073394, 11194179, 13949690, 18003855, 20100606, 17919343, 13222343, 10260180, 10714573, 12185144, 11997128, 10323601, 8928050, 8858863, 10130007, 11962694, 12862452, 12085219, 11078945, 11601434, 12738767, 12234532, 10349796, 9266536, 8903842, 7219404, 4998330, 5853011, 10170019]
32522A0170019L456733K52996M11434L699318M232333J63970l707431l681492
$$ y = [10170019, 13626752, 13879748, 14291182, 17990500, 22222833, 22386803, 18679372, 14997880]
$$ [...]
##END NTUPLES=NMR SPECTRUM
##END=
