##TITLE=31Pdec_AT-40_P_2_rasb
 DMSO-d6,CD3ONa, 1124 sc
 22.8.2022
##JCAMPDX= 6.0         $$ Bruker NMR JCAMP-DX V2.0
##DATA TYPE= NMR SPECTRUM
##DATA CLASS= NTUPLES
##ORIGIN= UXNMR, Bruker Analytische Messtechnik GmbH
##OWNER= root
$$ XWIN-NMR		Version 3.5
$$ Mon Aug 22 14:58:26 2022 Russian Standard Time (UT+4h)  she@DPX200
##.OBSERVE FREQUENCY= 81.013821
##.OBSERVE NUCLEUS= ^31P
##.ACQUISITION MODE= SIMULTANEOUS
##.ACQUISITION SCHEME= undefined
##.AVERAGES= 1124
##.DIGITISER RES= 16
##SPECTROMETER/DATA SYSTEM= spect
##.PULSE SEQUENCE= zgpg30
##.SOLVENT NAME= CDCl3
##.SHIFT REFERENCE= (INTERNAL, CDCl3, 0, 248.564)
##AUDIT TRAIL= $$ (NUMBER, WHEN, WHO, WHERE, WHAT)
$$ ##TITLE= Audit trail, XWIN-NMR		Version 3.5
$$ ##JCAMPDX= 5.01
$$ ##ORIGIN= Bruker BioSpin GmbH
$$ ##OWNER= she
$$ F:/spectra/data/she/nmr/P31/1/pdata/1/auditp.txt
$$ ##AUDIT TRAIL=  $$ (NUMBER, WHEN, WHO, WHERE, WHAT)
(   1,<2022-08-22 14:41:07.70 +0400>,<she>,<DPX200>,
      <continue with go, POWCHK disabled, PULCHK disabled
       configuration hash MD5:
       00 E9 B6 7A A2 85 ED C7 34 08 36 98 17 FE 4E 26
       data hash MD5: 32K
       17 5B 4B 9D 33 C6 35 9C 0D 2D EB 83 77 DA DB 96>)
(   2,<2022-08-22 14:56:53.48 +0400>,<she>,<DPX200>,
      <Start of raw data processing
       efp BC_mod = 2 LB = 1 FT_mod = 6 PKNL = 1 PHC0 = -10362.2 PHC1 = 241.0563 SI = 64K 
       data hash MD5: 64K
       2F 1E 92 2A 0E 98 C4 D9 21 B3 1D E9 FB 2D 55 F8>)
(   3,<2022-08-22 14:57:23.26 +0400>,<she>,<DPX200>,
      <pk PHC0 = 126.6096 PHC1 = -264.8 
       data hash MD5: 64K
       4F 6C 90 FB 4A 33 E0 28 FA 6D 56 89 4F C6 0B 1B>)
(   4,<2022-08-22 14:57:32.87 +0400>,<she>,<DPX200>,
      <abs ABSG = 5 
       data hash MD5: 64K
       18 6D 06 27 BD CE BD 89 C5 21 51 BF D2 21 4F CE>)
$$ ##END=
$$ 
$$ hash MD5
$$ F3 AC 56 5B 57 9B F7 02 4B B3 7A AF 8F 51 13 2F
##$RELAX= 
##$RELAX= 
##$RELAX= 
##$RELAX= 
##$RELAX= 
##$RELAX= 
##$RELAX= 
##$RELAX= 
$$ Bruker specific parameters
$$ --------------------------
##$DU= <F:/spectra>
##$EXPNO= 1
##$NAME= <P31>
##$PROCNO= 1
##$TYPE= <nmr>
##$USER= <she>
##$AMP= (0..31)
100 100 100 100 100 100 100 100 100 100 100 100 100 100 100 100 100 100 
100 100 100 100 100 100 100 100 100 100 100 100 100 100 
##$AQSEQ= 0
##$AQ_mod= 1
##$AUNM= <au_zg>
##$AUTOPOS= <>
##$BF1= 81.014009
##$BF2= 200.13
##$BF3= 200.13
##$BF4= 200.13
##$BF5= 200.13
##$BF6= 200.13
##$BF7= 200.13
##$BF8= 200.13
##$BYTORDA= 1
##$CFDGTYP= 0
##$CFRGTYP= 5
##$CHEMSTR= <none>
##$CNST= (0..31)
1 1 145 1 1 1 1 1 1 1 1 1 1 1 1 1 1 1 1 1 1 1 1 1 1 1 1 1 1 1 1 1 
##$CPDPRG= <waltz16>
##$CPDPRG1= <>
##$CPDPRG2= <waltz16>
##$CPDPRG3= <>
##$CPDPRG4= <mlev>
##$CPDPRG5= <mlev>
##$CPDPRG6= <mlev>
##$CPDPRG7= <mlev>
##$CPDPRG8= <mlev>
##$CPDPRGB= <>
##$CPDPRGT= <>
##$D= (0..31)
0 1 0 0 0 0 0 0 0 0 0 0.03 2e-05 3e-06 0 0 0 0 0 0 0 0 0 0 0 0 0 0 0 0 
0 0 
##$DATE= 1661163088
##$DBL= (0..7)
120 120 120 11 120 120 24 19 
##$DBP= (0..7)
150 150 150 150 150 150 150 150 
##$DBP07= 0
##$DBPNAM0= <>
$$ [...]
##$SUBNAM3= <"">
##$SUBNAM4= <"">
##$SUBNAM5= <"">
##$SUBNAM6= <"">
##$SUBNAM7= <"">
##$SUBNAM8= <"">
##$SUBNAM9= <"">
##$SW= 501.771253377433
##$SWIBOX= (0..15)
0 1 3 0 0 0 0 0 0 0 0 0 0 0 0 0 
##$SW_h= 40650.406504065
##$TD= 32768
##$TD0= 1
##$TE= 0
##$TE2= 300
##$TE3= 300
##$TEG= 300
##$TL= (0..7)
0 120 53 12 22 120 120 120 
##$TP= (0..7)
150 150 150 150 150 150 150 150 
##$TP07= 0
##$TPNAME0= <>
##$TPNAME1= <>
##$TPNAME2= <>
##$TPNAME3= <>
##$TPNAME4= <>
##$TPNAME5= <>
##$TPNAME6= <>
##$TPNAME7= <>
##$TPOAL= (0..7)
0.5 0.5 0.5 0.5 0.5 0.5 0.5 0.5 
##$TPOFFS= (0..7)
0 0 0 0 0 0 0 0 
##$TUNHIN= 0
##$TUNHOUT= 0
##$TUNXOUT= 0
##$USERA1= <user>
##$USERA2= <user>
##$USERA3= <user>
##$USERA4= <user>
##$USERA5= <user>
##$V9= 5
##$VALIST= <valist>
##$VCLIST= <CCCCCCCCCCCCCCC>
##$VD= 0
##$VDLIST= <DDDDDDDDDDDDDDD>
##$VPLIST= <PPPPPPPPPPPPPPP>
##$VTLIST= <TTTTTTTTTTTTTTT>
##$WBST= 1024
##$WBSW= 4
##$XGAIN= (0..3)
0 0 0 0 
##$XL= 0
##$YL= 0
##$YMAX_a= 271502
##$YMIN_a= -160269
##$ZGOPTNS= <>
##$ZL1= 120
##$ZL2= 120
##$ZL3= 120
##$ZL4= 120
##$ABSF1= 248.5645
##$ABSF2= -253.2056
##$ABSG= 5
##$ABSL= 3
##$ALPHA= 0
##$AQORDER= 0
##$ASSFAC= 0
##$ASSFACI= 0
##$ASSFACX= 0
##$ASSWID= 0
##$AUNMP= <proc_1d>
##$AZFE= 0.1
##$AZFW= 0.5
##$BCFW= 0
##$BC_mod= 2
##$BYTORDP= 0
##$COROFFS= 0
##$CY= -3
##$DATMOD= 1
##$DC= 0
##$DFILT= <>
##$DTYPP= 0
##$F1P= 0
##$F2P= 0
##$FCOR= 1
##$FTSIZE= 65536
##$FT_mod= 6
##$GAMMA= 0
##$GB= 0
##$INTBC= 1
##$INTSCL= 5.30512e-09
##$ISEN= 30
##$LB= 1
##$LEV0= 0
##$LPBIN= 0
##$MAXI= 10000
##$MC2= 0
##$MEAN= 0
##$ME_mod= 0
##$MI= 50
##$NCOEF= 0
##$NC_proc= -4
##$NLEV= 6
##$NOISF1= 182.463
##$NOISF2= 159.3651
##$NSP= 0
##$NTH_PI= 0
##$NZP= 0
##$OFFSET= 248.5645
##$PC= 4
##$PHC0= -10235.59
##$PHC1= -23.74368
##$PH_mod= 1
##$PKNL= yes
##$PPARMOD= 0
##$PSCAL= 0
##$PSIGN= 0
##$REVERSE= no
##$SF= 81.0140089999908
##$SI= 65536
##$SIGF1= 159.3651
##$SIGF2= -187.1042
##$SINO= 113.3802
##$SIOLD= 16384
##$SREGLST= <1H.CDCl3>
##$SSB= 0
##$STSI= 65536
##$STSR= 0
##$SW_p= 40650.406504065
##$SYMM= 0
##$S_DEV= 0
##$TDeff= 32768
##$TDoff= 0
##$TI= <>
##$TILT= no
##$TM1= 0
##$TM2= 0
##$TOPLEV= 0
##$USERP1= <user>
##$USERP2= <user>
##$USERP3= <user>
##$USERP4= <user>
##$USERP5= <user>
##$WDW= 1
##$XDIM= 65536
##$YMAX_p= 386630520
##$YMIN_p= -17045757
$$ End of Bruker specific parameters
$$ ---------------------------------
##NTUPLES= NMR SPECTRUM
##VAR_NAME=  FREQUENCY,     SPECTRUM/REAL,   SPECTRUM/IMAG
##SYMBOL=    X,             R,               I
##VAR_TYPE=  INDEPENDENT,   DEPENDENT,       DEPENDENT
##VAR_FORM=  AFFN,          ASDF,            ASDF
##VAR_DIM=   65536,         65536,           65536
##UNITS=     HZ,            ARBITRARY UNITS, ARBITRARY UNITS
##FACTOR=    0.620285442955139, 1,           1
##FIRST=     20137.2065510736, 0,            0
##LAST=      -20513.1999529914, 0,           0
##MIN=       -20513.1999529914, -17045757,   0
##MAX=       20137.2065510736, 386630520,    0
$$ Real data points
##PAGE= N=1
##DATA TABLE= (X++(R..R)), XYDATA
$$ [...]
37847h1686j646222j68487J028227N02958m56362n88514k55773J14705Q36991
37838g14163J580449J173037m15404j539565j134013p7851M45028N25306N83750
37829D26574K56175o00715r78836j66985P91340N44354l96396n07447K62591N99984
37819B30639J48796j35061K2410j60073n48053J32425J711316J919701k29760
37810C092340k330998j839092J12217N77572n87985q26466P47136K016846J390166
37801B351736n515o64278r51914j604870j834655o49822J155461J965818J503737
37792A265698O63407j15571r72349j600145j368212l51552O15344Q27016J96540
37783h39824q00943j339099q98832N4718O89414J072133J728467K009301O64210
$$ plain form
37847 -81686 -1727908 -1896395 -868168 -365210 -821572 -1410086 -1665859 -1551154 -714163
37838 -714163 866286 2039323 1623919 84354 -1049659 -1127510 -682482 -157176 426574
37829 426574 682749 82034 -896802 -1063787 -272447 271907 -124489 -631936 -369345 230639
37819 230639 379435 244374 266784 106711 -441342 -308917 1402399 3322100 3092340
37810 3092340 761342 -1077750 -965533 -387961 -975946 -1802412 -1055276 961570 2351736
37801 2351736 2346221 1681943 730029 -874841 -2709496 -3359318 -2203857 -238039 1265698
37792 1265698 1929105 1813534 841185 -758960 -2127172 -2478724 -1863380 -1036364 -839824
37783 -839824 -1640767 -2979866 -3878698 -3823980 -3134566 -2062433 -333966 1675335 2339545
37774B339545j538990j912681L11665K331908J610431n62685j394643o79995j6765
37765D87790N00550J644916K146361R8729k903958k905462L98030K545894Q30114
37756B842964j595727p43927J969677K164420m55383j666255O03332L009101J769402
37747G897604j847215l460982j615121P83094R26808l89327p19012K64882O66046
37738B506777n60955k136437k310430r86467N20435J045982M35308n31170p25459
37729b742416K19064J218367R44855j87520m32414N70164J030465j49686j363113
37720h92234o78747R74321J011393r80308k664070k227865m43797R33389J344903
37711c623015J337695J318401J158984O33618j57726p03253n16328J77728N73756
$$ plain form
37774 2339545 800555 -1112126 -800461 1531447 3141878 2579193 1184550 504555 487790
37765 487790 988340 2633256 4779617 4878346 1974388 -931074 -533044 2012850 2842964
37756 2842964 1247237 503310 2472987 4637407 4182024 2515769 3119101 6128202 7897604
37747 7897604 6050389 2589407 974286 1757380 2684188 2294861 1575849 1840731 2506777
37738 2506777 1945822 -190615 -2501045 -3487512 -2967077 -1921095 -1485787 -2016957 -2742416
37729 -2742416 -2523352 -1304985 -360130 -547650 -980064 -409900 620565 470879 -892234
37720 -892234 -1570981 -596660 414733 -565575 -3229645 -5457510 -5901307 -4967918 -3623015
37711 -3623015 -2285320 -966919 192065 825683 667957 -35296 -551624 -373896 199860
37702A99860L44068k7497k15503m34427m76405L15896J395442R57068j205652
37693H52850k516937j149926Q85777O64461r59521o87025J785594L076558J257064
37684C208895j389040j802222K396J675460J408622p62755l116617l344981r60754
37675e080996J476518J326463l72461n49161R52057J368922N6642l78626J019783
37666a80859J552423l45623k078750j223642M87084N33453p8788O47191J491188
37657H03677L17287j416749p23507J589352J954350j62203j652382r67145j2585
37648b69905l05564p76239l81828R3761o414N3905O47274Q83663L78012J3745
37638C30410K21052L01575Q683l2977J03652l97241j209936j034568m5798J10106
$$ plain form
37702 199860 543928 516431 300928 -133499 -609904 -294008 1101434 2058502 852850
37693 852850 -1664087 -2814013 -1928236 -1263775 -2223296 -2910321 -1124727 1951831 3208895
37684 3208895 1819855 17633 20029 1695489 3104111 2341356 -775261 -4120242 -5080996
37675 -5080996 -3604478 -2278015 -2650476 -3199637 -2247580 -878658 -822016 -1200642 -180859
37666 -180859 1371564 1025941 -1052809 -2276451 -1789367 -1255914 -1334702 -687511 803677
37657 803677 1120964 -295785 -1019292 570060 2524410 2362207 709825 -257320 -269905
37648 -269905 -575469 -1351708 -1733536 -1639775 -1646189 -1592284 -945010 -61347 316665 330410
37638 330410 551462 853037 861720 828743 932395 535154 -674782 -1709350 -1755148 -1645042
37628a645042o89689n32153J168895K296571J292661m70899j060543p09834o25792
37619i75825q55130q86820p96889m44746P83590K166933J625286q94770k219320
37610b497691k98805K275861J810134j044272k477683j205130L01372J02247p17673
37601c751640l99696J003270K272754K506202J444441l36370j365606p10507N61726
37592A224574P05760j71297n17981J0154K67876p9133j35601J32227l18011j216746
37582i8178q09239R85858J718419K08657j140204K0275J990263J459688j259873
37573C075666k620271j239876K62484l52321j560744q84246R32222J069220q39782
37564b157648j954133m05604J927855K101285J58334j200427m09995J271102J934790
$$ plain form
37628 -1645042 -2334731 -2866884 -1697989 598582 1891243 1420344 359801 -350033 -975825
37619 -975825 -1830955 -2717775 -3514664 -3959410 -3175820 -1008887 616399 -278371 -2497691
37610 -2497691 -2796496 -520635 1289499 245227 -2232456 -3437586 -3136214 -3033967 -3751640
37601 -3751640 -4151336 -3148066 -875312 1630890 3075331 2738961 1373355 662848 1224574
37592 1224574 1930334 1759037 1241056 1251210 1519086 1439953 1304352 1436579 1118568 -98178
37582 -98178 -907417 78441 1796860 2005517 865313 885588 2875851 4335539 3075666
37573 3075666 455395 -784481 -521997 -874318 -2435062 -3319308 -2387086 -1317866 -2157648
37564 -2157648 -4111781 -4517385 -2589530 -488245 -329911 -1530338 -1940333 -669231 1265559
37555A265559J275064J37694q13631j164903n91858M36695P11420o8203o55396
37546E32441j90863M18995K78471K45715J103540J391361l86478k389762j489152
37537d85732J579359K659100L29965k030586j715712n84117j141190j985628n13363
37528c887904K132928K610010O37760r22737o88091k4808J74085O71432J434096
37519B136771J000784q52227k257931j932326o74781L65820Q83941N16225r17535
37510a731259j830193j91127K795892L260312K15716k449800j501257R49779R83757
37501E01820j162523j941170N216K418769L015412J760578k66716j949970k143556
37492B37860o28099R80499R32940l57150j239496j284057j010939k18378J093406
$$ plain form
37555 1265559 2540623 2678317 1864686 699783 107925 544620 1256040 1187837 532441
37546 532441 341578 760573 1039044 1284759 2388299 3779660 3393182 1003420 -485732
37537 -485732 1093627 3752727 4082692 2052106 336394 -247723 -1388913 -3374541 -3887904
37528 -3887904 -1754976 855034 1492794 570057 -118034 -142842 31243 702675 2136771
37519 2136771 3137555 2285328 27397 -1904929 -2579710 -2213890 -1329949 -813724 -1731259
37510 -1731259 -3561452 -3752579 -956687 2303625 2519341 69541 -1431716 -481937 501820
37501 501820 -660703 -2601873 -2596657 -177888 2837524 4598102 4331386 2381416 237860
37492 237860 -390239 590260 1523200 1166050 -73446 -1357503 -2368442 -2586820 -1493414
37483a493414J214705r05625k655139p53955L066088L600872m5272k753873j127808
37474a853421J554506R91613j485204j865958j48555N20990l08108j39954J416164
37465a317927J800900J18006j273522p18907M44580O94000N37702O45702L51882
37456A282416n55140q52661j43832Q6826q24791j202536J2649J038313K47854
37447i10902o73760N66280K563273J984900j036811k747366j220446J183189J666539
37438A374896N85601j61561j58430k00576m58365n17466l82320k35119Q7154N07208
37428D41022M51292m5325l843Q54097J280903M26202n85263m02256K99831N4377
37418B771037p41664m98459O01045N86489j050669k214954j185315R41152J921473
$$ plain form
37483 -1493414 -278709 -1184334 -3839473 -4593428 -1527340 2073532 2028260 -725613 -1853421
37474 -1853421 -298915 692698 -792506 -2658464 -2807019 -2286029 -2594137 -2734091 -1317927
37465 -1317927 482973 600979 -672543 -1391450 -946870 -252870 284832 930534 1282416
37456 1282416 727276 -125385 -269217 -182391 -1007182 -2209718 -2197069 -1158756 -910902
37447 -910902 -1584662 -1018382 1544891 3529791 2492980 -254386 -1474832 -291643 1374896
37438 1374896 1960497 1798936 1640506 1439930 981565 464099 81779 -153340 -66186 441022
37428 441022 892314 846989 843146 1697243 2978146 3404348 2819085 2416829 2716660 2771037
37418 2771037 2029373 1530914 2131959 2718448 1667779 -547175 -1732490 -791338 1130135
37409A130135J234985N9860o67926q21138k88140R29814J865742J135848j163719
37400C415461k958610k363178l0369J452697O42415j036037j237478K19098J371374
37391e24627J114963O19009J042499J377843J29746j826805k077810j70411J636372
37382A320779J462187K4264q24983m30672N08127J046563N76090q36702k131546
37373G14107k023816m81227J253127K164140K065026Q95431j092742k435455j614814
37364e56223M51751J037062n64906j879765r47865R34017J571293R24915P4437
37355A044716r18915k038355j964746p7846J649811J216782k52026m49166L42830
37346a446915L00966k94382K34352J366565J001202o34254j205415l65367n9645
$$ plain form
37409 1130135 2365120 2424980 1757054 935916 647776 1577590 3443332 4579180 3415461
37400 3415461 456851 -1906327 -1936696 -483999 158416 -877621 -2115099 -1896001 -524627
37391 -524627 590336 1209345 2251844 3629687 3759433 1932628 -145182 -315593 1320779
37382 1320779 2782966 2807230 1982247 1551575 2059702 3106265 3682355 2845653 714107
37373 714107 -1309709 -1790936 -537809 1626331 3691357 4586788 3494046 1058591 -556223
37364 -556223 -104472 932590 367684 -1512081 -2459946 -1525929 45364 970279 1044716
37355 1044716 125801 -1912554 -3877300 -3955146 -2305335 -1088553 -1340579 -1789745 -1446915
37346 -1446915 -1145949 -1440331 -1205979 160586 1161788 527534 -677881 -1043248 -1102893
37337a102893o14672l61486M08413o21100k817144k128987K290362N362735L100996
37328C516224j383230k658437p18290L84218n22916r15514K24577R37284J75456
37319i60628o33859n55997n22577r15015m89650J224503K617752K203542N57927
37310B525998q05179j244954j056444p44714o38427n18794K23158J319156J277781
37301C37581m15861j723429n83477J769464K366686Q94575j87766J56208K32092
37292B846073r26880j775973j159178l69617p00988j151193l92199P68653Q09123
37283b052179J3678k16824M33353J150791J237169L38220j369485k359123q94940
37274c719340J885560K323485n50197k715442p97818K414265J892361j867963
$$ plain form
37337 -1102893 -1717565 -2079051 -1670638 -2291738 -5108882 -7237869 -4947507 415228 3516224
37328 3516224 2132994 -525443 -1243733 -859515 -1382431 -2297945 -2073368 -1136084 -960628
37319 -960628 -1594487 -2150484 -2673061 -3588076 -4077726 -2853223 -235471 1968071 2525998
37310 2525998 1720819 475865 -580579 -1325293 -1963720 -2482514 -2259356 -940200 337581
37301 337581 -78280 -1801709 -2385186 -615722 1750964 2645539 2457773 2613981 2846073
37292 2846073 1919193 143220 -1015958 -1385575 -2086563 -3237756 -3629955 -2861302 -2052179
37283 -2052179 -2038501 -2255325 -1821972 -671181 565988 904208 -465277 -2824400 -3719340
37274 -3719340 -1833780 489705 -60492 -2775934 -3573752 -1159487 732874 -1135089
37266a135089l617462j357324J329841J584837J046464J538085J471980n49886
37258C11446k205934j081328R09806N37227j330313j336111O68479J691638P74335
37249a060755o78K91603J82095o63926n33743O44075M34434j646576k367772K29886
37239d491357L213065K950237L86569r98703n12083j51779n53651m85794K29487
37230d14009M26723L2121R1303N13939K39012n79013r05166r25599j325484j097252
37220c943425R37620K926543J900249j087020j702788J039990L014408J371418
37212D456995j297493j537815j75543J55427l15947K14995J299267J228400M20033
37203D448319M91658J002697K71039j329020j890908j232665p60868n58744M72272
$$ plain form
37266 -1135089 -4752551 -6109875 -4780034 -3195197 -2148733 -610648 861332 311446
37258 311446 -1894488 -2975816 -2066010 -1528783 -2859096 -4195207 -3526728 -1835090 -1060755
37249 -1060755 -1061433 -769830 -587735 -1251661 -1785404 -1141329 -706895 -2353471 -4721243 -4491357
37239 -4491357 -1278292 1671945 2058514 1059811 547728 395949 -157702 -643496 -414009
37230 -414009 12714 44835 136138 650077 889089 310076 -595090 -1520689 -2846173 -3943425
37220 -3943425 -3005805 -79262 1820987 733967 -968821 71169 3085577 4456995
37212 4456995 3159502 1621687 1446144 1601571 1285624 1500619 2799886 4028286 4448319
37203 4448319 4939977 5942674 6213713 4884693 2993785 1761120 1000252 441508 913780
37194I13780J828362J734611L47109k28198N21592O68171q22083k388727k390327
37185A84290j195220R5484J065559J273057L1965k022511k774799j210463J053819
37176c498819J811003Q37319l62439m93008M84695J504037J249681l78742j649444
37167d95717q73599J198900K190266J281924K3871k15905J05795J11738p5152
37158C252121o2918j7074o7058k7798j67730r96769j919330j587593j10557P05983
37148i98723O1232n58401J59476J164136P19669q68520j716291r10280O83882
37139b263820J797321J930890J339755N60800p0023o39682j208404j335914o69490
37130e58567K55457O93830Q75898J367759J585342M98363j285072j919733j031081
$$ plain form
37194 913780 2742142 4476753 4823862 4595664 5117256 5785427 4963344 2574617 184290
37185 184290 -1010930 -915446 150113 1423170 1455135 -567376 -3342175 -4552638 -3498819
37176 -3498819 -1687816 -850497 -1212936 -1705944 -1221249 282788 1532469 1153727 -495717
37167 -495717 -1369316 -170416 2019850 3301774 3325645 3109740 3215535 3327273 3252121
37158 3252121 3189203 3172129 3105071 3077273 2909543 1912774 -6556 -1594149 -1704706 -998723
37148 -998723 -937491 -1495892 -1336416 -172280 547389 -321131 -2037422 -2947702 -2263820
37139 -2263820 -466499 1464391 2804146 3364946 3294923 2655241 1446837 110923 -558567
37130 -558567 -303110 390720 1266618 2634377 4219719 4718082 3433010 1513277 482196
37121D82196k44307n89219j125294p58403J67865P33598N15278n57377j960755
37112c336418k150581k16630K081429K215424P87712O53441J961405J710985p95753
37103B911014k166381n89365P85784q17173k788055j449026J549586J817128o85404
37094a431892j981207n90274R60381J006377Q27221J384878J707075J280201R47441
37085D110201Q30261J98330k84172P99019K420963J844375q24437k181120o38516
37076F274904J290798J188837N7563k66074j14558l89863m89703N1878Q4987r12762
37066F776007j272414J1724J025613Q504j374387p40405P72259L39781j634952
37057C911730k108029m87488N67269j93307p13393M52813J535729P41778n52273
$$ plain form
37121 482196 237889 -351330 -1476624 -2235027 -2067162 -1333564 -818286 -1375663 -3336418
37112 -3336418 -5486999 -5703629 -3622200 -1406776 -619064 34377 1995782 3706767 2911014
37103 2911014 744633 155268 941052 123879 -2664176 -4113202 -2563616 -746488 -1431892
37094 -1431892 -3413099 -4003373 -3042992 -2036615 -1209394 175484 1882559 3162760 4110201
37085 4110201 4940462 5138792 4854620 5653639 8074602 9918977 9094540 6913420 6274904
37076 6274904 7565702 8754539 8812102 8546028 8431470 8041607 7551904 7603782 7688769 6776007
37066 6776007 5503593 5515317 6540930 6549434 5175047 4434642 5206901 5546682 3911730
37057 3911730 1803701 1316213 1883482 1690175 976782 1429595 2965324 3707102 3154829
37048C154829k22476Q63535L30462j552073k205253j042193m12552j481040j962664
37039d529425K15312L101117L164337M80373j397261o45855O01766M8956j338762
37030b99442j349858k2993R59301J101685J130546R86444L6812j023044o94261
37021H25190P80126J414949M28734o51881m50464L89238O66370N07803O78485
37012D588550J031474P67849l33451j746348k771042k726166j213989J115583
37004a287540K557857J862183l71283k213736k248080p45021Q15339J291955R79520
36995F41194R50211J316383R26331p25914k233015j964361l26413R21566J063704
36986E69686P29564K62679n41650j236584r82678q6876L18726J96191M98965J063003
$$ plain form
37048 3154829 2932353 3795888 4126350 2574277 369024 -673169 -1085721 -2566761 -4529425
37039 -4529425 -4314113 -1212996 1951341 2431714 1034453 388598 990364 1039320 -299442
37030 -299442 -1649300 -1672293 -712992 388693 1519239 2505683 2542495 1519451 825190
37021 825190 1605316 3020265 3448999 2797118 2346654 2735892 3402262 3910065 4588550
37012 4588550 5620024 6387873 6054422 4308074 1537032 -1189134 -2403123 -1287540
37004 -1287540 1270317 3132500 2761217 547481 -1700599 -2445620 -1630281 -338326 641194
36995 641194 1591405 2907788 3834119 3108205 875190 -1089171 -1415584 -494018 569686
36986 569686 1299250 1561929 1020279 -216305 -1198983 -1285859 -967133 -770942 -271977 791026
36976G91026N77762r00142j433382o1458J598916J648545L21314r01893j263099
36967C77589q46097M4967P27382N04646j01607K30658J352578J401397k84510
36958C407003j740719j147233N21948J114061K83682o63795q36702j80119J196143
36949A954269K638049K748798J024633j000325j533418p47125l6752J20523K34521
36940E403173M29707L70663J18329m2078k10857m92854o05586n39863p86410j277423
36930B366801j154016k37346N11511O39524P80936Q95005j28485k063828k745339
36921a135237j343162N707l49231q39578L37652J838211J551684K80277m8455
36912B97868N2817p77454j372052k3782J671244J089101n57648j51372J494244
$$ plain form
36976 791026 1368788 468646 -964736 -1026194 572722 2221267 2542581 1640688 377589
36967 377589 -468508 -423541 303841 808487 706880 937538 2290116 3691513 3407003
36958 3407003 1666284 519051 1040999 2155060 2438742 1774947 938245 758126 1954269
36949 1954269 4592318 7341116 8365749 7365424 5832006 5084881 5048129 5168652 5403173
36940 5403173 5832880 6203543 6321872 6279794 6068937 5576083 4970497 4430634 3644224 2366801
36930 2366801 1212785 975439 1486950 2126474 2907410 3802415 3673930 1610102 -1135237
36921 -1135237 -2478399 -2472692 -2821923 -3661501 -3323849 -1485638 66046 346323 297868
36912 297868 350685 -426769 -1798821 -1822603 -151359 937742 380094 228722 1722966
36903A722966Q17167j805361k102561P37432K372585N29047j422123m26584J623185
36894B045753K044183J631866J556456K44656k888899m430684j937187J330608
36886d03248J148567j004075q82769J237338J583712k31660q94226M78725J186980
36877B219344K45911j21410Q40814Q95673o77963j380685j08757N66052r49552
36868A529427k054521l50335J885189J185598j388951j923556J60925J490481
36860E34257J99919j513282j150937N39923J237327M01455o61319j016783q40794
36851b270234m10440K80237Q98474Q67133L67565L46304J014539J171764q4036
36842B181306j602027j468296J33783R83760J28237o53004K48825J604038J399358
$$ plain form
36903 1722966 2540133 734772 -1367789 -630357 1742228 2271275 849152 422568 2045753
36894 2045753 4089936 5721802 7278258 7522914 4634015 203331 -1733856 -403248
36886 -403248 745319 -258756 -1141525 95813 1679525 1447865 553639 1032364 2219344
36877 2219344 2465255 2343845 3184659 4080332 3402369 2021684 1912927 2478979 1529427
36868 1529427 -525094 -875429 1009760 2195358 806407 -1117149 -956224 534257
36860 534257 734176 -779106 -1930043 -1390120 -152793 248662 -412657 -1429440 -2270234
36851 -2270234 -2680674 -2400437 -1501963 -634830 -267265 79039 1093578 2265342 2181306
36842 2181306 579279 -889017 -755234 228526 356763 -296241 -47416 1556622 2955980
36833B955980K65269L86351J568615J259218j116682k654880j181370J296439
36825B778940J387511q77441k354604j349754L38763K62332j407471k307141r23525
36816d452390J497549K241668L66823j729240r35518K310411L949570J458936
36808D707809k502034l474288j088327J011032P30596p9513M69502J105860P4032
36799I54669j378610r32277Q23489J309449J72778m74681L0575n4881j227436
36790g76925j301173P65501K399033J144364j265097j431321N39559J532045L73280
36781A979266r83309j240792j445524k089018j584124P50669K636260J858991
36773a17581l46225j109913K4511J035217P32015Q838p6129L64874Q59072J276142
$$ plain form
36833 2955980 3221249 3607600 5176215 6435433 5318751 2663871 1482501 2778940
36825 2778940 4166451 3289010 934406 -415348 -76585 185747 -1221724 -3528865 -4452390
36816 -4452390 -2954841 -713173 -346350 -2075590 -3011108 -700697 3248873 4707809
36808 4707809 2205775 -1268513 -2356840 -1345808 -615212 -694725 -225223 880637 954669
36799 954669 -423941 -1356218 -532729 776720 949498 474817 505392 450511 -776925
36790 -776925 -2078098 -1312597 1086436 2230800 965703 -465618 73941 1605986 1979266
36781 1979266 995957 -244835 -1690359 -3779377 -5363501 -4612832 -1976572 -117581
36773 -117581 -463806 -1573719 -1549208 -513991 218024 226862 150733 515607 1374679 2650821
36763B650821J372649P66502k31188o18038N4933J004599J078497k9957j498930
36754D549888k072558j181075L91253J249502R99490N47898M94470J73963q91745
36745D261086j556811m85853J452332J867708N8029j923983j952075m27635O09517
36736A902315K14014o19030o56756o1150J30182k84621l29830N00835J130510
36727A926469M33319o79667k75562J518091K339628J117540k34410O8747P88822
36718G002977j10720j829758j876552r7796J089490M01922p98514r74806k71479
36709B534764M96939Q11257Q7267j709091k814472j246431J853946K864563N98155
36700C476897j866905j650165L5202M06695n73231r55728m40479m21437j013668
$$ plain form
36763 2650821 4023470 4789972 4558784 3940746 3995679 5000278 6078775 6048818 4549888
36754 4549888 2477330 1296255 1687508 2937010 3936500 4484398 4978868 5152831 4261086
36745 4261086 2704275 2218422 3670754 5538462 5596491 3672508 1720433 1292798 1902315
36736 1902315 2116329 1497299 840543 779393 909575 624954 295124 795959 1926469
36727 1926469 2359788 1680121 1404559 2922650 5262278 6379818 6145408 6214155 7002977
36718 7002977 6892257 5062499 3185947 3088151 4177641 4579563 3781049 2806243 2534764
36709 2534764 3031703 3842960 3930227 2221136 -593336 -1839767 14179 2878742 3476897
36700 3476897 1609992 -40173 -4971 401724 -171507 -1127235 -1567714 -1989151 -3002819
36691c002819p37066P41364J824823J439778M81902J57706K99337J17299l97254
36682I25070o82781o41625o74201q06376l78253J030269K472324K120797m37679
36673B927545k875149k374678P27103L014950K204748k49559j618971j363107
36665C92882p25433k68478K77597N70924Q3156m41974J39229J226662J072441
36656B327006m45804j478488r17412K53131P88779P64819O48934K55956m45981
36647A750940o41318J68458J075756Q24838m86274j533754j329507j18909J050894
36638G61124J268325M56243n88447r55990m83194K63000O91757O16128K22506
36629B251452m2667J56412M89710K86194k39539M7252J317165J919354N92840
$$ plain form
36691 -3002819 -3739885 -2998521 -1173698 266080 747982 905688 1205025 1322324 925070
36682 925070 242289 -399336 -1073537 -1879913 -2258166 -1227897 1244427 3365224 2927545
36673 2927545 52396 -2322282 -1595179 1419771 3624519 3374960 1755989 392882
36665 392882 -332551 -601029 -323432 247492 330648 -111326 27903 1254565 2327006
36656 2327006 1881202 402714 -514698 -261567 527212 1292031 1940965 2196921 1750940
36647 1750940 1109622 1278080 2353836 3178674 2692400 1158646 -170861 -289770 761124
36638 761124 2029449 2485692 1897245 941255 458061 721061 1412818 2028946 2251452
36629 2251452 2208785 2365197 2854907 3141101 2901562 2948814 4265979 6185333 6778173
36620F778173j434730k090991j353193o72481k88086N83641J356524O09520r17505
36611B570872p87630J070226J772254J00340j343368m28399R61202K58941j330249
36602B844189r21775J129257J886969O58369k25626N59584J536010J164501q8095
36593H543383j113647j614163j554887q13236J37354N64309O15259P46534L72915
36584E883821j028346j933679m77256J937202J806902j115870k949886j479672
36576F43216N18684o9974j775839j356109P47996J396316m7382j111529m36690
36567a491311O61312R86304R50723Q46902J68712p50496o77050L12350O37089
36558A644535j54666o33879p4234L34656k04418o38645j04010M86612K56453n454
$$ plain form
36620 6778173 5343443 3252452 1899259 1226778 938692 1522333 2878857 3488377 2570872
36611 2570872 1783242 2853468 4625722 4726062 3382694 2954295 3915497 4174438 2844189
36602 2844189 1922414 3051671 4938640 5597009 5371383 5930967 7466977 8631478 8543383
36593 8543383 7429736 5815573 4260686 3447450 3584804 4149113 4764372 5510906 5883821
36584 5883821 4855475 2921796 2444540 4381742 6188644 5072774 2122888 643216
36576 643216 1161900 1091926 -683913 -2040022 -1292026 104290 56908 -1054621 -1491311
36567 -1491311 -829999 156305 1107028 1953930 2122642 1372146 695096 1007446 1644535
36558 1644535 1489869 855990 781756 1116412 911994 273349 169339 655951 912404 906950
36548I06950M30164N11513p81542k210047j814180J53962J584328J218263l95950
36539c96539j981300k309599p56387J636009K616121J509477K83451M06954M13763
36530A421950j226550k657038j245757J573252J901549n01972j740179K3631J902378
36521e48736J295588j03720L60070J849498J678518m68397k507222k908356j687354
36512c040111L75478J836800J250066p05358j290064N18855K185393J438326k11036
36503B358349l07015L02389o23128k148359j421456J201532K284512O73409r77659
36494A342574o51140M55050P38147N07920L37551j60958p46272l00414P62559
36485B285017N29005q63139p44441J449392K333555k28325l098046k249620J121357
$$ plain form
36548 906950 1337114 1848627 1067085 -1142962 -2957142 -2803180 -1218852 -589 -396539
36539 -396539 -2377839 -4687438 -5443825 -3807816 -1191695 317782 601233 1008187 1421950
36530 1421950 195400 -2461638 -3707395 -2134143 -232594 -734566 -2474745 -2451114 -548736
36521 -548736 746852 643132 1003202 2852700 4531218 4062821 1555599 -1352757 -3040111
36512 -3040111 -2664633 -827833 422233 -283125 -1573189 -1054334 1131059 2569385 2358349
36503 2358349 2051334 2353723 1730595 -417764 -1839220 -637688 1646824 2320233 1342574
36494 1342574 691434 1146484 1884631 2392551 2730102 2569144 1822872 1522458 2285017
36485 2285017 2814022 1950883 1206442 2655834 4989389 4761064 1663018 -586602 534755
36476E34755K531534P73080j232821j435380q05275m59608k1009N45845L32461
36467G63582m46189k76460Q71329R72435p08106j978795r80893Q63383J093595
36458A73881n1238l59727O65479J161155Q177j381812j128485N20814J614976
36449A223220R60966o29758j434971o73128P96517J420000N41604r37699j559481
36440b92730q99033J00928M17254J33731Q536K53231M09740L04771K76417K77098
36430I89943l17138j474971j968748r30288P22043J435240J071651O56333N49619
36421G33684K99602N7271M55077R65187J68398j807680k828792j613656M39098
36412c131811J328548R80609M66263j9395q01345j236785l37127J424844K366962
$$ plain form
36476 534755 3066289 3839369 2606548 1171168 365893 -93715 -114724 431121 763582
36467 763582 317393 40933 912262 1884697 1176591 -802204 -1783097 -919714 173881
36458 173881 122643 -237084 428395 1589550 1597727 215915 -912570 -391756 1223220
36449 1223220 2184186 1554428 119457 -553671 242846 1662846 2204450 1266751 -292730
36440 -292730 -1191763 -1090835 -673581 -539850 -531314 -278083 131657 436428 712845 989943
36430 989943 672805 -802166 -2770914 -3701202 -2979159 -1543919 -472268 184065 733684
36421 733684 1033286 1090557 1545634 2510821 2679219 871539 -1957253 -3570909 -3131811
36412 -3131811 -1803263 -822654 -356391 -375786 -1177131 -2413916 -2751043 -1326199 1040763
36403A040763J615443j15624j553690j832539q23311N87466R54190j03820j195812
36394a426934r42517J77077Q00608P61984Q33106R85298N26892l00031n04803
36385I10680r8742p3599n31240m71632K23357K77182p84316j436344k92364J638281
36375f38737K156990P70038r19475j532656j328117r70760j26727J585524K871332
36366A867412J721115j446039l274096j504725J711546K538064O72122p50473
36358A534926k17629L85490k60657o15937L32339O80426p72819j487955P56149
36349C34333L207023J835670j895203k805699o973J942500M82578j344307n23071
36340A226851J155040P57765q07885q56632L51877M09398r48859j488764j20350
$$ plain form
36403 1040763 2656206 2540582 986892 -845647 -1668958 -1081492 -127302 -231122 -1426934
36394 -1426934 -2369451 -2192374 -1391766 -629782 203324 1188622 1715514 1415483 910680
36385 910680 811938 738339 207099 -264533 -41176 236006 -548310 -1984654 -2277018 -638737
36375 -638737 1518253 2288291 1368816 -163840 -1491957 -2462717 -2589444 -1003920 1867412
36366 1867412 3588527 2142488 -1131608 -2636333 -924787 1613277 2285399 1534926
36358 1534926 1317297 1702787 1442130 826193 1158532 1838958 1066139 -421816 334333
36349 334333 3541356 5377026 3481823 676124 669151 2611651 3094229 1749922 1226851
36340 1226851 2381891 3139656 2331771 1475139 1827016 2236414 1287555 -201209 -321559
36331c21559J529168J456060k90337j841747j546494K10356J206421L335j919885
36322a514682j950795k3139J392777J048598L18183L01056J24341p22683q80202
36313a906546M18699J555393R97389l30865q79911p94395o48640J40603J653875
36304B05602K177993P60263p85590o58656O4358k47272o72820J70550R40734j60848
36294A794314j649019j009833P08969O37020o51097j27575J897659J852093q20102
36285B632429k294860n44194J613292J490273M43954M43551M21004j048112k437961
36276G19376j798679k87513j07091p65230l96110O86866P86115J18050L88112
36267f56104J634549K103116J018358o61412j940486k349817j360566P76668K158496
$$ plain form
36331 -321559 1207609 2663669 2373332 531585 -1014909 -804553 401868 405203 -1514682
36322 -1514682 -3465477 -3488616 -2095839 -1047241 -729058 -428002 -303661 -1026344 -1906546
36313 -1906546 -1487847 67546 1064935 734070 -145841 -940236 -1588876 -1448273 205602
36304 205602 2383595 3143858 2358268 1699612 1763970 1516698 843878 1014428 1955162 1794314
36294 1794314 145295 -864538 -155569 481451 -169646 -297221 1600438 3452531 2632429
36285 2632429 337569 -206625 1406667 2896940 3340894 3784445 4205449 3157337 719376
36276 719376 -1079303 -1366816 -1473907 -2239137 -2635247 -1948381 -1162266 -1044216 -656104
36267 -656104 978445 3081561 4099919 3438507 1498021 -851796 -2212362 -1435694 722802
36258G22802J292470m64792p33250J70126k9993j345078j176068J168484K700476
36249B305177J072180j826503k686054j384542m21551q61341j280709m14140J289812
36240d207671K835172L606744K939934N46016k123277k661709p85772Q79836L20694
36231A349967r67784l70071J621534K008893m5602j803028j071152O02339N74855
36222A899951p93993j004367N09423J664431J058905k79830j040665j490638k112282
36213a589065k042144m49918J508640J826978M15348p84616n34119K26868J34735
36204a287293n28387n09830L22746Q20518M39015K0203K03689K54649m64385q34234
36194a563309N31367K587272K720751N32466j427995j465446r54847j339199j343545
$$ plain form
36258 722802 2015272 1550480 817230 987356 957363 -387715 -1563783 -395299 2305177
36249 2305177 3377357 1550854 -1135200 -2519742 -2941293 -3802634 -5083343 -5497483 -4207671
36240 -4207671 -1372499 2234245 5174179 5720195 3596918 935209 149437 1029273 1349967
36231 1349967 382183 12112 1633646 3642539 3596937 1793909 722757 1325096 1899951
36222 1899951 1105958 101591 611014 2275445 3334350 3054520 2013855 523217 -1589065
36213 -1589065 -3631209 -4081127 -2572487 -745509 -330161 -1114777 -1648896 -1422028 -1287293
36204 -1287293 -1815680 -2325510 -2002764 -1182246 -743231 -723028 -519339 -264690 -729075 -1563309
36194 -1563309 -1031942 1555330 4276081 4808547 3380552 1915106 960259 -378940 -1722485
36185a722485L98326J970945P51096j855876k079570J72667J128448l85234p82921
36176b404604J968200M111308J733407k471080k669922J351495L760893J168727
36168F548424k893911l525286r46961J042077P76070n8438O8993N91335N83476
36159B185779L36436M06636M59731M4340l13494J27413Q21995L24483j616139
36150B777180l217450k524625K68771K904087L320190J454707j029371k331662
36142A621827j827852k31984J266626J959636J734856O46887r59489k007530j429539
36133G73438K49803J133729M49988k93403L20725J285232Q10001o14100q57173
36124C258240M87069J525203R99359j84215p80134p64180n39089k22137k28278
$$ plain form
36185 -1722485 -1324159 646786 1397882 -457994 -2537564 -2364897 -1236449 -1621683 -2404604
36176 -2404604 -436404 3674904 5408311 2937231 267309 1618804 5379697 6548424
36168 6548424 3654513 129227 -817734 224343 1000413 941975 1010968 1602303 2185779
36159 2185779 2522215 2928851 3388582 3432922 3119428 3246841 4068836 4393319 2777180
36150 2777180 -440270 -2964895 -2696124 207963 3528153 4982860 3953489 1621827
36142 1621827 -206025 -438009 828617 2788253 4523109 5169996 4210507 2202977 773438
36133 773438 1023241 2156970 2606958 2313555 2634280 3919512 4729513 4115413 3258240
36124 3258240 3745309 5270512 6269871 6085656 5305522 4541342 4002253 3780116 3551838
36115C551838r37269j366839n2273K195071K555248J96401k148885j956921k31594
36106A804777O08483K69788l475M744k71627m95058j25305J06200n34407r29776
36096D34344L06277K114567K143840K13404j559244j851314j258815m78123N15372
36087E80308J361210J315676N97550J11840j91362j015602j846917j253601P68296
36078D27398K471326K597372J448306j88781j512370j361679N43983K122263R58608
36069G506426k078163l630683k450483n77657M09700J261114K297020K073898
36061D811172M15363l34048P98362J230627q26323k676075j212594J640851J704377
36052E551712p31818j552127K68032J200494o04026k202311r76559J001609O67945
$$ plain form
36115 3551838 2614569 1247730 1195457 3390528 5945776 6142177 3993292 2036371 1804777
36106 1804777 2413260 2683048 2679573 2684317 2412690 1917632 1792327 1898527 1364120 434344
36096 434344 740621 2855188 4999028 5212432 3653188 1801874 543059 64936 580308
36087 580308 1941518 3257194 3854744 3966584 3775222 2759620 912703 -340898 427398
36078 427398 2898724 5496096 6944402 6755621 5243251 3881572 4425555 6547818 7506426
36069 7506426 5428263 1797580 -652903 -1230560 -820860 440254 2737274 4811172
36061 4811172 5226535 4892487 5690849 6921476 6095153 3419078 2206484 3847335 5551712
36052 5551712 4819894 3267767 3535799 4736293 4132267 1929956 953397 1955006 2622951
36043B622951q42367k71008K143204K902960P83168j316128p89980J140213J746738
36034H119751P01819j71124K6346L59678p352n97568o48253j76943M66788J199399
36024I272541J766848J502070K93566p95932p64365r2697N0234l06644p2537R10284
36014A1763368J380973O08270l91326l20816O81897J661782K396098L350252M621323
36005B5751821N855958O857990P550297P853985Q369948J0404805J4099800J7119163
35997A03863767J6727006J2979292Q369946M434045M61389m196849q526217j1440091
35989A22672288j3295308j4602982j4616993j2669338r858722p856575o792524
35982D2979846n781311m730935l951380k772335o71051P20930p26812l878752
$$ plain form
36043 2622951 1780584 1509576 3652780 6555740 7338908 6022780 5232800 6373013 8119751
36034 8119751 8821570 8650446 8676792 9036470 9029118 8431550 7783297 7606354 8073142 9272541
36024 9272541 11039389 12541459 12835025 12039093 11274728 11182031 11232265 10925621 10853084 11763368
36014 11763368 13144341 13752611 13361285 13040469 13722366 15384148 17780246 21130498 25751821
36005 25751821 31607779 38465769 46016066 53870051 62239999 72644804 86744604 103863767
35997 103863767 120590773 133570065 141940011 146374056 146835445 142638596 134112379 122672288
35989 122672288 109376980 94773998 80157005 67487667 57628945 49772370 42979846
35982 42979846 37198535 32467600 28516220 25743885 25072834 25793764 25066952 21188200
35974B1188200m898375k351557P53823J236202l19929j499927j647316j355432
35966A1105689l79649J258097J624977o14748l093896k433323N44377J814526
35958I826050K58278j056880k88165N23134k81206r37343O7424O94190j066492
35949G738990l019582j899938J188568K399324J082411R6236O24607P43253m21346
35940H532523r17928L88748J562613P14509j013206j414614m33978L37355J98364
35931G954386j36783J19518R40122J489547P67067r91634j790636j88510K097210
35922A0260287J983296m44892j730877j17736J926013J737613L63587J35089M98546
35913A4610926p26798l063472l456539o38168K965085M121388K045353j418780
$$ plain form
35974 21188200 16289825 13938268 14692091 15928293 15608364 14108437 12461121 11105689
35966 11105689 10726040 11984137 13609114 12994366 9900470 7467147 8011524 9826050
35958 9826050 10084328 9027448 8739283 9262417 8981211 8043868 8111292 8805482 7738990
35949 7738990 4719408 2819470 4008038 6407362 7489773 7586009 8210616 8953869 8532523
35940 8532523 7614595 8003343 9565956 10280465 9267259 7852645 7418667 7756022 7954386
35931 7954386 7817603 7937121 8877243 10366790 11133857 10142223 8351587 8163077 10260287
35922 10260287 12243583 11798691 10067814 9950078 11876091 13613704 13977291 14112380 14610926
35913 14610926 13884128 10820656 7364117 6725949 9691034 13812422 15857775 14438995
35905A4438995l585061k859084n4443K133273J765730m19272k288246k711823
35897F420069j793066J49797K254170K671026M62458k403630k888108o63106J685355
35888E894965K207025J526775J085982J277083J773137K128601J598463j74398
35880A7317633j929455j799964M4832J422232J268159Q67100J194077J103713
35872A9488327m36639k086610j915009k10903J231064J601718J133587k50520
35864A8555015k255860l019852j096994J614221J562174j466746l627208k276616
35856G988134M57613J079573k78499o95683P36919J692815L66399j824163k308430
35847G214678p43576Q84922Q96913l87255j447357j335973m48990K32695M05926
$$ plain form
35905 14438995 10853934 7994850 7940407 10073680 11839410 11420138 9131892 6420069
35897 6420069 4627003 4776800 7030970 9701996 10164454 7760824 4872716 4209610 5894965
35888 5894965 8101990 9628765 10714747 11991830 13764967 15893568 17492031 17317633
35880 17317633 15388178 13588214 13633046 15055278 16323437 17190537 18384614 19488327
35872 19488327 19051688 16965078 15050069 14839166 16070230 17671948 18805535 18555015
35864 18555015 16299155 13279303 12182309 13796530 15358704 13891958 10264750 7988134
35856 7988134 8445747 9525320 9246821 8551138 9288057 10980872 11347271 9523108 7214678
35847 7214678 6471102 7356024 8252937 7865682 6418325 5082352 4633362 4866057 5271983
35838E271983O42424J238584J464117O20802n80459p48545J61884P37022K40772
35829I048584l85941j96746L43434M75403N13091R22758J042096J82800p39694
35820A1205785l64958P61063Q10046m61681j354511r71184m28466p03778j062540
35811G429776o42546o9783k05338m81184Q6571J083768J335485P72619K81527
35802I590895J00674k48044o42200l82370L84998N66688k12788r51534p97782
35793G408537l17909n17763j239213j404307o18446K88306M13274j69350p75874
35784C067255r83825o91683J99165J426191J998047J188805j22701k79837P53494
35775F554911J211030L14452m01188K92058J077699L28788r08335o27930N36251
$$ plain form
35838 5271983 5914407 7152991 8617108 9237910 8657451 7908906 8070790 8807812 9048584
35829 9048584 8662643 8465897 8809331 9284734 9797825 10720583 11762679 11945479 11205785
35820 11205785 10840827 11601890 12411936 11950255 10595744 9624560 9196094 8492316 7429776
35811 7429776 6787230 6717447 6512109 6030925 6117496 7201264 8536749 9309368 9590895
35802 9590895 9691569 9443525 8801325 8418955 8803953 9370641 9157853 8206319 7408537
35793 7408537 7090628 6572865 5333652 3929345 3310899 3599205 4012479 3843129 3067255
35784 3067255 2083430 1391747 1590912 3017103 5015150 6203955 6081254 5801417 6554911
35775 6554911 7765941 8080393 7679205 7971263 9048962 9377750 8469415 7841485 8377736
35766H377736L95863p31843m97781R23366O13297j796099k562387L78664L570258
35757H671074K873130n90888k604212j896564n37535K77959J182854J973080J379186
35748A0728084l90359j541346j285610m09247N52600J563985J833355N92216j064785
35739A0578893j306545l02995K84721J02284M7395n2832j009874j893614j049462
35730E397971O47733P06774p51872j076918K55137P73725l01287m00839J682060
35721F932484L081673J284439j720803k421528o31153J184513J535485N61008
35713I806118j185012k491700j795824L42472J071172n21528j487171K52692K046047
35704F037266P36090j768880j415069J232117J951328j20810j403348j24928J127029
$$ plain form
35766 8377736 8773599 8041756 7543975 8467341 9080638 7284539 4722152 5100816 8671074
35757 8671074 11544204 10953316 8349104 6452540 5915005 6192964 7375818 9348898 10728084
35748 10728084 10337725 8796379 7510769 7101522 7654122 9218107 11051462 11643678 10578893
35739 10578893 9272348 8969353 9254074 9356358 9403753 9350921 8341047 6447433 5397971
35730 5397971 6045704 6752478 6000606 4923688 5178825 5952550 5651263 5250424 6932484
35721 6932484 10014157 11298596 9577793 7156265 6525112 7709625 9245110 9806118
35713 9806118 8621106 6129406 4333582 4676054 5747226 5225698 3738527 3991219 6037266
35704 6037266 6773356 5004476 3589407 4821524 6772852 6652042 5248694 5123766 6250795
35695F250795M21757k76065R22558K146485Q65787j753984k512831p97912J024476
35686F291066J167691K91342n9986N38376J116919N12301j054653j769790m62892
35677F570374J226998O07146j959205k873964k49274L084754L316095P94087q46604
35668I670407J65904J919576K128477J077612N24626J124234J951002J931164
35660B0493002J024823J96207M57695J706782K516228J529690q41275k585414
35652B4497738k212899m08245P28067l5131j813757k730899k076294r65136p21395
35643A4262049j132643r88751j13491K12989p64903j881390j561117j24370O30147
35634H538520L9566n16768K26150J478282J582751M71558l37274r2355J72759
$$ plain form
35695 6250795 6672552 6396487 7319045 9465530 10331317 8577333 6064502 5266590 6291066
35686 6291066 7458757 7750099 7690113 8228489 9345408 9857709 8803056 7033266 6570374
35677 6570374 7797372 8404518 6445313 3571349 3322075 6406829 9722924 10517011 9670407
35668 9670407 9836311 11755887 13884364 14961976 15486602 16610836 18561838 20493002
35660 20493002 21517825 21714032 22171727 23878509 26394737 27924427 27083152 24497738
35652 24497738 22284839 21876594 22604661 22569530 20755773 18024874 15948580 14983444 14262049
35643 14262049 13129406 12140655 12027164 12240153 11475250 9593860 8032743 7908373 8538520
35634 8538520 8578086 8061318 8287468 9765750 11348501 11820059 11482785 11390430 11563189
35625A1563189n31158j434067j155193O0249N06294o32079k184197k515859j306987
35616B370192N01534J774439J833478P95942k60285j50104Q92458J253589J15973
35607I127216j205406j036024K13080O39597l53292j212723m78996J206712J961643
35598H861807R28963r16317j974631j574089l45055O29057P86985K30567o83263
35589E944024j410110j176331K27347J567620J211558n34034j365816q5151J522048
35580E901155J219656l87722r06319K24983J280946J193723P20437M15073l32391
35571I329541j489470j693463n07880M55170K7711n86988k0293P22316O3253j033024
35561E266873l54642J707947K406536R14384l66511L51273J582508J279144J29441
$$ plain form
35625 11563189 11032031 9597964 8442771 8503020 9009314 8377235 6193038 3677179 2370192
35616 2370192 2871726 4646165 6479643 7275585 7015300 6865196 7757654 9011243 9127216
35607 9127216 7921810 6885786 7098866 7738463 7385171 6172448 5693452 6900164 8861807
35598 8861807 9790770 8874453 6899822 5325733 4980678 5609735 6396720 6627287 5944024
35589 5944024 4533914 3357583 3584930 5152550 6364108 5830074 4464258 4379107 5901155
35580 5901155 7120811 6733089 5826770 6051753 7332699 8526422 9246859 9661932 9329541
35571 9329541 7840071 6146608 5638728 6093898 6121609 5534621 5514328 6236644 6299897 5266873
35561 5266873 4912231 6620178 9026714 9941098 9574587 9925860 11508368 12787512 12916953
35552A2916953L8627P17147K76199j315752j868759l47709J503784J715749O10716
35543A4246955k84030n27455o54808o66805j06822P00355Q57024M06583M98134
35534A4469131J665848K772268K267128J75329j657904j395149Q18076K875916
35526B1990643K905613J238817l14099r35882j477739k453961k792619j573636
35518A6587137J68652P90553L40394m7545l39875j302999k435336k336800j186101
35509A0238080p24977j408897j652117n23095Q48465J385335J572643J818452
35501A1553889J329159k3261o38819L32448J168092J45113j531949j494773K16233
35492A1056132J518255J433458P53026Q9582o98919j367810j304064o00598J30954
$$ plain form
35552 12916953 12955580 13672727 13948926 12633174 10764415 10416706 11920490 13636239 14246955
35543 14246955 13962925 13435470 12780662 12113857 12007035 12707390 13564414 13970997 14469131
35534 14469131 16134979 18907247 21174375 21349704 19691800 18296651 19114727 21990643
35526 21990643 24896256 26135073 25820974 24885092 23407353 20953392 18160773 16587137
35518 16587137 16755789 17546342 17886736 17839191 17499316 16196317 13760981 11424181 10238080
35509 10238080 9513103 8104206 6452089 5928994 6777459 8162794 9735437 11553889
35501 11553889 12883048 12859787 12220968 12553416 13721508 13866621 12334672 10839899 11056132
35492 11056132 12574387 14007845 14760871 14850453 14151534 12783724 11479660 10879062 11010016
35483A1010016O21891O09568m22188j942897k112757m24515Q72012R575j263505
35474F957200n35989R44141K49510j923431j960341P22896K514954J216970q82595
35465G303315r47384N42751J539547J451921P84866r2576m39295N97490K112847
35456A2853482J917153j81689j837971j772114j326716j444192j031935K92426
35448G468444Q77303J50922l6553R12697O95390j463739k310943K84393L064547
35439I642461K254391k83868m32845J079372L58704k351051k866161l26987J385834
35430H459850K61257j022332l51211N11287l9165l10107J161897K444179J476991
35421A2592646k64193l29865O77738N99181m10244m28021Q08001J610446R88127
$$ plain form
35483 11010016 11631907 12241475 11819287 9876390 7763633 7339118 8211130 8220705 6957200
35474 6957200 6421211 7365352 7614862 5691431 3731090 4453986 6968940 8185910 7303315
35465 7303315 6355931 6898682 8438229 9890150 10675016 10582440 10143145 10740635 12853482
35456 12853482 14770635 14588946 12750975 10978861 9652145 8207953 7176018 7468444
35448 7468444 8345747 8496669 8460116 9372813 10068203 8604464 6293521 6577914 9642461
35439 9642461 11896852 11612984 11180139 12259511 12618215 10267164 7401003 7074016 8459850
35430 8459850 8721107 7698775 7347564 7858851 7819686 7509579 8671476 11115655 12592646
35421 12592646 12328453 11998588 12676326 13275507 12865263 12437242 13245243 14855689 15843816
35412A5843816m12173j563934j723597n40091J043056R32090j409642l345558
35404H823967k117942J184611K874769J546389n72688j279823j069551j268409
35396H121323j470380m41665J433174K291078J247379n11148j324290q72893J9496
35387H492074O83234R64109O99940j54769q38837k91254J199023J859169P09691
35378A3322380r68196j477053j078701j074779j315635o14719O76583Q30771k12266
35369H088385l55639J162564K089093N88803j568401j459296O20488J716938O01057
35360A1483992q98821j059331m27580r9588J75276R05141J308512M39056r14851
35351A0911806j047750J78074J124368P92193O7100J7455K28074j33934n65695
$$ plain form
35412 15843816 15431643 13867709 12144112 11604021 12647077 13579167 12169525 8823967
35404 8823967 6706025 7890636 10765405 12311794 11739106 10459283 9389732 8121323
35396 8121323 6650943 6209278 7642452 9933530 11180909 10669761 9345471 8472578 8492074
35387 8492074 9175308 10139417 10839357 10684588 9845751 9554497 10753520 12612689 13322380
35378 13322380 12354184 10877131 9798430 8723651 7408016 6793297 7469880 8300651 8088385
35369 8088385 7732746 8895310 10984403 11573206 10004805 8545509 9165997 10882935 11483992
35360 11483992 10585171 9525840 9098260 8998672 9173948 10079089 11387601 11826657 10911806
35351 10911806 9864056 10042130 11166498 11958691 12025791 12043246 12271320 12137386 11571691
35342A1571691k2061R96994Q56479o09965j598790r81966J64110N44672N36115
35333A1457279Q05226O46774m38732q70306Q59629K995146K347631q04645k634328
35324A4363674j162960J156598J464946M07930J70553Q36088J045049P29997P57426
35315A9769301Q68098L39608j0367J137576K971910L373663K307574J933209K981476
35306C5672048L516108K280356J014350J819399L877773M747320L917283L034643
35298E9879280K991080K803449J639153K12156n75451j057348j886200k682496
35290F1323623k771005k579885k949985l424378k783856j321072q84060k101411
35282D2507971l217360k710440j528384j223685j239753j40654J342394J016537
$$ plain form
35342 11571691 11549630 12546624 13403103 12793138 11194348 10212382 10376492 10921164 11457279
35333 11457279 12262505 12909279 12470547 11600241 12459870 15455016 17802647 16998002 14363674
35324 14363674 13200714 14357312 15822258 16230188 16400741 17236829 18281878 19011875 19769301
35315 19769301 20637399 20977007 20966640 22104216 25076126 28449789 30757363 32690572 35672048
35306 35672048 39188156 41468512 42482862 44302261 48180034 52927354 56844637 59879280
35298 59879280 62870360 65673809 67312962 67525118 66949667 65892319 64006119 61323623
35290 61323623 58552618 55972733 53022748 49598370 46814514 45493442 44609382 42507971
35282 42507971 39290611 36580171 35051787 33828102 32588349 32447695 33790089 34806626
35274C4806626j147342k602160j916698n92288l43532o97220n40098j88478l43565
35265B6435245m44139K59002J071809R18620J83228k4809L01698M41777M73039
35256B9615470R35446J501653J420475Q92759P39209J119193J706719K538029
35248D0468953L526663L916658L526336L624783N026894O289102N643865L796089
35240G5819343K658834K176433R19674q16913j375862q46402o94814l54444K286981
35231G9772830O508438Q685476P840795P453656R836337J2545722J3137203J3794674
35223A59575131J7395370K1963218K3706775K3557763K5459921K8989709K9116305
35216C29764192K3783302J6658231J0974893N449902j293583o561702p418896
$$ plain form
35274 34806626 33659284 31057124 29140426 28548138 28204606 27507386 26967288 26778810 26435245
35265 26435245 25991106 26250108 27321917 28240537 28423765 28398956 28700654 29142431 29615470
35256 29615470 30550916 32052569 33473044 34365803 35105012 36224205 37930924 40468953
35248 40468953 43995616 47912274 51438610 55063393 60090287 66379389 72023254 75819343
35240 75819343 78478177 80654610 81574284 80757371 79381509 78535107 77840293 77485849 79772830
35231 79772830 86281268 94966744 102807539 110261195 120097532 132643254 145780457 159575131
35223 159575131 176970501 198933719 222640494 246198257 271658178 300647887 329764192
35216 329764192 353547494 370205725 381180618 386630520 385336937 378775235 371356339
35209C71356339n690048n285360o427979o331044m456570l218328l639295l896216
35201C32411499k834521j928508k576605l827807m264744m375697n458003p342986
35193B99802628q747517r210396r373236r721870j0145369j0559988j1069780
35186B30974472j1553973j1797446j2027385j2715008j3735238j4168735j3145444
35179A41831243j0719505p836788n517388m049601k912326j477442K73630J792986
35171A11384809K526671K154919M58309k480278n740874p706820p282387n036103
35163H8278246k844364k122064k383448j863984J83149K250438K409193J165940
35155H5073106J192625L780746O980994Q370920Q451503R624966J2534136J5293988
$$ plain form
35209 371356339 365666291 360380931 353952952 347621908 343165338 339947010 336307715 332411499
35201 332411499 329576978 327648470 325071865 321244058 316979314 312603617 307145614 299802628
35193 299802628 291055111 281844715 272471479 262749609 252604240 242044252 230974472
35186 230974472 219420499 207623053 195595668 182880660 169145422 154976687 141831243
35179 141831243 131111738 123274950 117757562 113707961 110795635 109318193 109591823 111384809
35171 111384809 113911480 116066399 116524708 114044430 108303556 100596736 93314349 88278246
35163 88278246 85433882 83311818 80928370 79064386 79247535 81497973 83907166 85073106
35155 85073106 86265731 90046477 97027471 105398391 113849894 123474860 136008996 151302984
35147A51302984J6022984J4238644R976299L838598j737189l672891j774081Q23109
35139A89018457J786537K305931M447765P759534J0316790J1622644J2449759
35132B39707417J2881335J2484144J1657727J1004334J0004929P954629N509306
35125C11203821L726323K416477J108759O03084J531213K349739J150209j230107
35117C22859518k422359k301800k795888m198761m700259l861980l623350n138800
35109B93816321p243877q859850j0388457j1830012j2070212j1191755j1118468
35102B21113690j2675796j4167974j4070376j2954741j1591285r561878p176791
35095A38914849o264378p283490q029940p154444o546762p927895r448535q510216
$$ plain form
35147 151302984 167325968 181564612 191540911 195379509 193642320 189969429 188195348 189018457
35139 189018457 190804994 193110925 197558690 205318224 215635014 227257658 239707417
35132 239707417 252588752 265072896 276730623 287734957 297739886 305694515 311203821
35125 311203821 314930144 317346621 318455380 319058464 320589677 322939416 324089625 322859518
35117 322859518 320437159 318135359 315339471 311140710 306440451 302578471 298955121 293816321
35109 293816321 286572444 277712594 267324137 255494125 243423913 232232158 221113690
35102 221113690 208437894 194269920 180199544 167244803 155653518 146091640 138914849
35095 138914849 132650471 125366981 117337041 110182597 103635835 95707940 86259405 77749189
35087G7749189o012884m670687m586111l774386k117734j502083k377187l112686
35079D9595431k749037j964847j416414j244447j856882l065384l050651n92026
35071C3655743K268676K463782L62700q75178j55709N11909P50k69353M99651
35062C8462971P87278l75944j490877j182840n13571r28383j635970q85948J239060
35053C3475776K820316K250355m17857l458082m421447k324478P24515J525658
35045C0174756k00799j523071n25682J259868J670977J055135J002834J668780
35037C4582798K264427K990745M498018O144747O598055N784043M717034L652252
35029G1232119J816280j037766l933197n666506n797762m683341l110877j830791
$$ plain form
35087 77749189 71736305 67065618 62479507 58705121 56587387 55085304 52708117 49595431
35079 49595431 46846394 44881547 43465133 42220686 40363804 37298420 34247769 33655743
35071 33655743 35924419 38388201 38750901 37875723 37720014 38231923 38232673 37963320 38462971
35062 38462971 39250249 38874305 37383428 36200588 35687017 34758634 33122664 32236716 33475776
35053 33475776 36296092 38546447 38128590 34670508 30249061 27924583 28649098 30174756
35045 30174756 29973957 28450886 27925204 29185072 30856049 31911184 32914018 34582798
35037 34582798 36847225 39837970 44335988 50480735 57078790 62862833 67579867 71232119
35029 71232119 73048399 72010633 68077436 62410930 56613168 51929827 48818950 46988159
35021D6988159r83460n7225J294477K515385K418848K21496l421828o227100n864099
35012C6884653k587536L42036J02244k296564l520760k351316o74329j83752m20274
35003B5294402n63065q67333j353719j113785q9837L06547m21689p03671M77739
34994B0965589J671517J355554M95042O90266J287019O64696p00089r43651L3812
34985B5519755N53961P2543j90629L35982O52879J91209n0933P88269J854448
34976B9727484J656569J09525j237708r14904Q07658K132617J825871Q14480R11384
34967C5832976K143582K789510K358010K673219M971945P737623R053324R558148
34959G7118337J0977483J2860821J3152421J1350187Q687185N485194Q44642m818803
$$ plain form
35021 46988159 46004699 45947474 47241951 49757336 52176184 52397680 48975852 42748752 36884653
35012 36884653 34297117 34639153 34741397 32444833 28924073 26572757 25898428 25714676 25294402
35003 25294402 24731337 23864004 22510285 21396500 21306663 21613210 21191521 20487850 20965589
34994 20965589 22637106 23992660 24487702 25177968 26464987 27129683 26429594 25485943 25519755
34985 25519755 26073716 26146259 25955630 26291612 26944491 27135700 27084767 27873036 29727484
34976 29727484 31384053 31493578 30255870 29340966 30148624 32281241 34107112 34921592 35832976
34967 35832976 37976558 40766068 43124078 45797297 50769242 58506865 67560189 77118337
34959 77118337 88095820 100956641 114109062 125459249 134146434 139631628 140476270 135657467
34951A35657467r283179j1242650j1653642j1713877j1264940r993702q544521
34944F1960956p368388n845686l749711k444688l188602m871731m920422k490474
34936B7081254L21669Q92479q63536k454580j836687J31299Q78420n06194k162342
34927B1481782k043611m83979O92684P37263M23253M10307M50036J72269l38417
34918B1501587q07095r36493m64238L57534P20660L56698J00860N24927P34734
34909B2089174k59757j583172j437895K13255J458722J060791q6840m30974M13843
34900B1437147J655171K278137J734703L46089q17566q96674L8519J514157L247429
34891C0537112M659846M798257L802193L480027N048978P221209Q169497Q443912
$$ plain form
34951 135657467 126374288 115131638 103477996 91764119 80499179 70505477 61960956
34944 61960956 54592568 48746882 44997171 42552483 39363881 34492150 29571728 27081254
34936 27081254 27402923 28295402 27431866 24977286 23140599 23271898 24150318 23644124 21481782
34927 21481782 19438171 18954192 19646876 20384139 20807392 21217699 21667735 21840004 21501587
34918 21501587 20694492 19757999 19293761 19651295 20371955 20728653 20829513 21354440 22089174
34909 22089174 21829417 20246245 18808350 19021605 20480327 21541118 21454278 21023304 21437147
34900 21437147 23092318 25370455 27105158 27451247 26633681 25737007 25775526 27289683 30537112
34891 30537112 35196958 39995215 43797408 47277435 52326413 59547622 67717119 76161031
34883G6161031R819966J1941863J2649003J1474418J0152005R273019P036139
34876A48507444K255016l545750q129510j0897543j2304613j2614507j2230510
34869I1040027j1767325j0922395q738131n682876l757841l705056l964715l431681
34861C9070007l223629m245753m956376l579378j125621l8520o89229j246584
34853A9964917n68837N68811R98274N42700j13731j31496O33116J054926j45846
34844B2802834k244877k823075j113840N26871j24128j927003k202865n65448
34836A2328469J102820J590736J158752P8488j434865k223150j270446L73699
34828A1704503P50451r3382l84411L19079O01376j14943o42968l04029L2547j10584
$$ plain form
34883 76161031 85980997 97922860 110571863 122046281 132198286 141471305 148507444
34876 148507444 150762460 147216710 139087200 128189657 115885044 103270537 91040027
34869 91040027 79272702 68350307 59612176 53929300 50171459 46466403 42501688 39070007
34861 39070007 35846378 31600625 26644249 23064871 21939250 21900730 21211501 19964917
34853 19964917 19396080 19964891 20963165 21505865 21392134 21260638 21893754 22948680 22802834
34844 22802834 20557957 17734882 16621042 17147913 17023785 15096782 12893917 12328469
34836 12328469 13431289 15022025 16180777 16259265 14824400 12601250 11330804 11704503
34828 11704503 12454954 12361572 11977161 12296240 12897616 12782673 12139705 11835676 11868223 11757639
34818A1757639J28599J089635J685553J345415J056409J415152J473502P76363
34810B0728267O80618K017383L152975K394220R70940J357119L541350N328714
34802D0171586N810875O050579O336052N225406J999511j859375m516512n682890
34794E3535232n950029n593531m860725m274935l810861k771730j219263m31047
34786B4623111j057125j886376j513281l19862L57331K36055R988o8679j90135
34777B0191027j06619L41636K65527j146094k816551k846864j417564p66263j836146
34768I862089k788304j765116M44280J757167J624160J063255O42250k1850r35176
34759I882755j225021l00466J172334J810103R01345p67031j584516r19669m574
$$ plain form
34818 11757639 11886238 12975873 14661426 16006841 17063250 18478402 19951904 20728267
34810 20728267 21408885 23426268 26579243 28973463 29944403 31301522 34842872 40171586
34802 40171586 45982461 52033040 58369092 63594498 65594009 63734634 59218122 53535232
34794 53535232 47585203 41991672 37130947 32856012 29045151 26273421 25054158 24623111
34786 24623111 23565986 21679610 20166329 19846467 20203798 20439853 20449841 20381162 20191027
34777 20191027 20084408 20426044 20691571 19545477 16728926 13882062 12464498 11698235 9862089
34768 9862089 7073785 5308669 5752949 7510116 9134276 10197531 10839781 10817931 9882755
34759 9882755 8657734 8357268 9529602 11339705 12241050 11474019 9889503 8969834 8965260
34750H965260l42218j491630j605918k27060R29617N23848n33270o95008j3151
34741E510470M32625L45794J77453K4049k16243j77775L67320P79176M21177l24367
34731G339679q10675j145246j500763j295947j85054R94005J391159J320482J144670
34722G252310K48231j397605k019941l72093J829595J973686J97347j218351j244476
34713E248703n89653L12020J217211Q67328j160121k191317L96632M153289L817575
34704A2071667r36141m357573k683809P88833J128114j222656k078305J33552
34696B843682K924201L531137J592106j341544l166177k672246p80978M21493
34688C351674L78088L33630O27878R5585j043883o08550J689817K792203R06578
$$ plain form
34750 8965260 8623042 7131412 5525494 5298434 6228051 6751899 6218629 5523621 5510470
34741 5510470 5943095 6288889 6466342 6490391 6274148 6096373 6463693 7242869 7664046 7339679
34731 7339679 6529004 5383758 3882995 2587048 2401994 3395999 4787158 6107640 7252310
34722 7252310 7500541 6102936 4082995 3710902 5540497 7514183 7711530 6493179 5248703
34713 5248703 4659050 4971070 6188281 7055609 5895488 3704171 4100803 8254092 12071667
34704 12071667 11135526 6777953 4094144 4882977 6011091 4788435 2710130 2843682
34696 2843682 5767883 9299020 10891126 9549582 6383405 3711159 2930181 3351674
34688 3351674 3729762 4063392 4691270 4786855 3742972 3134422 4824239 7616442 8523020
34679H523020j259519o55676J312536J466651J44354n8510O85449j26510k446082
34670G585713l292006j485507P27566J356488R30003M01081l91436j201889p80288
34661C849725R70017K098302J061159j208067k514825j735000M22414K058707
34653E002432J524326p38678k137940j009271Q56812N89855j384042j774660O18587
34644A547421K923398K124452r96995l131737k360986L26925K556144K650470
34636E639092P47320j441467k124335r16240J130461K536667K217987J73653j988832
34627E974306k170622l05579J250382Q10261m83557q37079n15214n54017m15041
34618B753840O56608J351636K31970j180518m57691J426686J430694l49411q02918
$$ plain form
34679 8523020 7263501 6607825 7920361 9387012 9531366 9472856 10158305 10031795 7585713
34670 7585713 4293707 2808200 3535766 4892254 5822257 6223338 5831902 4630013 3849725
34661 3849725 4819742 6918044 7979203 6771136 4256311 2521311 2943725 5002432
34653 5002432 6526758 5788080 3650140 2640869 3497681 4087536 2703494 928834 1547421
34644 1547421 4470819 6595271 5598276 2466539 105553 432478 2988622 5639092
34636 5639092 6386412 4944945 2820610 1904370 3034831 5571498 7789485 7963138 5974306
34627 5974306 3803684 3498105 4748487 5558748 5075191 4238112 3722898 3168881 2753840
34618 2753840 3410448 4762084 4994054 3813536 3355845 4782531 6213225 5863814 5060896
34609E060896O59507R52431j203251k765773j309573J091945J441436L71051K99194
34600D597863J234495J341686K84086o25417p48933m93670o1573M74810N61521
34591F564868M3239j42601O19178J428810J233942L76084k84656o46432p37615
34582H454817j53262P33026M56071j304752k641420k041337o16162q8409r8008
34573B700564N26537J230185P76992k07824j74288N45969L08102q17157j011900
34564C877180K22756J210739P57282k09054l03280M26061R31118N18142o50956
34555F779988j700452j605378k99654R51999J028363L98123J88837L86806K09180
34546F337812k27834j36713L05627J86201l21877r6842P48598O40043q45940j832881
$$ plain form
34609 5060896 5720403 6672834 5469583 2703810 1394237 2486182 3927618 4298669 4597863
34600 4597863 5832358 7174044 7458130 6832713 6083780 5590110 5528537 6003347 6564868
34591 6564868 6608107 6465506 7084684 8513494 9747436 10123520 9838864 9192432 8454817
34582 8454817 8301555 9034581 9490652 8185900 5544480 3503143 2886981 2798572 2700564
34573 2700564 3227101 4457286 5234278 5026454 4852166 5398135 5706237 4889080 3877180
34564 3877180 4099936 5310675 6067957 5858903 5555623 5981684 6912802 7430944 6779988
34555 6779988 5079536 3474158 3174504 4126503 5154866 5552989 5741826 6128632 6337812
34546 6337812 6109978 5973265 6278892 6465093 6143216 6046374 6794972 7435015 6589075 4756194
34536D756194p11845J433688K280599J263274k38567j118580j444423j271808
34528D948532j29567J752274K906195K359606J262200J546498L072788L448382
34520B1166908J240223j769730k663830j096609M64496J35951j170770j455019
34512A4851620l92068N86781M11931m59611r99268r69214r43351j254767j435102
34503I396951r44628j15283K45525J10882K41415P49166P32546r4263o01341l8955
34493I682015N67660J74890l10558L44593J134672K61609j446463j375825N59475
34484I592068J440820j1697j223826J90851K578175K674430L83838j241813k70373
34475A4112473J796415K162269J00789k219808k131336L78136K441546J811386
$$ plain form
34536 4756194 4044349 5478037 7758636 9021910 8783343 7664763 6220340 4948532
34528 4948532 4818965 6571239 9477434 11837040 13099240 14645738 17718526 21166908
34520 21166908 22407131 20637401 17973571 16876962 17341458 17477409 16306639 14851620
34512 14851620 14459552 15046333 15458264 14998653 13999385 13030171 12086820 10832053 9396951
34503 9396951 8452323 8337040 8582565 8693447 8934862 9684028 10416574 10322311 9720970 9682015
34493 9682015 10249675 10424565 10114007 10458600 11593272 11854881 10408418 9032593 9592068
34484 9592068 11032888 11021191 9797365 9988216 12566391 15240821 15624659 14382846 14112473
34475 14112473 15908888 18071157 18171946 15952138 13820802 14198938 16640484 18451870
34467A8451870l20380j303497q39006o79557j200289j055257k04103k51678j276432
34458A1321671j365521j28734M45437k60551j77825J494275K359787Q37739j102499
34449A3423779j446158j170642j345230o45985J272848J550890r89549k289873
34441H360080R09648M629205K956823k405160m283282p71016K710747K339362
34433A4446407N28652K69952O41008K53717K62900J244464J193272o44472j609102
34424A6586798o0788J433671L44920j474474j025670Q32499J231989K46149K35379
34415A8350473J314892J108215j122767l135827k956387j289614r4275j96275
34407A1978435q15915o50231P35139K207585K124618M03044j252524j596413j200696
$$ plain form
34467 18451870 18131490 16827993 15988987 15309430 14109141 13053884 12849781 12598103 11321671
34458 11321671 9956150 9827416 10272853 10012302 9834477 11328752 13688539 14526278 13423779
34449 13423779 11977621 10806979 9461749 8815764 10088612 11639502 10649953 8360080
34441 8360080 9269728 13898933 16855756 14450596 10167314 9396298 12107045 14446407
34433 14446407 14975059 15245011 15886019 16139736 16402636 17647100 18840372 18195900 16586798
34424 16586798 16526010 17959681 18304601 16830127 15804457 16636956 17868945 18115094 18350473
34415 18350473 19665365 20773580 19650813 16514986 13558599 12268985 12174710 11978435
34407 11978435 11162520 10512289 11247428 13455013 15579631 15982675 14730151 13133738 11933042
34398A1933042r38104n01855M32098Q64444j13117j395119j055976Q72869K351450
34389A2449732K055535Q63792L52817P74093J046242L43273p63916q76725N23114
34380A6767957K179227K254630L61913j985144k913947j886058l2039R08260L02550
34371A5957349n42496q707J189676N17971k334796l927611j653001J868777K048146
34362A3115308r66915k509430l79213K221062J875030l96625j638969j309166
34354A0011082o97767p1990R95421J714113R28455p22835j445590p89220l7629
34345I884040l00739j288965j861226j213667K20101R97247M83903J33398J520038
34336H574130L350396K655206o61297l007564j972704L91300Q54749m75181j061814
$$ plain form
34398 11933042 10994938 10493083 10925181 11789625 11676508 10281389 9225413 10098282 12449732
34389 12449732 14505267 15369059 15721876 16495969 17542211 17885484 17121568 16244843 16767957
34380 16767957 18947184 21201814 21563727 19578583 16664636 14778578 14746539 15654799 15957349
34371 15957349 15414853 15406146 16595822 17113793 14778997 10851386 9198385 11067162 13115308
34362 13115308 12148393 9638963 9259750 11480812 13355842 12959217 11320248 10011082
34354 10011082 9313315 9241325 10236746 11950859 12879314 12156479 10710889 9921669 9884040
34345 9884040 9583301 8294336 6433110 5219443 5439544 6436791 6920694 7054092 8574130
34336 8574130 11924526 14579732 13918435 10910871 8938167 9329467 10184216 9709035 8647221
34327H647221O7209J446042J585011N04015q09516j385621j080950q06530j170850
34318F996031j106029M39749J758649K14490k874765k934152Q82201L491731J300814
34309H168719k158060j863631Q57395J136890j156368j724344M52120J576626
34301E289347k03670j817590p22322J115790J028906p2653R1156J202801J273852
34292G185617l9790j343052j752447j441397n94488P28458J970842K268478J244141
34283H226362n71659j904479j682240l93087J75925n79970r56582K90544J455448
34274D060262M69902j254111p52786J362029J525943p92355j868835K21581K361198
34265E332828J508427m94780l83440J086346R52009n38992m77923J408588K064277
$$ plain form
34327 8647221 8714430 10160472 11745483 12249498 11439982 10054361 8973411 8166881 6996031
34318 6996031 5890002 6329751 8088400 8302890 5428125 2493973 3376174 6867905 8168719
34309 8168719 6010659 4147028 5004423 6141313 4984945 3260601 3712721 5289347
34301 5289347 5085677 3268087 2545765 3661555 4690461 4617808 4708964 5911765 7185617
34292 7185617 7145827 5802775 4050328 2608931 2014443 2742901 4713743 6982221 8226362
34283 8226362 7654703 5750224 4067984 3674897 3850822 3270852 2314270 2604814 4060262
34274 4060262 4530164 3276053 2523267 3885296 5411239 4618884 2750049 2971630 5332828
34265 5332828 6841255 6346475 5963035 7049381 8001390 7462398 6984475 8393063 10457340
34256A0457340J78475j568683p18977J207339J161734q95883k128977r29280J085673
34247G848761J533298L01741q54803j010433r58298j325895j313175k83407O16222
34238D554011Q2627q50424j22260J694603J620988j096624l178046j838269J036482
34229A903088J691385J9076p20794P66177J905580M33561k099389k586189n32065
34220G80430J744671K237045J027175o52160j698083j478337j15312J264664J473621
34211D583714P60781M98716J035605J001702m01485j585480o46523J412412J683968
34202H343410k72912j436772J94046K316150J600089j259450k515464q76588Q70360
34193F962869K68116j402900j527512m1980R93180O75118J55430M52859J001786
$$ plain form
34256 10457340 10635815 9067132 8348155 9555494 10717228 9821345 7692368 6763088 7848761
34247 7848761 9382059 9683800 8828997 7818564 6860266 5534371 4221196 3937789 4554011
34238 4554011 4636638 3786214 3663954 5358557 6979545 5882921 2704875 866606 1903088
34229 1903088 3594473 3613549 2892755 3658932 5564512 5998073 3898684 1312495 780430
34220 780430 2525101 4762146 5789321 5137161 3439078 1960741 1845429 3110093 4583714
34211 4583714 5344495 5843211 6878816 7880518 7479033 5893553 5247030 6659442 8343410
34202 8343410 8070498 6633726 6827772 9143922 10744011 9484561 6969097 6092509 6962869
34193 6962869 7230985 5828085 4300573 4258593 5251773 5926891 6082321 6535180 7536966
34184G536966Q20623J10903r346R74466K285545K772003K165312J082629k1787
34175A7717314j200951k154309j975265m95357R10246R31321J42122n0811K61159
34166A4085469r9087q53096k27920J978176L240672J463663k019891l941031k786981
34157A0839974Q6299K310515K428952O17695j410795j659429K4875J470732P37479
34148A5446297j325532k185996r90217M94775M64636n92976q15982M87628K080684
34139A3063317K493539J740184R09629M61219k09731j350946k022374j513060
34131A3571777p63816j036739j647986p93900J310650K144204N15263j403964
34123A1895489j115208O23982J159034m8671r67677l82527M14779q7680j327468
$$ plain form
34184 7536966 8357589 8468492 8459146 9433612 11719157 14491160 16656472 17739101 17717314
34175 17717314 16516363 14362054 12386789 11891432 12801678 13732999 13875121 13824310 14085469
34166 14085469 13986382 13133286 12905366 14883542 18124214 19587877 17567986 13626955 10839974
34157 10839974 10926273 13236788 15665740 16283435 14872640 13213211 13238086 14708818 15446297
34148 15446297 14120765 11934769 10944552 11439327 11903963 11310987 10495005 10982633 13063317
34139 13063317 15556856 17297040 18206669 18667888 18458157 17107211 15084837 13571777
34131 13571777 12807961 11771222 10123236 9329336 10639986 12784190 13299453 11895489
34123 11895489 10780281 11404263 12563297 12514626 11546949 11164422 11579201 11491521 10164053
34114A0164053j725294r84391j42739J75553M05759R19120J203170O40741l95305
34105A0260667q54871l34979M45346O11447J16929m47655n91465j97877M85528
34096I493070Q53583N09143R0106O12951J492976O11437k406824m464813k717857
34087D073772R73102K157189O2582j550884l70182J221690O02043p30432j34886
34078F303994J355906Q27822j326647j868109k3982J310904K39261j450768j430362
34069C938019r4531Q14037Q75619O75637K60095m94530r31378m45437L62190M76064
34059E435785j28387p76721j186425j356653r66131J09600J107467J185189O16039
34050D039763K65501J91079j94550p40865n59139L92143Q98820K71969m29738
$$ plain form
34114 10164053 8438759 7454368 7311629 7487182 7892941 8812061 10015231 10655972 10260667
34105 10260667 9405796 9070817 9516163 10127610 10244539 9796884 9205419 9007542 9493070
34096 9493070 10346653 10855796 10945902 11558853 13051829 13663266 11256442 6791629 4073772
34087 4073772 5046874 7204063 7266645 5715761 5345579 6567269 7169312 6438880 6303994
34078 6303994 7659900 8487722 7161075 5292966 5268984 6579888 6819149 5368381 3938019
34069 3938019 3843488 4657525 5533144 6208781 6468876 5974346 5042968 4597531 4959721 5435785
34059 5435785 5307398 4530677 3344252 1987599 1021468 1131068 2238535 3423724 4039763
34050 4039763 4305264 4496343 4301793 3560928 3001789 3393932 4292752 4564721 4134983
34041D134983P4779J148274Q94665j038576k586950j831609M63539J851930J270285
34032D381320k192l66790K49907R04819J032561P11502J67605l34381m63300j90280
34022F090771O2223o3748m94172r68950j141888m55909J160679K342509J370773
34013G902288j183680k393872p25192J549471J381423p52692j796150p02581N25295
34004C804310M54648J68885P10887J032674Q2676r76303o48864J33641n48318
33995D214236k090872j833630P53525K756065J825948l55668n17595J325851J884769
33986G962629l23322k403849j225206J666442K023212p21445k311751M4748L278828
33977G990286K812395p73100k730236r51188J712770K149409P17153p37379j688219
$$ plain form
34041 4134983 4209762 5358036 6252701 5214125 2627175 795566 1259105 3111035 4381320
34032 4381320 4379128 4012338 4262245 5167064 6199625 6911127 7078732 6744351 6281051 6090771
34022 6090771 6152994 6089246 5595074 4626124 3484236 3028327 4189006 6531515 7902288
34013 7902288 6718608 4324736 3599544 5149015 6530438 5777746 3981596 3279015 3804310
34004 3804310 4258958 4427843 5138730 6171404 6254080 5277777 4628913 4762554 4214236
33995 4214236 2123364 289734 1043259 3799324 5625272 5269604 4752009 6077860 7962629
33986 7962629 7639307 5235458 4010252 5676694 7699906 6978461 4666710 4711458 7990286
33977 7990286 10802681 10029581 7299345 6348157 8060927 10210336 10927489 10190110 8501891
33968H501891k156972j537027q2625M10906o29185j011918P53789K336974Q38458
33959G424291k248640k837304m25049J276224K28457j125767k50325J585938J904155
33950E531980R38627M35720L76507l74581j304291q82547N39260R90188k5030
33941F225833r54034q70278n68511o00344l01069N14124P99475J70534k04956
33932D210774K76904L65890p76393j640417o11739J116326J163990k59003p07564
33923C138768N56072J544933Q75305l38844q18620j079499j692223j583629R4207
33914F96470J891895J855320L44515q31923j118892j032093k79445J435948K429088
33905E390883Q01459j942410k259594L1072J217654k80539j165921J086943L437423
$$ plain form
33968 8501891 6344919 4807892 4725267 5136173 4506988 3495070 4248859 6585833 7424291
33959 7424291 5175651 2338347 1913298 3189522 3417979 2292212 2041887 3627825 5531980
33950 5531980 6470607 6906327 7282834 6908253 5603962 4721415 5260675 6250863 6225833
33941 6225833 5271799 4401521 3833010 3232666 2931597 3445721 4245196 4415730 4210774
33932 4210774 4487678 4853568 4077175 2436758 1825019 2941345 4105335 3846332 3138768
33923 3138768 3694840 5239773 6115078 5776234 4957614 3878115 2185892 602263 696470
33914 696470 2588365 4443685 4788200 3956277 2837385 1805292 1525847 2961795 5390883
33905 5390883 6192342 4249932 1990338 2021410 3239064 2958525 1792604 2879547 6316970
33896F316970J899900j678174k193171O33623J909403m82709k642818j041941
33888B721083K161426K902520J076943m97256p32339p27542j016372j215532j415983
33879C256948j502875k54320K413205L707846J506044j593732j425661J262428
33871G369883J750747j100438k933549r40859J689136J074823j323790j544609
33863D041344O01591J982565J354427L67527M9741l27567r80555j070459n24436
33854E494178m4851N63916J777029K416260R77036j313435j695680k55796N0957
33845G969614j689596k762893j381785M03541K60812p80876o03163M10609O66429
33836B492692L85740O20466P39063k72088j180659j88004J577426J446704k55079
$$ plain form
33896 6316970 8216870 6538696 4345525 4979148 6888551 6405842 3763024 2721083
33888 2721083 4882509 7785029 8861972 8364716 7632377 6904835 5888463 4672931 3256948
33879 3256948 1754073 1499753 3912958 7620804 9126848 7533116 6107455 7369883
33871 7369883 9120630 8020192 5086643 4145784 5834920 6909743 5585953 4041344
33863 4041344 4642935 6625500 7979927 8347454 8397195 8069628 7089073 6018614 5494178
33854 5494178 5449327 6013243 7790272 10206532 11183568 9870133 8174453 7918657 7969614
33845 7969614 6280018 3517125 2135340 2538881 2799693 2018817 1415654 1826263 2492692
33836 2492692 2878432 3498898 4237961 3965873 2785214 2597210 4174636 5621340 5366261
33827E366261m83419J335415J854171j043138m526246m457928r11778K279656
33819e87006K555733J046910J50096M97286R30958N71857O9472O16806J975490
33810G827602K240836K68625k245047k475626k50099J489009N92781j475689j905925
33801D066467l93698R05830O53859k10979l29264K94823Q85384J161561J261567
33792H295550J046448K55127q32500j422925r75758J94844J056842O55636r52655
33783G320609k497867k527384q33856J301001K371176J952937P26371l79639p52291
33774F681057j75672J013875J804489J147545q23412k465756k105206J0141J705214
33765F792275J276718l78892p86787Q43293K348270J411463j152812k413210j435667
$$ plain form
33827 5366261 4882842 6218257 8072428 7029290 2503044 -1954884 -2866662 -587006
33819 -587006 1968727 3015637 3165733 3663019 4593977 5165834 5235306 5852112 7827602
33810 7827602 10068438 10337063 8092016 5616390 5366291 6855300 7448081 5972392 4066467
33801 4066467 3672769 4578599 5232458 5021479 4692215 4987038 5872422 7033983 8295550
33792 8295550 9341998 9597125 8764625 7341700 6365942 6560786 7617628 8273264 7320609
33783 7320609 4822742 2295358 1461502 2762503 5133679 7086616 7812987 7433348 6681057
33774 6681057 6505385 7519260 9323749 10471294 9647882 7182126 5076920 5087061 6792275
33765 6792275 8068993 7690101 6903314 7746607 10094877 11506340 10353528 7940318 6504651
33756F504651m14318r83343j526799m5859J957573J380659j318842k265332k9386
33747C259004K069065J166231p94746o14218Q26778M18765j524254j637095P42986
33738C912516K289366R70079r68854q09558Q11314J723107J464599P62748k51581
33729I903736j375272j544568n04560K85639P06j26325N63581L48022j662219
33720E888740k786963n50881K575112K214305j043004k212161M98642L113235
33712G697025K177825l84192r72336L11353Q67728N6701o03499n83420q53436
33703G713749j504592j201622N94383K419035K423226M49336j826580k500969
33695F565966j213860N38346J108024O09455M17475Q72877Q13180k00507p33044
$$ plain form
33756 6504651 6090333 5106990 3580191 3534332 5491905 6872564 5553722 3288390 3259004
33747 3259004 5328069 6494300 5699554 5085336 5912114 6330879 4806625 3169530 3912516
33738 3912516 6201882 7171961 6203107 5393549 6204863 7927970 9392569 10155317 9903736
33729 9903736 8528464 6983896 6479336 6764975 6765681 6639356 7202937 7550959 5888740
33720 5888740 3101777 2550896 5126008 7340313 6297309 4085148 4583790 7697025
33712 7697025 9874850 9490658 8518322 8829675 9697403 9754104 9150605 8567185 7713749
33703 7713749 6209157 5007535 5601918 8020953 10444179 10893515 9066935 6565966
33695 6565966 5352106 5890452 6998476 7607931 8025406 8898283 9711463 9510956 8777912
33686H777912L51535J820166J692479J38999r10934o77582k94565n71724p23151
33677I603135j8381O96952K96850o65224o99523J92773L54985q66267j731486
33668G163814n27669J611445K038698M56686n78930M76795J810712J072424j108692
33659A2415283k290964j788640r45890m86025J24225P99747O07979k64794m04257
33650G766664M22303P19986j35749p25414p3568N54073j80660j249542p86152
33641F311941R19681J791112R25484l97262o55585J80312J076330J300819J032892
33632A2485724Q78406R68327P51962p1980q32597p88844l55950l80413n22208
33623A2132427K05879J382714J398041L9089r00375k38447R83743J289176O70063
$$ plain form
33686 8777912 9129447 10949613 12642092 12781091 11870157 11192575 10898010 10326286 9603135
33677 9603135 9584754 10281706 10578556 9913332 9213809 9406582 9761567 8895300 7163814
33668 7163814 6636145 8247590 10286288 10742974 10164044 10640839 12451551 13523975 12415283
33659 12415283 10124319 8335679 7389789 6903764 7027989 7827736 8435715 8170921 7766664
33650 7766664 8188967 8908953 8773204 8047790 7974222 8528295 8347635 7098093 6311941
33641 6311941 7231622 9022734 9948218 9550956 8895371 9075683 10152013 11452832 12485724
33632 12485724 13364130 14332457 15084419 15012439 14179842 13390998 13035048 12654635 12132427
33623 12132427 12338306 13721020 15119061 15158150 14257775 14019328 15003071 16292247 16962310
33614A6962310j13288p29647r83922o80673m06506r78192j686579r59075P92383
33605A1216811J353030M14401K49079J540276J832557J5988j161596J95040J395890
33596A7051476j86871j962647k89976K765534K377419r02999k009012J01340J098346
33587A8042610p55731j603516R04709L232020J945869o52996p86426O70803N61870
33578B1559212q11411o82991J127923K177250J522615N25229J00244j6070K07793
33569B5709794Q55604R99409J25807k71984J109967K632622J872973l27926j013165
33560C1693101J92828Q06016o5005l50654J137529K564134K120097P15466K7391
33551C8840903j15703o35712j059310l78185R08359J386503Q64813L75781K63128
$$ plain form
33614 16962310 16849022 16119375 15135453 14454780 14048274 13070082 11383503 10424428 11216811
33605 11216811 12569841 12984242 13233321 14773597 16606154 16622142 15460546 15655586 17051476
33596 17051476 16864605 14901958 14611982 17377516 19754935 18851936 16842924 16944264 18042610
33587 18042610 17286879 15683363 16588072 19820092 21765961 21112965 20326539 20997342 21559212
33578 21559212 20747801 20064810 21192733 23369983 24892598 25417827 25518071 25502001 25709794
33569 25709794 26565398 27564807 27690614 27418630 28528597 31161219 33034192 32706266 31693101
33560 31693101 31885929 32691945 32626940 32276286 33413815 35977949 38098046 38813512 38840903
33551 38840903 38725200 38089488 37030178 36651993 37560352 38946855 39811668 40187449 40450577
33542D0450577k55543j361672j737410k99329J724467J695214j006399l454053
33534C5755852k395330J335588L434609J649428j298511j715711m5098L93199
33526C7114026j318460k643381j832332l43994j14454p67647r51860o76910o99259
33517B7765729p86972j97971Q11892J275840Q53169q1894j135777j812389j412318
33508B5279309k6352R51567L85684r59755j410552o77268m2853m02438j204699
33499B1892643j448527q53831J44862Q85909P90913k40687j546159k167893j688321
33490A5768909m12165J024674J851158J375893k45893j612379j273941N25188
33482A7001444J955791J650216R5422j191894j291606l73264Q65999J678716J449326
$$ plain form
33542 40450577 40195034 38833362 37095952 36796623 38521090 40216304 39209905 35755852
33534 35755852 33360522 34696110 38130719 39780147 38481636 36765925 36720827 37114026
33526 37114026 35795566 33152185 31319853 30975859 30861405 30093758 29141898 28464988 27765729
33517 27765729 26978757 26780786 27592678 28868518 29721687 29639793 28504016 26691627 25279309
33508 25279309 25252957 26204524 26590208 25630453 24219901 23542633 23499780 23097342 21892643
33499 21892643 20444116 19590285 19735147 20621056 21411969 21171282 19625123 17457230 15768909
33490 15768909 15356744 16381418 18232576 19608469 19362576 17750197 16476256 17001444
33482 17001444 18957235 20607451 20702873 19510979 18219373 17846109 18712108 20390824 21840150
33473B1840150P2503j653147k389391j430551M55144J653212J368358M19672N3824
33464B0389774K81595J12899o32157q14054K37309J425592J346657L55508k5623
33455B2677500O39699J409191J792725K321723L010448K880175J795533J255691
33447C7782685K116105K819509J596376m89854q16357P85268J612384J26594j813579
33438D3719131j867989m81664L68972K17348j07858p09419k236051l612523k710888
33429C2579059K20517K055493P39527k073115l510962k954910j595148j26066
33421B5334395J164361J213488n32335k222679j451321J032251J911996O4630
33413B6514786j712014q22164J459134K133294O48259j121648k009907k427562
$$ plain form
33473 21840150 21912653 20259506 17870115 16439564 16894708 18547920 19916278 20335950 20389774
33464 20389774 20671369 20784268 20152111 19338057 19575366 21000958 22347615 22703123 22677500
33455 22677500 23317199 24726390 26519115 28840838 31851286 34731461 36526994 37782685
33447 37782685 39898790 42718299 44314675 43824821 43008464 43793732 45406116 45532710 43719131
33438 43719131 41851142 41369478 41738450 41955798 41847940 41138521 38902470 35289947 32579059
33429 32579059 32799576 34855069 35594596 33521481 30010519 27055609 25460461 25334395
33421 25334395 26498756 27712244 27179909 24957230 23505909 24538160 26450156 26514786
33413 26514786 24802772 23980608 25439742 27573036 28221295 27099647 25089740 22662178
33405B2662178k480087j468233L27132J206296L20362q81280n95628P25700J015877
33396B0832317l43530j432492l57619K013277L035436J745654o3732o44800o60842
33387B4123669j481944k340574j315522J213892K493190J258649n09526o64995
33379B2776839K77553P26225N70835M37562k1871j100574j630080p75138l4645
33370B1226706r94705k159779r88630J568986K012683j72820j577131l39985J086388
33361A9661713M49226m05097J046042L242266K735155j84117j651385J35278K601489
33352B7630570K777820J066404j95233j37764K65223L30010N53136J324345J961722
33343C5576233J788945J609473K898243N293864O263565M356080J594510P91389
$$ plain form
33405 22662178 20182091 18713858 19040990 20247286 20567648 19686368 19090740 19816440 20832317
33396 20832317 20488787 19056295 18698676 20711953 23747389 25493043 25429311 24784511 24123669
33387 24123669 22641725 20301151 18985629 20199521 22692711 23951360 23441834 22776839
33379 22776839 23054392 23780617 24351452 24789014 24767143 23666569 22036489 21261351 21226706
33370 21226706 20232001 18072222 17083592 18652578 20665261 20492441 18915310 18575325 19661713
33361 19661713 20110939 19705842 20751884 23994150 26729305 26545188 24893803 25029081 27630570
33352 27630570 30408390 31474794 31279561 31141797 31407020 31737030 32290166 33614511 35576233
33343 35576233 37365178 38974651 41872894 47166758 53430323 57786403 59380913 60172302
33335F0172302J338161K82115k569965l858899j942432K82047j58638j838208
33327E1706483j711514j40924K80774m65127N9610K240703L578521K706946J188722
33318E9444194O82198J042568J936969L608747M965016L535862j016555n374772
33310F8824227o306321m440272k739203k542314k837757k552423j847168j382299
33302D4176470j410510j548595j070443J31689Q34351k70302k450687l380341
33294C5011632k114664k01558P20797Q50982R87794J065628J006322J399495K076393
33285D0802821J679276J51140j55587K085508M288497L221178Q1997q26425J753028
33276E3081433M389599M006497J576855m74890j895180l516626m387301k654246
$$ plain form
33335 60172302 61510463 61792578 59222613 55363714 53421282 53703329 53544691 51706483
33327 51706483 49994969 49854045 50134819 49669692 49729302 51970005 55548526 58255472 59444194
33318 59444194 60126392 61168960 63105929 66714676 71679692 75215554 74198999 68824227
33310 68824227 62517906 58077634 55338431 52796117 49958360 47405937 45558769 44176470
33302 44176470 42765960 41217365 40146922 40278611 41112962 40842660 38391973 35011632
33294 35011632 32896968 32695410 33416207 34267189 35254983 36320611 37326933 38726428 40802821
33285 40802821 42482097 42633237 42477650 44563158 48851655 52072833 52154830 51328405 53081433
33276 53081433 57471032 61477529 63054384 62579494 60684314 57167688 52780387 50126141
33268E0126141J177568M132353M235470K557108J307067J139981J142697O34489
33260F6452874j04580o70207j117167j452434j204025J5915J768964K962646K673004
33251F9324990P59671j892960l560172k829787k64228J611331R16023j243721
33243F2821147k000344j69690K551962L834761L076221J362714J68099L95088
33235G2039958J677013K277834P17918k125147l653557k749962j120766p99942
33227F6263349j631731k227456k218657k243424k554934k990548l669392m381940
33219D4345267l874190j296758J865056K901137J156179j083857j419373j6814
33211D2576647J129134Q12831l34297j097878j137168r42977q70989p95507n98366
$$ plain form
33268 50126141 51303709 55436062 59671532 62228640 63535707 64675688 65818385 66452874
33260 66452874 66348294 65678087 64560920 63108486 61904461 61920376 63689340 66651986 69324990
33251 69324990 70084661 68191701 64631529 61801742 61537514 63148845 64064868 62821147
33243 62821147 60820803 60651113 63203075 67037836 70114057 71476771 71644870 72039958
33235 72039958 73716971 75994805 76712723 74587576 70934019 68184057 67063291 66263349
33227 66263349 64631618 62404162 60185505 57942081 55387147 52396599 48727207 44345267
33219 44345267 40471077 39174319 41039375 43940512 45096691 44012834 42593461 42576647
33211 42576647 43705781 44518612 44184315 43086437 41949269 41006292 40135303 39339796 38741430
33202C8741430l39247J66204J170665K160144K254331J946378K943933N131759
33194E4175597N500079K275646j469431j500001J259291K028498l10372j613314
33186F0345993M23486K338576P52370k057595k182662m02135j12819j300881j280310
33177E6524023k4169n346j290059j342082K04098Q24244l17216j005119l9729
33168E3528645R87915J073744J513574K888600L514433K471459J348059J357143
33160F8683572J354614L61785m79722j93419K10765o0936n214O92416J82848k214779
33150F8531930l724012k080540L05351m03174l457727m493312j985301R71057
33142E3664272J713344J444814K361435M072382M813640M498419M390585M455434
$$ plain form
33202 38741430 38402183 38568387 39739052 41899196 44153527 46099905 49043838 54175597
33194 54175597 59675676 61951322 60481891 58981890 60241181 62269679 61959307 60345993
33186 60345993 60769479 63108055 63860425 61802830 59620168 59218033 59105214 57804333 56524023
33177 56524023 56499854 56494508 55204449 53862367 54066465 54890709 54573493 53568374 53528645
33168 53528645 54516560 55590304 57103878 59992478 63506911 65978370 67326429 68683572
33160 68683572 70038186 70399971 69920249 69726830 69937595 69876659 69871445 70563861 70746709 68531930
33150 68531930 64807918 62727378 63032729 62629555 59171828 54678516 52693215 53664272
33142 53664272 55377616 56822430 59183865 63256247 68069887 72568306 76958891 81414325
33134H1414325L128465O2670k450721j999490N55260J614427q30020m594134o067502
33125G0833280m685380l018098k753674k665668j212694O29533N55350j853142
33117E5829507m353571m401474j748583J224118J760508l35434k349319j935870
33109D3689882j01243M53149o32545j137665r4958O30702m98894k174166k304357
33100C7829905r09558N31891J228051J153155K90680p64701o63534P88214J748864
33091D1232967Q59761n63121n38915N21485P48776l7669k88144N23682J176133
33082D3634955Q14308O1819k71838k43749k35028l90459p65795j159915q09004
33073D0635294Q09131K795094L353412J774600o60934j959519j322048K01844
$$ plain form
33134 81414325 84542790 84605460 82154739 80155249 80710509 82324936 81494916 76900782 70833280
33125 70833280 66147900 63129802 60376128 57710460 56497766 57127299 57682649 55829507
33117 55829507 51475936 47074462 45325879 46549997 48310505 47975071 45625752 43689882
33109 43689882 43588639 44041788 43409243 42271578 42176620 42807322 42308428 40134262 37829905
33100 37829905 36920347 37452238 38680289 39833444 40124124 39359423 38695889 39484103 41232967
33091 41232967 42092728 41529607 40990692 41512177 42260953 42223284 41935140 42458822 43634955
33082 43634955 44449263 44511082 44239244 43995495 43760467 43370008 42604213 41444298 40635294
33073 40635294 41444425 44239519 47592931 49367531 48706597 46747078 45425030 45626874
33065D5626874P87502l08733j949235k443602j477984j47703O13880O85048J18267
33056D1504314q50905j285104n30085L41009k01285j464757j268368M73022J436157
33047C8153998P07598P6376N35858O09469k89263j28584J841449K725589N66498
33038D4798988j679862n21170K176104K059930o44892j753733n9093J195719L8316
33029D5610307j467814j195997j3966M34135J02394m18818q52001n69612P11393
33020D2340021J385814k44873k606390k408997K28042J746489P86986p1516O47947
33011D1803523P34141j178955k461218q49166J315619P05792j617242k162063
33003C6290431o07894L40255k56510o02001J48451N02106n00964j565785j194476
$$ plain form
33065 45626874 46414376 46105643 44156408 41712806 40234822 40087119 40700999 41386047 41504314
33056 41504314 40653409 39368305 38838220 39179229 38977944 37513187 36244819 36717841 38153998
33047 38153998 38861596 38937972 39473830 40083299 39794036 39665452 41506901 44232490 44798988
33038 44798988 43119126 42597956 44774060 46833990 46189098 44435365 44376272 45571991 45610307
33029 45610307 44142493 42946496 42932530 43366665 43469059 43050241 42198240 41628628 42340021
33020 42340021 43725835 43480962 40874572 38465575 38693617 40440106 41227092 41155576 41803523
33011 41803523 42537664 41358709 38897491 38048325 39363944 40069736 38452494 36290431
33003 36290431 35682537 36022792 35766282 35164281 35312732 35814838 35313874 33748089 32553613
32994C2553613K52391J348475J311730L73981p12999j143779o02002L95963R31679
32985C4709052M54787q38616j993468j797235j13525J353354P89807j145769j910659
32976B9507728n22782J287101J933172K039567K593684K965486K329893J466421
32968D3600270J392363J539550J085545Q22962J680614K488410J527026l95619
32960E3741121q16241P03421K070846J900026J063818O01912P9013j151659k544577
32951E5647680l113529k591565j241610N68041K090876K421021J608550Q84147
32943E6273611J222835K199496K715703K400066J819820J586482J682255J661252
32935G1561520J330281J093296J463975K305412K969628L302906L968428N464855
$$ plain form
32994 32553613 32806004 34154479 35466209 35840190 35127191 33983412 33381410 33777373 34709052
32985 34709052 35163839 34325223 32331755 30534520 30420995 31774349 32564156 31418387 29507728
32976 29507728 28984946 30272047 32205219 34244786 36838470 39803956 42133849 43600270
32968 43600270 44992633 46532183 47617728 48440690 50121304 52609714 54136740 53741121
32960 53741121 52924880 53628301 55699147 57599173 58662991 59264903 59343916 58192257 55647680
32951 55647680 52534151 49942586 48700976 49269017 51359893 53780914 55389464 56273611
32943 56273611 57496446 59695942 62411645 64811711 66631531 68218013 69900268 71561520
32935 71561520 72891801 73985097 75449072 77754484 80724112 84027018 87995446 93460301
32927I3460301P391517R150260J0846664J2934906J5458569J8254999K1355343
32920A88852559K4276903K5209874K1941659J3862397K667183q826311j8137375
32913B49846889k3775358k5442670k4045598k1171256j8142574j5377701j2507711
32906A09384021r129918n633573l162616k364816k330884j500192K87584J493876
32898H7043482R95193l70223j083089j117050j803758l631726n149297m570171
32890G0313361k055163L21766J037813Q20946J167102J879477J706379J241078
32882G6432759K683913N702691O307245K283646k566260l135467l99246K85177
32874H7594458k316920l637500j076962J691806P15789k286082l438686k801642
$$ plain form
32927 93460301 100851818 110002078 120848742 133783648 149242217 167497216 188852559
32920 188852559 213129462 238339336 260280995 274143392 276810575 267984264 249846889
32913 249846889 226071531 200628861 176583263 155412007 137269433 121891732 109384021
32906 109384021 100254103 94620530 91457914 89093098 86762214 85262022 85549606 87043482
32898 87043482 88038675 87668452 86585363 85468313 83664555 80032829 74883532 70313361
32890 70313361 68258198 68579964 69617777 70438723 71605825 73485302 75191681 76432759
32882 76432759 79116672 84819363 91126608 93410254 90843994 87708527 87309281 87594458
32874 87594458 85277538 81640038 80563076 82254882 82970671 80684589 77245903 74444261
32866G4444261k953280l873297l418549j552879k70915m7639L05633Q50861O76996
32857F4161192K96168R16576J826191J451580N78338J490943M171081O353921
32849H1245990P220795Q056441R355520J0413887J1868449J5358388K0169893
32842A63689363K3241962K3013480K0334011J5291541O672861m519304j4473559
32835B33250355k0819955k4390975k5677303k3232038j7468437j2376912j0679294
32828I8605441j0134728p498158l567815j193419m92065M91410J868809K025043
32820H0104518P22354q72647k486231m355241n396993m543758l169617l337177
32812E6665208m245609l429991j072879J25500o22162j197193m31661L63219N98857
$$ plain form
32866 74444261 71490981 67617684 64199135 62646256 62375341 62327702 62633335 63484196 64161192
32857 64161192 64457360 65373936 67200127 68651707 69230045 70720988 74892069 81245990
32849 81245990 88466785 96523226 105878746 116292633 128161082 143519470 163689363
32842 163689363 186931325 209944805 230278816 245570357 252243218 247723914 233250355
32835 233250355 212430400 188039425 162362122 139130084 121661647 109284735 98605441
32828 98605441 88470713 80972555 77404740 76211321 75719256 76210666 78079475 80104518
32820 80104518 80826872 79954225 77467994 73112753 67715760 63172002 60002385 56665208
32812 56665208 52419599 48989608 47916729 48042229 47420067 46222874 45791213 46154432 46753289
32803D6753289J772851M052901M632237J869472j379928j384329J211614K749947
32795F0278054K080646J394415J690759Q82039k340971n505031n455419k906058
32787E0118434j344909j908698k004160L38424L148066L386339J690063J735468
32779E5159027N023056Q656817R081696O151376K274300r05907l258857m652963
32771G7528545m764067m171478l855835l475427j695160J472555M094326M559493
32763F9692952L139782Q52311j824709m329932n531844n124477m475910m683345
32755D7714828m639045k740041L0684Q62443q58698k420287j606110J97582K77167
32746C6818523j357366k226307j118508N06715R41719J80410j006559k201467
$$ plain form
32803 46753289 48526140 52579041 57211278 59080750 57700822 56316493 57528107 60278054
32795 60278054 62358700 63753115 65443874 66325913 63984942 58479911 53024492 50118434
32787 50118434 48773525 46864827 44860667 45199091 48347157 51733496 53423559 55159027
32779 55159027 60182083 68838900 77920596 84071972 86346272 85440365 82181508 77528545
32771 77528545 72764478 68593000 64737165 61261738 59566578 61039133 65133459 69692952
32763 69692952 72832734 73685045 71860336 67530404 61998560 56874083 52398173 47714828
32755 47714828 43075783 40335742 40366426 41228869 40370171 37949884 36343774 36541356 36818523
32746 36818523 35461157 33234850 32116342 32623057 33564776 33745186 32738627 30537160
32738C0537160k754111j709023M60123J396597l03888k739410k863749m39421
32730B1584278J850491J947623L96142j175164j867699j541601n40975J39736
32722B0792831l43824j319723j227083N5798Q40442O9932j236842j664420j215799
32713A4751312o13690j6796N73135O88193K17463p2944K04089K97719j63200j06434
32703A5758847J105332J887838M94422j824177k040348K07110J711647J58115
32695A7458786k398346k189849J060908L544535K201362j399910l141268j540712
32687A3595506P72047R55913m19886r10296j2296O26106K86027J02243O71299
32678A5666663J011771O32158N00438R44600P02651o12469j227265j12501Q71598
$$ plain form
32738 30537160 27783049 26074026 26534149 27930746 27626858 24887448 22023699 21584278
32730 21584278 23434769 25382392 25778534 24603370 22735671 21194070 20653095 20792831
32722 20792831 20449007 19129284 17902201 17957999 18798441 18868373 17631531 15967111 14751312
32713 14751312 14137622 14120826 14693961 15382154 15599617 15526673 15730762 16028481 15865281 15758847
32703 15758847 16864179 18752017 19246439 17422262 15381914 15589024 17300671 17458786
32695 17458786 15060440 12870591 13931499 17476034 19677396 18277486 15136218 13595506
32687 13595506 14367553 15323466 14903580 13993284 13980988 14607094 14893121 14995364 15666663
32678 15666663 16678434 17310592 17811030 18755630 19458281 18845812 17618547 17506046 18377644
32669A8377644j08824j666961j503027l17413m03182j484097j324428N7726K96323
32660A1923761j095667j785171n52182R27031J205622J130673J532310J456093
$$ plain form
32669 18377644 18268820 16601859 15098832 14781419 14378237 12894140 11569712 11627438 11923761
32660 11923761 10828094 9042923 8490741 9417772 10623394 11754067 13286377 14742470
$$ [...]
##END NTUPLES=NMR SPECTRUM
##END=
