##TITLE=31Pdec_AT-40_P_2_Heat
 DMSO-d6,CD3ONa, 324 sc
 22.8.2022
##JCAMPDX= 6.0         $$ Bruker NMR JCAMP-DX V2.0
##DATA TYPE= NMR SPECTRUM
##DATA CLASS= NTUPLES
##ORIGIN= UXNMR, Bruker Analytische Messtechnik GmbH
##OWNER= root
$$ XWIN-NMR		Version 3.5
$$ Mon Aug 22 13:21:57 2022 Russian Standard Time (UT+4h)  she@DPX200
##.OBSERVE FREQUENCY= 81.013821
##.OBSERVE NUCLEUS= ^31P
##.ACQUISITION MODE= SIMULTANEOUS
##.ACQUISITION SCHEME= undefined
##.AVERAGES= 324
##.DIGITISER RES= 16
##SPECTROMETER/DATA SYSTEM= spect
##.PULSE SEQUENCE= zgpg30
##.SOLVENT NAME= CDCl3
##.SHIFT REFERENCE= (INTERNAL, CDCl3, 0, 248.564)
##AUDIT TRAIL= $$ (NUMBER, WHEN, WHO, WHERE, WHAT)
$$ ##TITLE= Audit trail, XWIN-NMR		Version 3.5
$$ ##JCAMPDX= 5.01
$$ ##ORIGIN= Bruker BioSpin GmbH
$$ ##OWNER= she
$$ F:/spectra/data/she/nmr/P31/1/pdata/1/auditp.txt
$$ ##AUDIT TRAIL=  $$ (NUMBER, WHEN, WHO, WHERE, WHAT)
(   1,<2022-08-22 13:18:47.59 +0400>,<she>,<DPX200>,
      <continue with go, POWCHK disabled, PULCHK disabled
       configuration hash MD5:
       00 E9 B6 7A A2 85 ED C7 34 08 36 98 17 FE 4E 26
       data hash MD5: 32K
       D8 E8 C1 8B 8E AA F3 2C C4 88 CB E8 97 1F E6 40>)
(   2,<2022-08-22 13:19:31.17 +0400>,<she>,<DPX200>,
      <Start of raw data processing
       efp BC_mod = 2 LB = 1 FT_mod = 6 PKNL = 1 PHC0 = -10307.98 PHC1 = 131.4563 SI = 64K 
       data hash MD5: 64K
       01 C0 3B 71 A1 A9 1E EB 4C 80 DF A6 20 73 83 B3>)
(   3,<2022-08-22 13:20:21.54 +0400>,<she>,<DPX200>,
      <pk PHC0 = -34.66327 PHC1 = 66.39999 
       data hash MD5: 64K
       6D 1E 4A 5A 62 FF 73 5B 22 C5 83 99 5F 6C 6B 92>)
$$ ##END=
$$ 
$$ hash MD5
$$ 2C 34 D8 2E 1A EA 84 34 87 78 BF 85 AB 2D D8 91
##$RELAX= 
##$RELAX= 
##$RELAX= 
##$RELAX= 
##$RELAX= 
##$RELAX= 
##$RELAX= 
##$RELAX= 
$$ Bruker specific parameters
$$ --------------------------
##$DU= <F:/spectra>
##$EXPNO= 1
##$NAME= <P31>
##$PROCNO= 1
##$TYPE= <nmr>
##$USER= <she>
##$AMP= (0..31)
100 100 100 100 100 100 100 100 100 100 100 100 100 100 100 100 100 100 
100 100 100 100 100 100 100 100 100 100 100 100 100 100 
##$AQSEQ= 0
##$AQ_mod= 1
##$AUNM= <au_zg>
##$AUTOPOS= <>
##$BF1= 81.014009
##$BF2= 200.13
##$BF3= 200.13
##$BF4= 200.13
##$BF5= 200.13
##$BF6= 200.13
##$BF7= 200.13
##$BF8= 200.13
##$BYTORDA= 1
##$CFDGTYP= 0
##$CFRGTYP= 5
##$CHEMSTR= <none>
##$CNST= (0..31)
1 1 145 1 1 1 1 1 1 1 1 1 1 1 1 1 1 1 1 1 1 1 1 1 1 1 1 1 1 1 1 1 
##$CPDPRG= <waltz16>
##$CPDPRG1= <>
##$CPDPRG2= <waltz16>
##$CPDPRG3= <>
##$CPDPRG4= <mlev>
##$CPDPRG5= <mlev>
##$CPDPRG6= <mlev>
##$CPDPRG7= <mlev>
##$CPDPRG8= <mlev>
##$CPDPRGB= <>
##$CPDPRGT= <>
##$D= (0..31)
0 1 0 0 0 0 0 0 0 0 0 0.03 2e-05 3e-06 0 0 0 0 0 0 0 0 0 0 0 0 0 0 0 0 
0 0 
##$DATE= 1661159418
##$DBL= (0..7)
120 120 120 11 120 120 24 19 
##$DBP= (0..7)
150 150 150 150 150 150 150 150 
##$DBP07= 0
##$DBPNAM0= <>
##$DBPNAM1= <>
##$DBPNAM2= <>
##$DBPNAM3= <>
##$DBPNAM4= <>
##$DBPNAM5= <>
##$DBPNAM6= <>
##$DBPNAM7= <>
##$DBPOAL= (0..7)
0.5 0.5 0.5 0.5 0.5 0.5 0.5 0.5 
$$ [...]
##$SUBNAM2= <"">
##$SUBNAM3= <"">
##$SUBNAM4= <"">
##$SUBNAM5= <"">
##$SUBNAM6= <"">
##$SUBNAM7= <"">
##$SUBNAM8= <"">
##$SUBNAM9= <"">
##$SW= 501.771253377433
##$SWIBOX= (0..15)
0 1 3 0 0 0 0 0 0 0 0 0 0 0 0 0 
##$SW_h= 40650.406504065
##$TD= 32768
##$TD0= 1
##$TE= 0
##$TE2= 300
##$TE3= 300
##$TEG= 300
##$TL= (0..7)
0 120 53 12 22 120 120 120 
##$TP= (0..7)
150 150 150 150 150 150 150 150 
##$TP07= 0
##$TPNAME0= <>
##$TPNAME1= <>
##$TPNAME2= <>
##$TPNAME3= <>
##$TPNAME4= <>
##$TPNAME5= <>
##$TPNAME6= <>
##$TPNAME7= <>
##$TPOAL= (0..7)
0.5 0.5 0.5 0.5 0.5 0.5 0.5 0.5 
##$TPOFFS= (0..7)
0 0 0 0 0 0 0 0 
##$TUNHIN= 0
##$TUNHOUT= 0
##$TUNXOUT= 0
##$USERA1= <user>
##$USERA2= <user>
##$USERA3= <user>
##$USERA4= <user>
##$USERA5= <user>
##$V9= 5
##$VALIST= <valist>
##$VCLIST= <CCCCCCCCCCCCCCC>
##$VD= 0
##$VDLIST= <DDDDDDDDDDDDDDD>
##$VPLIST= <PPPPPPPPPPPPPPP>
##$VTLIST= <TTTTTTTTTTTTTTT>
##$WBST= 1024
##$WBSW= 4
##$XGAIN= (0..3)
0 0 0 0 
##$XL= 0
##$YL= 0
##$YMAX_a= 123856
##$YMIN_a= -76789
##$ZGOPTNS= <>
##$ZL1= 120
##$ZL2= 120
##$ZL3= 120
##$ZL4= 120
##$ABSF1= 0
##$ABSF2= 0
##$ABSG= 0
##$ABSL= 0
##$ALPHA= 0
##$AQORDER= 0
##$ASSFAC= 0
##$ASSFACI= 0
##$ASSFACX= 0
##$ASSWID= 0
##$AUNMP= <proc_1d>
##$AZFE= 0.1
##$AZFW= 0.5
##$BCFW= 0
##$BC_mod= 2
##$BYTORDP= 0
##$COROFFS= 0
##$CY= -3
##$DATMOD= 1
##$DC= 0
##$DFILT= <>
##$DTYPP= 0
##$F1P= 0
##$F2P= 0
##$FCOR= 1
##$FTSIZE= 65536
##$FT_mod= 6
##$GAMMA= 0
##$GB= 0
##$INTBC= 1
##$INTSCL= 5.30512e-09
##$ISEN= 30
##$LB= 1
##$LEV0= 0
##$LPBIN= 0
##$MAXI= 10000
##$MC2= 0
##$MEAN= 0
##$ME_mod= 0
##$MI= 50
##$NCOEF= 0
##$NC_proc= -4
##$NLEV= 6
##$NOISF1= 182.463
##$NOISF2= 159.3651
##$NSP= 0
##$NTH_PI= 0
##$NZP= 0
##$OFFSET= 248.5645
##$PC= 4
##$PHC0= -10342.64
##$PHC1= 197.8563
##$PH_mod= 1
##$PKNL= yes
##$PPARMOD= 0
##$PSCAL= 0
##$PSIGN= 0
##$REVERSE= no
##$SF= 81.0140089999908
##$SI= 65536
##$SIGF1= 159.3651
##$SIGF2= -187.1042
##$SINO= 113.3802
##$SIOLD= 16384
##$SREGLST= <1H.CDCl3>
##$SSB= 0
##$STSI= 65536
##$STSR= 0
##$SW_p= 40650.406504065
##$SYMM= 0
##$S_DEV= 0
##$TDeff= 32768
##$TDoff= 0
##$TI= <>
##$TILT= no
##$TM1= 0
##$TM2= 0
##$TOPLEV= 0
##$USERP1= <user>
##$USERP2= <user>
##$USERP3= <user>
##$USERP4= <user>
##$USERP5= <user>
##$WDW= 1
##$XDIM= 65536
##$YMAX_p= 285327696
##$YMIN_p= -11208540
$$ End of Bruker specific parameters
$$ ---------------------------------
##NTUPLES= NMR SPECTRUM
##VAR_NAME=  FREQUENCY,     SPECTRUM/REAL,   SPECTRUM/IMAG
##SYMBOL=    X,             R,               I
##VAR_TYPE=  INDEPENDENT,   DEPENDENT,       DEPENDENT
##VAR_FORM=  AFFN,          ASDF,            ASDF
##VAR_DIM=   65536,         65536,           65536
##UNITS=     HZ,            ARBITRARY UNITS, ARBITRARY UNITS
##FACTOR=    0.620285442955139, 1,           1
##FIRST=     20137.2065510736, 0,            0
##LAST=      -20513.1999529914, 0,           0
##MIN=       -20513.1999529914, -11208540,   0
##MAX=       20137.2065510736, 285327696,    0
$$ Real data points
##PAGE= N=1
##DATA TABLE= (X++(R..R)), XYDATA
$$ [...]
$$ plain form
37938 864393 785440 373885 405445 627797 171627 -926492 -1635135 -1414419 -834234 -527612
37928 -527612 -440048 -421523 -698762 -1289460 -1624302 -1250750 -450420 172388 276173 -203687
37918 -203687 -1035875 -1528839 -1089614 -161638 169584 -255295 -436492 56072 217357 -779141
37908 -779141 -2102012 -2446425 -1960665 -1797783 -2198900 -2275109 -1591879 -846768 -793498 -1300828
37898 -1300828 -1690545 -1464681 -616704 342541 728618 475746 390457 1099577 2002314 1963573
37888 1963573 919392 33678 202500 1075819 1723785 1710321 1270670 826823 582204
37879 582204 427204 151218 -207355 -371668 -286751 -265359 -460313 -559684 -328462 -87747
37869 -87747 -277110 -866337 -1513072 -1888245 -1589796 -411556 865313 802933 -808812
$$ packed form
37938H64393p8953m11555L1560K22352m56170j098119p08643K20716N80185L06622
37928e27612Q7564J8525k77239n90698l34842L73552Q00330O22808J03785m79860
37918b03687q32188m92964M39225R27976L31222m24879j81197M92564J61285r96498
37908g79141j322871l44413M85760J62882m01117p6209O83230P45111N3270n07330
37898a300828l89717K25864Q47977R59245L86077k52872q5289P09120R02737l8741
37888A963573j044181q85714J68822Q73319O47966j3464m39651m43847k44619
37879E82204j55000k75986l58573j64313Q4917K1392j94954r9371K31222K40715
37869h7747j89363n89227o46735l75173K98449J178240J276869o2380j611745
$$ plain form
37860 -808812 -2209383 -1813933 -378058 203762 -356800 -699903 -181937 395976 495436
37851 495436 653321 1167974 1381356 881398 260130 33115 -179044 -721342 -1068073 -659012
37841 -659012 129434 530567 357979 -93339 -553263 -712034 -241568 611736 985383 444238
37831 444238 -387628 -645056 -216051 435869 958105 1246760 1317842 1336238 1396944 1163839
37821 1163839 255676 -923781 -1409934 -884910 19758 737738 1289021 1647791 1506186
37812 1506186 938432 431595 42667 -521722 -864201 -201813 980143 1055244 -338898
37803 -338898 -1527115 -1302364 -670095 -905374 -1371572 -871457 62598 100220 -523206 -515399
37793 -515399 151013 377591 107887 382754 1197802 1193249 -144678 -1568660 -1850433 -1175509
$$ packed form
37860h08812j400571L95450J435875N81820n60562l43103N17966N77913R9460
37851D95436J57885N14653K13382m99958o21268k27015k12159n42298l46731M09061
37841f59012P88446M01133j72588m51318m59924j58771M70466Q53304L73647n41145
37831D44238q31866k57428M29005O51920N22236K88655P1082J8396O0706k33105
37821A163839r08163j179457m86153N25024R04668P17980N51283L58770j41605
37812A506186n67754n06837l88928n64389l42479O62388J181956P5101j394142
37803c38898j188217K24751O32269k35279m66198N00115R34055L7622o23426P807
37793e15399O66412K26578k69704K74867Q15048m553j337927j423982k81773O74924
$$ plain form
37783 -1175509 -356941 126493 -44417 -932362 -1675250 -1136327 330597 1000665 196132
37774 196132 -695780 -363151 508876 475154 -510367 -1362041 -1617694 -1721263 -1904404 -1879669
37764 -1879669 -1554958 -1190554 -850191 -365050 169075 416963 301249 19073 -334161
37755 -334161 -697546 -760021 -314626 160742 -118229 -1203417 -2301128 -2828506 -3001805
37746 -3001805 -3093957 -2725718 -1517114 -77029 496497 146566 78187 1063069 2198067
37737 2198067 2048584 632074 -590458 -610564 97997 572208 522751 126314 -576001
37728 -576001 -1452754 -1962001 -1696881 -953101 -268511 255827 697730 810007 407364 -86431
37718 -86431 -176010 -122989 -505118 -1145113 -1304984 -910375 -726011 -1136523 -1524026 -1232025
$$ packed form
37783a175509Q18568M83434j70910q87945p42888N38923J466924O70068q04533
37774A96132q91912L32629Q72027l3722r85521q51674k55653j03569j83141K4735
37764a879669L24711L64404L40363M85141N34125K47888j15714k82176l53234
37755c34161l63385o2475M45395M75368k78971j085188j097711n27378j73299
37746c001805r2152L68239J208604J440085N73526l49931o8379R84882J134998
37737B198067j49483j416510j222532k0106P08561M74211m9457l96437p02315
37728e76001q76753n09247K65120P43780O84590N24338M41903J12277m02643m93795
37718h6431q9579N3021l82129o39995j59871L94609J84364m10512l87503K92001
$$ plain form
37708 -1232025 -579947 -437938 -1067262 -1785833 -1753351 -920000 -171877 -480978 -1826324
37699 -1826324 -3052935 -2922046 -1225555 1134799 2897385 3227943 2223370 888881
37691 888881 228012 130510 -352504 -1394928 -1807543 -664503 1145615 1880011 1094144
37682 1094144 -37073 -365788 79255 546247 451940 -262478 -1197859 -1877272 -2247251
37673 -2247251 -2542288 -2553518 -1719568 -281615 582248 434088 359314 1102307 1532380 424821
37663 424821 -1163221 -1175909 313400 1306231 1036116 754206 1137013 1130359 126909 -691523
37653 -691523 -304051 469746 479940 105618 281080 717492 463070 -484844 -1354407 -1841810
37643 -1841810 -2106880 -2004475 -1332096 -498719 -93381 -107822 -280172 -746722 -1577310 -2119568
$$ packed form
37708a232025O52078J42009o29324p18571L2482Q33351P48123l09101j345346
37699a826324j226611J30889J696491K360354J762586L30558j004573j334489
37691H88881o60869r7502m83014j042424m12615J143040J810118P34396p85867
37682A094144j131217l28715M45043M66992r4307p14418r35381o79413l69979
37673b247251k95037j1230Q33950J437953Q63863j48160p4774P42993M30073j107559
37663D24821j588042j2688J489309R92831k70115k81910L82807o654j003450q18432
37653f91523L87472P73797J0194l74322J75462M36412k54422r47914q69563m87403
37643a841810k65070J02405O72379Q33377M05338j4441j72350m66550q30588n42258
$$ plain form
37633 -2119568 -1699373 -712996 -205289 -502549 -958295 -960827 -576769 -192905 25658 246486
37623 246486 703745 1264373 1326269 496485 -702556 -1345017 -1262828 -988815 -611680 290245
37613 290245 1411761 1625132 656705 -238670 -12404 717778 748909 -26712 -899701 -1535566
37603 -1535566 -1952134 -1949251 -1503277 -1213887 -1496330 -1811000 -1480616 -738988 -172167 305745
37593 305745 1033370 1662628 1541637 671408 -431660 -1353633 -1649675 -845376 599953
37584 599953 1143586 34887 -1361060 -1262095 151915 1286925 1443572 1175695 803270
37575 803270 106620 -641888 -751857 -247318 224894 523338 939387 1212111 827667 105477
37565 105477 -251645 -438932 -1038705 -1543772 -987202 150708 464768 31355 292666
$$ packed form
37633b119568M20195R86377N07707k97260m55746k532L84058L83864K18563K20828
37623B46486M57259N60628O1896q29784j199041o42461Q2189K74013L77135R01925
37613B90245J121516K13371r68427q95375K26266P30182L1131p75621q72989o35865
37603a535566m16568K883M45974K89390k82443l14670L30384P41628N66821M77912
37593C05745P27625O29258j20991q70229j103068r21973k96042Q04299J445329
37584E99953N43633j108699j395947R8965J414010J135010J56647k67877l72425
37575H03270o96650p48508j09969N04539M72212K98444M16049K72724l84444p22190
37565A05477l57122j87287n99773n05067N56570J137910L14060m33413K61311
$$ plain form
37556 292666 1297671 1278264 -289858 -1415169 -650148 514133 1345 -1615493 -2176978
37547 -2176978 -1224030 -203172 102245 394547 1126828 1617924 1271368 492660 -14911
37538 -14911 -53962 205440 471162 310318 -428771 -1079880 -753069 391427 1170514 888475
37528 888475 103477 -438989 -886872 -1672508 -2376934 -2095599 -849229 189160 131122
37519 131122 -561435 -848504 -488568 -65883 92174 287823 682011 853762 478786 -50771
37509 -50771 -138073 182950 340942 -22450 -721457 -1289250 -1318574 -724557 98355 544834
37499 544834 365030 -216485 -892241 -1371571 -1215559 -316438 446081 13376 -1178985
37490 -1178985 -1513901 -604250 7414 -663661 -1412411 -949943 -79011 11256 194874 1778937
$$ packed form
37556B92666J005005j9407j568122j125311P65021J164281n12788j616838n61485
37547b176978R52948J020858L05417K92302P32281M91096l46556p78708n07571
37538a4911l9051K59402K65722j60844p39089o51109L26811J144496P79087k82039
37528H88475p84998n42466m47883p85636p04426K81335J246370J038389n8038
37519A31122o92557k87069L59936M22685J58057J95649L94188J71751l74976n29557
37509e0771q7302L21023J57992l63392o99007n67793k9324N94017Q22912M46479
37499E44834j79804n81515o75756m79330J56012Q99121P62519m32705j192361
37490a178985l34916R09651O11664o71075p48750M62468Q70932R0267J83618J584063
$$ plain form
37480 1778937 3448648 2735116 241180 -620459 1472016 3935398 4236118 3038402 2160059
37471 2160059 1784029 1318827 1015977 971878 229955 -1357403 -1972411 -427179 1544469
37462 1544469 1627242 262797 -525653 -478787 -821417 -1480990 -1223921 -192681 257285
37453 257285 150375 784652 1912704 1657185 -205086 -1414973 -655810 505975 381884
37444 381884 -241848 83689 805519 491890 -540942 -741495 121286 691663 108873
37435 108873 -1049856 -1798482 -1607647 -453812 967523 1374891 327415 -794642 -426485
37426 -426485 853975 1069332 -141218 -905691 25044 1379733 1302539 6055 -783038
37417 -783038 -355904 311317 204618 -573474 -1391955 -1886848 -1879148 -1230434 -212706 428121
$$ packed form
37480A778937J669711p13532k493936q61639K092475K463382L00720j197716q78343
37471B160059l76030m65202l02850m4099p41923j587358o15008J545232J971648
37462A544469Q2773j364445p88450M6866l42630o59573K57069J031240M49966
37453B57285j06910O34277J128052k55519j862271j209887P59163J161785j24091
37444C81884o23732L25537P21830l13629j032832k00553Q62781N70377n82790
37435A08873j158729p48626J90835J153835J421335M07368j047476j122057L68157
37426d26485J280460K15357j210550p64473R30735J354689p7194j296484p89093
37417g83038M27134O67221j06699p78092q18481m94893P700O48714J017728O40827
$$ plain form
37407 428121 189365 -632744 -1341528 -1559919 -1356768 -926690 -433835 -36127 172208 194608
37397 194608 32651 -293746 -568030 -475311 -19317 408775 521427 396647 98529 -521424
37387 -521424 -1315952 -1613444 -1053876 -283106 -116532 -280163 143672 1093346 1379329 435571
37377 435571 -744914 -1001006 -552108 -393439 -720115 -879967 -609445 -337628 -235149
37368 -235149 127262 865032 1272112 770131 -91050 -204470 685073 1704323 2014266
37359 2014266 1759477 1644292 1925967 2190402 1983226 1318228 570516 133128 180065 517562
37349 517562 689702 515979 447445 943582 1537274 1211887 -67957 -976429 -519844 551647
37339 551647 771211 -127026 -1195724 -1774213 -1961352 -1791930 -1073332 -113048 429445
$$ packed form
37407D28121k38756q22109p08784k18391K03151M30078M92855L97708K08335K2400
37397A94608j61957l26397k74284R2719M55994M28092J12652j24780k98118o19953
37387e21424p94528k97492N59568P70770J66574j63631M23835R49674K85983r43758
37377D35571j180485k56092M48898J58669l26676j59852K70522K71817J02479
37368b35149L62411P37770M07080n01981q61181j13420Q89543J019250L09943
37359B014266k54789j15185K81675K64435k07176o64998p47712m37388M6937L37497
37349E17562J72140j73723o8534M96137N93692l25387j279844r08472M56585J071491
37339E51647K19564q98237j068698n78489j87139J69422P18598R60284N42493
$$ plain form
37330 429445 590633 1020012 1653839 1547835 428650 -616702 -568038 272249 990645
37321 990645 1184649 832062 -37329 -855296 -615545 699224 1617547 1033361 -209220
37312 -209220 -605289 -123781 156103 -43596 -28260 415274 736170 740166 799183 917384
37302 917384 703067 353228 590855 1438169 2004819 1691314 775095 -263322 -1104593
37293 -1104593 -1278642 -545789 298060 130714 -741525 -727311 738337 2227709 2303115
37284 2303115 1359290 659020 488296 282630 -92578 -247524 -98435 64528 109087 40293
37274 40293 -230519 -560951 -485485 -47208 -150240 -1281195 -2409509 -2186500 -910506
37265 -910506 -148049 -465590 -736658 20705 1208855 1664928 1334819 1138853 1524311
$$ packed form
37330D29445J61188M29379O33827j06004j119185j045352M8664Q40287P18396
37321I90645J94004l52587q69391q17967K39751J314769R18323n84186j242581
37312b09220l96069M81508K79884j99699J5336M43534L20896L996N9017J18201
37302I17384k14317l49839K37627Q47314N66650l13505r16219j038417q41271
37293a104593j74049P32853Q43849j67346q72239J4214J465648J489372P5406
37284B303115r43825p00270j70724k05666l75208j54946J49089J62963M4559o8794
37274D0293k70812l30432P5466M38277j03032j130955j128314K23009J275994
37265i10506P62457l17541k71068P57363J188150M56073l30109j95966L85458
$$ plain form
37256 1524311 1909873 1601646 751928 159829 284789 688423 551392 -331221 -1262863
37247 -1262863 -1415626 -694704 288266 880366 812183 183699 -624190 -1095936 -946700 -357940
37237 -357940 302967 868225 1268901 1271875 718295 -49351 -405070 -122026 466907 965988
37227 965988 1210838 1076955 476259 -265198 -429554 359030 1611731 2437355 2389548 1666097
37217 1666097 672505 -271414 -840190 -712669 85637 989633 1316620 959765 514260
37208 514260 609485 1260462 2058341 2823728 3670445 4428757 4532386 3763802 2697749 1983075
37198 1983075 1484684 634070 -576991 -1513688 -1714700 -1244380 -313210 808039 1504646
37189 1504646 1239373 471074 350971 1094265 1454419 477588 -938475 -1192418 -236593
$$ packed form
37256A524311L85562l08227q49718n92099J24960M03634j37031q82613r31642
37247a262863j52763P20922R82970N92100o8183o28484q07889m71746J49236N88760
37237c57940O60907N65258M00676K974n53580p67646l55719K83044N88933M99081
37227I65988K44850j33883o00696p41457j64356P88584J252701Q25624m7807p23451
37217A666097r93592r43919n68776J27521P98306R03996L26987l56855m45505
37208E14260R5225O50977P97879P65387Q46717P58312J03629p68584j066053p14674
37198A983075m98391q50614j211061r36697k01012M70320R31170J121249O96607
37189A504646k65273p68299j20103P43294L60154r76831j416063k53943R55825
$$ plain form
37180 -236593 436343 -38557 -891255 -1126457 -900650 -914144 -1196175 -1259177 -1052444 -1014179
37170 -1014179 -1269613 -1332001 -676382 635406 1864813 2049943 852323 -831591 -1488837
37161 -1488837 -604785 668382 902403 102689 -571519 -491896 -133212 -3831 91075 426697
37151 426697 733787 650861 295982 -19953 -203768 -131495 490226 1505550 2057273 1646750
37141 1646750 1062871 1401455 2354084 2471856 1254533 -28120 -79135 686113 891206
37132 891206 158951 -581739 -600818 -325191 -589487 -1512215 -2438693 -2700728 -2207385 -1456548
37122 -1456548 -1039706 -958518 -514644 756401 2131473 2308439 1133030 25700 252094
37113 252094 1386712 2113523 1987266 1538814 1051765 370791 -137494 346879 1716307
$$ packed form
37180b36593O72936m74900q52698k35202K25807j3494k82031o3002K06733L8265
37170a014179k55434o2388O55619J311788J229407J85130j197620j683914o57246
37161a488837Q84052J273167K34021p99714o74208P9623L58684J29381R4906L35622
37151D26697L07090q2926l54879l15935j83815P2273O21721J015324N51723m10523
37141A646750n83879L38584R52629J17772j217323j282653n1015P65248K05093
37132H91206p32255p40690j9079K75627k64296r22728r26478k62035M93343P50837
37122a456548M16842Q1188M43874J271045J375072J76966j175409j107330K26394
37113B52094J134618P26811j26257m48452m87049o80974n08285M84373J369428
$$ plain form
37104 1716307 2646133 2227488 1074887 270327 28957 63235 407732 950077 844864
37095 844864 -460284 -2025104 -2392314 -1530039 -659887 -285007 340585 1627270 2778457
37086 2778457 2972141 2443661 1863265 1429065 1109842 1104602 1501721 1990965 2347475 2728628
37076 2728628 3191678 3500670 3710264 4249755 5045627 5318591 4768992 4201393 4308670
37067 4308670 4560733 4135248 3340349 3095058 3342185 3046437 1774221 405716 64302
37058 64302 880122 1988404 2425773 1954535 1178519 807149 807306 596622 59851 -252392
37048 -252392 -124597 -115836 -587080 -1047135 -1017855 -792615 -675049 -262025 680740 1402764
37038 1402764 1236420 798526 1008135 1514324 1335154 537421 -57090 -388944 -926591
$$ packed form
37104A716307R29826m18645j152601q04560k41370L4278L44497N42345j05213
37095H44864j305148j564820l67210Q62275Q70152L74880O25592J286685J151187
37086B778457J93684n28480n80396m34200l19223n240L97119M89244L56510L81153
37076B728628M63050L08992K09594N39491P95872K72964n49599n67599J07277
37067D308670K52063m25485p94899k45291K47127k95748j272216j368505l41414
37058F4302Q15820J108282M37369m71238p76016l71370J57k10684n36771l12243
37048b52392J27795Q761m71244m60055K9280K25240J17566M13024R42765P22024
37038A402764j66344m37894K09609N06189j79170p97733n94511l31854n37647
$$ plain form
37029 -926591 -1288582 -735786 155933 86843 -683759 -521388 849681 1764944 1373117 986109
37019 986109 1659894 2264549 1407487 -180517 -835768 -490646 -330640 -640649 -667107 -247446
37009 -247446 -568 34880 581417 1795666 2844905 3036630 2570388 2000873 1593932
37000 1593932 1335073 1098195 770323 495825 566109 770131 349357 -880496 -1912488
36991 -1912488 -1777645 -909483 -441819 -578276 -658992 -552208 -821663 -1495236 -1768235 -1245486
36981 -1245486 -657325 -933438 -2052874 -3069540 -2986039 -1627202 17812 543563 -294690
36972 -294690 -1055592 -318832 1412024 2388714 1965797 1183300 989253 1061733 785091 381926
36962 381926 424955 878505 1239037 1232970 953996 655085 704803 1389648 2499543 3421021
$$ packed form
37029i26591l61991N52796Q91719o9090p70602J62371J371069R15263l91827l87008
37019I86109O73785O04655q57062j588004o55251L45122J60006l10009k6458M19661
37009b47446K46878L5448N46537J214249J049239J91725m66242n69515m06941
37000A593932k58859k36878l27872k74498P0284K04022m20774j229853j031992
36991a912488J34843Q68162M67664j36457q0716J06784k69455o73573k72999N22749
36981a245486N88161k76113j119436j016666Q3501J358837J645014N25751q38253
36972b94690p60902P36760J730856R76690m22917p82497j94047P2480k76642m03165
36962C81926M3029M53550L60532o067k78974k98911M9718O84845J109895R21478
$$ plain form
36952 3421021 3783251 3679361 3268385 2703982 2481947 3130446 4299095 4812729 4001212
36943 4001212 2478583 1319118 968071 1206542 1592175 1599953 909905 -47756 -344824
36934 -344824 293289 1110183 1405276 1360698 1381166 1330186 1033791 905304 1304972 1731752
36924 1731752 1425000 461063 -448989 -980064 -1327667 -1551039 -1459757 -1031475 -405066 354820
36914 354820 1008387 987513 88259 -1004061 -1521582 -1593169 -1694928 -1536410 -480121 1132899
36904 1132899 2141106 2074546 1550362 1090286 529009 -210865 -724646 -834626 -845361 -771191
36894 -771191 -164776 899695 1532505 1225064 579230 309334 246350 -64074 -443474 -435894
36884 -435894 -57174 399879 794750 865740 184157 -989277 -1489984 -667242 601096
$$ packed form
36952C421021L62230j03890m10976n64403k22035O48499J168649N13634q11517
36943D001212j522629j159465l51047K38471L85633P778o90048r57661k97068
36934c44824O38113Q16894K95093m4578K0468n0980k96395j28487L99668M26780
36924A731752l06752r63937r10052n31075l47603k23372R1282M28282O26409P59886
36914C54820O53567k0874q99254j092320n17521p1587j01759J58518J056289J613020
36904A132899J008207o6560n24184m60076n61277p39874n13781j09980j0735P4170
36894g71191O06415J064471O32810l07441o45834k69896o2984l10424l79400P580
36884d35894L78720M57053L94871P0990o81583j173434n00707Q22742J268338
$$ plain form
36875 601096 1123110 956451 798082 513548 -443809 -1611659 -1948656 -1490548 -1153316
36866 -1153316 -967853 -83284 1300546 1701195 649165 -352126 -83384 534553 27925
36857 27925 -1266944 -1797133 -1029302 266115 1469968 2475960 2865440 2118260 706023
36848 706023 -219563 -375995 -482920 -680984 -74103 1610937 3027130 2762167 1194312
36839 1194312 -88336 -246936 306439 1009767 1708744 2094813 1592083 242285 -965828
36830 -965828 -1193647 -753280 -483955 -515069 -365583 -63967 -232126 -874547 -1034551 -240064
36820 -240064 495595 16635 -1161457 -1509806 -756371 -238042 -797233 -1574173 -1474162
36811 -1474162 -773531 -408048 -462162 -377059 -150992 -274983 -681874 -707910 -107664 609718
$$ packed form
36875F01096N22014j66659j58369k84534r57357j167850l36997M58108L37232
36866a153316J85463Q84569J383830M00649j052030j001291K68742O17937n06628
36857B7925j294869n30189P67831J295417J203853J005992L89480p47180j412237
36848G06023r25586j56432j06925j98064O06881J685040J416193k64963j567855
36839A194312j282648j58600N53375P03328O98977L86069n02730j349798j208113
36830i65828k27819M40367K69325l1114J49486L01616j68159o42421j60004P94487
36820b40064P35659m78960j178092l48349P53435N18329n59191p76940J00011
36811a474162P00631L65483n4114Q5103K26067j23991m06891k6036O00246P17382
$$ plain form
36801 609718 866455 481179 -432272 -1436934 -1779588 -1063982 152190 983035 1268381
36792 1268381 1413563 1456255 1102026 546341 389227 726593 1111913 1385869 1714569 1876076
36782 1876076 1500146 1041168 1383711 2262872 2261645 845688 -694758 -959210 -129194
36773 -129194 740231 1213401 1445176 1439482 1253255 1384854 2108419 2849168 2945464 2590915
36763 2590915 2347546 2226864 1970039 1715384 1593344 1161943 137479 -716557 -363164
36754 -363164 1099048 2611864 3466130 3678932 3450657 3107448 3206136 3775545 3866401 2900407
36744 2900407 2013764 2727177 4536373 5346508 4370012 3079072 2950333 3696533 4272569
36735 4272569 4329734 3986111 3296905 2680457 2832924 3515678 3505254 2528803 2074282 3233688
$$ packed form
36801F09718K56737l85276r13451j004662l42654P15606J216172Q30845K85346
36792A268381J45182M2692l54229n55685j57114L37366L85320K73956L28700J61507
36782A876076l75930m58978L42543Q79161j227j415957j540446k64452Q30016
36773a29194Q69425M73170K31775n694j86227J31599P23565P40749R6296l54549
36763B590915k43369j20682k56825k54655j22040m31401j024464q54036L53393
36754c63164J462212J512816Q54266K12802k28275l43209R8688N69409R0856r65994
36744B900407q86643P13413J809196Q10135r76496j290940j28739P46200N76036
36735D272569N7165l43623o89206o16448J52467O82754j0424r76451m54521J159406
$$ plain form
36725 3233688 4873989 5307279 4840363 5031711 6026862 6448876 5762187 4942866 4598157
36716 4598157 4128405 3290259 3011184 3752436 4360567 3694712 2442165 2055507 2554560
36707 2554560 2766806 2414819 2473434 3292982 3720188 2698613 790372 -643641 -1115295
36698 -1115295 -1063042 -730929 20552 887336 1063921 308345 -589150 -780615 -326096 209372
36688 209372 682673 1317122 1936402 1918250 1053370 10948 -316513 247732 1047435 1316665
36678 1316665 918719 409237 397955 847072 1095294 641301 -256480 -915286 -986313 -629032
36668 -629032 -90073 510768 992258 1099116 810644 425913 262086 455885 1029229 1837648
36658 1837648 2442425 2422966 1934088 1587018 1622778 1587625 1052371 271238 -178075 -60280
$$ packed form
36725C233688J640301M33290m66916J91348R95151M22014o86689q19321l44709
36716D598157m69752q38146k79075P41252O08131o65855j252547l86658M99053
36707B554560K12246l51987N8615Q19548M27206j021575j908241j434013m71654
36698a115295N2253L32113P51481Q66784J76585p55576q97495j91465M54519N35468
36688B09372M73301O34449O19280j8152q64880j042422l27461N64245P99703K69230
36678A316665l97946n09482j1282M49117K48222m53993q97781o58806p1027L57281
36668f29032N38959O00841M81490J06858k88472l84731j63827J93799N73344Q08419
36658A837648O04777j9459m88878l47070L5760l5153n35254p81133m49313J17795
$$ plain form
36648 -60280 558562 1638962 2949228 3809012 3701029 3050338 2747844 2885862 2690153
36639 2690153 1902686 1422760 2007976 2981551 3092789 2317260 1755364 1744909 1298680 -8815
36629 -8815 -718072 726730 3416965 4707870 3607595 2006654 1953149 3036523 3568162
36620 3568162 3287658 3276506 3670675 3331100 2027886 1221044 1859479 2782134 2450860
36611 2450860 1264352 810232 1474610 2266355 2729174 3478602 4661744 5303397 4771696
36602 4771696 3826548 3505304 3794048 4147449 4592164 5372662 5969520 5526588 4192741
36593 4192741 3158655 3202869 3843459 4111816 3629218 2695555 1773140 1191117 1062648
36584 1062648 1179727 1098836 522833 -402128 -1155445 -1161524 -227699 1110895 1884374 1679461
$$ packed form
36648f0280O18842J080400J310266Q59784j07983o50691l02494J38018j95709
36639B690153p87467m79926N85216R73575J11238p75529n61896j0455m46229j307495
36629h815p09257J444802K690235J290905j100275j600941n3505J083374N31639
36620C568162k80504j1152L94169l39575j303214q06842O38435R22655l31274
36611B450860j186508m54120O64378P91745M62819P49428J183142O41653n31701
36602D771696r45148l21244K88744L53401M44715P80498N96858m42932j333847
36593D192741j034086M4214O40590K68357m82598r33663r22415n82023j28469
36584A062648J17079q0891n76003r24961p53317o079R33825J338594P73479k04913
$$ plain form
36574 1679461 1145611 1050567 1090300 428755 -646218 -704762 754167 2246968 2165275 906391
36564 906391 57404 7905 -248762 -1060083 -1360055 -415705 911372 1416133 1146408 867304
36554 867304 642392 -6651 -931819 -1437655 -1429901 -1495562 -1749843 -1530114 -522813 616845
36544 616845 1207444 1428982 1727626 1905214 1515261 825886 599883 978580 1293203 1086512
36534 1086512 679546 485107 353767 30007 -206114 49211 507716 454106 -142686 -393788
36524 -393788 377481 1709036 2564577 2553424 2204174 2146826 2391226 2460699 2019273 1286515
36514 1286515 890385 1267396 2143959 2698794 2318818 1124334 -231479 -1066553 -980768
36505 -980768 -62663 1014620 1454045 1151619 734460 576535 294396 -367511 -763082
$$ packed form
36574A679461n33850r5044L9733o61545j074973n8544J458929J492801q1693j258884
36564I06391q48987m9499k56667q11321k99972R44350J327077N04761k69725k79104
36554H67304k24912o49043r25168n05836P754o5661k54281K19729J007301J139658
36544F16845N90599K21538K98644J77588l89953o89375k26003L78697L14623k06691
36534A086512m06966j94439j31340l23760k36121K55325M58505n3610n96792k51102
36524c93788P71269J331555Q55541j1153l49250n7348K44400O9473m41426p32758
36514A286515l96130L77011Q76563N54835l79976j194484j355813q35074Q5785
36505i80768R18105J077283M39425l02426m17159j57925k82139o61907l95571
$$ plain form
36496 -763082 -211976 790513 1160512 798509 579029 851195 1061616 1019097 1359427 2277220
36486 2277220 2834356 2233666 998163 173258 14270 164264 500481 1001537 1271322
36477 1271322 1017897 648071 645084 711428 281609 -451956 -819343 -693477 -419289 14304
36467 14304 824578 1586726 1487311 531334 -280503 -153820 687661 1434831 1410626 445870
36457 445870 -846816 -1306643 -459272 593139 363208 -976375 -1727609 -1013397 60204
36448 60204 67692 -797225 -1159591 -292845 1175817 2102411 1848789 679739 -426223 -492369
36438 -492369 572241 1818920 2174339 1501415 686002 677071 1418188 1822037 1085800 -58897
36428 -58897 -90241 1105695 1759620 685367 -753164 -451614 1312957 2259816 1426674
$$ packed form
36496g63082N51106J002489L69999l62003k19480K72166K10421m2519L40330R17793
36486B277220N57136o00690j235503q24905j58988J49994L36217N01056K69785
36477A271322k53425l69826k987O6344m29819p33565l67387J25866K74188M33593
36467A4304Q10274P62148r9415r55977q11837J26683Q41481P47170k4205r64756
36457D45870j292686m59827Q47371J052411k29931j339583p51234P14212J073601
36448F0204P488q64917l62366Q66746J468662R26594k53622j169050j105962o6146
36438d92369J064610J246679L55419o72924q15413q931P41117M03849p36237j144697
36428e8897l1344J195936O53925j074253j438531L01550J764571R46859q33142
$$ plain form
36419 1426674 282830 212468 680466 685735 483399 742149 1160081 1112963 820768 766217
36409 766217 690726 221120 -205129 -109073 25257 -329644 -494618 377322 1511037 1332259
36399 1332259 -68594 -908070 -366475 269431 -250456 -1162740 -895877 535688 1526721
36390 1526721 1103020 158125 152328 1172410 1908278 1492629 684577 731503 1499966 1649790
36380 1649790 659503 -385756 -458686 -18960 23110 -99502 411558 1304992 1551536 1056574
36370 1056574 829230 1327516 1795978 1584708 1116087 1033113 1198425 1154235 1001639 1182647
36360 1182647 1704325 2117807 2144226 1964236 1928809 2157151 2369096 2077968 1063267 -356370
36350 -356370 -1620858 -2384078 -2557881 -2179849 -1509272 -951378 -518713 284953 1562535
$$ packed form
36419A426674j143844p0362M67998N269k02336K58750M17932m7118k92195n4551
36409G66217p5491m69606m26249R6056J34330l54901j64974Q71940J133715j78778
36399A332259j400853q39476N41595O35906n19887r12284K66863J431565R91033
36390A526721m23701r44895n797J020082P35868m15649q08052M6926P68463J49824
36380A649790r90287j045259p2930M39726M2070j22612N11060Q93434K46544m94962
36370A056574k27344M98286M68462k11270m68621q2974J65312m4190j52596J81008
36360A182647N21678M13482K6419j79990l5427K28342K11945k91128j014701j419637
36350c56370j264488p63220j73803L78032O70577N57894M32665Q03666J277582
$$ plain form
36341 1562535 2425338 2038424 976104 620704 1283515 1892773 1679399 1189251 1233682
36332 1233682 1682405 1873135 1623047 1248015 971312 812563 781387 782549 567430 108086
36322 108086 -188001 88952 847644 1576042 1779975 1330627 607327 235848 387061 505938
36312 505938 179466 -13157 713862 1881437 2103419 1064368 36293 8069 416748
36303 416748 444307 500039 1307969 2268790 2057511 589404 -796856 -1107884 -635398 -48325
36293 -48325 466569 833620 662013 -274259 -1527786 -2346440 -2374777 -1845535 -1288933 -1107887
36283 -1107887 -1196535 -968684 -24224 1260655 2121125 2294101 2110928 1783404 1182120
36274 1182120 445057 194125 758138 1577880 1833787 1461317 1140556 1383698 2017091
$$ packed form
36341A562535Q62803l86914j062320l55400O62811O09258k13374m90148M4431
36332A233682M48723J90730k50088l75032k76703j58749l1176J162k15119m59344
36322A08086k96087K76953P58692P28398K03933m49348p23300l71479J51213J18877
36312E05938l26472j92623P27019J167575K21982j039051j028075k8224M08679
36303D16748K7559N5732Q07930R60821k11279j468107j386260l11028M72486N87073
36293d8325N14894L67051j71607r36272j253527q18654k8337N29242N56602J81046
36283a107887q8648K27851R44460J284879Q60470J72976j83173l27524o01284
36274A182120p37063k50932N64013Q19742K55907l72470l20761K43142O33393
$$ plain form
36265 2017091 2565420 2778497 2626634 2063252 1120777 190639 -145799 236548 750629
36256 750629 798025 595587 852136 1597802 1939472 1335920 557406 672190 1370209 1231217
36246 1231217 -183151 -1404786 -834457 1102746 2374016 1782129 259741 -452917 146913
36237 146913 1008612 972733 61085 -714136 -526561 469915 1445259 1802278 1644507 1373255
36227 1373255 1081100 608256 75491 -95255 145309 200097 -399002 -1241825 -1563211 -1318183
36217 -1318183 -1104124 -1064657 -657914 252088 882651 670926 284351 716284 1773664
36208 1773664 2339777 1973195 1343974 1032561 781745 238386 -298450 -326068 159140 818515
36198 818515 1448139 1943748 2136213 2012495 1821750 1680938 1378628 845426 488889 733427
$$ packed form
36265B017091N48329K13077j51863n63382r42475r30138l36438L82347N14081
36256G50629M7396k02438K56549P45666L41670o03552p78514J14784O98019j38992
36246A231217j414368j221635N70329J937203J271270n91887j522388p12658N99830
36237A46913Q61699l5879r11648p75221J87575R96476R75344L57019j57771k71252
36227A373255k92155m72844n32765j70746K40564N4788n99099q42823l21386K45028
36217a318183K14059L9467M06743R10002O30563k11725l86575M31933J057380
36208A773664N66113l66582o29221l11413k50816n43359n36836k7618M85208O59375
36198H18515O29624M95609J92465j23718j90745j40812l02310n33202l56537K44538
$$ plain form
36188 733427 1487207 2325264 2907704 3002125 2508814 1773949 1436957 1599441 1639811 1303401
36178 1303401 1353005 2372610 3442036 3082639 1395641 165251 611153 1950143 2601117
36169 2601117 2118521 1427779 1590407 2769091 4145789 4619749 3860567 2765366 2486139
36160 2486139 2993705 3213278 2663161 2102530 2182804 2400740 2153970 2031667 2945458 4428073
36150 4428073 5029420 4307554 3243819 2585006 2014014 1364915 1405024 2532641 3633796
36141 3633796 3395188 2259478 1873579 2723529 3476110 2895964 1443709 484520 595326
36132 595326 1235973 1683276 1723036 1573550 1524178 1624435 1606179 1275639 974561 1220107
36122 1220107 1787518 1794235 1075352 778912 1854269 3472810 3954729 3028536 2032214
$$ packed form
36188G33427P53780Q38057N82440R4421m93311p34865l36992J62484M0370l36410
36178A303401M9604J019605J069426l59397j686998j230390M45902J338990O50974
36169B601117m82596o90742J62628J178684J376698M73960p59182j095201k79227
36160B486139N07566K19573n50117n60631Q0274K17936k46770j22303R13791J482615
36150D428073O01347p21866j063735o58813n70992o49099M0109J127617J101155
36141C633796k38608j135710l85899Q49950P52581n80146j452255r59189J10806
36132E95326O40647M47303L9760j49486m9372J00257j8256l30540l01078K45546
36122A220107N67411O717p18883k96440J075357J618541M81919r26193r96322
$$ plain form
36113 2032214 1817263 1719833 1112489 761589 1598167 2924914 3157961 2110161 1274410
36104 1274410 1676973 2559063 2663553 1948866 1322460 1245875 1391143 1419403 1382163 1403530
36094 1403530 1543754 1981384 2806523 3592764 3704169 3151169 2628906 2517889 2388326
36085 2388326 1823712 1214248 1217991 1798412 2362251 2589518 2533075 2129182 1341155 697905
36075 697905 869472 1610408 1961049 1747758 1986728 3276857 4629566 4733747 3826758
36066 3826758 3340675 3935619 4819246 5015121 4494749 3901666 3787974 4296933 5095951
36057 5095951 5496963 5091039 4329030 4028125 4306040 4529371 4314356 3945333 3709738
36048 3709738 3499479 3292575 3382294 3811765 4147881 4156148 4193164 4609219 5256533 5882442
$$ packed form
36113B032214k14951r7430o07344l50900Q36578J326747K33047j047800q35751
36104A274410M02563Q82090J04490p14687o26406p6585J45268K8260l7240K1367
36094A403530J40224M37630Q25139P86241J11405n53000n22263j11017j29563
36085B388326n64614o09464L743N80421N63839K27267n6443m03893p88027o43250
36075F97905J71567P40936L50641k13291K38970J290129J352709J04181r06989
36066C826758m86083N94944Q83627J95875n20372n93083j13692N08959P99018
36057E095951M01012m05924p62009l00905K77915K23331k15015l69023k35595
36048C709738k10259k06904Q9719M29471L36116Q267L7016M16055O47314O25909
$$ plain form
36038 5882442 6466951 6865755 6747119 6287083 6269822 6981727 7647905 7559709 7097119 6919156
36028 6919156 6846343 6507694 6480120 7531925 9025085 9403916 8328697 7113826 6824279
36019 6824279 7088596 7209895 7373470 8067606 9079912 9803598 10083195 10218674 10517028
36010 10517028 11213344 12379442 13595461 14283888 14727072 16079339 18895018 22385577
36002 22385577 25776392 29597602 34682047 40565902 46124442 51382712 57236836 63374161
35994 63374161 67953572 69791156 69581695 68283120 65472217 60333801 53437481 46317142
35986 46317142 39717584 33398604 27426326 22456486 18681935 15601387 13073183 11568601
35978 11568601 10982147 10217691 8654374 7190755 6950454 7572675 7788958 7251491 6630744
$$ packed form
36038E882442N84509L98804j18636m60036j7261P11905O66178q8196m62590j77963
36028F919156p2813l38649k7574J051805J493160L78831j075219j214871k89547
36019F824279K64317J21299J63575O94136J012306P23686K79597J35479K98354
36010A0517028O96316J166098J216019O88427M43184J352267K815679L490559
36002B2385577L390815L821210N084445N883855N558540N258270N854124O137325
35994F3374161M579411J837584k09461j298575k810903n138416o896320p120339
35986D6317142o599558o318980n972278m969840l774551l080548k528204j504582
35978A1568601n86454p64456j563317j463619k40301O22221K16283n37467o20747
$$ plain form
35969 6630744 6103492 5084686 3696485 3195084 4225164 5636438 5968954 5426458 5309570
35960 5309570 5908502 6178927 5523862 4739204 4759311 5330188 5559581 5213374 4754649 4410914
35950 4410914 3970842 3513524 3639913 4627453 5754915 5962545 5132558 4294749 4393742
35941 4393742 5161312 5545297 5093141 4440042 4367363 4875950 5473844 5944813 6352851 6568956
35931 6568956 6389721 6055864 6097768 6623977 7241382 7703465 8101121 8349721 8135749 7607372
35921 7607372 7476871 8049964 8719827 8877695 8763855 8849256 8940032 8671935 8439710 8862939
35911 8862939 9563160 9558884 8912445 8874253 10047214 11384628 11569089 10633731 9630044
35902 9630044 9332493 9862710 10946410 11820452 11472283 9858994 8484128 8820934 10399965
$$ packed form
35969F630744n27252j018806j388201n01401J030080J411274L32516n42496j16888
35960E309570N98932K70425o55065p84658K0107N70877K29393l46207m58725l43735
35950D410914m40072m57318J26389R87540J127462K07630q29987q37809R8993
35941D393742P67570L83985m52156o53099p2679N08587N97894M70969M08038K16105
35931F568956j79235l33857M1904N26209O17405M62083L97656K48600k13972n28377
35921G607372j30501N73093O69863J57868j13840Q5401R0776k68097k32225M23229
35911H862939P00221m276o46439l8192J172961J337414J84461r35358j003687
35902I630044k97551N30217J083700Q74042l48169j613289j374866L36806J579031
$$ plain form
35893 10399965 11388396 10897988 9727512 8896031 8583785 8719272 9450065 10489227 10929390
35884 10929390 10388305 9644245 9495275 9644014 9427727 9054921 9243379 9996283 10582639
35875 10582639 10519000 9824752 8538160 6828818 5504743 5516493 6774700 8118576 8635052
35866 8635052 8463622 8184284 8000628 7751981 7272665 6538755 5802210 5603131 6188727
35857 6188727 6924060 6886871 6152976 5825193 6545008 7637684 8113168 7911004 7652494
35848 7652494 7657532 7796658 7970561 8135877 8073996 7703314 7475722 7874341 8528058 8406625
35838 8406625 7112593 5591675 5221140 6287347 7629591 7907428 7102061 6491157 7053828
35829 7053828 8298960 9099733 9341446 9906510 11003894 11545563 10749543 9521093 9289549
$$ packed form
35893A0399965R88431m90408j170476q31481l12246J35487P30793J039162M40163
35884A0929390n41085p44060j48970J48739k16287l72806J88458P52904N86356
35875A0582639o3639o94248j286592j709342j324075J1750J258207J343876N16476
35866H635052j71430k79338j83656k48647m79316p33910p36545j99079N85596
35857F188727P35333l7189p33895l27783P19815J092676M75484k02164k58510
35848G652494N038J39126J73903J65316o1881l70682k27592L98619O53717j21433
35838H406625j294032j520918l70535J066207J342244K77837q05367o10904N62671
35829G053828J245132Q00773K41713N65064J097384N41669p96020j228450k31544
$$ plain form
35820 9289549 9939367 10020268 8970366 8007441 8396192 9690147 10393714 9879889 8871624
35811 8871624 8185858 7795742 7356189 7042746 7343117 8248923 9178082 9717118 10011780
35802 10011780 10298133 10445434 10213327 9649106 8947247 8217488 7720751 7960725 8983210
35793 8983210 9820312 9324885 7569979 5830937 5130322 5365650 5912436 6406023 6712474
35784 6712474 6750131 6669190 6754974 6941571 6905470 6774467 7098795 7894752 8451413 8440408
35774 8440408 8433496 8807456 8946499 8284906 7447108 7394418 7890500 7841074 6967119 6157538
35764 6157538 6108249 6438902 6394146 5860951 5418022 5624816 6368767 6876159 6552982 5822190
35754 5822190 5647789 6121272 6274341 5644635 5082198 5275890 5440532 4621857 3571812
$$ packed form
35820I289549O49818Q0901j049902r62925L88751J293955P03567n13825j008265
35811H871624o85766l90116m39553l13443L00371R05806R29159N39036K94662
35802A0011780K86353J47301k32107n64221p01859p29759m96737K39974J022485
35793H983210Q37102m95427j754906j739042p00615K35328N46786M93587L06451
35784F712474L7657q0941Q5784J86597l6101j31003L24328P95957N56661j1005
35774H440408o912L73960J39043o61593q37798n2690M96082m9426q73955q09581
35764F157538m9289L30653m4756n33195m42929K06794P43951N07392l23177p30792
35754E822190j74401M73483J53069o29706n62437J93692J64642q18675j050045
$$ plain form
35745 3571812 3858712 5436450 6610575 6443291 5769063 5550270 5534292 5079850 4300885
35736 4300885 3778483 3813442 4376196 5223553 5846613 5900608 5747555 5874599 5870583 4970073
35726 4970073 3590643 3084433 3741465 4374115 4324236 4472224 5511554 6597863 6787429
35717 6787429 6638836 7070039 7540891 6869448 5317276 4380363 4699953 5458188 5767307
35708 5767307 5497130 4755871 3710000 3031917 3424754 4455623 4872961 4407671 4244732
35699 4244732 5181589 6279825 6195969 5185328 4724567 5384176 6164393 6149192 5849004
35690 5849004 6233904 7059117 7151859 6272285 5651724 6276459 7480024 7942216 7451723
35681 7451723 6776892 6241239 5541968 4820194 4717056 5228884 5610311 5669085 6067990 6999880
$$ packed form
35745C571812K86900J577738J174125j67284o74228k18793j5978m54442p78965
35736D300885n22402L4959N62754Q47357O23060N3995j53053J27044m016r00510
35726D970073j379430n06210O57032O32650m9879J47988J039330J086309J89566
35717F787429j48593M31203M70852o71443j552172r36913L19590P58235L09119
35708E767307k70177p41259j045871o78083L92837J030869M17338m65290j62939
35699D244732R36857J098236q3856j010641m60761O59609P80217j5201l00188
35690E849004L84900Q25213R2742q79574o20561O24735J203565M62192m90493
35681G451723o74831n35653o99271p21774j03138N11828L81427N8774L98905R31890
$$ plain form
35671 6999880 7713840 7849454 8042409 8542970 8522190 7724671 7550196 9138213 11389538
35662 11389538 12471198 12529978 13145381 14548549 15331109 14928911 14524139 15063000 15989251
35653 15989251 16545738 16902502 17227256 16879483 15464471 13754375 12653885 11978537 11062371
35644 11062371 9886428 8786554 7680338 6462176 5621828 5536148 5579539 4938671 4020624
35635 4020624 3971401 4862027 5461609 5042468 4398108 4554255 5278483 5610693 5343767 5078776
35625 5078776 4988041 4478418 3320387 2287763 2102710 2331886 2116474 1628499 1783947
35616 1783947 2558099 2782367 2035309 1575300 2516437 4006639 4423821 3757130 3365828
35607 3365828 3662504 3668490 3062872 3023764 4275682 5623554 5514795 4187426 3163020
$$ packed form
35671F999880P13960J35614J92955N00561k0780p97519j74475J588017K251325
35662A1389538J081660N8780O15403J403168P82560m02198m04772N38861R26251
35653A5989251N56487L56764L24754l47773j415012j710096j100490o75348r16166
35644A1062371j175943j099874j106216j218162q40348q5680M3391o40868r18047
35635D020624m9223Q90626N99582m19141o44360J56147P24228L32210k66926k64991
35625E078776r0735n09623j158031j032624j85053K29176k15412m87975J55448
35616A783947P74152K24268p47058m60009R41137J490202M17182o66691l91302
35607C365828K96676N986o05618l9108J251918J347872j08759j327369j024406
$$ plain form
35598 3163020 3197336 3802250 4374478 4695113 4511047 3693077 2839768 2802133 3485880 3944158
35588 3944158 3808858 3789609 4455654 5336082 5739221 5804245 6066833 6412572 6205809 5284014
35578 5284014 4138745 3139854 2259885 1700068 2072988 3501951 5060472 5783868 5979355
35569 5979355 6732366 8093601 8669089 7485453 5529699 4628761 5200090 6040497 6211634
35560 6211634 6090057 6302936 6606051 6427771 5819839 5138687 4312805 3273831 2751033
35551 2751033 3598425 5318232 6249566 5573923 4346289 4032036 4671825 5196284 5122479
35542 5122479 5042162 5458205 5986446 6066648 5898746 6162382 7082869 8265090 9335579
35533 9335579 10262047 11012748 11398662 11491341 11815242 12744776 13911123 14605338 14674659 14582092
$$ packed form
35598C163020L4316O04914N72228L20635j84066q17970q53309l7635O83747M58278
35588C944158j35300j9249O66045Q80428M03139O5024K62588L45739k06763r21795
35578E284014j145269r98891q79969n59817L72920J428963J558521P23396J95487
35569E979355P53011J361235N75488j183636j955754r00938N71329Q40407J71137
35560F211634j21577K12879L03115j78280o07932o81152q25882j038974n22798
35551B751033Q47392J719807R31334o75643j227634l14253O39789N24459p3805
35542E122479q0317M16043N28241Q0202j67902K63636R20487J182221J070489
35533I335579R26468P50701L85914R2679L23901R29534J166347O94215O9321r2567
$$ plain form
35523 14582092 14553354 14164554 13041434 11565500 10423616 9657781 8720909 7485773 6559207
35514 6559207 6258750 5847093 4492390 2744152 2150834 3226668 4658677 5046626 4664453
35505 4664453 4657649 5095799 5041047 4366661 4113104 4712516 5166703 4703935 4133328 4557445
35495 4557445 5645350 6396441 6911427 7924608 8944714 8547255 6689593 5183240 5305788
35486 5305788 6232399 6572034 6321759 6316962 6607558 6536730 5987234 5504745 5374253 5424261
35476 5424261 5616712 6056070 6469175 6390847 5910966 5654898 5969412 6609421 7224108 7660334
35466 7660334 7778907 7471627 6930921 6480094 6103226 5568208 5019126 4925359 5319845 5609326
35456 5609326 5420173 5224884 5729699 6816582 7461350 6773989 5006296 3452516 3278356
$$ packed form
35523A4582092k8738l88800j123120j475934j141884p65835r36872j235136r26566
35514F559207l00457m11657j354703j748238n93318J075834J432009L87949l82173
35505D664453o804M38150n4752o74386k53557N99412M54187m62768n70607M24117
35495D557445J087905P51091N14986J013181J020106l97459j857662j506353J22548
35486E305788R26611L39635k50275m797K90596p0828n49496m82489j30492N0008
35476E424261J92451M39358M13105p8328m79881k56068L14514O40009O14687M36226
35466G660334J18573l07280n40706m50827l76868n35018n49082r3767L94486K89481
35456E609326j89153j95289N04815J086883O44768o87361j767693j553780j74160
$$ plain form
35447 3278356 4409068 5669468 6043767 5562069 4848380 4223073 3675369 3394811 3655829
35438 3655829 4191652 4313882 3826020 3316526 3334696 3744498 4183993 4725247 5620810 6623998
35428 6623998 7045321 6532079 5549583 5028620 5585709 6982206 8248973 8485115 7704676
35419 7704676 6814360 6610102 6907482 6905462 6377554 6119800 6896885 8143184 8333569 6934957
35409 6934957 5403760 5466177 6686996 6899975 5312192 3892022 4727711 7022395 8164198
35400 8164198 7261231 5932866 5615633 5863512 5855549 5927797 6534583 6933254 6218252 4880488
35390 4880488 4100961 4077693 4221776 4459224 5062065 5625020 5585282 5445751 5985243 6441112
35380 6441112 5234670 2713588 1349121 2518731 4708373 5862242 6047494 6530659
$$ packed form
35447C278356J130712J260400L74299m81698p13689o25307n47704k80558K61018
35438C655829N35823J22230m87862n09494J8170M09802M39495N41254Q95563J003188
35428F623998M21323n13242r82496n20963N57089J396497J266767K36142p80439
35419G704676q90316k04258K97380k020n27908k57754P77085J246299J90385j398612
35409F934957j531197O2417J220819K12979j587783j420170Q35689K294684J141803
35400H164198r02967j328365l17233K47879p963P2248O06786L98671p15002j337764
35390D880488p79527k3268J44083K37448O02841N62955l9738j39531N39492M55869
35380F441112j206442k521082j364467J169610K189642J153869J85252M83165
$$ plain form
35372 6530659 7439561 7895187 7685724 7264682 6569359 5327692 4249384 4437519 5668510
35363 5668510 6599639 6710865 6728103 7035765 7087657 6718180 6632636 7008740 6905189 5870130
35353 5870130 5007733 5440453 6604322 7180889 7047513 7093660 7496712 7440702 6562870 5650478
35343 5650478 5635647 6549909 7686571 8359158 8399499 8236984 8476989 9159127 9647341 9574421
35333 9574421 9510137 10112031 10937264 10901608 9845115 8820079 8676666 9106167 9414090
35324 9414090 9617639 10221332 11177057 11637315 10913769 9468408 8621705 9075449 9978841
35315 9978841 9986686 9155229 8930354 9966013 10977779 10568049 9313387 8849762 9479699
35306 9479699 10110797 10275492 10613469 11262405 11406697 10910925 10902805 11974584 13141317
$$ packed form
35372F530659R08902M55626k09463m21042o95323j241667j078308J88135J230991
35363E668510R31129J11226J7238L07662N1892l69477q5544L76104j03551j035059
35353E870130q62397M32720J163869N76567j33376M6147M03052n6010q77832r12392
35343E650478j4831R14262J136662O72587M0341j62515K40005O82138M88214p2920
35333I574421o4284O01894Q25233l5656j056493j025036j43413M29501L07923
35324I414090K03549O03693R55725M60258p23546j445361q46703M53744R03392
35315I978841P845q31457k24875J035659J011766m09730j254662m63625O29937
35306I479699O31098J64695L37977O48936J44292m95772q120J071779J166733
$$ plain form
35297 13141317 13545470 13988041 15540489 17585593 18680358 18837061 19532855 21626723 24493564
35288 24493564 27237741 29697697 32061291 34299193 36221264 37617203 38356873 38779663
35280 38779663 39720989 41537840 43392876 44259594 44399145 44966460 46270484 47339781 47211862
35271 47211862 45754692 43163258 39616746 35689962 32258928 29669754 27657362 26214684
35263 26214684 25698785 25866082 25785057 25172223 24928963 25775594 27200487 28526755 30309932
35254 30309932 33721085 38917455 44904698 50848391 56755167 62812912 68511152 72390046
35246 72390046 72496764 67620455 58726271 48901563 41183335 36409070 33496433 31388302
35238 31388302 29957477 29215413 28656534 27806632 26921856 26733453 27589511 28905269 29411864
$$ packed form
35297A3141317M04153M42571J552448K045104J094765J56703O95794K093868K866841
35288B4493564K744177K459956K363594K237902J922071J395939P39670M22790
35280C8779663R41326J816851J855036Q66718J39551N67315J304024J069297j27919
35271D7211862j457170k591434l546512l926784l431034k589174k012392j442678
35263B6214684n15899J67297q1025o12834k43260Q46631J424893J326268J783177
35254C0309932L411153N196370N987243N943693N906776O057745N698240L878894
35246G2390046J06718m876309q894184r824708p718228m774265k912637k108131
35238C1388302j430825p42064n58879q49902q84776j88403Q56058J315758N06595
$$ plain form
35229 29411864 28221571 25930914 24303421 24345463 25058514 24851999 23895483 23956510 25808358
35220 25808358 28032560 28994878 28969713 29355926 30541716 31773843 32808029 34333648 36569680
35211 36569680 38647412 40005914 41517872 44360771 48261155 51795324 54301360 56620093
35203 56620093 59779082 63655939 67276681 69859675 71074075 70675296 68565906 65236916
35195 65236916 61707005 58872650 57043982 56016630 55356584 54727806 54282568 54731593 56746384
35186 56746384 60283207 64733668 69690921 75308807 82048763 90509428 101448129 115371931
35178 115371931 131802279 149174920 165609128 179755937 191352815 201654083 213079528
35171 213079528 227266721 242979908 256732853 266038696 271453251 275037199 277728295
$$ packed form
35229B9411864j190293k290657j627493M2042P13051k06515r56516O1027J851848
35220B5808358K224202R62318k5165L86213J185790J232127J034186J525619K236032
35211C6569680K077732J358502J511958K842899L900384L534169K506036K318733
35203E6620093L158989L876857L620742K582994J214400l98779k109390l328990
35195F5236916l529911k834355j828668j027352o60046o28778m45238M49025K014791
35186E6746384L536823M450461M957253N617886O739956Q460665J0938701J3923802
35178A15371931J6430348J7372641J6434208J4146809J1596878J0301268J1425445
35171B13079528J4187193J5713187J3752945R305843N414555L583948K691096
$$ plain form
35164 277728295 279003040 278232288 275105774 269084904 259645151 247041167 231981268 214786472
35156 214786472 195867311 176760206 159387632 144214725 130348434 117558112 106781547
35149 106781547 98240692 90568804 82665231 75165165 69019652 63710244 58177098 52707213
35141 52707213 48411041 45248704 42089211 38680703 36129452 35071467 34501683 33017142
35133 33017142 30541387 28291517 27409435 27927756 28807479 28861507 27894800 26913942 26935493
35124 26935493 27803569 28671591 29408327 30780186 33259950 36398819 39457478 41888566
35116 41888566 43009465 42063866 39179341 35784871 33553541 33103557 33888773 34979971
35108 34979971 35771450 36346663 37373351 39303514 41671015 43765920 46025108 49847052
$$ packed form
35164B77728295J274745p70752l126514o020870r439753j2603984j5059899j7194796
35156B14786472j8919161j9107105j7372574j5172907j3866291j2790322j0776565
35149A06781547q540855p671888p903573p500066o145513n309408n533146n469885
35141E2707213m296172l162337l159493l408508k551251j057985n69784j484541
35133C3017142k475755k249870q82082N18321Q79723N4028r66707r80858K1551
35124B6935493Q68076Q68022P36736J371859K479764L138869L058659K431088
35116D1888566J120899r45599k884525l394470k231330m49984P85216J091198
35108C4979971P91479N75213J026688J930163K367501K094905K259188L821944
$$ plain form
35100 49847052 55677242 62270832 68611039 75726064 85525351 98352410 112967802 128863844
35092 128863844 147252756 169205488 193620795 217682837 238907295 256225905 269448770
35085 269448770 278504064 283532403 285327696 285023463 282961145 278046369 268708485 254634567
35077 254634567 237212604 218175452 198375902 178285528 159084801 142330980 128531492
35070 128531492 116746073 105809788 95473862 86162522 78112388 71166794 65196044
35063 65196044 60321185 56683346 54167331 52411749 51039346 49840204 48743370 47699731
35055 47699731 46673963 45617411 44216410 41803596 38002555 33565617 30050551 28332336
35047 28332336 27809110 27390415 26819214 26564967 26870025 27578085 28625180 29928387 30836073
$$ packed form
35100D9847052N830190O593590O340207P115025R799287J2827059J4615392J5896042
35092A28863844J8388912K1952732K4415307K4062042K1224458J7318610J3222865
35085B69448770R055294N028339J795293l04233k062318m914776r337884j4073918
35077B54634567j7421963j9037152j9799550k0090374j9200727j6753821j3799488
35070A28531492j1785419j0936285j0335926r311340q050134o945594n970750
35063F5196044m874859l637839k516015j755582j372403j199142j096834j043639
35055D7699731j025768j056552j401001k412814l801041m436938l515066j718215
35047B8332336n23226m18695n71201k54247L05058P08060J047095J303207R07686
$$ plain form
35038 30836073 30403314 28362520 25365830 22255437 19547856 17545938 16325459 15509722
35030 15509722 14571284 13449454 12449754 11604240 10698528 9870638 9497108 9477739 9394158
35021 9394158 9431402 10217406 11482037 11860007 10602137 8690176 7572287 7437763 7474447
35012 7474447 7270048 7080676 7017767 6827551 6456501 6246497 6545429 7417299 8525291
35003 8525291 9067242 8337513 6812898 6072309 6904360 8062307 7913819 6922204 7170324
34994 7170324 9407304 11956107 13045905 13038465 13513985 15064936 17093465 19284501 22073960
34985 22073960 25701311 29855502 34469748 39869409 45573954 49765744 50887425 49443683
34977 49443683 47294564 45241784 42312467 37658657 32112901 27173670 23249335 19822682
$$ packed form
35038C0836073m32759k040794k996690l110393k707581k001918j220479q15737
35030A5509722r38438j121830r99700q45514r05712q27890l73530j9369q3581
35021I394158L7244P86004J264631L77970j257870j911961j117889j34524L6684
35012G474447k04399j89372o2909j90216l71050k10004K98932Q71870J107992
35003H525291N41951p29729j524615p40589Q32051J157947j48488r91615K48120
34994G170324K236980K548803J089798p440M75520J550951K028529K191036K789459
34985B2073960L627351M154191M614246N399661N704545M191790J121681j443742
34977D9443683k149119k052780k929317m653810n545756m939231l924335l426653
$$ plain form
34969 19822682 16770159 14411836 12584929 10878987 9681163 9681132 10215369 9534725 7241291
34960 7241291 5154517 4966048 6140853 7028456 7002476 6431749 5491023 4315574 3659817
34951 3659817 4036893 4623489 4261134 3161070 2411930 2252745 2190362 2393189 3364365
34942 3364365 4451591 4413377 3503484 3259221 4029225 4520644 4192366 4182069 5123808 5922928
34932 5922928 5765554 5610811 6359710 7130105 6950685 6761300 7789725 8991015 8335486
34923 8335486 6203436 5296202 6998252 9631316 10777871 9960970 8533627 8002308 8946280
34914 8946280 10816139 12473667 13460515 14646005 16941001 19743541 21801543 23424549
34906 23424549 26403242 31476538 37161734 41516463 43890680 44445593 43151226 40096785
$$ packed form
34969A9822682l052523k358323j826907j705942j197824l1N34237o80644k293434
34960G241291k086774j88469J174805Q87603k5980n70727r40726j175449o55757
34951C659817L77076N86596l62355j100064p49140j59185o2383K02827R71176
34942C364365J087226l8214r09893k44263P70004M91419l28278j0297R41739P99120
34932E922928j57374j54743P48899P70395j79420j89385J028425J201290o55529
34923H335486k132050r07234J702050K633064J146555q16901j427343n31319R43972
34914H946280J869859J657528R86848J185490K294996K802540K058002J623006
34906B3424549K978693N073296N685196M354729K374217N54913j294367l054441
$$ plain form
34898 40096785 35969146 31465319 26834338 22479447 19183307 17087805 15238149 12897250
34890 12897250 10631169 9305506 8651816 7741020 6413822 5337557 4948135 5113179 5533843
34881 5533843 5749976 5140163 3770386 2890287 3597207 5213433 6034671 5607879 5122328
34872 5122328 5399394 5713501 5151293 4123161 3670012 3882925 3914513 3310679 2554793
34863 2554793 2310217 2721069 3530685 4383545 4827571 4425376 3201496 1827350 1081476
34854 1081476 1146872 1617901 2120354 2605167 2972371 2843967 2112782 1469764 1801396 3011917
34844 3011917 3976081 3883119 3192452 2954006 3537073 4386004 4767566 4417907 3683617 3364081
34834 3364081 4198739 6146135 8307213 9823158 10650319 11252297 11927102 12814190 14147535
$$ packed form
34898D0096785m127639m503827m630981m354891l296140k095502j849656k340899
34890A2897250k266081j325663o53690r10796j327198j076265l89422J65044M20664
34881E533843K16133o09813j369777q80099P06920J616226Q21238m26792m85551
34872E122328K77066L14107n62208j028132m53149K12913L1588o03834p55886
34863B554793k44576M10852Q09616Q52860M44026m02195j223880j374146p45874
34854A081476O5396M71029N02453M84813L67204j28404p31185o43018L31632J210521
34844C011917R64164r2962o90667k38446N83067Q48931L81562l49659p34290l19536
34834C364081Q34658J947396K161078J515945Q27161O01978O74805Q87088J333345
$$ plain form
34825 14147535 15950203 17751497 19090524 19949329 20178017 19061347 16340492 13213405
34817 13213405 11160249 9985322 8333130 6135250 4968431 5498898 6149447 5348192
34809 5348192 3843381 3382880 3940544 3901912 2715513 1707173 1961728 2747400 2750023
34800 2750023 1984490 1599153 2154911 2918421 2965834 2467674 2469532 3454554 4547718 4508133
34790 4508133 3297975 2076152 1615430 1479398 1092548 798481 1105367 1489288 970453
34781 970453 -351311 -1336489 -1374989 -985453 -721465 -405388 211452 844446 1239044 1700699
34771 1700699 2471436 3033287 2678482 1562189 626744 513447 958945 1312919 1352615
34762 1352615 1421215 1824623 2252117 2025259 1017289 40684 6085 891833 1903260
$$ packed form
34825A4147535J802668J801294J339027Q58805K28688j116670k720855l127087
34817A3213405k053156j174927j652192k197880j166819N30467O50549q01255
34809E348192j504811m60501N57664l8632j186399j008340K54555P85672K623
34800B750023p65533l85337N55758P63510M7413m98160J858R85022J093164l9585
34790D508133j210158j221823m60722j36032l86850k94067L06886L83921n18835
34781I70453j321764r85178l8500L89536K63988L16077O16840O32994L94598M61655
34771A700699P70737N61851l54805j116293r35445j13297M45498L53974L9696
34762A352615O8600M03408M27494k26858j007970r76605l4599Q85748J011427
$$ plain form
34753 1903260 2405715 2211162 1258942 -168087 -1017160 -276229 1530388 2580417 1913800
34744 1913800 517650 -225409 -236301 -140111 120984 930796 1795032 1760104 909036 341333
34734 341333 623232 1224752 1588890 1805669 2011787 2036514 1996015 2416174 3307995 3827220
34724 3827220 3359963 2333889 1434517 646982 -240918 -730151 -141267 1117977 1723013
34715 1723013 1054148 6563 -116908 901922 2131929 2646115 2367475 1816532 1362539
34706 1362539 957199 513827 214085 234798 390114 379245 266797 304255 349278 20197
34696 20197 -511425 -561162 -44405 155819 -543701 -1418924 -1413986 -610540 142949 641132
34686 641132 1251104 1636104 903750 -702577 -1560945 -800369 376127 406892 -398807
$$ packed form
34753A903260N02455j94553r52220j427029q49073P40931J806617J050029o66617
34744A913800j396150p43059j0892R6190K61095Q09812Q64236l4928q51068n67703
34734C41333K81899O01520L64138K16779K06118K4727m0499M20159Q91821N19225
34724C827220m67257j026074q99372p87535q87900m89233N88884J259244O05036
34715A723013o68865j047585j23471J018830J230007N14186k78640n50943m53993
34706A362539m05340m43372k99742K0713J55316j0869j12448L7458M5023l29081
34696B0197n31622m9737N16757K00224o99520q75223M938Q03446P53489M98183
34686F41132O09972L85000p32354j606327q58368P60576J176496L0765q05699
$$ plain form
34677 -398807 -456514 732268 1990725 2184631 1542607 1061697 1271733 1820996 1914951 1148379
34667 1148379 181221 300806 1822525 3309844 3141279 1556172 214910 -70654 -24976
34658 -24976 -310553 -539249 -293063 31491 58471 193557 872111 1821549 2664280 3425836
34648 3425836 3847659 3197822 1609099 602881 1176631 2238535 2204646 1368512 1194952
34639 1194952 1858872 2195521 1825694 1570211 1732257 1700288 1501536 2021051 3158518
34630 3158518 3415748 2108705 535854 13418 80472 -226029 -506557 179710 1409057
34621 1409057 1777757 904877 -127815 -254501 531332 1531993 2042104 1762600 1049227
34612 1049227 657370 931068 1499802 1943983 2233708 2316111 2032584 1758276 2169379 2887114
$$ packed form
34677c98807n7707J188782J258457J93906o42024m80910K10036N49263R3955p66572
34667A148379r67158J19585J521719J487319j68565j585107j341262k85564M5678
34658b4976k85577k28696K46186L24554K6980J35086O78554R49438Q42731P61556
34648C425836M21823o49837j588723j006218N73750J061904l3889q36134j73560
34639A194952O63920L36649l69827k55483J62046l1969j98752N19515J137467
34630C158518K57230j307043j572851n22436O7054l06501k80528O86267J229347
34621A409057L68700q72880j032692j26686P85833J000661N10111k79504p13373
34612A049227l91857K73698N68734M44181K89725Q2403k83527k74308M11103P17735
$$ plain form
34602 2887114 2484646 627530 -974664 -851765 116869 250301 -325366 -342263 167520
34593 167520 164975 -93560 677786 2162878 2384096 850115 -397969 104916 1041923
34584 1041923 642920 -418136 -326093 743445 928833 -189261 -811887 301427 1911901
34575 1911901 2103243 979783 380574 1285238 2686111 3242569 3057840 3104228 3523414
34566 3523414 3565864 3076402 2866642 3308482 3686494 3595089 3918675 5404379 7089577
34557 7089577 7418259 6421224 5497767 5354556 5478471 5460256 5448228 5282958 4559215 3724566
34547 3724566 3830333 4931407 5900541 6016444 5543427 4661385 3266456 2030330 2008399
34538 2008399 2746261 2489068 932072 -37275 718826 1747844 1439913 599390 890397
$$ packed form
34602B887114m02468j857116j602194J22899R68634J33432n75667j6897N09783
34593A67520k545k58535P71346J485092K21218j533981j248084N02885R37007
34584A041923l99003j061056R2043J069538J85388j118094o22626J113314J610474
34575A911901J91342j123460n99209R04664J400873N56458j84729M6388M19186
34566C523414M2450m89462k09760M41840L78012r1405L23586J485704J685198
34557G089577L28682r97035r23457j43211J23915j8215j2028j65270p23743q34649
34547C724566J05767J101074R69134J15903m73017q82042j394929j236126k1931
34538B008399P37862k57193j556996r69347P56101J029018l07931q40523K91007
$$ plain form
34529 890397 2107709 2887827 3058351 3307075 3353431 2516061 1539326 1760255 2744852 2809324
34519 2809324 1817822 1418989 2335214 3411484 3769430 3993389 4508147 4565140 3807717
34510 3807717 3345203 4127435 5391583 5855156 5556322 5404754 5598653 5592649 5232068 4964616
34500 4964616 5104766 5554599 6085478 6433646 6358710 5959190 5612088 5342250 4725523 3714036
34490 3714036 2976388 3004756 3463868 3896565 4438879 5190284 5466095 4567677 3023837
34481 3023837 2208029 2729667 3849827 4525045 4490401 4217929 4223079 4576224 4934142 5023323
34471 5023323 5076506 5520219 6185412 6355107 5882076 5638850 6278220 7103821 7013728 6182126
34461 6182126 5749294 5959168 5816470 4879857 4213602 4836214 6124325 6716797 6407049
$$ packed form
34529H90397J217312P80118J70524K48724M6356q37370r76735K20929R84597O4472
34519B809324r91502l98833R16225J076270L57946K23959N14758N6993p57423
34510C807717m62514P82232J264148M63573k98834j51568J93899o004l60581k67452
34500D964616J40150M49833N30879L48168p4936l99520l47102k69838o16727j011487
34490C714036p37648K8368M59112M32697N42314P51405K75811q98418j543840
34481C023837q15808N21638J120160O75218l4644k72472N150L53145L57918Q9181
34471E023323N3183M43713O65193J69695m73031k43226O39370Q25601r0093q31602
34461F182126m32832K09874j42698r36613o66255O22612J288111N92472l09748
$$ plain form
34452 6407049 6051698 5928327 5420491 4424633 3870792 4325888 5003547 4885062 4151419
34443 4151419 3675376 3584897 3308318 2822573 2789952 3306912 3471176 2651932 1525386 1283254
34433 1283254 2181594 3358555 3881919 3593985 3027238 2762079 2875291 2988400 2895960
34424 2895960 2894872 3159767 3137584 2294744 1301115 1455033 2761876 3694233 3375597 2939016
34414 2939016 3888661 5987438 7775025 8505279 8494451 8103856 7555333 7359526 7704421
34405 7704421 7698315 6491172 4933128 4676085 5639181 5957987 4775015 3474290 3452208
34396 3452208 4143439 4280335 3857843 3568144 3249275 2381967 1545511 1810737 2842993
34387 2842993 3090921 2049754 1018326 1160519 1983217 2460314 2687832 3344530 4059332
$$ packed form
34452F407049l55351j23371n07836r95858n53841M55096O77659j18485p33643
34443D151419m76043r0479k76579m85745l2621N16960J64264q19244j126546k42132
34433A283254Q98340J176961N23364k87934n66747k65159J13212J13109r2440
34424B895960j088K64895k2183q42840r93629J53918J306843R32357l18636m36581
34414B939016R49645K098777J787587P30254j0828l90595n48523j95807L44895
34405G704421o106j207143j558044k57043R63096L18806j182972j300725k2082
34396C452208O91231J36896m22492k89699l18869q67308q36456K65226J032256
34387B842993K47928j041167j031428J42193Q22698M77097K27518O56698P14802
$$ plain form
34378 4059332 3609319 1829014 217878 115537 1035271 1556333 1373662 1482714 2425175
34369 2425175 3410713 3556102 3124090 2868588 2791738 2399326 1801273 1608703 1854245 1953374
34359 1953374 1827218 2132536 3037479 3605902 3007027 1778268 1183531 1585573 2114575
34350 2114575 1908605 1115015 494939 423594 600308 632107 579650 768832 1230884 1626504
34340 1626504 1751235 1808828 2012433 2167940 1918804 1277533 694923 653728 1250222 2016064
34330 2016064 2179775 1456350 591178 609901 1437483 1940676 1584609 1220691 1722367 2659874
34320 2659874 3050496 2681147 1861809 626749 -805255 -1497172 -941969 -164197 -367623
34311 -367623 -1027821 -813836 79651 286914 -294416 -371784 385187 875926 789208 1208865
$$ packed form
34378D059332m50013j780305j611136j02341R19734N21062j82671J09052R42461
34369B425175R85538J45389m32012k55502p6850l92412n98053j92570K45542R9129
34359A953374j26156L05318R04943N68423n98875j228759n94737M02042N29002
34350B114575k05970p93590o20076p1345J76714L1799n2457J89182M62052L95620
34340A626504J24731N7593K03605J55507k49136o41271n82610m1195N96494P65842
34330B016064J63711p23425q65172J8723Q27582N03193l56067l63918N01676R37507
34320B659874L90622l69349q19338j235060j432004o91917N55203P77772k03426
34311c67623o60198K13985Q93487K07263n81330p7368P56971M90739q6718M19657
$$ plain form
34301 1208865 2324300 2597952 1304039 74033 566281 2105916 3041925 3111882 2974683
34292 2974683 2571686 1561555 505720 96768 -88802 -702167 -1226664 -861683 -99423
34283 -99423 37152 -248492 18948 842929 1357892 1276752 936741 329649 -627455 -1303464
34273 -1303464 -1114661 -580121 -355479 96729 1376851 2440483 1878426 375082 -147459
34264 -147459 466691 625055 -77420 -267443 560101 1102149 624938 185322 603332 1129234
34254 1129234 1134028 1338994 2202923 2704811 2011716 957815 596209 579158 246392 19967
34244 19967 301725 213677 -947129 -2022855 -1507937 5554 648635 7559 -695240
34235 -695240 -779256 -694945 -576657 11578 716366 451895 -732554 -1305953 -436692 700215
$$ packed form
34301A208865J115435K73652j293913j230006M92248J539635R36009O9957j37199
34292B974683m02997j010131j055835m08952j85570o13365n24497L64981P62260
34283i9423J36575k85644K67440Q23981N14963q1140l40011o07092r57104o76009
34273a303464J88803N34540K24642M52208J280122J063632n62057j503344n22541
34264a47459O14150J58364p02475j90023Q27544N42048m77211m39616M18010N25902
34254A129234M794K04966Q63929N01888o93095j053901l61606j7051l32766k26425
34244A9967K81758q8048j160806j075726N14918J513491O43081o41076p02799
34235f95240q4016Q4311J18288N88235P04788k64471j184449n73399Q69261J136907
$$ plain form
34225 700215 617835 -410979 -891477 -131451 1149550 1964575 2071534 1855197 1722606
34216 1722606 1785815 1933821 2055175 2149704 2241145 2291777 2269354 2185520 2023869 1818518
34206 1818518 1836766 2358498 3159167 3624218 3597749 3658990 4234546 4931565 5184652 5030476
34196 5030476 4657711 3767373 2265765 1190287 1811072 3806503 5375889 5399437 4583192
34187 4583192 4147348 4286406 4459726 4403211 4097203 3317085 2122603 1485506 2438679
34178 2438679 4532642 5997936 5752433 4550747 3697121 3292169 2561688 1531086 1243258
34169 1243258 2104463 3038902 2957696 2347328 2486289 3505253 4291751 4227704 3899339 3826185
34159 3826185 3536163 2499019 1201908 578944 866780 1635654 2476743 3008109 2663390
$$ packed form
34225G00215q2380j028814m80498P60026J281001Q15025J06959k16337j32591
34216A722606O3209J48006J21354R4529R1441N0632k2423q3834j61651k05351
34206A818518J8248N21732Q00669M65051k6469O1241N75556O97019K53087j54176
34196E030476l72765q90338j501608j075478O20785J995431J569386K3548q16245
34187D583192m35844J39058J73320n6515l06008p80118j194482o37097R53173
34178B438679K093963J465294k45503j201686q53626m04952p30481j030602k87828
34169A243258Q61205R34439q1206o10368J38961J018964P86498o4047l28365p3154
34159C826185k90022j037144j297111o22964K87836P68874Q41089N31366l44719
$$ plain form
34150 2663390 1310050 -117590 -371839 720568 2157694 2956479 2923851 2369376 1677464
34141 1677464 1213991 1163683 1352943 1505454 1595848 1701956 1759651 1813731 2174989 2865217
34131 2865217 3285751 3011950 2498155 2279550 1943333 869013 -378109 -612984 146626
34122 146626 751168 867547 1379341 2486583 2978713 2194987 1279749 1370794 1780868 1380155
34112 1380155 761836 1295163 2621329 3004225 2098695 1506357 2191157 3033668 2752135
34103 2752135 1876904 1715419 2314273 2652667 2312759 1827921 1627886 1627297 1769587 2094952
34093 2094952 2234944 1644932 515970 -206235 47874 838606 1413431 1534142 1377818
34084 1377818 1108548 876230 854170 968513 948007 901189 1350758 2277868 2673407 1730920
$$ packed form
34150B663390j353340j427640k54249J092407J437126P98785l2628n54475o91912
34141A677464m63473n0308J89260J52511R0394J06108N7695N4080L61258O90228
34131B865217M20534k73801n13795k18605l36217j074320j247122k34875P59610
34122A46626O04542J16379N11794J107242M92130p83726r15238R1045M10074m00713
34112A380155o18319N33327J326166L82896r05530n92338O84800Q42511k81533
34103B752135q75231j61485N98854L38394l39908m84838k00035n89J42290L25365
34093B094952J39992n90012j128962p22205K54109P90732N74825J20711j56324
34084A377818k69270k32318k2060J14343k0506m6818M49569R27110L95539r42487
$$ plain form
34074 1730920 117744 -759434 -533631 9225 484372 1361293 2551891 2843756 1638006
34065 1638006 272414 389905 1590142 2086559 1430079 1035407 1810633 2804477 2877748
34056 2877748 2374489 2106161 1796885 936860 422820 1611354 3868737 4794393 3339918
34047 3339918 1255176 642824 1296232 1606428 1231861 1372468 2593575 3771702 3585583
34038 3585583 2155942 722910 244760 706269 1404564 1570793 994298 282782 265983
34029 265983 1018817 1808900 2108471 2165335 2326561 2352440 1894918 1257259 1080944 1482246
34019 1482246 2039072 2466745 2736810 2648601 1959547 1008493 566486 849672 1225207 1177662
34009 1177662 1054653 1437943 2163109 2481888 2040101 1260332 791923 886947 1282488 1452175
$$ packed form
34074A730920j613176q77178K25803N42856M75147Q76921J190598K91865j205750
34065A638006j365592J17491J200237M96417o56480l94672P75226R93844P3271
34056B877748n03259k68328l09276q60025n14040J188534K257383R25656j454475
34047C339918k084742o12352O53408L10196l74567J40607J221107J178127j86119
34038C585583j429641j433032m78150M61509O98295J66229n76495p11516j6799
34029B65983P52834P90083K99571N6864J61226K5879m57522o37659j76315M01302
34019A482246N56826M27673K70065q8209o89054r51054m42007K83186L75535m7545
34009A177662j23009L83290P25166L18779m41787p79769m68409R5024L95541J69687
$$ plain form
33999 1452175 1023630 166385 -497952 -566121 -307379 -190123 -118086 412333 1364984 1881824
33989 1881824 1286740 107814 -332587 631124 2265907 3273910 3158860 2539675 2206147
33980 2206147 2219887 2142951 1893002 1910393 2384276 2724319 2186563 893243 -180512 -318071
33970 -318071 167939 464749 276464 -39176 -201635 -357644 -541216 -275805 787899
33961 787899 2055617 2437499 1703232 819602 657311 897831 741063 280762 379250 1218625
33951 1218625 1797061 1213470 -113785 -1001740 -943133 -452439 -85896 315441 1156452
33942 1156452 2155520 2324976 1102303 -655277 -1243869 52696 1999356 2758431 2065842
33933 2065842 1419464 1995212 3120122 3300956 2189026 776626 -67857 -403879 -531673
$$ packed form
33999A452175m28545q57245o64337o8169K58742J17256P2037N30419R52651N16840
33989A881824n95084j178926m40401R63711J634783J008003j15050o19185l33528
33980B206147J3740p6936k49949J7391M73883L40043n37756j293320j073755j37559
33970c18071M86010K96810j88285l15640j62459j56009j83572K65411J063704
33961G87899J267718L81882p34267q83630j62291K40520j56768m60301R8488Q39375
33951A218625N78436n83591j327255q87955N8607M90694L66543M01337Q41011
33942A156452R99068J69456j222673j757580n88592J296565J946660P59075o92589
33933B065842o46378N75748J124910J80834j111930j412400q44483l36022j27794
$$ plain form
33924 -531673 -342392 249940 802252 829443 546157 619159 1247803 1906298 2042306 1713057
33914 1713057 1439711 1661657 2386590 3129337 3148703 2099319 628085 -62275 415028
33905 415028 1059966 797075 7038 -78499 617974 758506 -281828 -1169569 -432097 1302756
33895 1302756 2154561 1666226 1206581 1665019 2183677 1719730 690615 215035 506454
33886 506454 919460 1087115 1144390 1104468 805119 407863 377824 977971 2085497 3287425
33876 3287425 3892386 3318805 1962423 1189285 1781690 2805078 2845582 2024223 1711352
33867 1711352 2324572 2649077 1747284 482210 360415 1502701 2630113 2792457 2299212
33858 2299212 1902986 1757151 1542986 1236997 1203858 1493795 1529426 872037 32298 -79169
$$ packed form
33924e31673J89281N92332N52312K7191k83286P3002O28644O58495J36008l29249
33914A713057k73346K21946P24933P42747J9366j049384j471234o90360M77303
33905D15028O44938k62891p90037q5537O96473J40532j040334q87741P37472J734853
33895A302756Q51805m88335m59645M58438N18658m63947j029115m75580K91419
33886E06454M13006J67655N7275l9922k99349l97256l0039O00147J107526J201928
33876C287425O04961n73581j356382p73138N92405J023388M0504q21359l12871
33867A711352O13220L24505r01793j265074j21795J142286J127412J62344m93245
33858B299212l96226j45835k14165l05989l3139K89937L5631o57389q39739j11467
$$ plain form
33848 -79169 494880 681391 -26366 -630665 22565 1498534 2326664 2061834 1716124 2012419
33838 2012419 2287094 1689985 675504 453112 1267264 2008778 1614359 356052 -485234
33829 -485234 -25938 1332110 2396645 2432400 1784159 1292324 1348511 1693111 1921379 1891525
33819 1891525 1709552 1543913 1424084 1151429 613957 231260 616640 1558778 1953660
33810 1953660 1270335 470787 688562 1540395 1821653 1517590 1779873 2890163 3667001
33801 3667001 3333161 2718984 2908373 3703964 4242890 4293009 4051434 3353794 2090795
33792 2090795 980313 936932 1826458 2621806 2709797 2418999 2335553 2639232 3084657 3271282
33782 3271282 3033028 2766485 3051011 3731011 3921727 3303879 2745588 3018168 3547631
$$ packed form
33848g9169N74049J86511p07757o04299O53230J475969Q28130k64830l45710K96295
33838B012419K74675n97109j014481k22392Q14152P41514l94419j258307q41286
33829d85234M59296J358048J064535L5755o48241m91835N6187L44600K28268k9854
33819A891525j81973j65639j19829k72655n37472l82697L85380R42138L94882
33810A953660o83325p99548K17775Q51833K81258l04063K62283J110290P76838
33801C667001l33840o14177J89389P95591N38926N0119k41575o97640j262999
33792B090795j110482m3381Q89526P95348Q7991k90798q3446L03679M45425J86625
33782C271282k38254k66543K84526O80000J90716o17848n58291K72580N29463
$$ plain form
33773 3547631 3309428 2461264 2049556 2356616 2616935 2346977 1933144 1727195 1463381
33764 1463381 925203 521808 802147 1773043 2909959 3567796 3390472 2680750 2294965
33755 2294965 2760062 3617968 4085272 4115187 4185601 4282864 3943939 3272702 3042728 3629306
33745 3629306 4563419 5288721 5673049 5682102 5327780 5096267 5603834 6581969 7021200 6612961
33735 6612961 6190258 6359084 6604886 6310470 5783682 5546519 5376117 4924640 4666775
33726 4666775 5230951 6186279 6523017 6169245 6045632 6576713 7043787 6673330 5695203
33717 5695203 4977704 5053539 5811690 6840855 7773497 8433551 8874497 9272218 9711551
33708 9711551 10081514 10188313 9970958 9597837 9273386 8929328 8321651 7582353 7345255
$$ packed form
33773C547631k38203q48164m11708L07060K60319k69958m13833k05949k63814
33764A463381n38178m03395K80339R70896J136916O57837j77324p09722l85785
33755B294965M65097Q57906M67304K9915P0414R7263l38925o71237k29974N86578
33745C629306R34113P25302L84328R053l54322k31513N07567R78135M39231m08239
33735F612961m22703J68826K45802k94416n26788k37163j70402m51477k57865
33726D666775N64176R55328L36738l53772j23613N31081M67074l70457r78127
33717E695203p17499P5835P58151J029165R32642O60054M40946L97721M39333
33708I711551L69963J06799k17355l73121l24451l44058o07677p39298k37098
$$ plain form
33699 7345255 7930158 8690815 8760040 8252677 7999502 8166024 8014558 7170526 6239894 5896010
33689 5896010 6196951 7080981 8545207 9893486 9915144 8553239 7380442 7505204 7974457
33680 7974457 7380798 6155254 5810971 6489491 6868123 6341627 5771031 5900125 6311398
33671 6311398 6278490 5673548 4773015 3969590 3768248 4280908 4787954 4675868 4606484 5623774
33661 5623774 7270438 8028032 7719684 7866138 9173432 10245686 9674103 8092909 7073617
33652 7073617 6985515 7102155 7077517 7134983 7226225 7041782 6650852 6355856 6091748 5566180
33642 5566180 4809135 4157476 3936770 4387560 5438946 6349193 6264423 5470180 5298071
33633 5298071 6321092 7468450 7529588 6735854 6174733 6395497 7270861 8418139 9010760
$$ packed form
33699G345255N84903P60657O9225n07363k53175J66522j51466q44032r30632l43884
33689E896010L00941Q84030J464226J348279K1658j361905j172797J24762M69253
33680G974457n93659j225544l44283O78520L78632n26496n70596J29094M11273
33671F311398l2908o04942r00533q03425k01342N12660N07046j12086o9384J017290
33661E623774J646664P57594l08348J46454J307294J072254n71583j581194j019292
33652G073617q8102J16640k4638N7466R1242j84443l90930k94996k64108n25568
33642E566180p57045o51659k20706M50790J051386R10247q4770p94243j72109
33633E298071J023021J147358O1138p93734n61121K20764Q75364J147278N92621
$$ plain form
33624 9010760 8076477 5921947 4435761 4952450 6561136 7526475 7508776 7192071 6650619
33615 6650619 5639836 4843193 5137473 5969796 6055215 5426651 5228323 5702327 6027101
33606 6027101 6044486 6439341 7147080 7275874 6800404 6692570 7132067 7253174 6974821 7329233
33596 7329233 8493575 9267123 9163543 9253026 10050938 10295376 8988528 7174360 6393664
33587 6393664 6568095 6654490 6335599 5862741 5193995 4453422 4348296 5043170 5535532 5203123
33577 5203123 4969260 5799080 7081781 7748452 7923829 8072424 7618405 6139778 5024576
33568 5024576 5950316 8196874 9393856 8730789 7653428 7482628 8081156 8923908 9803527
33559 9803527 10241826 9718016 8792181 8659758 9324266 9518090 8717905 7932951 8097496
$$ packed form
33624I010760r34283k154530j486186N16689J608686R65339j7699l16705n41452
33615F650619j010783p96643K94280Q32323Q5419o28564j98328M74004L24774
33606F027101J7385L94855P07739J28794m75470j07834M39497J21107k78353L54412
33596G329233J164342P73548j03580Q9483P97912K44438j306848j814168p80696
33587F393664J74431Q6395l18891m72858o68746p40573j05126O94874M92362l32409
33577E203123k33863Q29820J282701O66671J75377J48595m54019j478627j115202
33568E024576R25740K246558J196982o63067j077361j70800N98528Q42752Q79619
33559I803527M38299n23810r25835j32423O64508J93824q00185p84954J64545
$$ plain form
33550 8097496 8871780 9482821 9706863 9610783 9284516 9194594 9897240 11084192 11771318 11679493
33540 11679493 11575279 12053171 12856467 13587291 14242342 14889520 15551258 16360313 17099203
33531 17099203 16984989 15941524 15454116 16617433 17943429 17243155 15401862 15601271 18374440
33522 18374440 20321855 19010396 16510413 16120987 17712804 18709978 18214078 17576234 17613897
33513 17613897 17655870 17218426 16722568 16430764 16054962 15456133 14701774 13643965 12364586
33504 12364586 11601334 11770744 12137223 11959580 11737785 12161244 12653372 12390279 11984259
33495 11984259 12480222 13300423 13050861 11987190 11710083 12510545 12977920 12402861 11707596
33486 11707596 11644744 11800734 11844777 12162797 12733426 12877300 12642411 12937099 13709256 13552346
$$ packed form
33550H097496P74284O11041K24042r6080l26267q9922P02646J186952O87126r1825
33540A1679493j04214M77892Q03296P30824O55051O47178O61738Q09055P38890
33531A7099203j14214j043465m87408J163317J325996p00274j841293J99409K773169
33522A8374440J947415j311459k499983l89426J591817R97174m95900o37844L7663
33513A7613897M1973m37444m95858k91804l75802n98829p54359j057809j279379
33504A2364586p63252J69410L66479j77643k21795M23459M92128k63093m06020
33495A1984259M95963Q20201k49562j063671k77107Q00462M67375n75059o95265
33486A1707596o2852J55990M4043L18020N70629J43874k34889K94688P72157j56910
$$ plain form
33476 13552346 11926536 10329435 10258716 11197298 11645013 11162289 10377561 9745959 9227761
33467 9227761 8653836 7793875 6629256 5879435 6412027 7839932 8775843 8813642 8941272
33458 8941272 9499358 9322819 7835540 6448858 6573970 7527978 7839621 7498517 7342643
33449 7342643 7200710 6404864 5479797 5553880 6470390 7090016 7165976 7371944 7731454 7605757
33439 7605757 7119336 7052811 7343996 7193285 6687889 6807577 7666898 8231275 8043498 7831719
33429 7831719 8080796 8336530 8273850 8149900 7853630 6862736 5559520 5192185 6001163
33420 6001163 6775298 6857017 7095416 8018955 8613854 8056970 7286835 7474502 8058087 7808001
33410 7808001 6962611 6682540 6953844 6661507 5507450 4384871 3881174 3689421 3569488
$$ packed form
33476A3552346j625810j597101p0719R38582M47715m82724p84728o31602n18198
33467I227761n73925q59961j164619p49821N32592J427905R35911L7799J27630
33458H941272N58086j76539j487279j386682J25112R54008L11643l41104j55874
33449G342643j41933p95846r25067P4083R16510O19626P5960K05968L59510j25697
33439G605757m86421o6525K91185j50711n05396J19688Q59321N64377j87777k11779
33429G831719K49077K55734o2680j23950k96270r90894j303216l67335Q08978
33420F001163P74135Q1719K38399R23539N94899n56884p70135J87667N83585k50086
33410G808001q45390k80071K71304k92337j154057j122579n03697j91753j19933
$$ plain form
33401 3569488 3757672 4263077 4692078 4924629 5221961 5647378 6071236 6631283 7449099
33392 7449099 8094517 8171691 8197902 8916072 9929638 10155953 9579037 9328435 9900053 10539411
33382 10539411 10654701 10578058 10482610 9814869 8498505 7558806 7667568 8039335 7783369
33373 7783369 7524590 8468850 10362795 11652859 11559998 10909174 10789859 11302874 11965668
33364 11965668 12773789 14450021 17732650 22369322 26644934 28217109 25999568 21307145
33356 21307145 16818317 14335020 13673606 13518325 12944660 12093372 11676724 12025789 12699999
33347 12699999 13114107 13364300 14015082 15114820 16055252 16611638 17460070 19267090 21882005
33338 21882005 24893835 28244506 31501149 33164115 31861653 28120758 24019125 21096379
$$ packed form
33401C569488J88184N05405M29001K32551K97332M25417M23858N60047Q17816
33392G449099O45418P7174K6211P18170J013566K26315n76916k50602N71618O39358
33382A0539411J15290p6643r5448o67741j316364r39699J08762L71767k55966
33373G783369k58779R44260J893945J290064r2861o50824j19315N13015O62794
33364A1965668Q08121J676232L282629M636672M275612J572175k217541m692423
33356B1307145m488828k483297o61414j55281n73665q51288m16648L49065O74210
33347A2699999M14108K50193O50782J099738R40432N56386Q48432J807020K614915
33338B1882005L011830L350671L256643J662966j302462l740895m101633k922746
$$ plain form
33330 21096379 19394006 18399470 17859001 17458875 16687607 15478363 14346277 13571164 12862298
33321 12862298 12083318 11589468 11485980 11277848 10737690 10432869 10788737 11266456 11235480
33312 11235480 11141889 11855156 13116233 13692399 13177673 12671028 13245910 14509430 15345966
33303 15345966 15615644 16289245 18015422 20420767 23072954 26255244 29983529 32783662
33295 32783662 32688322 29674175 26071545 23980672 23139358 22130205 20817502 20222782 20371484
33286 20371484 19935595 18384036 17052110 17219294 18155248 18178943 17074597 16298483 16951713
33277 16951713 18624421 20491510 22702426 25994278 30099156 33148433 33148254 30123723 26396704
33268 26396704 24333695 24076481 24044711 23364932 22770614 22998564 23532645 23627679 23575935 23956626
$$ packed form
33330B1096379j702373r94536n40469m00126p71268j209244j132086p75113p08866
33321A2862298p78980m93850j03488k08132n40158l04821L55868M77719l0976
33312A1235480r3591P13267J261077N76166n14726n06645N74882J263520Q36536
33303A5345966K69678O73601J726177K405345K652187L182290L728285K800133
33295C2783662r5340l014147l602630k090873q41314j009153j312703n94720J48702
33286B0371484m35889j551559j331926J67184R35954K3695j104346p76114O53230
33277A6951713J672708J867089K210916L291852M104878L049277j79l024531l727019
33268B6396704k063009k57214l1770o79779n94318K27950N34081R5034n1744L80691
$$ plain form
33258 23956626 24361573 24055087 23440937 23553467 24228915 24134481 22796300 21292530 20448023
33249 20448023 19574744 17886170 16206239 16040902 17350825 18454508 18191015 17184286
33241 17184286 16681933 16984890 17549845 18016252 18387267 18466401 17881242 16727730 15615276
33232 15615276 14938244 14591740 14509067 14849824 15400462 15548282 15422622 16322360 19063869
33223 19063869 22413586 24362498 24757593 25333711 27036812 28777598 29356328 29190681 29155885
33214 29155885 28873728 27449255 25169114 23152000 21764550 20622189 19795198 19670203
33206 19670203 19752322 18992506 17497913 16719745 17598693 19507266 21332751 22625140 23294410
33197 23294410 23177252 22540285 22281353 22992229 24298610 25517318 26386669 26795457 26526257
$$ packed form
33258B3956626M04947l06486o14150J12530O75448r4434j338181j503770q44507
33249B0448023q73279j688574j679931j65337J309923J103683k63493j006729
33241A7184286n02353L02957N64955M66407L71015P9134n85159j153512j112454
33232A5615276o77032l46504q2673L40757N50638J47820j25660Q99738K741509
33223A9063869L349717J948912L95095N76118J703101J740786N78730j65647l4796
33214B9155885k82157j424473k280141k017114j387450j142361q26991j24995
33206A9670203Q2119p59816j494593p78168Q78948J908573J825485J292389O69270
33197B3294410j17158o36967k58932P10876J306381J218708Q69351M08788k69200
$$ plain form
33188 26526257 25813309 25481833 25874001 26203987 25682670 24761201 24437063 24729564 24794377
33179 24794377 24374503 24132888 24409745 24551815 23912010 22898132 22447888 22732159 22922438
33170 22922438 22263740 20978453 19873619 19236845 18499053 17141485 15649607 15174805 16278317
33161 16278317 18366558 20408825 21816190 22473014 22375856 21688969 20966622 20854364 21458372
33152 21458372 22178873 22213252 21178707 19331046 17301632 15610458 14381642 13509437 12973492
33143 12973492 12812308 12855339 12758570 12376891 11914022 11662181 11766508 12230158 12893418 13365695
33133 13365695 13258671 12640075 12116934 12363745 13575871 15274864 16565603 16852243 16577729
33124 16577729 16986234 18745433 21047301 22563348 23007700 23078436 23101183 22679515 21716510
$$ packed form
33188B6526257p12948l31476L92168L29986n21317r21469l24138K92501O4813
33179B4794377m19874k41615K76857J42070o39805j013878m50244K84271J90279
33170B2922438o58698j285287j104834o36774p37792j357568j491878m74802J103512
33161A6278317K088241K042267J407365O56824r7158o86887p22347j12258O04008
33152B1458372P20501L4379j034545j847661k029414j691174j228816q72205n35945
33143A2973492j61184M3031r6769l81679m62869k51841J04327M63650O63260M72277
33133A3365695j07024o18596n23141K46811J212126J698993J290739K86640k74514
33124A6577729M08505J759199K301868J516047M44352P0736K2747m21668r63005
$$ plain form
33115 21716510 20784979 20213224 19711884 19252353 19372379 20104236 20521836 20019933 19189189
33106 19189189 18656207 17953477 16604262 15571503 16223463 18150191 19395875 18947533 17804836
33097 17804836 17320961 17551741 17736307 17593857 17513551 17883461 18692693 19573740 20027411
33088 20027411 19846870 19400384 19229609 19432730 19840208 20651179 22230069 24220678 25596314
33079 25596314 25886881 25774578 26136034 27020647 27979284 28925793 30114269 31471865 32417938
33070 32417938 32327032 30994311 28803873 26576674 24994899 23982550 22893445 21451579
33062 21451579 20150070 19485862 19202663 18689761 17827853 16977789 16341666 15844593 15556311
33053 15556311 15702840 16194959 16582365 16616889 16518938 16529387 16507983 16207682 15735796 15462219
$$ packed form
33115B1716510r31531n71755n01340m59531J20026P31857M17600n01903q30744
33106A9189189n32982p02730j349215j032759O51960J926728J245684m48342j142697
33097A7804836m83875K30780J84566j42450q0306L69910Q09232Q81047M53671
33088B0027411j80541m46486j70775K03121M07478Q10971J578890J990609J375636
33079B5596314K90567j12303L61456Q84613R58637R46509J188476J357596R46073
33070C2417938r0906j332721k190438k227199j581775j012349j089105j441866
33062B1451579j301509o64208k83199n12902q61908q50064o36123m97073k88282
33053A5556311J46529M92119L87406L4524r7951J0449k1404l00301m71886k73577
$$ plain form
33043 15462219 15499043 15440851 14688691 13077357 11239936 10223094 10482193 11280555 11428707
33034 11428707 10702042 10099143 10438293 11175613 11182418 10396339 9905217 10344901 11011653 10922393
33024 10922393 10112330 9344954 8994831 8832992 8627277 8338325 7910724 7469974 7552154
33015 7552154 8454082 9454029 9476398 8621330 8222630 9107661 10558581 11437558 11650263
33006 11650263 11859844 12263411 12438606 12212832 11970417 12039664 12283692 12449176 12603715
32997 12603715 13048485 13899828 14851929 15420060 15509904 15650418 16426677 17751890 19011916
32988 19011916 19816180 20130593 19790455 18654637 17371939 17088365 17919187 18507137 17752344
32979 17752344 16280509 15389711 15169934 14717654 13840443 13355361 13684873 14228299 14385674
$$ packed form
33043A5462219L6824n8192p52160j611334j837421j016842K59099P98362J48152
33034A1428707p26665o02899L39150P37320O805p86079m91122M39684O66752q9260
33024A0922393q10063p67376l50123j61839k05715k88952m27601m40750Q2180
33015G552154R01928R99947K2369q55068l98700Q85031J450920Q78977K12705
33006A1650263K09581M03567J75195k25774k42415O9247K44028J65484J54539
32997A2603715M44770Q51343R52101N68131Q9844J40514P76259J325213J260026
32988A9011916Q04264L14413l40138j135818j282698k83574Q30822N87950p54793
32979A7752344j471835q90798k19777m52280q77211m85082L29512N43426J57375
$$ plain form
32970 14385674 14331668 14395654 14387738 14052160 13752217 14211484 15729146 17912085 20067524
32961 20067524 21737420 22970758 24121163 25276608 25960362 25575274 24075515 22037439
32953 22037439 20182011 18969139 18441286 18234535 17930045 17567931 17556714 17977779 18475525
32944 18475525 19058551 20329813 22446723 24585247 26220000 28366471 32639001 39492242
32936 39492242 48285836 58523457 69665435 79824618 86084155 86652031 82064885 74254867
32928 74254867 65256244 56756488 49786258 44448420 40522457 38221777 37544758 37209813
32920 37209813 35551325 32497721 29384256 26816182 24254255 21838617 20710759 20869321
32912 20869321 20580382 18971908 17488560 17439708 17736642 16770559 15149602 14532038 14755459
$$ packed form
32970A4385674n4006O3986p916l35578k99943M59267J517662K182939K155439
32961B0067524J669896J233338J150405J155445O83754l85088j499759k038076
32953B2037439j855428j212872n27853k06751l04490l62114j1217M21065M97746
32944A8475525N83026J271262K116910K138524J634753K146471M272530O853241
32936C9492242Q793594J0237621J1141978J0159183O259537N67876m587146p810018
32928G4254867q998623q499756o970230n337838l925963k300680o77019l34945
32920C7209813j658488l053604l113465k568074k561927k415638j127858J58562
32912B0869321k88939j608474j483348m8852K96934r66083j620957o17564K23421
$$ plain form
32903 14755459 14394456 13609741 14052250 15945727 17545875 17966128 18519005 20423960 22850724
32894 22850724 24262903 24387876 23775955 22516386 20658834 19202179 19373982 21136552
32886 21136552 23329346 25160268 26830921 28830485 31289090 33932170 36029206 36452092
32878 36452092 34521531 31002975 27690738 25663362 24323412 22488603 20062474 18089354
32870 18089354 17305157 17297146 17300710 17252104 17567462 18249195 18886599 19506278 20816871 23441026
32860 23441026 27324888 32091047 37690751 44587882 53387801 63925845 74199117 80642053
32852 80642053 80638325 75039938 67378129 60427696 54520471 49321794 45583836 44029216
32844 44029216 43682164 42773489 40742445 38150629 35203777 31723354 28214361 25528464
$$ packed form
32903A4755459l61003p84715M42509J893477J600148M20253N52877J904955K426764
32894B2850724J412179J24973o11921j259569j857552j456655J71803J762570
32886B1136552K192794J830922J670653J999564K458605K643080K097036M22886
32878C6452092j930561l518556l312237k027376j339950j834809k426129j973120
32870A8089354p84197q011L564m8606L15358O81733O37404O19679J310593K624155
32860B3441026L883862M766159N599704O897131Q799919J0538044J0273272O442936
32852H0642053l728n598387p661809o950433n907225n198677l737958j554620
32844D4029216l47052r08675k031044k591816k946852l480423l508993k685897
$$ plain form
32836 25528464 23540395 21440350 19326126 18202498 18231539 18225374 17263999 15827595 14932705
32827 14932705 14940070 15501361 15984254 15811350 15075649 14797882 15786675 17428714 18614438
32818 18614438 19548405 21171502 22884624 22727616 20313944 17791849 17035971 17508396 17918791
32809 17918791 18356669 19392518 20547952 21386141 22945927 26124953 29406957 30235505
32801 30235505 28296415 25576874 23430164 21512038 19542233 18014159 16783829 14924672
32793 14924672 12654367 11580544 12110763 12333760 10747009 8654608 8300093 9676403
32785 9676403 10897715 11076671 11050626 11473074 11914704 12095010 12526560 13387085 13897911
32776 13897911 13522172 12962527 13262448 14494533 15992214 17430195 18998332 20749151
$$ packed form
32836B5528464j988069k100045k114224j123628K9041o165r61375j436404q94890
32827A4932705P365N61291M82893j72904p35701k77767R88793J642039J185724
32818A8614438R33967J623097J713122j57008k413672k522095p55878M72425M10395
32809A7918791M37878J035849J155434Q38189J559786L179026L282004Q28548
32801C0235505j939090k719541k146710j918126j969805j528074j230330j859157
32793A4924672k270305j073823N30219K22997j586751k092401l54515J376310
32785I676403J221312J78956k6045M22448M41630J80306M31550Q60525N10826
32776A3897911l75739n59645K99921J232085J497681J437981J568137J750819
$$ plain form
32768 20749151 22356943 23422961 23630844 22793946 21161890 19485114 18328520 17490581
32760 17490581 16560045 15822276 15964046 16950932 17929307 18362687 18545362 18724940 18452344
32751 18452344 17316413 15760806 14559091 13871169 13414524 13210454 13473953 14003259 14386487
32742 14386487 14666671 15094493 15328162 14650809 12995680 11032035 9255807 7828472 7296038
32733 7296038 8316741 10300499 11457753 10935367 9995483 10212972 11298771 11755370 11070319
32724 11070319 10037664 9244738 8531814 7921405 7841299 8170677 8129080 7526174 7250746
32715 7250746 8042446 9478932 10636424 11137582 11112716 10731864 10278518 10173601 10419852
32706 10419852 10444582 9911081 9216958 8796295 8524295 8312180 8580310 9383677 9738168
$$ packed form
32768B0749151J607792J066018K07883q36898j632056j676776j156594q37939
32760A7490581r30536p37769J41770R86886R78375M33380J82675J79578k72596
32751A8452344j135931j555607j201715o87922m56645k04070K63499N29306L83228
32742A4386487K80184M27822K33669o77353j655129j963645j776228j427335n32434
32733G296038J020703J983758J157254n22386r39884K17489J085799M56599o85051
32724A1070319j032655p92926p12924o10409q0106L29378m1597o02906k75428
32715G250746P91700J436486J157492N01158k4866l80852m53346j04917K46251
32706A0419852K4730n33501o94123m20663k72000k12115K68130Q03367L54491
$$ plain form
32697 9738168 8841036 7471588 6979793 7193675 6742516 5438555 4726362 5287160 5771110
32688 5771110 4911698 3603545 3473725 4259924 4273670 3148055 2444048 3302578 4918959
32679 4918959 5890616 5950210 5671022 5363983 5102090 5193667 5730036 6011039 5249621 3737403
32669 3737403 2661386 2760803 3587802 4037642 3333603 1739724 620682 1382884 3835884
32660 3835884 6013648 6301892 5360526 5068052 5902463 6608417 6507237 6703773 8295010
32651 8295010 10465166 11412366 10608429 9161532 8229597 7970707 7961516 7824899 7321285
32642 7321285 6425386 5482994 4894508 4601762 4281907 4020351 4278788 5096188 5816533
32633 5816533 5841551 5287584 4650408 4124347 3563359 2949429 2579369 2743194 3347799 3939577
$$ packed form
32697I738168q97132j369448m91795K13882m51159j303961p12193N60798M83950
32688E771110q59412j308153j29820P86199J3746j125615p04007Q58530J616381
32679D918959R71657N9594k79188l07039k61893R1577N36369K81003p61418j512218
32669C737403j076017R9417Q26999M49840p04039j593879j119042P62202K453000
32660C835884K177764K88244r41366k92474Q34411P05954j01180J96536J591237
32651H295010K170156R47200q03937j446897r31935k58890r191j36617n03614
32642G321285q95899r42392n88486k92746l19855k61556K58437Q17400P20345
32633E816533K5018n53967o37176n26061n60988o13930l70060J63825O04605N91778
$$ plain form
32623 3939577 4148598 4117885 4369186 5142921 6003073 6255705 5651844 4541933 3526966
32614 3526966 3154045 3677359 4744500 5529452 5625604 5626670 6282166 7239857 7355188 6272233
32604 6272233 4905701 4149511 3903943 3736759 3683687 3806682 3686667 3116091 2720454
32595 2720454 3064463 3649131 3740225 3742674 4588153 5991056 6623034 6091556 5450154 5472433
32585 5472433 5743630 5966254 6769063 8284783 9141354 8194151 6488792 6106285 7473693
32576 7473693 9125882 9882446 9963589 10032380 10431387 11496209 13403514 15408848 16312743
32567 16312743 16034978 15743323 16092024 16373615 15849859 14845859 13895981 12790309 11240905
32558 11240905 9675183 8581235 7774585 7033082 6690250 6813637 6615563 5633472 4738402
$$ packed form
32623C939577K09021l0713K51301P73735Q60152K52632o03861j109911j014967
32614C526966l72921N23314J067141P84952R6152J066O55496R57691J15331j082955
32604F272233j366532p56190k45568j67184n3072J22995j20015n70576l95637
32595B720454L44009N84668R1094K449Q45479J402903O31978n31478o41402K2279
32585E472433K71197K22624Q02809J515720Q56571r47203j705359l82507J367408
32576G473693J652189P56564Q1143O8791L99007J064822J907305K005334R03895
32567A6312743k77765k91655L48701K81591n23756j004000r49878j105672j549404
32558A1240905j565722j093948q06650p41503l42832J23387j98074r82091q95070
$$ plain form
32549 4738402 4906251 5693652 6114292 6331315 7044917 7731228 7187892 5697403 4954599
32540 4954599 5632561 6538489 6545428 5944189 5384811 4814891 4146893 3845710 4116084 4419906
32530 4419906 4419700 4515806 4894082 4996886 4564087 4260985 4610735 5212415 5633727 6046952
32520 6046952 6312876 5692992 4439993 4321027 6129646 7852495 7158199 4938171 4281988
32511 4281988 6199917 8513466 9264726 9194822 10010032 11822474 13520793 14644273 15641296
32502 15641296 16779710 17877896 18993624 20573222 22737693 24786514 25633956 24813821
32494 24813821 23079527 21778742 21407895 21077712 19767302 17707133 15916241 14750835
32486 14750835 13772765 12845925 12348274 12254600 11995008 11424217 11049536 11122117 11475094 12522874
$$ packed form
32549D738402J67849P87401M20640K17023P13602O86311n43336j490489p42804
32540D954599O77962R05928O939o01239n59378n69920o67998l01183K70374L03822
32530D419906k06R6106L78276J02804m32799l03102L49750O01680M21312M13225
32520F046952K65924o19884j252999j18966J808619J722849o94296k220028o56183
32511D281988J917929K313549P51260o9904Q15210J812442J698319J123480R97023
32502A5641296J138414J098186J115728J579598K164471K048821Q47442q20135
32494B4813821j734294j300785l70847l30183j310410k060169j790892j165406
32486A4750835r78070r26840m97651r3674k59592n70791l74681P2581L52977J047780
$$ plain form
32476 12522874 15274469 19686982 23883275 25788098 24999289 22544703 19538693 16738786
$$ packed form
32476A2522874K751595M412513M196293J904823p88809k454586l006010k799907
$$ [...]
##END NTUPLES=NMR SPECTRUM
##END=
