##TITLE=31Pdec_AT-40_P
 DMSO-d6,CD3ONa, 324 sc
 22.8.2022
##JCAMPDX= 6.0         $$ Bruker NMR JCAMP-DX V2.0
##DATA TYPE= NMR SPECTRUM
##DATA CLASS= NTUPLES
##ORIGIN= UXNMR, Bruker Analytische Messtechnik GmbH
##OWNER= root
$$ XWIN-NMR		Version 3.5
$$ Mon Aug 22 13:05:09 2022 Russian Standard Time (UT+4h)  she@DPX200
##.OBSERVE FREQUENCY= 81.013821
##.OBSERVE NUCLEUS= ^31P
##.ACQUISITION MODE= SIMULTANEOUS
##.ACQUISITION SCHEME= undefined
##.AVERAGES= 324
##.DIGITISER RES= 16
##SPECTROMETER/DATA SYSTEM= spect
##.PULSE SEQUENCE= zgpg30
##.SOLVENT NAME= CDCl3
##.SHIFT REFERENCE= (INTERNAL, CDCl3, 0, 248.564)
##AUDIT TRAIL= $$ (NUMBER, WHEN, WHO, WHERE, WHAT)
$$ ##TITLE= Audit trail, XWIN-NMR		Version 3.5
$$ ##JCAMPDX= 5.01
$$ ##ORIGIN= Bruker BioSpin GmbH
$$ ##OWNER= she
$$ F:/spectra/data/she/nmr/P31/1/pdata/1/auditp.txt
$$ ##AUDIT TRAIL=  $$ (NUMBER, WHEN, WHO, WHERE, WHAT)
(   1,<2022-08-22 13:03:34.84 +0400>,<she>,<DPX200>,
      <continue with go, POWCHK disabled, PULCHK disabled
       configuration hash MD5:
       00 E9 B6 7A A2 85 ED C7 34 08 36 98 17 FE 4E 26
       data hash MD5: 32K
       CE 08 9E D2 77 B5 B6 F1 31 D1 20 80 8F 34 09 25>)
(   2,<2022-08-22 13:03:37.75 +0400>,<she>,<DPX200>,
      <Start of raw data processing
       efp BC_mod = 2 LB = 1 FT_mod = 6 PKNL = 1 PHC0 = -10257.26 PHC1 = 18.85645 SI = 64K 
       data hash MD5: 64K
       D0 88 7E 19 31 70 AE 27 6B F2 75 7D 15 CD 42 57>)
(   3,<2022-08-22 13:04:16.96 +0400>,<she>,<DPX200>,
      <pk PHC0 = -50.71599 PHC1 = 112.5999 
       data hash MD5: 64K
       5C 6F 89 D3 F2 98 05 95 4F 4C 3C FC 3F A8 DE BE>)
(   4,<2022-08-22 13:04:19.76 +0400>,<she>,<DPX200>,
      <abs ABSG = 5 
       data hash MD5: 64K
       6C 40 E6 60 F4 76 2E 15 DE 3F 9E 13 DF A9 0A 98>)
$$ ##END=
$$ 
$$ hash MD5
$$ D9 3B 98 88 B7 EB 2A DF 8B 5D 51 19 5D 48 CE 07
##$RELAX= 
##$RELAX= 
##$RELAX= 
##$RELAX= 
##$RELAX= 
##$RELAX= 
##$RELAX= 
##$RELAX= 
$$ Bruker specific parameters
$$ --------------------------
##$DU= <F:/spectra>
##$EXPNO= 1
##$NAME= <P31>
##$PROCNO= 1
##$TYPE= <nmr>
##$USER= <she>
##$AMP= (0..31)
100 100 100 100 100 100 100 100 100 100 100 100 100 100 100 100 100 100 
100 100 100 100 100 100 100 100 100 100 100 100 100 100 
##$AQSEQ= 0
##$AQ_mod= 1
##$AUNM= <au_zg>
##$AUTOPOS= <>
##$BF1= 81.014009
##$BF2= 200.13
##$BF3= 200.13
##$BF4= 200.13
##$BF5= 200.13
##$BF6= 200.13
##$BF7= 200.13
##$BF8= 200.13
##$BYTORDA= 1
##$CFDGTYP= 0
##$CFRGTYP= 5
##$CHEMSTR= <none>
##$CNST= (0..31)
1 1 145 1 1 1 1 1 1 1 1 1 1 1 1 1 1 1 1 1 1 1 1 1 1 1 1 1 1 1 1 1 
##$CPDPRG= <waltz16>
##$CPDPRG1= <>
##$CPDPRG2= <waltz16>
##$CPDPRG3= <>
##$CPDPRG4= <mlev>
##$CPDPRG5= <mlev>
##$CPDPRG6= <mlev>
##$CPDPRG7= <mlev>
##$CPDPRG8= <mlev>
##$CPDPRGB= <>
##$CPDPRGT= <>
##$D= (0..31)
0 1 0 0 0 0 0 0 0 0 0 0.03 2e-05 3e-06 0 0 0 0 0 0 0 0 0 0 0 0 0 0 0 0 
0 0 
##$DATE= 1661158448
##$DBL= (0..7)
120 120 120 11 120 120 24 19 
##$DBP= (0..7)
150 150 150 150 150 150 150 150 
##$DBP07= 0
##$DBPNAM0= <>
##$DBPNAM1= <>
$$ [...]
##$SUBNAM3= <"">
##$SUBNAM4= <"">
##$SUBNAM5= <"">
##$SUBNAM6= <"">
##$SUBNAM7= <"">
##$SUBNAM8= <"">
##$SUBNAM9= <"">
##$SW= 501.771253377433
##$SWIBOX= (0..15)
0 1 3 0 0 0 0 0 0 0 0 0 0 0 0 0 
##$SW_h= 40650.406504065
##$TD= 32768
##$TD0= 1
##$TE= 0
##$TE2= 300
##$TE3= 300
##$TEG= 300
##$TL= (0..7)
0 120 53 12 22 120 120 120 
##$TP= (0..7)
150 150 150 150 150 150 150 150 
##$TP07= 0
##$TPNAME0= <>
##$TPNAME1= <>
##$TPNAME2= <>
##$TPNAME3= <>
##$TPNAME4= <>
##$TPNAME5= <>
##$TPNAME6= <>
##$TPNAME7= <>
##$TPOAL= (0..7)
0.5 0.5 0.5 0.5 0.5 0.5 0.5 0.5 
##$TPOFFS= (0..7)
0 0 0 0 0 0 0 0 
##$TUNHIN= 0
##$TUNHOUT= 0
##$TUNXOUT= 0
##$USERA1= <user>
##$USERA2= <user>
##$USERA3= <user>
##$USERA4= <user>
##$USERA5= <user>
##$V9= 5
##$VALIST= <valist>
##$VCLIST= <CCCCCCCCCCCCCCC>
##$VD= 0
##$VDLIST= <DDDDDDDDDDDDDDD>
##$VPLIST= <PPPPPPPPPPPPPPP>
##$VTLIST= <TTTTTTTTTTTTTTT>
##$WBST= 1024
##$WBSW= 4
##$XGAIN= (0..3)
0 0 0 0 
##$XL= 0
##$YL= 0
##$YMAX_a= 108839
##$YMIN_a= -78673
##$ZGOPTNS= <>
##$ZL1= 120
##$ZL2= 120
##$ZL3= 120
##$ZL4= 120
##$ABSF1= 248.5645
##$ABSF2= -253.2056
##$ABSG= 5
##$ABSL= 3
##$ALPHA= 0
##$AQORDER= 0
##$ASSFAC= 0
##$ASSFACI= 0
##$ASSFACX= 0
##$ASSWID= 0
##$AUNMP= <proc_1d>
##$AZFE= 0.1
##$AZFW= 0.5
##$BCFW= 0
##$BC_mod= 2
##$BYTORDP= 0
##$COROFFS= 0
##$CY= -3
##$DATMOD= 1
##$DC= 0
##$DFILT= <>
##$DTYPP= 0
##$F1P= 0
##$F2P= 0
##$FCOR= 1
##$FTSIZE= 65536
##$FT_mod= 6
##$GAMMA= 0
##$GB= 0
##$INTBC= 1
##$INTSCL= 5.30512e-09
##$ISEN= 30
##$LB= 1
##$LEV0= 0
##$LPBIN= 0
##$MAXI= 10000
##$MC2= 0
##$MEAN= 0
##$ME_mod= 0
##$MI= 50
##$NCOEF= 0
##$NC_proc= -4
##$NLEV= 6
##$NOISF1= 182.463
##$NOISF2= 159.3651
##$NSP= 0
##$NTH_PI= 0
##$NZP= 0
##$OFFSET= 248.5645
##$PC= 4
##$PHC0= -10307.98
##$PHC1= 131.4563
##$PH_mod= 1
##$PKNL= yes
##$PPARMOD= 0
##$PSCAL= 0
##$PSIGN= 0
##$REVERSE= no
##$SF= 81.0140089999908
##$SI= 65536
##$SIGF1= 159.3651
##$SIGF2= -187.1042
##$SINO= 113.3802
##$SIOLD= 16384
##$SREGLST= <1H.CDCl3>
##$SSB= 0
##$STSI= 65536
##$STSR= 0
##$SW_p= 40650.406504065
##$SYMM= 0
##$S_DEV= 0
##$TDeff= 32768
##$TDoff= 0
##$TI= <>
##$TILT= no
##$TM1= 0
##$TM2= 0
##$TOPLEV= 0
##$USERP1= <user>
##$USERP2= <user>
##$USERP3= <user>
##$USERP4= <user>
##$USERP5= <user>
##$WDW= 1
##$XDIM= 65536
##$YMAX_p= 286856826
##$YMIN_p= -41045634
$$ End of Bruker specific parameters
$$ ---------------------------------
##NTUPLES= NMR SPECTRUM
##VAR_NAME=  FREQUENCY,     SPECTRUM/REAL,   SPECTRUM/IMAG
##SYMBOL=    X,             R,               I
##VAR_TYPE=  INDEPENDENT,   DEPENDENT,       DEPENDENT
##VAR_FORM=  AFFN,          ASDF,            ASDF
##VAR_DIM=   65536,         65536,           65536
##UNITS=     HZ,            ARBITRARY UNITS, ARBITRARY UNITS
##FACTOR=    0.620285442955139, 1,           1
##FIRST=     20137.2065510736, 0,            0
##LAST=      -20513.1999529914, 0,           0
##MIN=       -20513.1999529914, -41045634,   0
##MAX=       20137.2065510736, 286856826,    0
$$ Real data points
##PAGE= N=1
##DATA TABLE= (X++(R..R)), XYDATA
$$ [...]
37631c73080j77190n35655o31471N7313P95610Q13071M24163J67837j22742o22210
37621b04354q51018n18403j56858j28359R4510P70692R92674J24962p13979r0184
37611f80317J372611J715934N60421m39313k69969N0879n30046j253549q74894
37602c48243K26976O49683J09780l68800k13765J8834j35735k69237K7605L48575
37592D5673J11756n16685r01341p95372m18463N1337N43433Q17932O53559K73810
37582a34361J07014J16152j30153o30066p43136r2445P80562J043724N24585l28975
37572E12901j067656j343723p83163N15007J532440J234338n732p08334k35664
37563c49586M31173K95386j84548m0947M93168L60979n00169r16738k31778P12601
$$ plain form
37631 -373080 -550270 -1085925 -1717396 -1660083 -864473 -51402 372761 540598 417856 -204354
37621 -204354 -1055372 -1573775 -1730633 -1858992 -1764482 -993790 -1116 123846 -590133 -680317
37611 -680317 692294 2408228 2968649 2529336 2259367 2310246 1780200 526651 -348243
37602 -348243 -121267 528416 638196 269396 55631 74465 -61270 -330507 -302902 45673
37592 45673 157429 -359256 -1260597 -2055969 -2474432 -2423095 -1879662 -1061730 -408171 -134361
37582 -134361 -27347 88805 -41348 -671414 -1414550 -1506995 -726433 317291 841876 512901
37572 512901 -554755 -1898478 -2681641 -2166634 -634194 600144 594412 -113922 -349586
37563 -349586 81587 376973 192425 151478 644646 1005625 505456 -411282 -643060 69541
37553F9541Q06870J44799l37818k22585N1313L6793j21165o5843J33683K1144
37543E16732n57053j033979p06669K62245Q69839N45278o9831q1392L63816M61369
37533E70355J00984j00918j6945j90340o39606n89298J58583O25998J23728n80240
37523e37699m24959L26135O14905K20465j70114k08841j95546k82292k86970k50117
37513a195033l60767l75187J01628P92432R87073N88604J65755J0064o7284p7179
37503E70106J08058J04130n66936j351715j107470R0541P82628K16985n66916
37494a720589m02519L51815O70662M30953J57453m5199l10165l61675r286K48693
37484i89857L7599n7199N13034J008461L79415q94126j283129l88112O66213J024440
$$ plain form
37553 69541 876411 1021210 683392 460807 512120 548913 427748 361905 495588 516732
37543 516732 -40321 -1074300 -1780969 -1518724 -648885 -103607 -173438 -254830 108986 570355
37533 570355 671339 570421 553476 363136 -276470 -865768 -707185 -81187 42541 -537699
37523 -537699 -962658 -636523 -21618 198847 28733 -180108 -375654 -657946 -944916 -1195033
37513 -1195033 -1555800 -1930987 -1829359 -1036927 -49854 538750 704505 714569 647285 570106
37503 570106 678164 782294 215358 -1136357 -2243827 -2153286 -1370658 -1153673 -1720589
37494 -1720589 -2123108 -1771293 -1100631 -669678 -512225 -557424 -867589 -1229264 -1238550 -989857
37484 -989857 -952258 -1009457 -496423 512038 891453 -2673 -1285802 -1673914 -1007701 16739
37474A6739R92022R45519O13136j28950p84811j033806j122817j083422m78860
37465b065250O07079J244269R13469K89973J43874K09950j28019o87850q41754
37456c14259n42737k10607M6209L52817N23110L46467J82786M85653Q53548L94689
37446B117676q48653j614938r64317L95376Q89906O7578p64951k23276J189858
37437B44259J542135N9364j614099j505421J5964R00992M51741Q8899Q01886J498683
37427B484403Q39984o13733j375757j219320r96488r09199m31017L48459P04866
37418a167802N62873N69870Q31147P01816l684o06223n91386k07934J27795K84704
37408E01176K07669m1027r5115J35961k7829r95939j727220r11720Q47811J600844
$$ plain form
37474 16739 1008761 1954280 2567416 2438466 1653655 619849 -502968 -1586390 -2065250
37465 -2065250 -1458171 -213902 699567 989540 1133414 1343364 1215345 527495 -314259
37456 -314259 -856996 -1067603 -1021394 -668577 -145467 201000 383786 869439 1722987 2117676
37446 2117676 1269023 -345915 -1310232 -914856 -24950 42628 -722323 -945599 244259
37437 244259 1786394 1845758 231659 -1273762 -1257798 -356806 94935 183834 985720 2484403
37427 2484403 3324387 2710654 1334897 115577 -880911 -1790110 -2221127 -1872668 -1167802
37418 -1167802 -604929 -35059 796088 1497904 1494220 887997 296611 88677 216472 501176
37408 501176 708845 667818 572703 708664 680835 -315104 -2042324 -2954044 -2106233 -505389
37398e05389Q68833J76048M07238N21375k79420r31505l62962N41082L90994m24636
37388D01658n58650K4509K72649j6977j25518L4671j53919o46591o98194j97763
37378a664125J89675K12576K13892J67908k88894q71451q64619l52730o8238k3681
37368c349687M22000J078901R50530J4655m86516j6518M26272R8717k88596m6420
37358a196662J67050l39717p88222j31871J048701J314079N30548j58788k49749
37349A95369l46351p22455p63017j55004M52883M53047J48507J51781M98390P74996
37339F88146P00888K66489l36256o86452m20023K27332N40977K35586j37635P33
37329A079785L95478L31931l15451q64425o77560Q1189O47818M60940k99801q88500
$$ plain form
37398 -505389 363444 539492 946730 1468105 1188685 257180 -105782 435300 826294 401658
37388 401658 -156992 -132483 140166 123189 -2329 32342 -121577 -768168 -1466362 -1664125
37378 -1664125 -1474450 -1261874 -1047982 -880074 -1168968 -2040419 -2905038 -3257768 -3326006 -3349687
37368 -3349687 -2927687 -1848786 -898256 -883601 -1370117 -1386635 -960363 -861646 -1150242 -1196662
37358 -1196662 -1029612 -1369329 -2157551 -2289422 -1240721 73358 603906 445118 195369
37349 195369 -150982 -873437 -1636454 -1791458 -1338575 -885528 -737021 -585240 -86850 688146
37339 688146 1389034 1655523 1319267 632815 212792 440124 981101 1216687 1079052 1079785
37329 1079785 1475263 1807194 1491743 627318 -50242 30947 678765 1139705 839904 -48596
37319d8596o96489J25849P55310N19906l48122r24103o23557J36018M79184J61291
37309d63309j95104o175M75842N65301J52847j19331K27191P79644P22496q0305
37299B059097q36633p59769P48O09904N94345K61036L1836j59795m93844p13841
37289E93084m99089j12295j6098k5740L53477Q22562N28415m39744r20095m67453
37279a82976q6732m71846p41592l1417P70553L68349o72794p19643L29636J029353
37269d09109P76778L82425K12485l21811j074164q86742L14455R49695K37111
37260A81123m66150P5434R35755O82513k33954l96509K13916M58919N4103k46515
37250A258635j30529J9949J30429M46380P34744N69523J65815q3558m85090j313057
$$ plain form
37319 -48596 -745085 -619236 136074 655980 307858 -616245 -1239802 -1103784 -624600 -463309
37309 -463309 -658413 -664588 -188746 376555 529402 410071 637262 1416906 2139402 2059097
37299 2059097 1222464 462695 463443 1073347 1667692 1928728 1960564 1800769 1306925 593084
37289 593084 93995 -18300 -34398 -60138 293339 1115901 1644316 1204572 284477 -182976
37279 -182976 -269708 -741554 -1483146 -1514563 -744010 -375661 -1048455 -1768098 -1438462 -409109
37269 -409109 367669 750094 962579 640768 -433396 -1320138 -1005683 -55988 181123
37260 181123 -285027 -209593 726162 1408675 1174721 778212 992128 1451047 1505150 1258635
37250 1258635 1128106 1148055 1278484 1724864 2459608 3029131 3194946 3111388 2626298 1313241
37240A313241j695999o70848R42321J310804K39472n43267l4974O38648J04576
37231A603974j220963j824050j029092M80943J565181J546513O54982j28239n2977
37222A596272M55621L36264n77233j238811q11107K25055P20379K09082o62381
37213B53141q57117m5101R19425Q84486o0025n20808K73590J272443J152227K62588
37203C534849j75676j27629m40005r00634m38254P21197R70541j76507j202361
37194A765521q78864O1653L57630m387l36525m46637m09161j04514K49286L8543
37184B92545o32900q10516k64324M3406k36457m7085J026691J483358J99985j342911
37174b88208j038161N81905J149426M7754r39200n58057L34736N60175K98210
$$ plain form
37240 1313241 -382758 -1053606 -111285 1199519 1438991 895724 860750 1499398 1603974
37231 1603974 383011 -1441039 -2470131 -1989188 -424007 1122506 1777488 1649249 1596272
37222 1596272 2051893 2388157 1810924 572113 -238994 -13939 706440 915522 253141
37213 253141 -603976 -649077 270348 1154834 1094809 574001 847591 2120034 3272261 3534849
37203 3534849 3359173 3231544 2791539 1890905 1452651 2173848 3144389 2967882 1765521
37194 1765521 886657 948310 1305940 1301553 965028 518391 109230 4716 254002 292545
37184 292545 -340355 -1150871 -1415195 -1371789 -1608246 -1655331 -628640 854718 1054703 -288208
37174 -288208 -1326369 -744464 404962 452716 -486484 -1044541 -709805 -149630 148580
37165A48580K36100K70525r0304p58946j156948q70135N9914J092414J396326
37156C27526O49647l73061o21745j33273J42428j45464k76388L03440J077645
37147I50755J190767N24586l26118p77285p02464m34231m21515o46423n04673
37138a146601L24733J094022P44191n60786j391456p72152O37426J378565P97270
37129A105212m45775j160031p30685L35204Q94432L87478n26609q31652m15600
37120a388026K2014J07714J17649J80531k0028m75563n09169L02779J337769J584953
37110A260623Q50390j20723n67943l99187m6907L2313k79209o57476n80469J16393
37100c92195Q69681P98024k92706j425268j342710m056J196738J034129p6940
$$ plain form
37165 148580 384680 655205 564901 -194045 -1350993 -2221128 -2161214 -1068800 327526
37156 327526 977173 604112 -17633 -150906 -8478 -153942 -430330 -126890 950755
37147 950755 2141522 2666108 2339990 1562705 860241 426010 4495 -641928 -1146601
37138 -1146601 -821868 272154 1016345 455559 -935897 -1708049 -1070623 307942 1105212
37129 1105212 659437 -500594 -1231279 -896075 -1643 385835 -140774 -972426 -1388026
37120 -1388026 -1366012 -1258298 -1140649 -960118 -980146 -1455709 -1964878 -1662099 -324330 1260623
37110 1260623 2111013 1990290 1422347 1023160 976253 1008566 729357 71881 -508588 -392195
37100 -392195 477486 1275510 982804 -442464 -1785174 -1789230 -592492 441637 364697
37091C64697p33358l78125K75216N41941N49317N43906L77297J00860J77314N47948
37081B367013L90368m61686p76885L39951J708728J422763l77714j479081m89543
37072B643914J394307J969141O32942j104472j434813k48819P95017L34974q61235
37063D120956r47084J76116N28884q16390j950314r46154R69973J204835j93634
37054B147188q88595k46514q4350j036999j141756O64323K220020J285833r10094
37045B009056j566131m61792K16095m55882j078336n68415K86158M61121K16538
37036i41588J95430K41517J5002q1088M51585J124674R53818r7622r47293q06730
37026A07705j40709J59576Q7999L25914Q80343Q29240k04710j164113r30305R217
$$ plain form
37091 364697 -368661 -746786 -471570 70371 619688 1163594 1540891 1641751 1819065 2367013
37081 2367013 2757381 2295695 1518810 1858761 3567489 4990252 4612538 3133457 2643914
37072 2643914 4038221 6007362 6640304 5535832 4101019 3852200 4647217 4982191 4120956
37063 4120956 3173872 3349988 3878872 3062482 1112168 166014 1135987 2340822 2147188
37054 2147188 1258593 1012079 927729 -109270 -1251026 -586703 1633317 2919150 2009056
37045 2009056 442925 -18867 197228 -258654 -1336990 -1905405 -1619247 -1158126 -941588
37036 -941588 -746158 -504641 -489639 -570727 -119142 1005532 1959350 1861728 914435 107705
37026 107705 -33004 126572 214571 540485 1420828 2250068 2045358 881245 -49060 -39843
37016c9843L03356k10589m36550N1069L56076j37595p60273p30378k74775P6445
37006a803057L49962N87553L92201j92383k76073M91882J036473M35024m64199
36997E57383k99165O11753Q31293J41726l09939j30529k73792j159176j696423
36988a726869r23781M88481J218856J007345N63032L09441O6179k72077m77643
36979B52964m15726k43497j24475n8013l3979r2229j34835R2141O02000Q66586
36969G10937L06423p66631j149796j91129J095796J139021o9423r36393n27994
36960c89189K70549M12231L16937P78522J206627M67085r74768j384134k95773
36951D08087P69161N46733k94212m16147K58014P79599P06983M70511M44745M37428
$$ plain form
37016 -39843 263513 52924 -383626 -332557 23519 -114076 -874349 -1604727 -1879502 -1803057
37006 -1803057 -1453095 -865542 -473341 -665724 -941797 -449915 586558 1021582 557383
36997 557383 258218 869971 1701264 1842990 1533051 1402522 1128730 -30446 -1726869
36988 -1726869 -2650650 -2162169 -943313 64032 627064 936505 1002684 730607 252964
36979 252964 -162762 -406259 -530734 -588747 -622726 -714955 -849790 -757649 -155649 710937
36969 710937 1017360 250729 -899067 -1090196 5600 1144621 1075198 138805 -389189
36960 -389189 -118640 293591 610528 1389050 2595677 3062762 2087994 703860 408087
36951 408087 1177248 1723981 1429769 1013622 1271636 2051235 2758218 3228729 3673474 4110902
36941D110902J64393k61816n04635m63275l83030m70248n12097j44416M58068
36932A993846N85738l3032p16980p59577m31178m16707o66041o36468l60392k69195
36922a709986j49461N43793J331214J015666l21308j002625j37881R19080N28931
36913A017423p87546j146889p341J218960J146754m1752j143325j266282m73560
36904a483558M12850N90708J33488j21185K30699N71310L19966o1084J08462M74066
36894A175722K62159k49257j27502M80473L97255n77604j089249k68161Q40754
36885H44590Q00690j47671o16153j37791M15551L32750k7135j8117L13301M11523
36875B171538N2239l39079k31415K56145L59084l55421j229682j232475l43946
$$ plain form
36941 4110902 4275295 4013479 3508844 3045569 2662539 2192291 1680194 1535778 1993846
36932 1993846 2579584 2546552 1829572 1069995 638817 222110 -443931 -1080399 -1440791 -1709986
36922 -1709986 -1859447 -1315654 15560 1031226 709918 -292707 -430588 488492 1017423
36913 1017423 229877 -917012 -924353 294607 1441361 1399609 256284 -1009998 -1483558
36904 -1483558 -1070708 -480000 -346512 -467697 -236998 334312 654278 593194 701656 1175722
36894 1175722 1437881 1188624 1061122 1541595 1938850 1361246 271997 3836 844590
36885 844590 1645280 1497609 881456 743665 1159216 1491966 1464831 1446714 1760015 2171538
36875 2171538 2223777 1884698 1653283 1909428 2268512 1913091 683409 -549066 -893012
36866h93012M65646O78219P38052Q49922L96905p15073j230560k54979J028264
36857A063384Q33767n19107j043058j12027P15493K34585p26999q92752l56733
36848h03447J41197N60396J062831J116209L04091o17275o21849P9669M53399
36839A675221J56520l18577o24267p40257n39321p5105R0243k65081l67617L42222
36829f66019R80813N08084l49305j17233Q44107P38985o22610j289156k68552
36820b40886Q40895M09293p35377q22229J24600O79470L55006m2595k8226J223
36810E41174k37160m73432n25410n48601n57473l16707K23381P92906J062745
36801c8577P96018n616q55947j061783n33214J02514M15854O10824P97556O32053
$$ plain form
36866 -893012 -427366 250853 988905 1838827 2235732 1520659 290099 35120 1063384
36857 1063384 1897151 1378044 334986 222959 938452 1173037 446038 -446714 -803447
36848 -803447 -662250 -101854 960977 2077186 2381277 1764002 1142153 1221822 1675221
36839 1675221 1831741 1513164 888897 148640 -390681 -465786 -375543 -640624 -1008241 -666019
36829 -666019 314794 822878 473573 356340 1200447 1939432 1316822 27666 -240886
36820 -240886 600009 1009302 273925 -548304 -423704 255766 610772 568177 539951 541174
36810 541174 304014 -169418 -694828 -1243429 -1800902 -2117609 -1894228 -1101322 -38577
36801 -38577 757441 751825 -104122 -1165905 -1699119 -1596605 -1180751 -569927 227629 859682
36791H59682J20065r4263J58679R9086n99633r35379j66593O57058J43052j128566
36781h86812j319939o8047J083781J023777L73823J36563K81356K16444j69906
36772F71040m36206j12596Q18591J590775J098725o51324j949728j241558P14275
36763E01994J718995J006502r6255m24688l99805p38843j086144p30337K18802
36754b9779J104831J531321J376933O59378j40558k52766M09622R89667P74203
36745F422852K0305n84847p17493m19589R1655L75901J12307l55867m35226k57195
36735D252803m29521q09909n82049K70976P45637M48637K55040P80725J364714
36726F297053J295616R61560R40998R56755O57594M96336Q07085Q66906N875j067579
$$ plain form
36791 859682 979747 885484 1044163 1143249 543616 -391763 -558356 98702 241754 -886812
36781 -886812 -2206751 -2274798 -1191017 -167240 206583 343146 624502 840946 671040
36772 671040 234834 122238 940829 2531604 3630329 2979005 1029277 -212281 501994
36763 501994 2220989 3227491 3131236 2706548 2306743 1567900 481756 -248581 -29779
36754 -29779 1075052 2606373 3983306 4642684 4502126 4249360 4658982 5648649 6422852
36745 6422852 6443157 5858310 5140817 4721228 4812883 5188784 5301091 4945224 4509998 4252803
36735 4252803 3823282 3013373 2431324 2702300 3447937 3896574 4151614 4932339 6297053
36726 6297053 7592669 8554229 9495227 10451982 11109576 11605912 12412997 13279903 13285778 12218199
36716A2218199j233997o85285m91554q84990j161916j011539q11560p34999n51733
36707D650626k54877q4353n7983j45907n89765j317698j476864m58146R55207
36698A220240J402125O48797l71137q74547p00416R0386J036614J114665o3868
36689C502859j236092r34058L57157Q80813K06966m34898l58662k14875l62806
36680A406404k26310K35177J47175m99555m26053O44528J031535k46125j491597
36671E75179p84766Q63679R53924o35245j522804m94812Q90038Q92809l0669m01153
36661C06180N1458M75632M52333L57489M59181N08350K50633j47002k78483M6505
36651B482276N10566N16078n3491m39870J00409J039370R76346m10913j612295
$$ plain form
36716 12218199 10984202 10298917 9807363 8922373 7760457 6748918 5937358 5202359 4650626
36707 4650626 4395749 4311396 4253413 4107506 3517741 2200043 723179 265033 1220240
36698 1220240 2622365 3271162 2900025 2025478 1325062 1415448 2452062 3566727 3502859
36689 3502859 2266767 1332709 1689866 2570679 2777645 2342747 1984085 1769210 1406404
36680 1406404 1180094 1415271 1562446 1062891 636838 1281366 2312901 2066776 575179
36671 575179 -209587 654092 1608016 972771 -550033 -1044845 -154807 738002 707333 306180
36661 306180 357638 833270 1285603 1643092 2102273 2610623 2861256 2714254 2435771 2482276
36651 2482276 2992842 3508920 3455429 3015559 3115968 4155338 5131684 4720771 3108476
36642C108476j146311M23705J240109O08382l36910m64484p6821l5261l09316
36633C011569k08813L70618P90917O84317M03998L51702M36782M26952L81062
36624F649104M35928M74807L09899J0244j87883j72780j0658J54451J57962n0366
36614G770708k60733k24231p1592j89753n92824q25042o51580l59146j12705L88111
36604D871213J142211J374729O17738k02631K20754J644912K441975J793779O49975
36595A4554655J62745K10236R3357k04044l21174m50033r84571j595760j601775
36586I863636j094598q15180r72985j057873q45400o89285o72406m00338O9109
36577C384680O5395m34530l93224O40339J402095N92057r96392j467948o06522
$$ plain form
36642 3108476 1962165 2385870 3625979 4234361 3897451 3432967 3356146 3320885 3011569
36633 3011569 2802756 3173374 3964291 4648608 5052606 5404308 5841090 6268042 6649104
36624 6649104 7085032 7559839 7869738 7879982 7692099 7519319 7508661 7663112 7821074 7770708
36614 7770708 7509975 7285744 7214152 7024399 6431575 5606533 4954953 4595807 4483102 4871213
36604 4871213 6013424 7388153 8005891 7803260 8024014 9668926 12110901 13904680 14554655
36595 14554655 14717400 14927636 15020993 14816949 14495775 14045742 13061171 11465411 9863636
36586 9863636 8769038 7953858 6980873 5923000 5077600 4388315 3715909 3315571 3384680
36577 3384680 3450075 3015545 2622321 3262660 4664755 5256812 4260420 2792472 2185950
36568B185950p499l49809l70008P37452J644249R72730k68253j29903J162114
36559E577023J555818M49455m53618L556O46916N1238j112439j207585j45399
36550E364965P09637O44880K21101k9949k57167n37698n28262j29164K88106N18494
36540F264943P03659P63568M10933q7319K2038Q20365J403874J176588P19470
36531A2198119P84377J107556R99028N61178L66643K61549m15139j461602j802995
36522A2598714j136952n16738p11830r57134k48959Q58046R70143J7056o55771
36513A0216575m05526j29682n43931r42766n54226k8835l36842r39425n50202
36504E785140O12080R29114j27737j138946r08501j55798j44720o64823n64565
$$ plain form
36568 2185950 2178451 1828642 1458634 2196086 3840335 4813065 4544812 4414909 5577023
36559 5577023 7132841 7582296 7128678 7132234 7779150 7830388 6717949 5510364 5364965
36550 5364965 6074602 6719482 6940583 6910634 6653467 6115769 5587507 5458343 5746449 6264943
36540 6264943 6968602 7732170 8143103 8055784 8077822 8898187 10302061 11478649 12198119
36531 12198119 12982496 14090052 15089080 15650258 16016901 16278450 15863311 14401709 12598714
36522 12598714 11461762 10945024 10233194 9276060 9027101 9885147 10855290 10872346 10216575
36513 10216575 9811049 9681367 9137436 8194670 7640444 7611609 7274767 6335342 5785140
36504 5785140 6397220 7326334 7198597 6059651 5151150 4995352 4850632 4185809 3621244
36495C621244K65532O78603j597j002854j122027j66388R19664J140585M69930
36486D802692k14687j85448L18886N43504K59576j20130l20942m41485m36906
36477D205060j43558J10415j87678o60615l41322O34751R08329Q7324l54656N66534
36467D824584J493949Q34870m16757o5559J658919K230628P10068q03064l94780
36458A0072858R36040J064123j58276j122334r92360m88740l61254l64026q860
36449H577171M61985L12206o97496j812763j914490p55075N90087Q48205M3629
36440E653459n92954k01459P74233J354030J179418O70248M68617R57079J954553
36431A2217224K721335K649620K065154J878760K302894K487537J740465N58631
$$ plain form
36495 3621244 3886776 4565379 4563782 3560928 2438901 2272513 3192177 4332762 4802692
36486 4802692 4588005 4402557 4721443 5264947 5524523 5404393 5083451 4641966 4205060
36477 4205060 4061502 4171917 3984239 3323624 2982302 3617053 4525382 4612706 4258050 4824584
36467 4824584 6318533 7153403 6736646 6671087 8330006 10560634 11270702 10467638 10072858
36458 10072858 11008898 12073021 11914745 10792411 9800051 9311311 8950057 8586031 8577171
36449 8577171 9039156 9351362 8653866 6841103 4926613 4171538 4761625 5609830 5653459
36440 5653459 5060505 4859046 5633279 6987309 8166727 8836975 9305592 10262671 12217224
36431 12217224 14938559 17588179 19653333 21532093 23834987 26322524 28062989 28621620
36423B8621620p8887j07075m25115j524390k591966k405610j047788j95358j219536
36414A9025895l266287m060347k747740r63567n43263j169150j268181m47627
36406D559733K88047L33321J05077l1083j77039k05609J64167N18464J35802o86922
36396E003958q74524k43752K97345L34747L85781N59753K55625m53077o60826
36387D605030l36053n77924j527297j734253n46862N56872K59235n13060k49036
36378f3348P34040J120025P17154J59714m80766j140949q50446P63509J945931
36369B904864Q98202j213153j600602N6858J259184O10545k99440K43739J397903
36360D258100J298601p7692j056622o48191M12352Q77422M70656l89K46199R70222
$$ plain form
36423 28621620 28542733 28435658 28010543 26486153 23894187 21488577 20440789 20245431 19025895
36414 19025895 15759608 11699261 8951521 7987954 7444691 6275541 5007360 4559733
36406 4559733 4847780 5181101 5286178 5255095 5078056 4872447 5036614 5555078 5690880 5003958
36396 5003958 4129434 3885682 4183027 4517774 4903555 5463308 5718933 5265856 4605030
36387 4605030 4268977 3691053 2163756 429503 -117359 439513 698748 185688 -63348
36378 -63348 670692 1790717 2507871 2667585 2186819 1045870 195424 958933 2904864
36369 2904864 3803066 2589913 989311 1046169 2305353 2915898 2616458 2860197 4258100
36360 4258100 5556701 5479009 4422387 3774196 4186548 5063970 5534626 5534237 5780436 6750658
36350F750658J274327Q93425M59823K71336k32356j144490j373042l52511N88554
36341G135724P7514r87434q22997K29910L02062p03788q95826K78787R96135J27881
36331E737968r52017p91261n3328J14728J12260O69459J132744P32045K99031
36322G001629Q56589J544306R72510j36037J24666J614048K128232Q29567m20381
36313A4515129J03796J528151J824472N51085r75868j538409j041936j17469M27755
36304A5276706L031j162852j919872j374882j51588K12346p32724j670518j280161
36295G199486l2120N84426K56472J30939P91888J225951N26575m54543l54414
36286I874660N18860P10370j7572m79203k79396m86489j525058k058232j064791
$$ plain form
36350 6750658 8024985 8918410 9378233 9649569 9417213 8272723 6899681 6547170 7135724
36341 7135724 7213238 6225804 5402807 5632717 5934779 5230991 4335165 4613952 5610087 5737968
36331 5737968 4785951 3994690 3941362 4056090 4168350 4837809 5970553 6702598 7001629
36322 7001629 7858218 9402524 10375034 10238997 10363663 11977711 14105943 14935510 14515129
36313 14515129 14618925 16147076 17971548 18522633 17546765 16008356 14966420 14848951 15276706
36304 15276706 15279737 14116885 12197013 10822131 10670543 10882889 10150165 8479647 7199486
36295 7199486 7167366 7751792 8008264 8139203 8931091 10157042 10683617 10229074 9874660
36286 9874660 10393520 11103890 11086318 10607115 10327719 9841230 8316172 6257940 5193149
36277E193149K76080J88795j061866j651523q87098O8141J31907l56440n38209
36268A362936k61108Q4304L02888M89976P09298Q70784P84323L02433m01054q03899
36258C440881n90302j11515P1068k5264P3529M52500O21725K89429j56255j97522
36248C868274J04393K62700O4079j94772j68697P6915J83373o5856n82229j119361
36238B428819j322340p51871O24595J868582J689639J06523j134098n70707J003557
36229C942699J560933N41924o45915q35203n03543n52502q28759n97866K52020
36220B333788J140093J436052Q32876l07940q17856J41368J554588J397218m71741
36211G238446j686570o04425J264517J486426J50218p56942n79518m36274p21314
$$ plain form
36277 5193149 5469229 5658024 4596158 2944635 2057537 2125678 2257585 1901145 1362936
36268 1362936 1101828 1186132 1489020 1978996 2688294 3559078 4343401 4645834 4244780 3440881
36258 3440881 2850579 2739064 2810132 2784868 2858397 3310897 3932622 4222051 4065796 3868274
36248 3868274 3972667 4235367 4299446 4104674 3935977 4012892 4196265 4130409 3548180 2428819
36238 2428819 1106479 354608 979203 2847785 4537424 4643947 3509849 2939142 3942699
36229 3942699 5503632 6045556 5399641 4564438 4060895 3508393 2679634 2081768 2333788
36220 2333788 3473881 4909933 5742809 5434869 4617013 4758381 6312969 7710187 7238446
36211 7238446 5551876 4947451 6211968 7698394 7848612 7091670 6512152 6075878 5354564
36202E354564m36018O11389R95039m5665j139846p80275L96036O46804k79554
36193E322474r51932m51113M44559N26808k02115o84754k79561M74970O84365
36184D883701K92003Q8J18533J38550l13853p40983n20215Q3634L03269l5770
36174D208957m41498n41524l30224J33767O50104P40906K40537k60019k47884
36165D153122j73034o05146r34875j77365J096909J157696k44676j134255j9803
36156C118573J847181K101755M66317r54134m60619J240564K175379J548187L89884
36147A1473087j09696j67038p29781j659036j709223n79217K48334l86103j417756
36138D963571j128025J35575N55395j70121m40642M11087R25004r961j224492
$$ plain form
36202 5354564 4918546 5529935 6524974 6479309 5339463 4559188 4955224 5602028 5322474
36193 5322474 4370542 3919429 4363988 4890796 4688681 4003927 3724366 4199336 4883701
36184 4883701 5175704 5175792 5294325 5432875 5119022 4378039 3857824 3941458 4244727 4208957
36174 4208957 3767459 3225935 2895711 3029478 3679582 4420488 4661025 4401006 4153122
36165 4153122 3980088 3374942 2440067 2262702 3359611 4517307 4272631 3138376 3118573
36156 3118573 4965754 7067509 7533826 6579692 6119073 7359637 9535016 11083203 11473087
36147 11473087 11363391 11196353 10466572 8807536 7098313 6519096 6767430 6381327 4963571
36138 4963571 3835546 3971121 4526516 4356395 3915753 4326840 5251844 5241883 4017391
36129D017391j067739J34991P99832L99703k55175m78559k57468K71432Q51188
36120D415596R03897K06016n08308m26256J65998L73975M7549j80748L4507M34647
36110E466873P16297O94498J46621p75463j232957o02155M89401Q30994K11460
36101E945569m54122m81134o7385L97692Q05415R46603M58036m99364j087623
36092E963687p20371J82721O81554L90764j36600r4107N57632R29195L54542m72483
36082G636534k23350J112759J988000J513797Q33764J259121J971322J137847
36074A7229794j088936k429724j552743K22683Q80444J66065o79217p63011k69672
36065A1715683J54871N4234n32422j020995q53629l23145l00408q89011j058670
$$ plain form
36129 4017391 2949652 3084643 3884475 4284178 4029003 3550444 3292976 3564408 4415596
36120 4415596 5319493 5525509 5017201 4590945 4756943 5130918 5178467 4997719 5032226 5466873
36110 5466873 6183170 6877668 7024289 6248826 5015869 4413714 4903115 5734109 5945569
36101 5945569 5491447 5010313 4942928 5340620 6146035 7092638 7550674 7051310 5963687
36092 5963687 5243316 5426037 6107591 6498355 6361755 6267648 6825280 7754475 8109017 7636534
36082 7636534 7413184 8525943 10513943 12027740 12861504 14120625 16091947 17229794
36074 17229794 16140858 13711134 12158391 12381074 13261518 13427583 12748366 11985355 11715683
36065 11715683 11870554 11924788 11392366 10371371 9517742 9194597 8894189 8005178 6946508
36056F946508j29878J032588J070714k6120r72975r52813n05835m84798p96078
36047E181313o61156J55313R24405Q90170K76496j9854L45652P28041M60798k02937
36037H078241n30059l50106j18209j18614j70478q2862Q2200J87378R3117k95805
36027F774803o77971l97042N83926J188139N71821m35300m06696M23182M84435
36018H109297m77195q42349J98741J191003P69763j17211R0627R27359Q95574
36009A0745609K36267M99570J685463K130071J473896J466870L007296M442998
36001B5688040M177068L317117L974248O026255P511948P653551P429010P165768
35993G2943005N667866K477933p09712k187429k677669m130942o651994q266501
$$ plain form
36056 6946508 6816630 7849218 8919932 8893812 7920837 6968024 6462189 5977391 5181313
36047 5181313 4520157 4675470 5599875 6490045 6766541 6746687 7092339 7820380 8281178 8078241
36037 8078241 7548182 7198076 7079867 6961253 6790775 6707913 6790113 6977491 7070608 6774803
36027 6774803 6096832 5699790 6283716 7471855 8043676 7608376 7201680 7624862 8109297
36018 8109297 7632102 6789753 6988494 8179497 8949260 8832049 8922676 9850035 10745609
36009 10745609 10981876 11481446 13166909 15296980 16770876 18237746 21245042 25688040
36001 25688040 29865108 33182225 37156473 43182728 50694676 58348227 65777237 72943005
35993 72943005 78610871 81088804 80379092 78191663 75513994 71383052 64731058 56464557
35985E6464557p804849o467907n877737n805713m948751l230447j972013j891011
35977A8466129k184510j920506j308041r91538q88278n41956j31049k21415p06963
35968I571873q55200m42971p2842j47262k18460K11474P27018M30683p61140j741447
35958F701726j362015J68299J312099Q51426o18541j309726m73288O39030N53803
35949F462813l53449n68019J74214N94209Q8877k76427L03643Q41753J72921r34479
35939F506056q38300L98407J171630Q61626M33131L81551n2568r93710j074292
35930F793531L53242J645227J070542n08755r49876r5873K91013l79613o63932
35921G555506K81873J202050Q47053j4292P804O61598O64601j11126n60879k08267
$$ plain form
35985 56464557 48659708 42191801 36314064 30508351 25559600 22329153 20357140 18466129
35977 18466129 16281619 14361113 13053072 12061534 11173256 10631300 10500251 10278836 9571873
35968 9571873 8716673 8273702 8200860 8053598 7835138 8046612 8773630 9204313 8443173 6701726
35958 6701726 5339711 5508010 6820109 7671535 7052994 5743268 5269980 5909010 6462813
35949 6462813 6109364 5541345 5715559 6309768 6398645 6122218 6425861 7267614 7440535 6506056
35939 6506056 5667756 6066163 7237793 8099419 8532550 8914101 8861533 7867823 6793531
35930 6793531 7146773 8792000 9862542 9353787 8403911 8308038 8599051 8219438 7555506
35921 7555506 7837379 9039429 9886482 9872190 9879994 10541592 11206193 11095067 10534188 10325921
35911A0325921K02881O3515k47231j39209L50822P83085Q19962L55736l54205
35902A2161277o37991m4182Q80899J033563J22703r39154j194021o79865j09589
35893A0593640J2430k85438n91004l84739M25574J108471P71938l57900r37500
35884A0355472j98490R53096J165771N15952K84300R82547J563850R67561k71538
35875A6318521o88254R6039Q43254M17312o53614r85308l41235J00852m34249
35866A4673318j221302j263464p51285m62037m02549j58375j04055q77540j793922
35857G638789j343950M18441J503819O91159p43306r53683m101P72345R29040
35848H908553R88227R79335M02350n59710j100896r93071o18526l728R51837J484064
$$ plain form
35911 10325921 10528802 10592317 10345086 10205877 10556699 11339784 12159746 12515482 12161277
35902 12161277 11523286 11479104 12360003 13393566 13516269 12577115 11383094 10703229 10593640
35893 10593640 10606070 10320632 9729628 9344889 9770463 10878934 11650872 11292972 10355472
35884 10355472 10156982 11110078 12275849 12791801 13076101 14058648 15622498 16590059 16318521
35875 16318521 15630267 15726306 16569560 16986872 16333258 15347950 15006715 15107567 14673318
35866 14673318 13452016 12188552 11437267 10975230 10572681 10414306 10310251 9432711 7638789
35857 7638789 6294839 6713280 8217099 8908258 8164952 7211269 7207168 7979513 8908553
35848 8908553 9896780 10876115 11278465 10718755 9617859 8624788 8006262 8002534 8954371 10438435
35838A0438435O89229p13138r61690N9448M25763p96511j847773r09049R78962
35829G363676J414567K01976n85931Q7591Q41156K86434q12082p96216M78641
35820H479812J623190J639265Q69738J41581j93847j83343J57733Q01103J462620
35811A4797852J734149J459330Q41232K01799k41588l83836k01864J91997N97496
35802A8996567R50036J382677J917767K240349K034138J467089J047527J027320
35794C1063470J269075J672663K279310K854203K895654K390622K157541L008573
35786D9591111M809787O736633Q236269R396617J0615533J2213113J3918278J4203715
35778A29721056J0738322K704148p267721j4594458j6722032j5005603j2407345
$$ plain form
35838 10438435 11127664 10414526 9452836 9512284 9938047 9141536 7293763 6384714 7363676
35829 7363676 8778243 8980219 8394288 8481879 9323035 9609469 8797387 8001171 8479812
35820 8479812 10103002 11742267 12612005 12753586 12559739 12376396 12534129 13335232 14797852
35811 14797852 16532001 17991331 18832563 19034362 18792774 18408938 18207074 18399071 18996567
35802 18996567 19946603 21329280 23247047 25487396 27521534 28988623 30036150 31063470
35794 31063470 32332545 34005208 36284518 39138721 42034375 44424997 46582538 49591111
35786 49591111 54400898 61137531 69373800 78770417 89385950 101599063 115517341 129721056
35778 129721056 140459378 143163526 135895805 121301347 104579315 89573712 77166367
35771G7166367j0336320q454864o573399n254962m658546m066424k974610j872143
35763C2975099j515077j949133k583752k809561k306899j215164k60747k20012
35755B0114754r23406j284883p08505O7974O7357n07705p05330l35646j51225
35746A5633385n65509j047251r75853m14005K14483O39970O96571L07282j83235
35737A4305838j54560M75945J011474Q88334M49563M58042J161979K164923K923458
35728B3684996L102599K789782K647263L460258N196206O941094Q190341R711124
35720F5723663J2390726J5364265J5991190J2019765L772634n671688j2483759
35713A07106796j4780632j3733203j1881699j0441158q812077o546468m471931
$$ plain form
35771 77166367 66830047 58375183 51801784 46546822 41888276 37821852 34847242 32975099
35763 32975099 31460022 29510889 26927137 24117576 21810677 20595513 20334766 20114754
35755 20114754 19191348 17906465 17197960 17265934 17333291 16825586 16120256 15784610 15633385
35746 15633385 15067876 14020625 13044772 12630767 12845250 13485220 14181791 14489073 14305838
35737 14305838 14151278 14627223 15638697 16527031 16976594 17434636 18596615 20761538 23684996
35728 23684996 26787595 29577377 32224640 35684898 40881104 47822198 56012539 65723663
35720 65723663 78114389 93478654 109469844 121489609 125262243 119590555 107106796
35713 107106796 92326164 78592961 66711262 56270104 47458027 40911559 36439628
35706C6439628l300756k429861j230739m63204r57026j709561j076605N51639
35698B5823515J181424L13794l36428L80090J426574J551440J225347J455085
35690C3020841J949619J799924J134004Q07630R45968Q83956K63154o46418j451794
35681C8706884j827900j537991q06208l02478l43758n97402q83396j503355k316576
35672B8587820k405268j370719j40140K82296O7743j84453m92070q47361n43333
35663B2954515O32969J429438P67887l81720l08376Q43207J444753R52305L43735
35654B8678713J55591j31589o53144q05325o10304q79455j659489j986304j585481
35645B0523213j367835j748240j906031j344088q33808j046691j421355j192530
$$ plain form
35706 36439628 33138872 30709011 29478272 29015068 28058042 26348481 25271876 25823515
35698 25823515 27004939 27318733 26982305 27362395 28788969 30340409 31565756 33020841
35690 33020841 34970460 36770384 37904388 38712018 39657986 40541942 40805096 40158678 38706884
35681 38706884 36878984 35340993 34534785 34232307 33888549 33291147 32407751 30904396 28587820
35672 28587820 26182552 24811833 24671693 24953989 25021732 24837279 24345209 23497848 22954515
35663 22954515 23587484 25016922 25784809 25403089 25094713 25937920 27382673 28334978 28678713
35654 28678713 28834304 28702715 28049571 27244246 26633942 25754487 24094998 22108694 20523213
35645 20523213 19155378 17407138 15501107 14157019 13323211 12276520 10855165 9662635
35637I662635n59181j06835N5884N010k69227l88072J72348R66781Q56299j69506
35627A0226136p53391l01480R7161l74428r22511p54600m98262p60789p33173
35618E224663K69369J182641P91599j76554l40096l727k38413n32639L62129J796776
35608H335748J875791O27756R5239R70669J501852M89324p45625n20558P51363
35599A3381559J537436J374978Q38910K49676l82388p16511m19790J75350M54982
35590A6494202K64563j88292p39486j153857j058958m05775L70202Q79869J033067
35581A5495535O92171k23443j111668j008356P8510R25535O53831j66316m65735
35572A4870064o3466M53118O53070M87708N0828l85518m86764l57650m56934p47293
$$ plain form
35637 9662635 9103454 8996619 9052503 9057513 8788286 8400214 8572562 9539343 10395642 10226136
35627 10226136 9472745 9171265 9268426 8893998 7971487 7216887 6718625 5957836 5224663
35618 5224663 5494032 6676673 7468272 7291718 6951622 6947895 6709482 6176843 6538972 8335748
35608 8335748 10211539 10839295 10934534 11905203 13407055 13896379 13150754 12630196 13381559
35599 13381559 14918995 16293973 17132883 17382559 17000171 16283660 15863870 16039220 16494202
35590 16494202 16758765 16570473 15830987 14677130 13618172 13212397 13582599 14462468 15495535
35581 15495535 16187706 15964263 14852595 13844239 13922749 14848284 15502115 15335799 14870064
35572 14870064 14806598 15259716 15912786 16400494 16451322 16065804 15579040 15221390 14764456 14017163
35562A4017163n92458J21834N09770j14576j213454j801130j641008j069740k70172
35553G946229N56847Q63639M00566k36522m29337m52525q02610j100442o09239
35544F136606M55454J107886R74232O21209N30510N40844L80787J11819m2073
35535A0817274J33764P31541J368431J288233L96154k46850K32493J115443J075918
35526A6912401K31855j08424L27528L37443o09574j317293p78023J33199J4690
35517A5143802r42961j467056j210190q97665p83659l45699M39834Q00425M66440
35508A1203271J63062L25828L19169m01039j208743j243985p49895m83132l11272
35499G613264L99481J247529J037039k55137j101761n76570L10973K49325m82563
$$ plain form
35562 14017163 13424705 13546539 14056309 13941733 12728279 10927149 9286141 8216401 7946229
35553 7946229 8503076 9366715 9767281 9530759 9101422 8648897 7846287 6745845 6136606
35544 6136606 6592060 7699946 8674178 9295387 9825897 10366741 10747528 10859347 10817274
35535 10817274 10951038 11682579 13051010 14339243 14735397 14488547 14721040 15836483 16912401
35526 16912401 17144256 17035832 17363360 17700803 17091229 15773936 14995913 15129112 15143802
35517 15143802 14200841 12733785 11523595 10625930 9842271 9496572 9936406 10736831 11203271
35508 11203271 11366333 11692161 12011330 11610291 10401548 9157563 8407668 7924536 7613264
35499 7613264 8012745 9260274 10297313 10042176 8940415 8363845 8674818 8924143 8441580
35490H441580q53573q95599j254031j519352o81419Q82526J563128R16594L13416
35481F913270O67881J071777N59125j77795n6266N02676L54605m25981q12633
35472H596659n68606l10908j05880N58770J403247J347123J69745r70283j089798
35463I030069n28239j38873j60606l38480m74538m15202l5314M24863N06314K43142
35453H113136J72903M49628N97397L80866J97343K68690K00284j81897k85137
35444I913213L24081J035312R42057O9286p82069j071155q21781k66312J93307
35435I535939J4892q23311j467024j149708k45349L09689L15450K07317k3127
35426F674768p12296j403213j088819J31524Q43005L45863k28757K81341J142077
$$ plain form
35490 8441580 7588007 6692408 5438377 3919025 3237606 4120132 5683260 6599854 6913270
35481 6913270 7581151 8652928 9212053 9034258 8977992 9480668 9835273 9409292 8596659
35472 8596659 8028053 7717145 7611265 8170035 9573282 10920405 11090150 10119867 9030069
35463 9030069 8501830 8362957 8202351 7863871 7389333 6974131 6938817 7363680 7869994 8113136
35453 8113136 8286039 8735667 9333064 9713930 9911273 10179963 10380247 10198350 9913213
35444 9913213 10237294 11272606 12214663 12283949 11501880 10430725 9608944 9342632 9535939
35435 9535939 9550831 8727520 7260496 6110788 5865439 6175128 6490578 6697895 6674768
35426 6674768 5962472 4559259 3470440 3601964 4444969 4790832 4562075 4843416 5985493
35417E985493Q56022m05828j005662l33342M13592K48244k07620m3047L97067
35408E904919K96591j50522k06784K4636p0347k46193K63471J089330Q96166m45101
35398G356166j298369o02049N18795N24890k39454l89310J25193J28266n59876
35389E564252o96779L18110J398765J387238N87904k8448k63842n27946q66090
35380F873164r61962p41968l45100J90277O95782P14105J19267m66862m34433
35371E642270p716K44303K88252L38445J38503n69992j169660q15138J37074M69667
35361D696008l6109k97800J71199L71786m11606j163711o77620L38510K47071
35352C237728q23579r89895M89885J964794J779672N95869J87873Q07237J136402
$$ plain form
35417 5985493 6841515 6435687 5430025 5096683 5510275 5758519 5550899 5507852 5904919
35408 5904919 6201510 6050988 5844204 5868840 5798493 5552300 5815771 6905101 7801267 7356166
35398 7356166 6057797 5455748 5974543 6499433 6259979 5870669 5995862 6124128 5564252
35389 5564252 4867473 5185583 6584348 7971586 8559490 8531042 8267200 7739254 6873164
35380 6873164 5911202 5169234 4824134 5014411 5710193 6424298 6543565 6076703 5642270
35371 5642270 5634554 5878857 6167109 6505554 6644057 6074065 4904405 4089267 4226341 4696008
35361 4696008 4659899 4362099 4533298 4905084 4493478 3329767 2652147 2990657 3237728
35352 3237728 2414149 1424254 1914139 3878933 5658605 6254474 6442347 7249584 8385986
35343H385986N40284m3228K79430R35095P15341n25714j640343j526473l16220
35334F804158Q11615Q64364M032p70118q17652m14205n1140K71864O46105O87802
35324H036825J08391m84022k37535O17928J021418O51073K47840K44074J72826
35315A0378818j92593k38196L13255O36955N2666p99408r43452n16394k63670
35306H427981k21346L7364L54923L12536K09872N77618J021400P54215P3883L9354
35296A1587800P37161J173271R82989R33926J456284J940563J929359J836660
35288B2578013J951699J825989J280790J002264J396546J758908J391473P53993
35280C3939675O24655P73911M10958n03710j277906j534918j498421j449929j499698
$$ plain form
35343 8385986 8926270 8883042 9162472 10097567 10812908 10287194 8646851 7120378 6804158
35334 6804158 7615773 8480137 8484169 7714051 6896399 6482194 6431054 6702918 7349023 8036825
35324 8036825 8145216 7661194 7423659 8041587 9063005 9714078 9961918 10205992 10378818
35315 10378818 10186225 9948029 10261284 10898239 10950905 10151497 9208045 8691651 8427981
35306 8427981 8206635 8243999 8598922 8911458 9121330 9698948 10720348 11474563 11548446 11587800
35296 11587800 12324961 13498232 14481221 15415147 16871431 18811994 20741353 22578013
35288 22578013 24529712 26355701 27636491 28638755 30035301 31794209 33185682 33939675
35280 33939675 34564330 35338241 35749199 35245489 33967583 32432665 30934244 29484315 27984617
35271B7984617j654388j616177q70426M85741J396577R63571l97213j516275j879550
35262B2896477j846114j767298j636890j488409j437029j316399q37236j43532
35254A2423570K45833R2709k94544m32411o1425O89724J304864J269901P36068
35245A5974289N29266J185526K258575K936254L083427L317410M241686N797242
35237C9323675P035142O427984L097918j820055n667399o712666n646785m204309
35229C1833505l087699k040104j155519q35967p65510j62506R46993J694103J605732
35220B8033028R98228K18649n43713p52850N3268J203721J382798N12945Q0433
35211C1186507J045675K391500K535397J506245P88626J251119K056663J809065
$$ plain form
35271 27984617 26330229 24714052 23843626 24329367 25725944 26689515 26292302 24776027 22896477
35262 22896477 21050363 19283065 17646175 16157766 14720737 13404338 12567102 12423570
35254 12423570 12669403 12762112 12467568 12035157 11973732 12663456 13968320 15238221 15974289
35245 15974289 16503555 17689081 19947656 22883910 25967337 29284747 33526433 39323675
35237 39323675 46358817 52786801 55884719 54064664 48397265 41684599 36037814 31833505
35229 31833505 28745806 26705702 25550183 24714216 23948706 23786200 24733193 26427296 28033028
35220 28033028 29031256 29249905 28706192 27953342 28006610 29210331 30593129 31106074 31186507
35211 31186507 32232182 34623682 37159079 38665324 39453950 40705069 42761732 44570797
35203D4570797L36918j044741j110538k67311j3869q42476j497411q53659K91219
35194C9568929L16072q97178k018210k381454k597228k981556k886662k079803
35186B4042910j462034j678763k061131j716971q09115k4654M35864O47595N14293
35177A7887994K17280L40655Q82812J002075M82569M64863J753920L412640M282188
35168C0726996M927874O399301P684077O402999K116489k789739n877336o849610
35160D2741051o590613n566889m030261k622322j740828j004539j26870L57366
35152B1416095L482n64246m79708K7086M1600n58914r54878o79159k77500m96506
35142A7477352j316813j990878j811701q28342P4069P220q34003j293592p70451
$$ plain form
35203 44570797 44907715 43862974 42752436 42485125 42471256 41628780 40131369 39277710 39568929
35194 39568929 39885001 38987823 36969613 34588159 31990931 29009375 26122713 24042910
35186 24042910 22580876 20902113 18840982 17124011 16314896 16290242 16726106 17373701 17887994
35177 17887994 18105274 18445929 19328741 20330816 20813385 21278248 23032168 26444808 30726996
35168 30726996 35654870 42054171 49738248 56141247 58257736 55467997 49590661 42741051
35160 42741051 36150438 30583549 26553288 23930966 22190138 21185599 21058729 21416095
35152 21416095 21419577 20855331 20375623 20402709 20444309 19885395 18930517 18251358 17973858 17477352
35142 17477352 16160539 14169661 12357960 11529618 11603687 11610907 10776904 9483312 8712861
35133H712861q2832k20846p65823n31458M70410R17029K11792n59055k97130M70946
35123H325894N08113k57006p70496m17186L97718J048703J194207O14504n11244
35114A0133207j189471n21281P92579R61604m47011j692940j243468Q3978M86728
35105G363925j37984l64232K81796O91710K12247k90203p7149J20529n26149j267152
35095F007338q37436L74040P11134k64095j078409m89582Q53875J517754J132921
35086G927540L60764l00495p40602o71346J56125J209825J501792P87241k09847
35077A0020997q39974j094079j012183l84442N50114Q92419K25378o04767n71549
35068G181914J07631M17815Q6462k11688n0665K52713L96449N08316O18383M56092
$$ plain form
35133 8712861 8630029 8409183 7643360 7111902 7582312 8499341 8711133 8152078 7854948 8325894
35123 8325894 8834007 8577001 7806505 7389319 7787037 8835740 10029947 10644451 10133207
35114 10133207 8943736 8422455 9215034 10176638 9729627 8036687 6793219 6877197 7363925
35105 7363925 7225941 6861709 7143505 7835215 8047462 7757259 7680110 7800639 7274490 6007338
35095 6007338 5169902 5543942 6255076 5990981 4912572 4422990 5276865 6794619 7927540
35086 7927540 8288304 7987809 7247207 6575861 6731986 7941811 9443603 10230844 10020997
35077 10020997 9181023 8086944 7074761 6690319 7240433 8132852 8358230 7753463 7181914
35068 7181914 7289545 7707360 7793822 7582134 7531469 7784182 8180631 8688947 9307330 9763422
35058I763422L4029j88838K2125L88505O70862R26435J068524Q14906K53317j95409
35048A3557878m98129r26805j180043o11848M30038P10511L0069k74871N16119
35039A1752919J273808J012389O57606J276992J852796Q66874p91415q68185O85993
35030A7719777J663278J204307R40201J930406K912472K782600K673294L937679
35022C5764014N773358O748011P454496R620636J3347293J7273938K1099843K5764676
35014A42846265L0776964L3192082L0227298K2019989J1217556O42625q076031
35007B62846748j4424475j8667214k1564457k3725492k4976272k4612027k2388597
35000A12488214j9019209j5505904j2241292r169187o624670n238874m822851
$$ plain form
35058 9763422 9797451 9608613 9630738 10019243 10690105 11616540 12685064 13499970 13753287 13557878
35048 13557878 13059749 12132944 10952901 10341053 10771091 11481602 11511671 11236800 11752919
35039 11752919 13026727 14039116 14696722 15973714 17826510 18693384 17901969 17033784 17719777
35030 17719777 19383055 20587362 21527563 23457969 26370441 29153041 31826335 35764014
35022 35764014 41537372 48285383 55739879 65360515 78707808 95981746 117081589 142846265
35014 142846265 173623229 206815311 237042609 259062598 270280154 270922779 262846748
35007 262846748 248422273 229755059 208190602 184465110 159488838 134876811 112488214
35000 112488214 93469005 77963101 65721809 56552622 49927952 44689078 39866227
34993C9866227m244484l012399k115216k360746k755044j942770n94745m95284
34985B2345539j512158j663494m42999L23981k14865k58758J429459K863335J704318
34976B4574358q22461j575601j46203Q92304N9884j363088j922529j804700j504184
34967A6387780q14069O2464J98004m32850o12458O2611M06230j90869m97951M44722
34957A5013614J485485J170953J99532L23655J567982K342113K036506J843419
34949B5983259K856988M687859O346475P572884Q874520J0843668J3793964J7753620
34941I8713237K2554699K7835165L2643709L4983687L2499990K4412730J2647899
34934B86291116N65710r358294j6475760k1270119k4451085k6473514k7264764
$$ plain form
34993 39866227 35621743 32609344 30494128 28133382 25378338 23435568 22840823 22345539
34985 22345539 20833381 19169887 18726888 19050869 18836004 18577246 20006705 22870040 24574358
34976 24574358 23751897 22176296 22030093 22922397 22982281 21619193 19696664 17891964 16387780
34967 16387780 15573711 15636175 15834179 15401329 14788871 14851482 15257712 15066843 14568892 15013614
34957 15013614 16499099 17670052 17869584 18193239 19761221 22103334 24139840 25983259
34949 25983259 28840247 33528106 39874581 47447465 56321985 67165653 80959617 98713237
34941 98713237 121267936 149103101 181746810 216730497 249230487 273643217 286291116
34934 286291116 286856826 277498532 261022772 239752653 215301568 188828054 161563290
34927A61563290k6392814k3766863j9962058j5699748j1505926q091842o241282
34920D9902757n743311n257223m029998k947457k923567l149797k332183r52221
34912B2567000n52477j133718j212481m92741l78332j296990j599646k21708J342991
34903A7021898J205834j49874r04501o65931m42007n71643n37097m87678j096654
34894A3372347j899115j554643j07187O37352l71806j880486k089594q97281M42434
34885E652021J013257P22528j78361j127962j292196m31136N70071P29736K20160
34876E878118o5724J36512L00240R7501k05879l21433k72924j17515J60951M30470
34866F020317M77686L00284K9390l16732o69100p11657k85545K06356K77210L8052
$$ plain form
34927 161563290 135170476 111403613 91441555 75741807 64235881 56144039 49902757
34920 49902757 44159446 38902223 34872225 31924768 29001201 25851404 23519221 22567000
34912 22567000 22014523 20880805 19668324 19175583 18797251 17500261 15900615 15678907 17021898
34903 17021898 18227732 18077858 17173357 16507426 16065419 15493776 14956679 14469001 13372347
34894 13372347 11473232 9918589 9811402 10448754 10076948 8196462 6106868 5209587 5652021
34885 5652021 6665278 7387806 7209445 6081483 4789287 4358151 4928222 5657958 5878118
34876 5878118 5812394 5948906 6249146 6346647 6140768 5819335 5546411 5428896 5589847 6020317
34866 6020317 6498003 6798287 6827677 6510945 5841845 5130188 4844643 5050999 5328209 5366261
34856E366261j14630k30525n39749o67745r283J078871J385541M41317p67361
34847E942697j064520m10997M14413Q02948N32865l42173j227425j189718j28433
34838C329657P45686L98873m95344n13178L08195M91554m93930j230993m69525
34829B070995Q84561J091013J79938k66005K61226M84927k72573o62158N16248
34820D288172J960762J477705o28746j775984p91861O06856O69399M4439J15170
34811E965912M97257k1959j061225j143357j74149M69011K28558n4083K2153k03523
34801D524595q17977q14719O8089N86002L7989l66801N51567J823031J653351
34792G245127J06291j082104r90407l72170j21936j88537k12879k07550k43713
$$ plain form
34856 5366261 5251631 5021106 4481357 3813612 3804329 4883200 6268741 6710058 5942697
34847 5942697 4878177 4467180 4881593 5684541 6217406 5875233 4647808 3458090 3329657
34838 3329657 4075343 4474216 3978872 3465694 3773889 4265443 3771513 2540520 2070995
34829 2070995 2955556 4046569 4226507 3960502 4221728 4706655 4434082 3771924 4288172
34820 4288172 6248934 7726639 7097893 5321909 4530048 5136904 5806303 5850742 5965912
34811 5965912 6463169 6441210 5379985 4236628 4062479 4531490 4760048 4705965 4728118 4524595
34801 4524595 3706618 2891899 2959988 3545990 3583979 3217178 3768745 5591776 7245127
34792 7245127 7351418 6269314 5278907 4906737 4784801 4596264 4383385 4175835 3932122
34783C932122j58066J23243M12220N28083L74565j67854r46192j256495n06640
34774B334986Q02450J401967P64317k50940n47673j25540J83544L3735N793N80908
34764E183547J178130P91617m86367j278000o30063O50716J030072K43506n72563
34755F110595n78962j14827J87981K20356O3826k84240n06109j12415O13931O70230
34745F270366j83835q49578m21091M87438O85778L3455o49813p90379m48204R2403
34735D226540M80657M00778L602j68881k8967j01671m91016n19198O8659M32217
34725D302720j03962r23457j035806l98906L89848R37528R18580O4991r35691
34716C215845o83237Q11560J528193K61511j274121q92707O55320Q70459n91422
$$ plain form
34783 3932122 3774056 3897299 4309519 4837602 5212167 5044313 4098121 2841626 2334986
34774 2334986 3137436 4539403 5303720 5052780 4505107 4379567 4563111 4596846 4602639 5183547
34764 5183547 6361677 7153294 6666927 5388927 4758864 5409580 6439652 6683158 6110595
34755 6110595 5531633 5416806 5604787 5825143 5888969 5604729 5098620 4986205 5600136 6270366
34745 6270366 6086531 5236953 4815862 5303300 5989078 6022533 5372720 4582341 4134137 4226540
34735 4226540 4707197 5107975 5111577 4942696 4913729 4812058 4321042 3801844 3870503 4302720
34725 4302720 4198758 3275301 2239495 1840589 2230437 3167965 4086545 4151536 3215845
34716 3215845 2532608 3344168 4872361 5133872 3859751 2967044 3622364 4492823 3901401
34707C901401j535182o44030Q65816J331482O49605k60681o87056m55924J0384
34698C175815o5119p28381r06254q0509M89049l46678j430339r05297P20606J353611
34688A276504O62248J96858M05587J71246n78972n09150M52254P03263j44756
34679B635082n39841J23259N13159J42420L83857J511918J532629m06069k068330
34670C828084j529870j29368R2102l45622k5749M61252r1284q43596l40132O71251
34660A747068M89358n07865o47859Q1944L56775M4931j4139m9633p17481j102483
34650c19384L5462J573023J344999j87455n10786P38320J220011j4599r41335
34641B938256j11736R73000N46845o13028q24236k44213j43904n87062n73773
$$ plain form
34707 3901401 2366219 1722189 2588005 3919487 4569092 4308411 3621355 3165431 3175815
34698 3175815 3110696 2382315 1476061 1395552 1884601 1537923 107584 -797713 -77107 1276504
34688 1276504 1938752 2135610 2541197 2712443 2133471 1624321 2076575 2779838 2635082
34679 2635082 2095241 2218500 2731659 2874079 3257936 4769854 6302483 5896414 3828084
34670 3828084 2298214 2168846 2260948 1915326 1889577 2350829 2259545 1415949 1075817 1747068
34660 1747068 2236426 1728561 1080702 1162646 1519421 1564352 1550213 1500580 783099 -319384
34650 -319384 -283922 1289101 2634100 2446645 1935859 2674179 3894190 3879591 2938256
34641 2938256 2826520 3799520 4346365 3733337 2909101 2664888 2520984 1933922 1360149
34632A360149J22516O93973O03840J32151k46043l52082k65579j66603j24434
34623A757888M49K22123K05709j82315m28960j15428K81411J26784k52179j37371
34613A478111L21655N03869N01858O62625M63922o34193j669962j284002k2217
34604C21666M44294J65881O30802J597096J006746j211099k154412k90065J804263
34595B315172J171939j119283j840924m19042Q63615P27425K35740L28587M31488
34586B694717L2385k32379J59405N77089K38286n76818r20454l26669P24910J200003
34576C570475M36841r54377j444845l93567R38727R61951j02512o90617k08527
34567B113549L65636J99049l33109n98901o05033m76795j1747O82255R29329M70221
$$ plain form
34632 1360149 1482665 2176638 2780478 2912629 2666586 2314504 2048925 1882322 1757888
34623 1757888 1758337 1980460 2186169 2003854 1574894 1459466 1740877 1867661 1615482 1478111
34613 1478111 1799766 2303635 2805493 3468118 3932040 3297847 1627885 343883 321666
34604 321666 765960 931841 1562643 3159739 4166485 2955386 800974 510909 2315172
34595 2315172 3487111 2367828 526904 107862 971477 1698902 1934642 2263229 2694717
34586 2694717 2727102 2494723 2654128 3231217 3469503 2892685 1972231 1645562 2370472 3570475
34576 3570475 4007316 3052939 1608094 1214527 2153254 3115205 3012693 2322076 2113549
34567 2113549 2479185 2678234 2345125 1746224 1141191 664396 652649 1334904 2264233 2734454
34557B734454l2447r6172k59954j011737j574238q72618O50603J389792P35544
34548A663227k37066m45278q5383K04651M42052P85300P33879j27613j050730
34539A883039q94223J71736P86264K97026m53034n03951l5808K16835Q9019m0246
34529A516657N9570K60603K64303j83168q54171q46057L99650J812746J539314
34520C969447m92441k039481j372577M70300J323189P64886k5496m67252r15183
34511A215392j157591l98366J053583J623696N36006j072348j617092q09698M46364
34502a80054J149090Q55988r7763p71124n30641J39955K89036j71890n15441m09192
34492b42036j65233J27752O87926J215454J032859J93363n24896q15578r99279
$$ plain form
34557 2734454 2702007 2605835 2345881 1334144 -240094 -1112712 -462109 927683 1663227
34548 1663227 1426161 980883 895500 1100151 1542203 2327503 3061382 2933769 1883039
34539 1883039 988816 1160552 1946816 2243842 1790808 1286857 1251049 1467884 1556903 1516657
34529 1516657 1576227 1836830 2101133 1917965 1063794 217737 617387 2430133 3969447
34520 3969447 3477006 1437525 64948 535248 1858437 2623323 2597827 2130575 1215392
34511 1215392 57801 -340565 713018 2336714 2872720 1800372 183280 -626418 -180054
34502 -180054 969036 1825024 1727261 956137 425496 565451 854487 682597 167156 -242036
34492 -242036 -407269 -279517 408409 1623863 2656722 2850085 2325189 1509611 510332
34483E10332r55207j58758J002488J287984M03778n15388o86832o23776p23791
34474d59170l56846P26909J397706P27535m66479q67603n57829m02946l26473
34465e85196L38982J234152J209803J44532p31207n22946K63886N97668J60965
34456B110639n25766p54829k47743N86962R83941N92262j88919p42482q04592
34447A009473l96468L21352Q61320O21017k83742q53016l59836O66099J062157
34438B648356L88241o78451j072863k92261J049957J559254M63291j264513j859451
34429I41560r19786K49984N85531M28663L46271P1124n38031o32475L51030J379231
34419B263102J069181k79872j133915q57905k10973J03992K18498L70493L84523
$$ plain form
34483 510332 -444875 -603633 398855 1686839 2090617 1575229 888397 264621 -459170
34474 -459170 -816016 -89107 1308599 2036134 1569655 702052 144223 -258723 -585196
34465 -585196 -246214 987938 2197741 2342273 1611066 1088120 1352006 1949674 2110639
34456 2110639 1584873 830044 582301 1169263 2153204 2745466 2556547 1814065 1009473
34447 1009473 613005 934357 1795677 2416694 2132952 1279936 920100 1586199 2648356
34438 2648356 3036597 2358146 1285283 993022 2042979 3602233 4065524 2801011 941560
34429 941560 21774 271758 857289 1285952 1632223 1703347 1165316 532841 883871 2263102
34419 2263102 3332283 3052411 1918496 1060591 849618 953610 1172108 1542601 1927124
34410A927124J09496k84094o02143p77945p39690n06615k80389j02983K87739
34401i69500Q74553J037156L48010o42225r71208l74791N87790J187300R48173
34392B025258q8802j095256j006001J60386J117812R48046K11551j53398j79115
34383A940481l02830l16161P9152M01930K08758R3381O17986R15577j12806j640452
34373A885016j687303l9696J272789P78772o01442j134283n39013J15572P1826
34364A22238l32672l40395J92860N63569J60579m70532k03921Q19213J021360
34355A532299j97999j130594k06270J312488J018658q70243j693924l20255J308432
34346G52592J186317j48730r46821o22479K36448J013295J227605N41750n53674
$$ plain form
34410 1927124 2036620 1752526 1150383 372438 -367252 -873867 -1154256 -1257239 -969500
34401 -969500 -94947 942209 1290219 647994 -323214 -698005 -110215 1077085 2025258
34392 2025258 1936456 841200 -164801 -4415 1113397 2061443 2272994 2119596 1940481
34383 1940481 1637651 1321490 1400642 1802572 2011330 2104711 2722697 3638274 3525468 1885016
34373 1885016 197713 158017 1430806 2209578 1608136 473853 -65160 50412 122238
34364 122238 -210434 -550829 -357969 205600 366179 -104353 -308274 510939 1532299
34355 1532299 1334300 203706 -2564 1309924 2328582 1458339 -235585 -555840 752592
34346 752592 1938909 1790179 843358 220879 457327 1470622 2698227 3239977 2686303
34337B686303r53904n02019l09737q52395r89885J28374J390561J289913K47551
34328B134762j47401L54190N10316k24353q97815p16029k33070l00012o89007
34319b08419n16224L42180R48381M99638n58882r66212k07042P53752O96699j59245
34309F24626m10661N26585J508165J213875p4294r67202q43864m13639m71494
34300F92097q40329q08331j57770O09616R22957P27444L79327J41272l0055k21248
34290A414980l41175l04371k22759j91976p2759K23377L87187L2806o64982j014729
34280g54401n73820L46927J001758R17615L02829j86636j60428P5569L1169j54461
34270H46121O9897O43323Q12502K86969l08956m83418n14625n74091k16809N42334
$$ plain form
34337 2686303 1732399 1230380 920643 68248 -921637 -793263 597298 1887211 2134762
34328 2134762 1987361 2341551 2851867 2627514 1729699 1013670 780600 480588 -208419
34319 -208419 -724643 -382463 565918 1065556 506674 -459538 -666580 87172 783871 624626
34309 624626 213965 740550 2248715 3462590 3388296 2421094 1577230 1163591 692097
34300 692097 -148232 -956563 -1114333 -504717 418240 1145684 1525011 1666283 1636228 1414980
34290 1414980 1073805 769434 546675 354699 281940 505317 892504 925310 260328 -754401
34280 -754401 -1328221 -981294 20464 938079 1240908 1054272 893844 969413 1000582 846121
34270 846121 916018 1559341 2371843 2658812 2349856 1866438 1351813 777722 560913 1103247
34260A103247P12318j20670p72167k47940M61675l8481j050202q08671N34700
34251b26191J113808L90439k11123P4154K75395k18652n48674j90722J2251l87901
34241H2784m13276M42228R16024k7000j278881j200469p8188N68713L25090K5035
34231f37940J19571K82791L22087L37552K09373j86192n33014n31840l73753j98760
34221a190125K56587Q65416Q18759q8375p70437l69662M32469O39799N29118P85152
34211A908701R57665K77644o60738o49330J09047L15989l02201p42303n32689
34202F81785k89065l53444k77568J03506L46523M05501P46235J150888O53508
34193C167869q11109j815567j226739K44851J041225P11345J11522l316J58578
$$ plain form
34260 1103247 1815565 1694895 922728 674788 1136463 1097982 47780 -760891 -226191
34251 -226191 887617 1278056 1066933 1141087 1416482 1197830 649156 458434 470685 82784
34241 82784 -330492 111736 1027760 1000760 -278121 -1478590 -1556778 -988065 -662975 -637940
34231 -637940 -518369 -235578 86509 424061 633434 447242 -85772 -617612 -991365 -1190125
34221 -1190125 -933538 -68122 750637 662262 -108175 -477837 -45368 594431 1123549 1908701
34211 1908701 2866366 3144010 2483272 1833942 1942989 2258978 1956777 1214474 681785
34202 681785 392720 39276 -238292 -134786 211737 617238 1363473 2514361 3167869
34193 3167869 2356760 541193 -685546 -440695 600530 1311875 1423397 1420081 1578659
34184A578659Q867m60192o05722J233R03462J250594Q55707K81083j08778m68316
34174C236597o95845k80492N93025P80117j79441j073823p25784J40833N2092
34165A847279q37729j060218k10065O00924O75486N60545O53416M05336n06706
34156B128268j322571j178046k06249P97471J200369P75888j96973q63133m96994
34147F38030N38429J160342R25501L05574l16047r66336j359579r33524J23911
34138A16301Q53762Q24670N39857L30926j00611p12795q25737l04450L2563k11461
34128E43025k86942L18121Q02093L04923o07549p80278j88478K34739R1015j51098
34118B79571r4876J59128M04788M90301K42344k27083l87220J1677M29110K92012
$$ plain form
34184 1578659 1587526 1127334 521612 522845 1426307 2676901 3532608 3813691 3704913 3236597
34174 3236597 2540752 2260260 2853285 3633402 3453961 2380138 1654354 1795187 1847279
34165 1847279 1009550 -50668 -260733 340191 1015677 1576222 2229638 2634974 2128268
34156 2128268 805697 -372349 -578598 218873 1419242 2195130 1998157 1135024 638030
34147 638030 1176459 2336801 3262302 3567876 3251829 2285493 925914 -7610 116301
34138 116301 970063 1794733 2334590 2665516 2564905 1852110 1026373 721923 754486 543025
34128 543025 256083 574204 1376297 1681220 1073671 293393 104915 339654 430669 279571
34118 279571 184695 343823 748611 1238912 1481256 1254173 866953 878630 1307740 1599752
34108A599752j13337j73005q91j54741n44638n25691l2296K63808N9297j21652
34098B56606J47499M98789L97490n2737l67962l61647j29223L15370Q65123J001120
34088B570428L01755p04509q78778L6052Q79578N75449l59093o38149j83626r3662
34078A505445n99282m82086Q06711J777436Q96294r63180j600375n67597M51091
34069A224457K88216k98104k33253K83299M94559L33432J81704J01941l7326j74886
34059B164039k29087k20753n7506K55864K41030l94573q43178j30883J030698
34050A815651Q67845o60810j469721n03704N75506J32277p86097l57410Q70667
34041D84204R75817q9641o37566k50448k30679r33329r85464K09041J230757Q89649
$$ plain form
34108 1599752 1486415 1313410 1312519 1157778 613140 87449 55153 318961 378258 256606
34098 256606 404105 902894 1300384 1247647 879685 518038 388815 704185 1569308 2570428
34088 2570428 2872183 2167674 1288896 1324948 2204526 2779975 2420882 1782733 1599107 1505445
34078 1505445 906163 424077 1230788 3008224 3904518 2941338 1340963 773366 1224457
34069 1224457 1512673 1214569 981316 1264615 1759174 2092606 2274310 2376251 2338925 2164039
34059 2164039 1934952 1714199 1656693 1912557 2153587 1759014 915836 784953 1815651
34050 1815651 2683496 2022686 552965 49261 624767 757044 -29053 -386463 484204
34041 484204 1460021 1370380 732814 482366 251687 -681642 -1667106 -1458065 -227308 662341
34031F62341M0510j3528M04007J97106n05028o00655J76206R06457Q54862L02413
34021B424691n2587N9593L36681L05691j57644o28310o06427j97944O954k28828
34011A261870n08652m65635k32296o8555J9389P3327K5505l9938J17067M43066
34001F25148N70694M26072L67326N00700M08648j00571m85975j79303N55847R18913
33991C607499N11016l55496j092502j307870r96957m57815O0580N76418J038544
33982A583417J024317L05902m76837m84360K9129L1101n58748n77011M83014J396552
33972B756476Q63701o06100j424343r62865M1774O84590O49753J09164m10893
33963A701257l73349K3810m2974o72006q28542k2594O39337K03462l85965J54950
$$ plain form
34031 662341 702851 689323 1093330 1290436 785408 184753 360959 1267416 2122278 2424691
34021 2424691 2372104 2431697 2768378 3074069 2916425 2288115 1681688 1483744 1490698 1261870
34011 1261870 753218 287583 55287 -13268 6121 79448 104953 65015 182082 625148
34001 625148 1195842 1621914 1989240 2489940 2898588 2798017 2312042 2132739 2688586 3607499
33991 3607499 4118515 3763019 2670517 1362647 365690 -92125 -31545 544873 1583417
33982 1583417 2607734 2913636 2436799 1952439 1981568 2012669 1453921 876910 1359924 2756476
33972 2756476 3620177 3014077 1589734 626869 668643 1353233 2002986 2112150 1701257
33963 1701257 1327908 1351718 1308744 636738 -191804 -214398 424939 628401 242436 397386
33953C97386J060505O76146n70614o95333M41387P86282l65809j024742J72536
33944H77744J571641J099940n29456j152889m33002J95675N1902k36032k81499
33935A164024l62447m75270l23871n5415J01373M86867J159908J097014k86130
33926B506053j502617p36443J197823J707470J65219j352723j331904o21666l30244
33917b99032q0191N43381P17186l0580n21197K18797J084231N57229p54987j039443
33907C95394p3770P03744N99706L84499N64052N24789j88552r46975r31952j82557
33897H48378O49112J026652P76325R7327m98063o23061m38796l33826l19858j42777
33887A041413J81140L92344L99885K63658k0907l32617l26971M1715K75851Q4906
$$ plain form
33953 397386 1457891 2134037 1563423 868090 1309477 2095759 1729950 705208 877744
33944 877744 2449385 3549325 3019869 1866980 1433978 1629653 1681555 1445523 1164024
33935 1164024 801577 326307 2436 -52979 48394 535261 1695169 2792183 2506053
33926 2506053 1003436 266993 1464816 3172286 3337505 1984782 652878 31212 -299032
33917 -299032 -379223 164158 881344 850764 329567 548364 1632595 2189824 1434837 395394
33907 395394 321624 1025368 1625074 2009573 2573625 3098414 2909862 1962887 1030935 848378
33897 848378 1497490 2524142 3300467 3397794 2899731 2276670 1837874 1504048 1184190 1041413
33887 1041413 1222553 1614897 2014782 2278440 2257533 1924916 1597945 1639660 1915511 2000417
33877B000417q4180J64554L94741P4598m24069m24951q4700R879n0852J60591
33867A736028L53531k2607n62242m19038J52353J31204m61227n38727J68552P06341
33857A244168O35240O52697J023197R21489M2805n70793k22050J92257l38023
33848C580987j279659j464221p59327K02657J120941J791000J584885L48296q05678
33839D319881p45566J43097P08926P28569O93293M75497l98189j413620j413544
33830C098344l27655O18405N80962J185l37216k78902r2431L8830J17351L11357
33820C730230P51898J041204M40385q93874j530071n36559R84353J306969M95608
33811E790143o510J84523O4035o87129j086103o42975j01212J26369O16302J348757
$$ plain form
33877 2000417 1916237 2080791 2475532 2550130 2126061 1701110 1616410 1626289 1575437 1736028
33867 1736028 2089559 2066952 1504710 1085672 1238025 1369229 908002 369275 537827 1244168
33857 1244168 1879408 2532105 3555302 4476791 4519596 3948803 3726753 3919010 3580987
33848 3580987 2301328 837107 77780 280437 1401378 3192378 4777263 5125559 4319881
33839 4319881 3574315 3717412 4426338 5154907 5848200 6323697 5925508 4511888 3098344
33830 3098344 2770689 3389094 3970056 3971241 3634025 3355123 3262692 3301522 3418873 3730230
33820 3730230 4482128 5523332 5963717 5069843 3539772 3003213 3987566 5294535 5790143
33811 5790143 5783633 5968156 6032191 5345062 4258959 3615984 3514772 3641141 4257443 5606200
33801E606200J164352j85718j065772l65716N59327q113j316159j363497j27808
33792B897096N84926J77107p7842M27928N95500j93800p43663j1839J075125J127895
33782E858433N03733M86916R84216P16061m91510j238718o93079J75124J86009
33773F487185k73214m9999Q10368J054148J30804q72101o18215P24796J670055
33764I063827J179963j91107j002840n37099M97218Q84728L76181m4638M95893
33755A0722126J494373J678726Q08067J05296N09319J191028O56823r85209j932903
33746A4247646j064320N61147J164878M94035k40676k64910o2371k69219o93826
33737A3872384q47132p81186q42200r99316r77025p84235n59694j13854P19149
$$ plain form
33801 5606200 6770552 6584834 5519062 5153346 5712673 5704560 4388401 3024904 2897096
33792 2897096 3482022 3659129 3581287 4009215 4604715 4410915 3667252 3655413 4730538 5858433
33782 5858433 6362166 6849082 7833298 8549359 8057849 6819131 6126052 6301176 6487185
33773 6487185 6213971 6163972 6974340 8028488 8159292 7287191 6668976 7393772 9063827
33764 9063827 10243790 10052683 9049843 8512744 9009962 9894690 10270871 10226233 10722126
33755 10722126 12216499 13895225 14703292 14808588 15317907 16508935 17165758 16180549 14247646
33746 14247646 13183326 13744473 14909351 15403386 15162710 14897800 14835429 14566210 13872384
33737 13872384 13025252 12244066 11401866 10402550 9425525 8641290 8081596 7967742 8686891
33728H686891J373769R89441k71742j114021p39731O3065P0572o73548j105640
33719G279056p66445k36980J4934K70471P75452J128303R10148L44626j29223
33710I590342m62987p33007p31674l47072J0968r8918m91518o48847m05895P7482
33700E758874O76215J135098R43155J0310q67025r19584m73564l31695m37422
33691E494362j68254K66792q990q71110j011952J01025J265483J238490L85145
33682F690991j87847k69285l49655m81972l84953k19781k77448k65871J50095
33673D404274M89398J62465l20771j9935P98382R88674M20673J42173N07697O30584
33663H203614J09228k13140R8710J63170m79151o93644K71691R56513k65870k211613
$$ plain form
33728 8686891 10060660 11050101 10778359 9664338 8924607 8987672 9058244 8384696 7279056
33719 7279056 6512611 6275631 6290565 6561036 7336488 8464791 9374939 9719565 9590342
33710 9590342 9127355 8394348 7662674 7315602 7326570 7227652 6736134 6087287 5681392 5758874
33700 5758874 6435089 7570187 8513342 8523652 7656627 6737043 6263479 5931784 5494362
33691 5494362 5326108 5592900 5583910 4712800 3700848 3801873 5067356 6305846 6690991
33682 6690991 6503144 6233859 5884204 5402232 5017279 4797498 4520050 4254179 4404274
33673 4404274 4893672 5056137 4735366 4715431 5513813 6502487 6923160 7065333 7573030 8203614
33663 8203614 8312842 8099702 8198412 8361582 7882431 7188787 7460478 8416991 8151121 5939508
33653E939508k216314j44894J309733O51496m38371q3081R48877R31753Q2653
33644F981360j56101K92210L06888j78590j20630N04637M74679m25732p52367
33635F926354K28093J096730L66720j150360j434177o7397J370348J493172N56389
33626I385872l37720n81298l46629p3795M0349J64056M19433M11517l30196j290251
33616G461338j157941L40110J611947J167467k40348p00183N6341M77844k22475
33607H794100r96076r17460n80810o52660m79041N67853J472286R01731n08599
33598G601324q80939J42160J007421O93009p0675m06605n60626q19577n60546
33589F144946N18083J328868Q94381Q5903L23838J087174N60494j258581k098474
$$ plain form
33653 5939508 3723194 3578300 4888033 5539529 5101158 5018077 5966954 6898707 6981360
33644 6981360 6825259 7117469 7424357 7245767 7125137 7629774 8104453 7678721 6926354
33635 6926354 7154447 8251177 8617897 7467537 6033360 5965963 7336311 8829483 9385872
33626 9385872 9048152 8466854 8120225 8046430 8086779 8250835 8670268 9081785 8751589 7461338
33616 7461338 6303397 6643507 8255454 9422921 9182573 8482390 8538731 9016575 8794100
33607 8794100 7798024 6880564 6299754 5647094 5168053 5735906 7208192 8109923 7601324
33598 7601324 6720385 6862545 7869966 8562975 8492300 8085695 7525069 6705492 6144946
33589 6144946 6663029 7991897 8886278 8972181 9296019 10383193 10943687 9685106 7586632
33580G586632p51295R33628P24736o91169r07161M46554J259488L14527r38529
33571G977411p94741J62508K65924n55065q90702k07951M75896L66656j5011K4343
33561F809268J94010p2111m80187l08261L63226O59209J38830o04658p54377k65749
33551E679200K36180L42457K73045L45268L79366J4554n10076m73281K28535O99833
33541G215081K60382m84025n38047q3289j15765o53024n56911N44621J380562
33532F969585P98914n61867j270514j034229o25160m25159j52978K33406M13709
33523D345707L91880M15457L33230p7844l13777K83560J199101J136941r0590
33514G623665j176215j122040l59346L21827Q50591J295265J247197N66403q1955
$$ plain form
33580 7586632 6835337 7768965 8493701 7802532 6895371 7341925 8601413 8915940 7977411
33571 7977411 7182670 7345178 7611102 7056037 6165335 5957384 6433280 6799936 6784925 6809268
33561 6809268 7003278 6931167 6450980 6142719 6505945 7165154 7303984 6699326 5944949 5679200
33551 5679200 5915380 6257837 6530882 6876150 7255516 7270070 6759994 6286713 6515248 7215081
33541 7215081 7475463 6991438 6453391 6370102 6254337 5601313 5044402 5589023 6969585
33532 6969585 7768499 7206632 5936118 4901889 4276729 3851570 3698592 3931998 4345707
33523 4345707 4737587 5153044 5486274 5408430 5094653 5378213 6577314 7714255 7623665
33514 7623665 6447450 5325410 4966064 5287891 6138482 7433747 8680944 9247347 9165392
33505I165392j93278j70845m00371m29882P7994M39764L4333m87912k51294L00895
33495H084796K45764n3618M09339J265195J131896n0485p89191l74672K23881
33486A0092905K25980J63669M77412N40905j7238l92042j9775L15169j06453n66148
33476A0714384j94364L81224O0031q53477j209905q31867l91494k1550N45358
33467H198340R24199O01534R7636J47784J90989o51784j518882p74459J048904
33458H264261J549426J11675j025408k61600R65366O78692n75169r67105l54527
33449H385611k8369k86113k07654M34998P42825K12403o00057j017395q52934
33440F783315j64871O69631Q33709J4289p67845l61799P00784Q60098p8634o37866
$$ plain form
33505 9165392 8972114 8801269 8400898 7971016 8049010 8488774 8523107 8035195 7783901 8084796
33495 8084796 8330560 8276942 8686281 9951476 11083372 11032887 10243696 9869024 10092905
33486 10092905 10318885 10482554 10959966 11500871 11483633 11091591 11071816 11386985 11280532 10714384
33476 10714384 10520020 10901244 10961275 10107798 8897893 8066026 7674532 7652982 8198340
33467 8198340 9122539 9724073 9821709 9969493 10160482 9508698 7989816 7215357 8264261
33458 8264261 9813687 9925362 8899954 8638354 9603720 10282412 9707243 8740138 8385611
33449 8385611 8357242 8071129 7863475 8298473 9041298 9253701 8653644 7636249 6783315
33440 6783315 6618444 7288075 8121784 8136073 7368228 7006429 7707213 8567311 8488677 7850811
33430G850811j2598O96615K42600r33946j507398j107166m30898J7695M32669
33421E248384J051289J593923J464089L59885j231177k185542j732009l33778
33413D235064P73421R22342M63404m4908m20832n43452k12924L50767N17127J40243
33403F180252j31390J55783N33683L61887k10057n79763n67700l88782r9888L44300
33393E598325P34329Q17915O50296L28970k61976r55020j002263l639J187068
33384G094005J335348M66580k43897k08754r4706n14283r93210p97656r9649L70747
33374F314525M12101M14100N76356P08390P19073P20891O30014K07191l74492
33365A0328149n03841N5761P10046P46183K40687j57794j99868k77808o32248
$$ plain form
33430 7850811 7838213 8534828 8777428 7843482 6336084 5228918 4798020 4815715 5248384
33421 5248384 6299673 7893596 9357685 9717570 8486393 6300851 4568842 4235064
33413 4235064 5008485 5930827 6394231 6349323 5928491 5385039 5172115 5522882 6040009 6180252
33403 6180252 6048862 6204645 6738328 7100215 6890158 6310395 5742695 5353913 5254025 5598325
33393 5598325 6332654 7150569 7800865 8129835 7867859 6912839 5910576 5906937 7094005
33384 7094005 8429353 8895933 8652036 8443282 8348576 7834293 6841083 6043427 5943778 6314525
33374 6314525 6726626 7140726 7717082 8425472 9144545 9865436 10495450 10702641 10328149
33365 10328149 9824308 9880069 10590115 11336298 11576985 11419191 11219323 10941515 10309267
33356A0309267q33376m03738L47159N80129k9089q95143j233650q36794m1507
33347F963258P19125J099364Q83673K31491k45654m2239N86800Q50093L71931
33338A1417842l62995o38429l27363R1366J38441k45964p39993q94623m72410
33329G965872K60665O86194M73640o0244m38486o39357q60432r13007m63034J89727
33319F201538L19124q5469j82250L50034O48215L8825p10188m97498L31641N37362
33309F951334J0147j47274M14089P15903K54947l6321N85429J293659R81638J9653
33299A1043204m32061k12855q4596l08819m62999m17168m10352l18330J39203
33290H535227N99814M69862L713p3610J01709k33221r02738q05934K15903Q61425
$$ plain form
33356 10309267 9475891 9072153 9419312 9999441 9970352 9075209 7841559 7004765 6963258
33347 6963258 7682383 8781747 9665420 9896911 9651257 9609018 10195818 11045911 11417842
33338 11417842 11054847 10416418 10089055 10180421 10318862 10072898 9332905 8438282 7965872
33329 7965872 8226537 8912731 9386371 9326127 8887641 8248284 7387852 6474845 6011811 6201538
33319 6201538 6520662 6435193 6252943 6602977 7251192 7290017 6579829 6082331 6413972 6951334
33309 6951334 6961481 6814207 7228296 7944199 8199146 8162825 8748254 10041913 11023551 11043204
33299 11043204 10611143 10398288 10313692 10004873 9541874 9124706 8714354 8396024 8535227
33290 8535227 9135041 9604903 9608616 9535006 9636715 9403494 8500756 7694822 7910725 8772150
33280H772150L10669m91434k95687O58322J225060J009644M84421m8403o32788
33271A0991954j024841p65099O1840P28549O56107J5401m96745l70551J57034
33262I953649L11870k00499n87100M3941J212980J468350M04785p01328o94852
33253A1211796j1140K99306R8244j60211m95050j066845j320387o28300M69935
33244H397348P86924J66828l85128k76512j0682r5465k27207J745L15174K22869
33234H895894j74171l64470j78646O2021Q3114L3069K23618O06743P00606J90977
33224A0078755n15559o81317j95098K87617K85119P1604P0289J98405K07525J77283
33214I984623J97054K9981l76334n32410j81160Q0327k54618m93563L87340J957559
$$ plain form
33280 8772150 9082819 8591385 8295698 8954020 10179080 11188724 11673145 11624742 10991954
33271 10991954 9967113 9202014 9263854 9992403 10648510 10663911 10167166 9796615 9953649
33262 9953649 10265519 10065020 9477920 9521861 10734841 12203191 12607976 11906648 11211796
33253 11211796 11200656 11499962 11598206 11437995 10942945 9876100 8555713 7927413 8397348
33244 8397348 9184272 9351100 8965972 8689460 8678778 8583313 8356106 8357851 8673025 8895894
33234 8895894 8721723 8357253 8178607 8240628 8323742 8356811 8580429 9187172 9887778 10078755
33224 10078755 9563196 8881879 8686781 8974398 9259517 9331121 9401410 9599815 9807340 9984623
33214 9984623 10181677 10211658 9835324 9302914 9121754 9202081 8947463 8453900 8841240 10798799
33204A0798799K528251J309157n43154j382829r18593k16875k91121j035480j429077
33195H819078p31597N01346R16113Q7676q05342n61986L83256P33782K69809j08158
33185I503977k3491l3611l29685k91229L03764P27647M68356K0435l4264P7187
33175A0389086p8970l58203m60349n34655p65565q57125m91697J10856N55629
33166G509007P71104P40276K37381o69720j298509j071833k44469N10115Q87480
33157G370832R40093P05154L22472J47176K38299P4039o72819j357236j000023
33148F767987L64593J540120J476543L64823p25311j060452q34088n46393j66632
33139G181190N90766J282180R56604j96166m49841J151388K928978K552857L85513
$$ plain form
33204 10798799 13327050 14636207 14093053 12710224 11791631 11574756 11283635 10248155 8819078
33195 8819078 8087481 8588827 9504940 9592616 8787274 8225288 8608544 9342326 9612135 9503977
33185 9503977 9480486 9446875 9117190 8825961 9129725 9857372 10325728 10346163 10311899 10389086
33175 10389086 10310116 9951913 9491564 8956909 8191344 7334219 6842522 6953378 7509007
33166 7509007 8280111 9020387 9257768 8588048 7289539 6217706 5973237 6483352 7370832
33157 7370832 8310925 9016079 9338551 9485727 9724026 9798065 9125246 7768010 6767987
33148 6767987 7132580 8672700 10149243 10514066 9788755 8728303 7894215 7347822 7181190
33139 7181190 7771956 9054136 10010740 9814574 9364733 10516121 13445099 15997956 16383469
33130A6383469j052601q31817n52057j069155q38254J050348K463780J128053
33122A6681766j585251k390576q25545M29828j67316j094739p14659K03240J58296
33113A0695044n87568p40535j99986k5433n70890r56392m87826L23301N35125
33104G984840P7341k23903J23520N08969R3086q21111j064917l54359J87048k19313
33094F291201o95341j10987R62586J005463j31922j049398q86505k69158J5074
33085E131013O9574K31594L68886K84514P4985j92485m56783k58468P18374J630894
33075G602098J167174m47447j356680n39902P72426Q86978j67578j114610j229631
33066E572828p10367Q8283Q20580R98674N17795J913j0020K02921J94318J62570
$$ plain form
33130 16383469 15330868 14499051 13946994 12877839 12039585 13089933 15553713 16681766
33122 16681766 15096515 12705939 11880394 12310222 12142906 11048167 10333508 10536748 10695044
33113 10695044 10107476 9366941 9166955 9141522 8570632 7614240 7126414 7449715 7984840
33104 7984840 8062181 7838278 7961798 8470767 8563853 7742742 6677825 6323466 6510514 6291201
33094 6291201 5595860 5484873 6447459 7452922 7321000 6271602 5385097 5115939 5131013
33085 5131013 5200587 5432181 5801067 6085581 6160566 5968081 5511298 5252830 5971204 7602098
33075 7602098 8769272 8321825 6965145 6425243 7197669 8084647 7917069 6802459 5572828
33066 5572828 4862461 4950744 5771324 6769998 7287793 7289706 7279686 7482607 7676925 7839495
33056G839495M36057P33769P12054O91734R91153J063019K67207q92651j310361
33047A0531476p91412p5458M08600Q02253R77799M95094n16426j291977j358766
33038I181183q69987r8310O81740R80925O15613K73150O11153R86767K58018j209524
33028A1410728j728898p31135M00411M50277p1553k69408l93651q92083j085497
33019G089191k48562P67536N77878n00532q70212j73118K76580j90707m96627
33010F231427K84213J322772J362875O03420O7205j54971o88018j318891j108867
33001F601165q2922N42157J74298k93306j9444M52900K51485l06311l45690m121
32991F970211j06436n20158j97963R71668J644900Q99781m04513q89554m71805
$$ plain form
33056 7839495 8275552 9009321 9721375 10413109 11404262 12467281 12734488 11841837 10531476
33047 10531476 9740064 9664606 10073206 10875459 11853258 12348352 11831926 10539949 9181183
33038 9181183 8311196 8212886 8894626 9875551 10491164 10764314 11375467 12362234 12620252 11410728
33028 11410728 9681830 8950695 9351106 9801383 9729830 9460422 9066771 8174688 7089191
33019 7089191 6840629 7608165 8186043 7685511 6815299 6642181 6918761 6728054 6231427
33010 6231427 6515640 7838412 9201287 9804707 9871912 9716941 9028923 7710032 6601165
33001 6601165 6518243 7060400 7234698 6941392 6921948 7374848 7626333 7320022 6974332 6970211
32991 6970211 6863775 6343617 6145654 7117322 8762222 9662003 9257490 8367936 7896131
32982G896131m6684L3860J51962L82351K84585k04184m81180j13587N81108R86070
32972I470432Q21234K28973l93534n70412j37584M41520M84644r9296p09173p97954
32962H738850l87569J95152P02247R57034Q23868M00001J6574j01202J714K50300
32952A1596969O93592J278278J668118J507477Q79275M24611Q50724K085937K974557
32943B3959538K285532K36609j503455j735655j093939q73502j138925j065118
32935A9071085p37476j122172k120605k232026q50970M84211K65565o39594l05117
32926A1812901J206235J824132N34921j127133j261965q5212P18419M24227l9039
32917A4007486K98447J079592J239840N11648k30145j21978O02233R91745O85338
$$ plain form
32982 7896131 7849447 7883307 8035269 8417620 8702205 8498021 8016841 7903254 8484362 9470432
32972 9470432 10291666 10520639 10127105 9556693 9419109 9860629 10345273 10245977 9536804 8738850
32962 8738850 8351281 8546433 9248680 10205714 11029582 11429583 11446157 11344955 11346669 11596969
32952 11596969 12290561 13568839 15236957 16744434 17623709 18048320 18899044 20984981 23959538
32943 23959538 26245070 26481679 24978224 23242569 22148630 21275128 20136203 19071085
32935 19071085 18333609 17211437 15090832 12858806 12007836 12492047 12757612 12118018 11812901
32926 11812901 13019136 14843268 15378189 14251056 12989091 12903879 13622298 14046525 14007486
32917 14007486 14305933 15385525 16625365 17137013 16906868 16784890 17387123 18378868 19064206
32908A9064206L53712O53196J175379R46344j70532j156094j098486l43466k3958
32899A9400301o44372j541731j785754j257325n86106k30940n3591J42178J45974
32890A3588634j90784l82200J25861Q84785P33511n43868j572050j008124O64602
32881A2300367J718259J328697L54123k4145L51335Q74701J124271J104519R52302
32872B0084429Q59560J074860J630844K231023K653940L000646L205990K641185
32864C7382477Q22114j571263l083322l111013k566798k543190k836317k421937
32856B0070751j098695J47494M85277K09408M8621J04379P543k60437l46020j95534
32846A9172787j64519m20460p14858q40197q73279p98407l00051P44543J777629
$$ plain form
32908 19064206 19417918 20071114 21246493 22192837 22022305 20866211 19767725 19424259 19400301
32899 19400301 18755929 17214198 15428444 14171119 13585013 13354073 13300482 13442660 13588634
32890 13588634 13397850 13015650 13141511 14026296 14759807 14215939 12643889 11635765 12300367
32881 12300367 14018626 15347323 15701446 15677301 16028636 16903337 18027608 19132127 20084429
32872 20084429 20943989 22018849 23649693 25880716 28534656 31535302 34741292 37382477
32864 37382477 38204591 36633328 33550006 30438993 27872195 25329005 22492688 20070751
32856 20070751 18972056 19119550 19604827 19814235 19862856 19967235 19974778 19714341 19368321 19172787
32846 19172787 19008268 18587808 17872950 17032753 16159474 15361067 15061016 15805559 17583188
32837A7583188J922970R13461m58959r69288j80020J010678J327044O51363J16354
32828B1916791M44772Q95423N13365k27505j38550O61167Q08312j25822r49615
32819B3798338q20491n02520q04973j040742k88229P72254P70018j85541p76029
32810B0922085o23180o03737j019979j021428k03185O06723P16251N37973N61397
32801A9872920M76527R0032N7082P11007J066475K05962r71736p61707Q55484
32792B1602046K110056J900716J048280P01060O69158J13838r39536j737982k021754
32783B3445882k163887k215788j719876o72283P2043j73142r18354j038696j57478
32774A4458421R51225J308725P04942l14253j082165j278498j011886o50247m75074
$$ plain form
32837 17583188 19506158 20419619 19960660 18991372 18811352 19822030 21149074 21800437 21916791
32828 21916791 22361563 23256986 23770351 23542846 23404296 24065463 24873775 24747953 23798338
32819 23798338 22977847 22475327 21670354 20629612 20341383 21113637 21883655 21698114 20922085
32810 20922085 20298905 19695168 18675189 17653761 17450576 18057299 18773550 19311523 19872920
32801 19872920 20349447 20439479 20496561 21207568 22274043 22480005 21508269 20746562 21602046
32792 21602046 23712102 25612818 26661098 27362158 28031316 28145154 27205618 25467636 23445882
32783 23445882 21281995 19066207 17346331 16674048 16746091 16572949 15654595 14615899 14458421
32774 14458421 15409646 16718371 17423313 17109060 16026895 14748397 13736511 13086264 12611190
32765A2611190l96013j07981M18199P87480O56697K06977m6726J37441M62530
32756A4729794M55276M7581k53240Q8745Q36237R80817q4465j530354j778908
32747A3491483l43880J509960K164837J262189l03944j451467j555045n69191
32739A4204942Q10463J370389M59045j160626k028867j557844m95794J09403j5597
32730A1695514l39172k10467M83016J160043J118690L80532k91646l89350k62994
32721A3344166m13823o63625n51527j54670J00987J32208Q9742j10577m86264
32712A1286617n72262o8848M33243K39387k50907j28487M80107N81763n2404o09040
32702A1339169o48160o10142p33217o41709k81556j25871j69256J05443M90533
$$ plain form
32765 12611190 12215177 12107196 12525395 13312875 13969572 14176549 14129823 14267264 14729794
32756 14729794 15185070 15232651 14979411 15068156 15904393 16885210 16800745 15270391 13491483
32747 13491483 13147603 14657563 16822400 18084589 17780645 16329178 14774133 14204942
32739 14204942 15015405 16385794 16844839 15684213 13655346 12097502 11601708 11711111 11695514
32730 11695514 11356342 11145875 11628891 12788934 13907624 14288156 13996510 13607160 13344166
32721 13344166 12930343 12266718 11715191 11560521 11661508 11793716 11883458 11772881 11286617
32712 11286617 10714355 10645507 11078750 11318137 11067230 10938743 11418850 12000613 11948209 11339169
32702 11339169 10691009 10080867 9347650 8705941 8424385 8298514 8129258 8234701 8725234
32693H725234J29914p84258r11574J6238N05419k29408p77335J28145J318684
32684H121059J014466k67311o61731L752K95964j13429o8853O94197R42832J76735
32674A0137681m38275j05948K69181k67665j084945j069198l70688N0348o0230
32665G060261j84253k9259K54714N62869Q80694J073671J099158J132178J115190
32656A2965223O12328m59107j409721j598124j258931r79954p70075l04809K06954
32647G003784J68141m48914r57445q68201m38937j80479k23115l34954k58089
32638C461791J24795P01067J064246P96669K6847n02770k35684M06536M11826
32629F255323n11996j378678j057568K26254J073121O53088l15768o49362k15579
$$ plain form
32693 8725234 8855148 8070890 7159316 7175554 7680973 7451565 6674230 6802375 8121059
32684 8121059 9135525 8868214 8206483 8210235 8506199 8392770 8323917 9018114 9960946 10137681
32674 10137681 9699406 9593458 9862639 9594974 8510029 7440831 7070143 7120491 7060261
32665 7060261 6876008 6846749 7101463 7664332 8545026 9618697 10717855 11850033 12965223
32656 12965223 13577551 13118444 11708723 10110599 8851668 7871714 7101639 6796830 7003784
32647 7003784 7171925 6723011 5765566 4897365 4458428 4277949 4054834 3719880 3461791
32638 3461791 3586586 4287653 5351899 6148568 6175415 5672645 5436961 5843497 6255323
32629 6255323 5743327 4364649 3307081 3533335 4606456 5259544 4943776 4294414 4078835
32620D078835K17645K88522L76795O33807N09582l43315j244752j173040j18432
32611C225647P84250O03140k63721o17182J0390P77466O80620j17006o13962m12061
32601D057581q4897m5484P6328N26264P63242M16696J48049N79584R67997J98183
32591G603543j218107j567121m14359P65800Q03575K89679J60333J48608l13294
32582F258657p05537k56410M96381L85293m48509o90791M5042N84840M3927q20830
32572D892063p93667N0010N96954L01482k41522k63206K45549P33974Q75107Q66569
32562G263313R78994J030787N88432k54782o68525m3290J049664J410915P21042
32553A2076550j01844k09305J45408K49315J9960j35196j53698l25713o48406
$$ plain form
32620 4078835 4296480 4585002 4961797 5595604 6105186 5761871 4517119 3344079 3225647
32611 3225647 4009897 4613037 4349316 3732134 3742524 4519990 5200610 5083604 4469642 4057581
32601 4057581 3972684 3927200 4003528 4529792 5293034 5709730 5857779 6437363 7405360 7603543
32591 7603543 6385436 4818315 4403956 5169756 5973331 6263010 6423343 6571951 6258657
32582 6258657 5553120 5296710 5793091 6178384 5729875 5039084 5084126 5668966 5712893 4892063
32572 4892063 4098396 4148406 4745360 5046842 4805320 4542114 4787663 5521637 6396744 7263313
32562 7263313 8242307 9273094 9861526 9606744 8938219 8894929 9944593 11355508 12076550
32553 12076550 11974706 11765401 11910809 12160124 12180084 12044888 11891190 11565477 10917071
32544A0917071q12920p64135p10517o57211m94736m30835o76559q34061m08449
32535E127648J59222q586o42162m87388O14727J206373M72871m04511k51184J34258
32525E921268m17486j046208j07123J837743K491374J170104l93048p14791m6126
32516H695707J009645K265734K979008K416678K051419M566540R287957J1156714
32508D4429402O502507j926378q026679r078208p103046m793439l001697j871872
32500A5130590j623565j718453j207870l07207r3396n69568o29636J6088N28094
32491I525077O25552R21647J434363J438375J014986J074254J562683J365313
32483A8962250L71214j10429M62416R54049M97625k57167o07832r70213j692392
$$ plain form
32544 10917071 10104151 9340016 8629499 7972288 7477552 7046717 6370158 5536097 5127648
32535 5127648 5286870 5278284 4636122 4148734 4763461 5969834 6442705 6038194 5787010 5921268
32525 5921268 5503782 4457574 4350451 6188194 8679568 9849672 9456624 8741833 8695707
32516 8695707 9705352 11971086 14950094 17366772 19418191 23984731 33272688 44429402
32508 44429402 50931909 49005531 40978852 31900644 24797598 20004159 17002462 15130590
32500 15130590 13507025 11788572 10580702 10273495 10180099 9610531 8980895 8996983 9525077
32491 9525077 10150629 11072276 12506639 13945014 14960000 16034254 17596937 18962250
32483 18962250 19333464 19223035 19685451 20639500 21137125 20879958 20272126 19301913 17609521
32474A7609521k086349j613607q80830n89347n32303l39620j70290q9418J28248
32465A1436005J47341o48158j626598j261008M37962J604560J349717J001204
32457A2441025J608422K293717K321030K675913M087879N697683P437232J1074400
32449D9637301J6114938J7120960R238679m437176j4913174j6830520j2785779
32442D3145229q153942n269590l747269l146039l096198k722844j857345j605489
32434A3546513k400775k793083j528738L17892P68605k93831j204103r03190L8159
32425E547449O52828P55852O89453N79904K46918l01109n78523j12416P56174
32416H236530J035596L79182k96112n2449P05937Q83233L00865k36461k06049
$$ plain form
32474 17609521 15523172 13909565 13028735 12439388 11907085 11567465 11397175 11307757 11436005
32465 11436005 11583346 10935188 9308590 8047582 8485544 10090104 11439821 12441025
32457 12441025 14049447 16343164 18664194 21340107 25427986 31125669 38562901 49637301
32449 49637301 65752239 82873199 92111878 87674702 72761528 55931008 43145229
32442 43145229 34991287 29721697 25974428 22828389 19732191 17009347 15152002 13546513
32434 13546513 11145738 8352655 6823917 7141809 7910414 7616583 6412480 5509290 5547449
32425 5547449 6200277 6956129 7645582 8225486 8472404 8171295 7592772 7480356 8236530
32416 8236530 9272126 9651308 9355196 9302747 10008684 10891917 11192782 10956321 10750272
32407A0750272J91465O18425P65184K23332q98318j582383j109479k39788j02459
32398H616251m21755j61073N95117R76117J095497J708508K496605K773191L580384
32389B1258842O416662R596183Q857235K861700m371295q087281p775595n965619
32381B2790832m262028k809482k011294k166535k224224j126527J98041J52517
32373H541300q32932r64362j949N77990J69836k44849n6071J76355J30978K08822
32363G705118K84147l74135j483090j638508m54328O40338N06586j13303l3562
32354E039263M67111K94546o35371j320202j087460k61460M11088M45759q7899
32345C265375n73164l80514L22422O30200O2836p14170p16008J17520R13849R32865
$$ plain form
32407 10750272 10941737 11560162 12325346 12548678 11650360 10067977 8958498 8718710 8616251
32398 8616251 8194496 8033423 8628540 9604657 10700154 12408662 14905267 17678458 21258842
32389 21258842 27675504 37271687 46128922 48990622 44619327 36532046 28756451 22790832
32381 22790832 18528804 15719322 13708028 11541493 9317269 8190742 8388783 8541300
32373 8541300 7708368 6744006 6742057 7320047 7489883 7245034 7188963 7365318 7496296 7705118
32363 7705118 7989265 7615130 6132040 4493532 4039204 4679542 5186128 5072825 5039263
32354 5039263 5506374 5800920 5165549 3845347 2757887 2496427 2907515 3353274 3265375
32345 3265375 2692211 2311697 2634119 3264319 3327155 2612985 1896977 2014497 2928346 3861211
32335C861211K92226l14435l92496j06323L828k56038m87361l24405j7794m1277
32325B217136l59445n44484m35581j88531J45878N47512P29246N23337L37931
32316B972999N23460N75076j06312r12613o99727K84662N64851k06559n97204
32307B398633K30013R88009K19325j412758k101063j307370Q2620J262966J816047
32298B176422J205615m82650j729029j123245N01535J086405L45177o9005N00572
32289B411797O63428m40439j419510p21880R60755J762200J144413M5032p10683
32280C695113r12393m94757K50873M75915j55694p13211l58825J72748k78237
32271A681532j235077j194274j2593R15059Q54457N24862M74000K26419m25790
$$ plain form
32335 3861211 4153437 3839002 3446506 3340183 3344011 3087973 2600612 2276207 2258413 2217136
32325 2217136 1857691 1313207 877626 689095 834973 1382485 2111731 2635068 2972999
32316 2972999 3496459 4071535 3965223 3052610 2352883 2637545 3202396 2995837 2398633
32307 2398633 2628646 3616655 3835980 2423222 322159 -985211 -902591 360375 2176422
32298 2176422 3382037 2899387 1170358 47113 548648 1635053 1980230 1911225 2411797
32289 2411797 3075225 2634786 1215276 493396 1454151 3216351 4360764 4405796 3695113
32280 3695113 2782720 2287963 2538836 3014751 2859057 2145846 1787021 1959769 1681532
32271 1681532 446455 -747819 -760412 154647 1009104 1533966 2007966 2234385 1808595
32262A808595o83889n3190P10110P59156L92968L83944P86263J105255J074012
32253F283224O90147K779o86616r25217p29901n53433m82045k14701P0803j54951
32243C300089n98769l24226N46364P08690j68451o98221o3060N49119L8587o22651
32233B667471j42543O90553L42314p13048p51704K60359P03302P6333m10167j21093
32223B601777J29670j53641l06714N5298L02200L0757k82242l00223k73460j85186
32213A618236K70936O66557K05261o78981o39568L85028R70915N94578L68763
32204C761725P78787O71433m93995j296709o04091M98565N50658L6562K19944
32195D122879R01934J085251Q89176J081307J505583J624570J884209K903524
$$ plain form
32262 1808595 1124706 1071516 1781626 2540782 2933750 3317694 4103957 5209212 6283224
32253 6283224 6973371 6976150 6289534 5364317 4634416 4080983 3598938 3384237 3455040 3300089
32243 3300089 2701320 2377094 2923458 3632148 3463697 2765476 2702416 3251535 3290122 2667471
32233 2667471 2524928 3215481 3557795 2844747 2093043 2353402 3056704 3133037 2722870 2601777
32223 2601777 2731447 2577806 2271092 2326390 2628590 2659347 2377105 2076882 1803422 1618236
32213 1618236 1889172 2555729 2760990 2082009 1442441 1827469 2798384 3392962 3761725
32204 3761725 4540512 5211945 4717950 3421241 2817150 3315715 3866373 3902935 4122879
32195 4122879 5024813 6110064 6999240 8080547 9586130 11210700 13094909 15998433
$$ [...]
##END NTUPLES=NMR SPECTRUM
##END=
