##TITLE=1H_UK_26_9
 CD2Cl2
 64 sc, 
 18.12.2023
##JCAMPDX= 6.0         $$ Bruker NMR JCAMP-DX V2.0
##DATA TYPE= NMR FID
##DATA CLASS= NTUPLES
##ORIGIN= UXNMR, Bruker Analytische Messtechnik GmbH
##OWNER= root
$$ XWIN-NMR		Version 3.5
$$ Mon Dec 18 14:19:22 2023 Russian Standard Time (UT+4h)  she@DPX200
##.OBSERVE FREQUENCY= 200.1313
##.OBSERVE NUCLEUS= ^1H
##.DELAY= (6, 6)
##.ACQUISITION MODE= SIMULTANEOUS
##.ACQUISITION SCHEME= undefined
##.AVERAGES= 64
##.DIGITISER RES= 18
##SPECTROMETER/DATA SYSTEM= spect
##.PULSE SEQUENCE= zg30
##.SOLVENT NAME= CD2Cl2
##.SHIFT REFERENCE= (INTERNAL, CD2Cl2, 0, 15.7039)
##AUDIT TRAIL= $$ (NUMBER, WHEN, WHO, WHERE, WHAT)
$$ ##TITLE= Audit trail, XWIN-NMR		Version 3.5
$$ ##JCAMPDX= 5.01
$$ ##ORIGIN= Bruker BioSpin GmbH
$$ ##OWNER= she
$$ F:/spectra/data/she/nmr/H-F/1/audita.txt
$$ ##AUDIT TRAIL=  $$ (NUMBER, WHEN, WHO, WHERE, WHAT)
(   1,<2023-12-18 14:18:09.31 +0400>,<she>,<DPX200>,
      <continue with go, POWCHK disabled, PULCHK disabled
       configuration hash MD5:
       00 E9 B6 7A A2 85 ED C7 34 08 36 98 17 FE 4E 26
       data hash MD5: 16K
       E3 C3 9E 09 82 32 CC F8 EF 4E 06 96 50 EE 2D 8D>)
$$ ##END=
$$ 
$$ hash MD5
$$ 7C B8 3F E6 CA 3B EF FD 6D 47 22 A0 68 A5 DA 79
##$RELAX= 
##$RELAX= 
##$RELAX= 
##$RELAX= 
##$RELAX= 
##$RELAX= 
$$ Bruker specific parameters
$$ --------------------------
##$DU= <F:/spectra>
##$EXPNO= 1
##$NAME= <H-F>
##$PROCNO= 1
##$TYPE= <nmr>
##$USER= <she>
##$AMP= (0..31)
100 100 100 100 100 100 100 100 100 100 100 100 100 100 100 100 100 100 
100 100 100 100 100 100 100 100 100 100 100 100 100 100 
##$AQSEQ= 0
##$AQ_mod= 1
##$AUNM= <au_zg>
##$AUTOPOS= <>
##$BF1= 200.13
##$BF2= 200.13
##$BF3= 200.13
##$BF4= 200.13
##$BF5= 200.13
##$BF6= 200.13
##$BF7= 200.13
##$BF8= 200.13
##$BYTORDA= 1
##$CFDGTYP= 0
##$CFRGTYP= 5
##$CHEMSTR= <none>
##$CNST= (0..31)
1 1 145 1 1 1 1 1 1 1 1 1 1 1 1 1 1 1 1 1 1 1 1 1 1 1 1 1 1 1 1 1 
##$CPDPRG= <>
##$CPDPRG1= <>
##$CPDPRG2= <>
##$CPDPRG3= <>
##$CPDPRG4= <mlev>
##$CPDPRG5= <mlev>
##$CPDPRG6= <mlev>
##$CPDPRG7= <mlev>
##$CPDPRG8= <mlev>
##$CPDPRGB= <>
##$CPDPRGT= <>
##$D= (0..31)
0 1.2 0 0 0 0 0 0 0 0.06 0 0.03 0 0 0 0 0.0002 0 0 0 0 0 0 0 0 0 0 0 0 
0 0 0 
##$DATE= 1702894428
##$DBL= (0..7)
120 120 120 120 120 120 120 120 
##$DBP= (0..7)
150 150 150 150 150 150 150 150 
##$DBP07= 0
##$DBPNAM0= <>
##$DBPNAM1= <>
##$DBPNAM2= <>
##$DBPNAM3= <>
##$DBPNAM4= <>
##$DBPNAM5= <>
##$DBPNAM6= <>
##$DBPNAM7= <>
##$DBPOAL= (0..7)
0.5 0.5 0.5 0.5 0.5 0.5 0.5 0.5 
##$DBPOFFS= (0..7)
0 0 0 0 0 0 0 0 
##$DE= 6
##$DECBNUC= <off>
##$DECIM= 32
##$DECNUC= <off>
##$DECSTAT= 4
##$DIGMOD= 1
##$DIGTYP= 9
##$DL= (0..7)
0 120 120 120 120 120 120 120 
##$DP= (0..7)
150 150 150 150 150 150 150 150 
##$DP07= 0
##$DPNAME0= <>
##$DPNAME1= <>
##$DPNAME2= <>
##$DPNAME3= <>
##$DPNAME4= <>
##$DPNAME5= <>
##$DPNAME6= <>
##$DPNAME7= <>
##$DPOAL= (0..7)
0.5 0.5 0.5 0.5 0.5 0.5 0.5 0.5 
##$DPOFFS= (0..7)
0 0 0 0 0 0 0 0 
##$DQDMODE= 0
##$DR= 18
##$DS= 0
##$DSLIST= <SSSSSSSSSSSSSSS>
$$ [...]
##$SUBNAM2= <"">
##$SUBNAM3= <"">
##$SUBNAM4= <"">
##$SUBNAM5= <"">
##$SUBNAM6= <"">
##$SUBNAM7= <"">
##$SUBNAM8= <"">
##$SUBNAM9= <"">
##$SW= 18.0517328524113
##$SWIBOX= (0..15)
0 0 2 0 0 0 0 0 0 0 0 0 0 0 0 0 
##$SW_h= 3612.71676300578
##$TD= 16384
##$TD0= 1
##$TE= 0
##$TE2= 300
##$TE3= 300
##$TEG= 300
##$TL= (0..7)
0 120 120 120 120 120 120 120 
##$TP= (0..7)
150 150 150 150 150 150 150 150 
##$TP07= 0
##$TPNAME0= <>
##$TPNAME1= <>
##$TPNAME2= <>
##$TPNAME3= <>
##$TPNAME4= <>
##$TPNAME5= <>
##$TPNAME6= <>
##$TPNAME7= <>
##$TPOAL= (0..7)
0.5 0.5 0.5 0.5 0.5 0.5 0.5 0.5 
##$TPOFFS= (0..7)
0 0 0 0 0 0 0 0 
##$TUNHIN= 0
##$TUNHOUT= 0
##$TUNXOUT= 0
##$USERA1= <user>
##$USERA2= <user>
##$USERA3= <user>
##$USERA4= <user>
##$USERA5= <user>
##$V9= 5
##$VALIST= <valist>
##$VCLIST= <CCCCCCCCCCCCCCC>
##$VD= 0
##$VDLIST= <DDDDDDDDDDDDDDD>
##$VPLIST= <PPPPPPPPPPPPPPP>
##$VTLIST= <TTTTTTTTTTTTTTT>
##$WBST= 1024
##$WBSW= 4
##$XGAIN= (0..3)
0 0 0 0 
##$XL= 0
##$YL= 0
##$YMAX_a= 469201
##$YMIN_a= -445172
##$ZGOPTNS= <>
##$ZL1= 120
##$ZL2= 120
##$ZL3= 120
##$ZL4= 120
##$ABSF1= 10
##$ABSF2= 0
##$ABSG= 5
##$ABSL= 3
##$ALPHA= 0
##$AQORDER= 0
##$ASSFAC= 0
##$ASSFACI= 0
##$ASSFACX= 0
##$ASSWID= 0
##$AUNMP= <proc_1d>
##$AZFE= 0.1
##$AZFW= 0.1
##$BCFW= 1
##$BC_mod= 2
##$BYTORDP= 1
##$COROFFS= 0
##$CY= 11.3945322036743
##$DATMOD= 1
##$DC= 2
##$DFILT= <>
##$DTYPP= 0
##$F1P= 15.7292609196834
##$F2P= 12.9074282941183
##$FCOR= 0.5
##$FTSIZE= 0
##$FT_mod= 4
##$GAMMA= 1
##$GB= 0.15
##$INTBC= 1
##$INTSCL= 1
##$ISEN= 128
##$LB= 0.24
##$LEV0= 0
##$LPBIN= 0
##$MAXI= 10000
##$MC2= 0
##$MEAN= 0
##$ME_mod= 0
##$MI= 1.114404
##$NCOEF= 0
##$NC_proc= 0
##$NLEV= 6
##$NOISF1= 3.799351
##$NOISF2= 2.8
##$NSP= 1
##$NTH_PI= 0
##$NZP= 0
##$OFFSET= 15.70392
##$PC= 1
##$PHC0= -24595.2
##$PHC1= 16.65272
##$PH_mod= 1
##$PKNL= yes
##$PPARMOD= 0
##$PSCAL= 0
##$PSIGN= 0
##$REVERSE= no
##$SF= 200.130013532006
##$SI= 16384
##$SIGF1= 3
##$SIGF2= 2
##$SINO= 400
##$SIOLD= 16384
##$SREGLST= <1H.CDCl3>
##$SSB= 0
##$STSI= 0
##$STSR= 0
##$SW_p= 3612.71676300578
##$SYMM= 0
##$S_DEV= 0
##$TDeff= 0
##$TDoff= 0
##$TI= <>
##$TILT= no
##$TM1= 0
##$TM2= 0
##$TOPLEV= 0
##$USERP1= <user>
##$USERP2= <user>
##$USERP3= <user>
##$USERP4= <user>
##$USERP5= <user>
##$WDW= 1
##$XDIM= 8192
##$YMAX_p= 0
##$YMIN_p= 0
$$ End of Bruker specific parameters
$$ ---------------------------------
##NTUPLES= NMR FID
##VAR_NAME=  TIME,          FID/REAL,        FID/IMAG
##SYMBOL=    X,             R,               I
##VAR_TYPE=  INDEPENDENT,   DEPENDENT,       DEPENDENT
##VAR_FORM=  AFFN,          ASDF,            ASDF
##VAR_DIM=   8192,          8192,            8192
##UNITS=     SECONDS,       ARBITRARY UNITS, ARBITRARY UNITS
##FACTOR=    0.0002768,     1,               1
##FIRST=     0,             0,               0
##LAST=      2.2672688,     0,               0
##MIN=       0,             -445172,         0
##MAX=       2.2672688,     469201,          0
$$ Real data points
##PAGE= N=1
##DATA TABLE= (X++(R..R)), XYDATA
$$ [...]
2532a871J275L405l280q12L476k92l523J775K314l301j394K768o80l485J847L801
$$ -1871 -596 2809 -471 -1283 2193 1901 -1622 153 2467 -834 -2228 540 -140 -3625 -1778 2023
2548B023k756n69M493r43l545J946J828l564j744M021l38m381K293L154k549j958
$$ 2023 -733 -1302 3191 2248 -1297 649 2477 -1087 -2831 1190 852 -3529 -1236 1918 -631 -2589
2564b589M611P13m398J782K447k780j693L370L56m349J840J846j619k351M223
$$ -2589 2022 2735 -1663 119 2566 -214 -1907 1463 1819 -2530 -690 1156 -463 -2814 1409
2579A409m54k182R32L709l189j680L370K44l969L26K943k200j912L029M76l749
$$ 1409 955 -1227 -295 3414 225 -1455 1915 2159 -1810 -1484 1459 -741 -2653 376 852 -2897
2595b897J825L717l079j251L567J232m100J261K000l033j593K692K16l526O36
$$ -2897 -1072 2645 -434 -1685 1882 3114 -986 275 2275 -758 -2351 341 557 -2969 -2333
2610b333M132j989j995L926Q96l306Q17L431k861k768L549r60l099R98K782j958
$$ -2333 1799 -190 -2185 1741 2637 -669 148 3579 718 -2050 1499 539 -2560 -1562 1220 -738
2626g38j611K954J475l393J218K956k100k237K789M38m031L54L453k800j448K711
$$ -738 -2349 605 2080 -1313 -95 2861 761 -1476 1313 1751 -2280 -1926 1527 -1273 -2721 -10
2642a0P81k068M29L433j034k386J907J127l326m85L494k338k419K938j00k351
$$ -10 771 -1297 -868 2565 1531 -855 1052 2179 -1147 -1632 1862 -476 -2895 43 -57 -2408
2658b408j85M487j583k628M271P90k861J095J142p81l126J849M92k824K55K653
$$ -2408 -2593 1894 311 -2317 1954 2744 -117 978 2120 1339 -1787 62 554 -2270 -2015 638
2674F38j616j067K014K236k207n46K582l89l112J641J180k542p63K873r37l531
$$ 638 -978 -2045 -31 2205 -2 -548 2034 1645 -1467 174 1354 -1188 -1951 922 -15 -3546
2690c546L454J113j949n52L839m84k650K245J512l060j083K510j210l120L222
$$ -3546 -92 1021 -928 -1480 2359 1875 -775 1470 2982 -78 -1161 1349 139 -2981 241
2705B41P9k209j45K570Lk241K193K905l579l81K127q07l026J973J059l080m50
$$ 241 320 -1889 -2034 536 539 -1702 491 3396 -183 -564 1563 756 -2270 -297 762 -2318 -2768
2722b768L578k15k125K339J481j719p48K678j100k574N17K207l727o52K315P64
$$ -2768 810 595 -1530 809 2290 571 -177 2501 1401 -1173 -656 1551 -2176 -2828 -513 251
2738B51k921J810K946k537k83L203j234k042R42K623l122j921K947l5l587J213
$$ 251 -2670 -860 2086 -451 -734 2469 1235 -807 135 2758 -364 -2285 662 627 -2960 -1747
2754a747L007k840j198L905p29j933J807K618l350l29K708j020l279J302J831
$$ -1747 1260 -1580 -2778 1127 398 -1535 272 2890 -460 -789 1919 899 -2380 -1078 753
2769G53j755j875L636j64k167J696L077k330p43K206j075k567J267J236k731n06
$$ 753 -1002 -2877 759 595 -1572 124 3201 871 128 2334 1259 -1308 -41 1195 -1536 -2042
2785b042J665L39j988J805J324n48j219K537J134l628Q49J240j383k436K014J011
$$ -2042 -377 -38 -2026 -221 1103 555 -664 1873 3007 -621 228 1468 85 -2351 -337 674
2801F74k898R08K243j573j071L101L85k238P35K389k221j604K104L17l887J055
$$ 674 -2224 -1316 927 -646 -1717 1384 1769 -469 266 2655 434 -1170 934 1251 -2636 -1581
2817a581K237k810o89L403J07j514N12L130j820k164K782n59k093k72J245j241
$$ -1581 656 -2154 -2843 560 667 -847 -335 2795 975 -1189 1593 1034 -1059 -1331 -86 -1327
2833a327q80J360J307k255J979K556j500k005K706N82l621O60K128j821k055J665
$$ -1327 -2207 -847 460 -1795 184 2740 1240 -765 1941 2523 -1098 -438 1690 -131 -2186 -521
2849e21N60j985k93L685j869j010K495J371k430M45J884j270k223K324k12l634
$$ -521 39 -1946 -2239 1446 -423 -1433 1062 2433 3 448 2332 1062 -1161 1163 951 -2683
2865b683Q49K273j096k275L439J536l108J552K562j882k002K318k49k623K1K071
$$ -2683 -1834 439 -657 -2932 507 2043 -1065 487 3049 1167 -835 1483 1234 -1389 -1368 703
2881G03k390j730L486L88j977R70K249n58r73J198R28k742l92K048j361k084J792
$$ 703 -1687 -3417 69 457 -1520 -550 1699 1141 168 1366 2294 -448 -840 1208 -153 -2237 -445
2898d45O11j624l66L280j857q95L087L88k283k0K333j601k359J206M26j844n15
$$ -445 166 -1458 -1824 1456 -401 -1296 1791 2179 -104 -124 2209 608 -1751 -545 -119 -1963 -2478
2915b478K693r95j060J480J733j446N95K413k138o32J151O86l739m20J736l64
$$ -2478 215 -780 -1840 -360 1373 -73 522 2935 797 165 1316 2002 -1737 -2157 -421 -785
2931g85j788K596N26j500k0L125m58j947J691R90k736j16J447j465j921J277P15
$$ -785 -2573 23 549 -951 -971 2154 1696 -251 1440 2430 -306 -422 1025 -440 -2361 -1084 -369
2948c69r44R8J556R08k159J867J494k662l91J939j449j621J364L30j652j70K143
$$ -369 -1313 -1215 341 1249 -910 957 2451 -211 -602 1337 -112 -1733 -369 -39 -1691 -1861 282
2965B82k12j688K932N14k124O27K415p21k302N42J208k736m17J579o44j318J797
$$ 282 70 -1618 1314 1828 -296 331 2746 2025 -277 265 1473 -1263 -1680 -101 -745 -2063 -266
2982b66J449k149L22K203J77j518Q07J045k651m69R83l44j898J217N39m32k89
$$ -266 1183 -966 -644 1559 1736 218 1025 2070 -581 -1050 -67 -411 -2309 -1092 -553 -985 -1274
2999a274J967M42j767J722Q61j704q40J615j468j993J656J428j869m65J371O01
$$ -1274 693 1135 -632 1090 1951 247 -593 1022 -446 -2439 -783 645 -1224 -1689 -318 283
3015B83j504J496J192o54p36J915j176o92n49J336j523j419J349J78j025Q69J968
$$ 283 -1221 275 1467 813 77 1992 816 124 -425 911 -612 -2031 -682 -504 -1529 -660 1308
3032A308j373o06K519M68k118P02N25k047p31N68K74j500L20K612j986J36K702
$$ 1308 -65 -671 1848 2316 198 900 1425 -622 -1353 -785 -511 -2011 -1691 921 -1065 -929 1773
3049A773J38j610L95K281k628j136R91l71j242j31J128j398K86K192J49j121O68
$$ 1773 1911 301 696 2977 349 -787 204 -167 -1409 -1540 -412 -1810 -1524 668 817 -304 364
3066C64J306n13j407J661k11j941j20J736j482j151Q67O05j035M61K235m43r85
$$ 364 1670 1157 -250 1411 1200 -741 -861 875 -607 -1758 -891 -286 -1321 -860 1375 932 -53
3083e3J665J075k403k1J029j551k134J206R20j903K86K707q62j036K332K25q55
$$ -53 1612 2687 284 263 1292 -259 -2393 -1187 -267 -2170 -1884 823 -39 -1075 1257 1482 627
3100F27o0J618j468j463P96Lj985l64K331j263j09K184j97q04Q58J347j227r52
$$ 627 567 2185 717 -746 50 53 -1932 -2296 35 -1228 -1337 847 650 -154 704 2051 824 -128
3118a28J203p84p18r81J397q83q63J162J381j829L50K164j033JJ006L1j604J4
$$ -128 1075 291 -427 -1408 -11 -894 -1757 -595 786 -1043 -693 1471 438 439 1445 1476 -128 -114
3136a14J128p90j497Q39j04j594J061J414l06j521K577P70j240o84J326j92k074
$$ -114 1014 224 -1273 -434 -538 -2132 -1071 343 37 -1484 1093 1863 623 -61 1265 1073 -1001
3153a001O77P7j106l76K434j729m87K033j56L94j43J323q04j355M64M73j841l52
$$ -1001 -324 -247 -1353 -1729 705 -1024 -1511 522 366 760 617 1940 1136 -219 245 718 -1123 -1475
3171a475J507r90o49J181J160j797O18J830o4j159Q63P67k216N91L31j052o95
$$ -1475 32 -958 -1607 -426 734 -1063 -445 1385 1321 162 1025 1792 -424 167 498 -554 -1249
3188a249R82O08k465N41K134N02k034J925R59p34p8P1j521o82J393p52j674J78
$$ -1249 -267 341 -2124 -1583 551 1053 -981 944 1903 1169 1091 1162 -359 -1041 352 -400 -2074 -1896
3206a896J274K46r76J769N37k04J17R27o24k102N96m05j213Q97L40K62j329J290
$$ -1896 -622 -376 -1352 417 954 750 867 1794 1170 -932 -336 -741 -1954 -1057 -717 -455 -1784 -494
3224d94J242j019R8K072o60j414M42J465j701j30J15j98j068m60J357j013K00
$$ -494 748 -271 -173 1899 1239 -175 267 1732 31 -99 16 -182 -1250 -1710 -353 -1366 -1166
3241a166J432O24j154R08J500j805k48P95j271l70L67J79n36p37J359J65p60J720
$$ -1166 266 890 -264 644 2144 339 91 886 -385 -755 -388 -209 -745 -1482 -123 42 -718 1002
3259A002L81j110k4J759o12j939l49J254j441k49J273j68j071M13J565K88n83
$$ 1002 1383 273 249 2008 1396 -543 -892 362 -1079 -1328 -55 -223 -1294 -881 684 972 389
3276C89K088j571k50M26m54j414M2Q89m06n53k07Q35k52l54O93J355j058J26J447
$$ 389 2477 906 656 1082 628 -786 -744 145 -261 -814 -1021 -186 -438 -792 -99 1256 198 324 1771
3295A771j236q68N89n8j294N33O60j652L81O55J126n36N51Q88k19o64J9M81j478
$$ 1771 535 -333 256 198 -1096 -563 97 -1555 -1174 -519 607 71 622 1510 1291 627 646 1127 -351
3314c51l41N01j003M29J69N40n74m71J995m18j00J429n83j224l3J107j040m43
$$ -351 -692 -191 -1194 -765 -596 -56 -630 -1101 894 476 376 1805 1222 -2 -35 1072 32 -411
3332d11M37o04p92O33R63j27m86R74M91n69j77Q02n87j564J725j332m94o7N52
$$ -411 26 -578 -1370 -737 226 99 -387 587 1078 509 332 1134 547 -1017 708 -624 -1118 -1185 -633
3351f33k34m78J786J62n88J73J599j568O2j63Q43j507j109J979o36j056L08R62
$$ -633 -867 -1345 441 603 15 188 1787 219 281 118 961 -546 -1655 324 -312 -1368 -1060 -98
3369i8o67R86J104o17o97P07L84n50m53L13n55j106N06n21P18o40J894j60m9O61
$$ -98 -765 221 1325 708 11 718 1102 552 99 412 -143 -1249 -743 -1264 -546 -1186 708 548 499 1160
3389A160L85r51o6Q7p27K0R3K4q78j40Q43m64k50Q15N97m31N9M49J51o55k66R96
$$ 1160 1545 594 528 615 -112 -92 1 25 -853 -993 -150 -614 -864 -49 548 117 176 625 776 121 -145 851
3411H51j446q57L69M96o55M45M13J40R14M83j016O5P78Q82j309j564M64K85n93
$$ 851 -595 -1452 -1083 -587 -1242 -797 -384 -244 670 1153 137 202 980 1862 553 -1011 -547 -262 -855
3430h55J10K9k41L31L19P66r66N87P25R4j64Jl1j641P70P55r96j292Q22Q46l07
$$ -855 -745 -716 -957 -626 -307 459 -507 80 805 899 735 736 705 -936 -166 589 -407 -1699 -877 -31 -338
3451c38R85N84p09l83O56m13L51J43K88j557j260J477j73j376R63J410q94k00
$$ -338 647 1231 522 139 795 382 733 876 1164 -393 -1653 -176 -349 -1725 -762 648 -246 -446
3469d46J277N49p56Q1K70q44p89L98k82j323P68J173n35o71J858O77j207Q56j13
$$ -446 831 1380 624 705 975 131 -658 -260 -542 -1865 -1097 76 -459 -1130 728 1405 198 1054 941
3488I41r5o73M97j44p90k13K42p05k8Q51L39M3r3J584j355N3P70p32o04M81k04
$$ 941 846 173 670 526 -264 -477 -235 -940 -968 -117 222 265 172 1756 401 454 1224 492 -112 369 165
3509A65n62r92J258m52j160J276R12J85K33L65n09n1j81k9q60J70K79m52p12K24
$$ 165 -397 -1389 -131 -583 -1743 -467 445 630 863 1228 719 668 487 458 -402 -232 47 -405 -1117 -893
3529h93J389r10r9R03Q64p04r3P98j493J93R46j363q82K50N56l25K68N63L13o42
$$ -893 496 -414 -513 390 1254 550 457 1255 -238 -45 901 -462 -1344 -1094 -538 -863 -595 -32 281 -361
3549c61J45J649q66l67O25n18lj97P8k74n11P75k50q07P82M46l28J53P33J28p06
$$ -361 -216 1433 567 200 825 307 304 107 185 -89 -600 175 -75 -882 -100 346 18 171 904 1032 326
3570C26M19l56q38j88P67J91j610J030N24J4o75J129n9K05J3m32k46L80n67r94
$$ 326 745 389 -449 -637 130 321 -1289 -259 265 279 -396 733 674 879 892 460 214 594 27 -967
3590i67o77R63L78k0L0P88p47o21J644K66j44m73K94k1j313l05N34K82o70P47
$$ -967 -1644 -681 -303 -323 -293 495 -252 -873 771 1037 893 420 714 693 -620 -925 -391 -109 -779 -32
3610c2O9LL22ML00J81j22k73j2l47O7o37l68P42O52j207O1P37k34K03J2L96k1
$$ -32 37 40 362 366 666 847 725 452 440 93 160 -477 -845 -103 549 -658 -597 140 -94 109 121 517 496
3633D96O0O2J36j470J090j310J33m92Q33q8P74RQ03r90r7L84nK51o41O19k37m08
$$ 496 556 618 754 -716 374 -936 -803 -1295 -462 -550 224 233 1036 46 -51 333 328 579 -62 557 320 -88
3655h8L12j101N17K59k34N33k54K02L90p5p09P83m09j45j54m1j051J645p96j50
$$ -88 224 -877 -360 -101 -335 198 -56 146 536 461 -248 535 126 -19 -173 -214 -1265 380 -416 -566
3675e66Q3J036m23O56r9J54m42jo1M56n13p13N1K22p48J04M90R27k90J41q42N50
$$ -566 -483 553 130 786 687 841 399 398 337 793 280 -433 -382 -160 -908 -804 -314 613 323 464 -378 172
3697A72N76n18q09K84R3m65R2Q8J265j107R48n85m6K58k59M09n28M49M15j149
$$ 172 748 230 -579 -295 -202 -667 -575 -487 778 -329 619 34 -12 246 -13 396 -132 317 732 -417
3717d17m6k76J209r04O9P32m99n15J122P13j189Q71J26o33o24O84P5j265R1M92
$$ -417 -463 -739 470 -434 -365 367 -132 -647 475 1188 -1 870 996 363 -261 423 498 -767 -676 -184
3737a84n68j10O31L2n77R29R19j209L18K85q43m07O55K49J36j507Q89p43L99Q02
$$ -184 -752 -862 -231 -199 -776 153 1072 -137 181 466 -377 -784 -129 120 256 -1251 -362 -1105 -706 96
3757I6N30l95l7L83N89q18J85n64q48O55j0J77l11l17P99j83M50m52N42j39l4
$$ 96 626 231 194 577 1166 348 533 -31 -879 -224 -234 -57 -368 -685 114 -69 381 -71 471 332 298
3778B98L00o32o16R83n93m98N11M72k63l92M10L54j89j94J165P5j414N01j63j93
$$ 298 598 -34 -650 333 -260 -758 -247 225 -38 -430 -20 334 145 -49 1116 1191 -223 278 115 -78
3798g8j29L33K2q18M50k96P6K48N78o8j46O95m27rq7l24l57j30Q85m97r82N97
$$ -78 -207 126 148 -670 -220 -516 -440 -192 386 318 172 867 440 431 344 20 -337 -467 418 -79 -1061 -464
3820d64L35k31M9J288k77n44l09Q02o26k56N50k63J84l49O5l12n34J252O2o58
$$ -464 -129 -360 -311 977 700 156 -153 649 23 -233 317 54 238 -111 -46 -358 -892 360 422 -236
3840b36L86L73L66q57o07K86L15n58J48k25J01N5J279j100J74K33P91n71L1L54
$$ -236 150 523 889 32 -575 -289 26 -532 -384 -609 -508 -453 826 -274 -100 133 924 353 384 738
3860G38j129L15J76k27L6k59P10n01K74L63j59k50m72J433j221M45o16K51J95
$$ 738 -391 -76 100 -127 -91 -350 360 -141 133 496 337 87 -385 1048 -173 272 -344 -93 102
3879A02j88o79q43Q86O41K73q67N09M25n63P49L16o59oP92o28o1n70Mq1N4oO60
$$ 102 -86 -765 -1608 -722 -81 192 -675 -166 259 -304 445 761 102 96 888 260 199 -371 -367 -448 -394 -400 260
3902B60n14O9Q83q4n48Rk65J80N98q27N1J78j40p57O08L08N61J8j82k20l58J24
$$ 260 -254 -185 698 614 66 75 -190 -10 588 -239 -188 -10 -150 -907 -299 9 570 588 406 186 -172 -48
3924d8k92o0Q61j129R76k42k4Q0n01O71j174M86R70l41O76l35N8r47R05m69n80
$$ -48 -340 -400 461 -668 308 66 42 122 -379 292 -882 -396 574 233 909 574 632 -315 590 121 -459
3945d59j90K85N21k5n5L01l04j54K27N73k45J29j83jj85j58k59j91j93P69l36
$$ -459 -649 -364 157 132 77 378 74 -80 147 720 475 604 421 420 235 77 -182 -373 -566 203 -133
3966a33K24N43j4m14N36q55J44J55N90k49k25j005L35L85n54J074j644J007L75
$$ -133 91 634 620 206 742 -113 31 186 776 527 302 -703 -368 17 -537 537 -1107 -100 275
3985B75n71N60p00P53j77O7o40N42l71J55o53O62p76P79M57m42O5n15P44n00K72
$$ 275 -296 264 -436 317 140 207 -433 109 -262 -107 -760 -98 -874 -95 362 -80 -15 -530 214 -286 -14
4006a4j22J36K38n02J10m11K22K21j73R17l49K76l54j41L5J2l22m13R77m41O32
$$ -14 -136 0 238 -264 -154 -565 -343 -122 -295 622 273 549 195 54 89 101 -221 -634 343 -98 534
4027E34m59J84n66j82N07p08P35L04q33N97m00L58K49R1k90k60L8Q33n73J03n3
$$ 534 75 259 -307 -489 18 -690 45 349 -484 113 -287 71 320 411 121 -139 -101 732 159 262 209
4048B09K11M91q21Q54l67o57N92j141N71P6K11n5r07Q96o1j18O0R55k57j129K81
$$ 209 420 911 90 944 577 -80 512 -629 -58 18 229 174 -733 163 102 -16 44 999 742 -387 -106
4069a06k3L07K43m32J77l41n8n66J032K6J47J52l56L64o44J17P2j53N42o65K8
$$ -106 -129 178 421 -11 166 -175 -233 -799 233 259 406 558 202 566 -78 39 111 -42 500 -165 -137
4090a37J92q19J403p70M74p60K57K22K96o05K71j71M50K7m3J66j11l04l21K07
$$ -137 55 -764 639 -131 343 -417 -160 62 358 -247 24 -147 303 330 287 453 342 38 -283 -76
4110g6M37m38n93N58Q06o84n71P05O78m07o15O76j077r3J75P95P4m18M65q14M30
$$ -76 361 -77 -670 -112 694 10 -561 144 822 415 -200 476 -601 -694 -519 276 350 -68 397 -417 13
4131A3K39m72O27j9J8q26k42L41Q73p98J098m95n35L87k50J15K32M1p71O79p15
$$ 13 252 -220 407 388 406 -420 -662 -321 552 -246 852 357 -178 209 -41 74 306 347 -424 255 -460
4152d60J90P5N1n7N08p38Q21j345N03K82R59l63m03J34K00j68O53j034m3l87L73
$$ -460 -270 -195 -144 -201 307 -431 390 -955 -452 -170 789 426 23 157 357 189 842 -192 -235 -622 -249
4173b49L83J89P7k73L63k06k17J80m52Q47q03M43l78J50L35q09K65M88M6N56j500
$$ -249 134 323 400 127 490 284 67 247 -205 642 -161 282 -96 54 389 -420 -155 333 379 935 -565
4194e65Q30J88j179M95M5N55q19l6Q24n7k74J2K29m81N9P97p97L8K02L92o78K54
$$ -565 265 453 -726 -231 -186 369 -450 -486 338 281 7 19 248 -233 -174 623 -174 -136 66 458 -220 34
4216C4M13j109M29j54L82j91M5J35O09m85M88j95n69l47L22N18j08l66j50Q88
$$ 34 447 -662 -233 -387 -5 -196 -151 -16 593 108 596 401 -168 -515 -193 325 217 -149 -299 589
4236E89k1q60p4k46O67q33R52j53O57p1k96n73P53r55M03K92j73Q7N37m59k81
$$ 589 568 -292 -366 -612 55 -778 174 21 678 607 311 -262 491 -464 -61 231 58 145 682 223 -58
4257e8O3p57Q53K68j112M76O25o67K23j74P21m01k35L30n9K9K75r78P43p37K35
$$ -58 5 -752 101 369 -743 -267 358 -309 -86 -260 461 60 -175 155 96 125 400 -578 165 -572 -337
4278c37N60l67K59J72l52n95J054m74m32O75k34k12L36j9P6O04p46R01j566L99
$$ -337 223 -144 115 287 -65 -660 394 -80 -512 163 -71 -283 53 34 110 714 -32 869 -697 -298
4298b98O32n29M12r0Qpp30L10N91r31L45j6R69m19K85qq19j92L32l75P00N53j077
$$ -298 334 -195 217 127 135 128 -602 -292 299 -632 -287 -303 666 247 532 524 -295 -487 -155 -530 170 723 -354
4321c54R5Q78K48n84j77k89M35m61K7N84k27p66jN53l77K93M70j168L40J84J098
$$ -354 -259 619 867 283 106 -183 252 -209 -182 402 175 -591 -592 -39 -416 -123 347 -821 -481 -297 801
4342H01j155K81M65o62N9P07n52K49j9J45n45M77l39P83k11m17k21J75N22p91
$$ 801 -354 -73 392 -270 -211 496 -56 193 174 319 -226 251 -88 695 484 67 -154 21 543 -248
4362b48O86o37k04O26k4l26N53m37R40j295J53M46k25m11Q42m52n44j35R95L79
$$ -248 438 -199 -403 223 199 -127 426 -11 929 -366 -213 233 8 -403 439 -13 -557 -692 303 682
4382F82m24n6Jl66n3N03n44r2J03N35k4M87m66K49o82l14L8L14L10O19p53l15
$$ 682 258 202 203 -163 -216 287 -257 -349 -246 289 265 752 286 535 -147 -461 -423 -109 201 820 67 -248
4404b48l15Q21k80L2K32l66r7R1R0P06m25L90o66m93O51l49J57N25j62p65J5O98
$$ -248 -563 258 -22 10 242 -124 -221 -130 -40 666 241 631 -35 -528 123 -226 -69 456 294 -471 -456 242
4426B42j64j039J132l10K34K12k12o61l09J415p80M4P0n1L34j092M81PM62l54
$$ 242 78 -961 171 -139 95 307 95 -566 -875 540 -240 -196 -126 -177 157 -935 -454 -447 15 -339
4446c39l73R67r36O25l17O33J35k40j08j41Q22r85Q6K73K1k08N78n35P52q48N46
$$ -339 -712 255 -681 -56 -373 260 395 155 47 -94 728 -257 -171 102 123 -85 493 -42 710 -138 408
4467D08l29Qk49N65J63l57j59J11J78J51o85M2P7N44l81k40M34M68p65j6M57k65
$$ 408 79 87 -162 403 566 209 50 161 339 490 -195 -153 -76 468 87 -153 281 749 -16 -32 425 160
4489A60k40j96L97j085K82M72J06r6Q7L87np18J1M72m0q47Q67L65o4K52m93k70
$$ 160 -80 -276 121 -964 -682 -210 -104 -200 -113 274 269 -449 -438 34 -6 -853 14 379 315 567 74 -196
4511a96J209r33p38Q61l73k84O39m7O8o69J76L28J1O44q55rM64l65o81K41J131
$$ -196 1013 80 -658 203 -170 -454 185 138 206 -463 -287 41 52 696 -159 -168 296 -69 -750 -509 622
4532F22j513J140o21J12K19mJ45J36J01K64p36k09R52j83J06j110N31R2L54m03
$$ 622 -891 249 -372 -260 -41 -45 100 236 337 601 -135 -344 608 425 531 -579 -48 44 398 -5
4552eJ89o19N08K9j84L76J61p72O52k49p72J023o53J048n42l44R4M3j1l32P33
$$ -5 184 -435 73 102 -82 294 455 -317 335 86 -686 337 -316 732 190 -154 -60 -17 -28 -360 373
4573C73k5n97L72l54k58P82m35l19J21N87k62m61J32M48o3J08o26J78j46O32n03
$$ 373 348 -249 123 -231 -489 293 -142 -461 -340 247 -15 -476 -344 104 41 149 -477 -299 -445 187 -316
4594c16R11j236N47j20N5K43K41K29pr90J059o62J62j08k49j86K21J049j241K96
$$ -316 595 -641 -94 -214 -159 84 325 554 547 -443 616 -46 116 8 -241 -427 -206 843 -398 -102
4614a02PN7l92Q15l14m39nL16Q0K5J7l24o57J095N7o3o35O99j39j65L35k16o03
$$ -102 -95 -38 -430 385 71 -368 -373 -57 23 48 65 -259 -916 179 236 173 -462 237 98 -67 268 52 -551
4637e51P3L33k63K02N64L63q00M5m47J07J40M92k76K65k83P78k81j92m03m25M70
$$ -551 -478 -145 -408 -206 358 721 -79 -34 -481 -374 -234 258 -18 247 -36 742 461 269 -134 -559 -89
4658h9k40k77N88K39l30Q41N3p98m37P23r39Q05M7m4p40P13N90k97r17R44M73
$$ -89 -329 -606 -18 221 -109 732 785 -13 -450 273 -666 139 186 142 -598 115 705 408 -509 435 908
4679I08j188m15J078n27o19O76n69J574r12k19O52n19p68O69O51j219l64J004
$$ 908 -280 -695 383 -144 -763 -87 -656 918 6 -213 439 -80 -848 -179 472 -747 -1111 -107
4697a07L93L66j168m1N02k19m77J57R52j04o3j078Q94Q0q19N74M14J23n64J141
$$ -107 286 652 -516 -557 -55 -274 -751 -594 358 254 191 -887 7 87 -732 -158 256 379 -185 956
4717I56q80p13P66q27O56L5j23k08L47q4J88k31P67k65M0m43j46O92l28l3m34
$$ 956 76 -637 129 -698 -42 -7 -130 -338 9 -75 113 -118 649 384 424 -19 -165 527 199 166 -268
4738b68O88l46k48N59j101K71J069n14r61Q82p0k70n54K087j484O06j4p11J09
$$ -268 420 74 -174 385 -716 -445 624 110 -851 31 -39 -309 -863 1224 -260 346 332 -379 -270
4757b70P92l53l31p94J238l06j45K6N87p57l12J009J16p12M65K09j004N52K87
$$ -270 522 169 -162 -956 282 -24 -169 -143 444 -313 -625 384 500 -212 253 462 -542 10 297
4776B97L6q91J89P59p9j79KL7k12J69j1P58j023N7M93o52J08K84l47J74j53M65
$$ 297 333 -558 -369 390 311 132 134 171 -41 128 117 875 -148 -91 402 -250 -142 142 -205 -31 -184 281
4798B81J15n09O90l23p77J258j99j081Q60m04k61%J72Q9n66L67P31l11p57J334
$$ 281 396 -113 577 254 -523 735 536 -545 315 -89 -350 -350 -178 -89 -655 -288 443 132 -625 709
4818G09j33o52q18J456m03k8K30k45k39l99R08l35J36o49O47l49m02J194r67K04
$$ 709 576 -76 -894 562 159 131 361 116 -123 -522 386 51 187 -462 185 -164 -566 628 -339 -135
4838a35l36J111l25l58m13P08j000J029l18j75l50L14K45j94j84M90J27N9m3j77
$$ -135 -471 640 315 -43 -456 252 -748 281 -37 -212 -562 -248 -3 -197 -381 109 236 295 252 75
4858G5n3j39P65p59L89L42n47n49P35k47K13k89qn5M51M80k41o35j98M0O5j76
$$ 75 22 -117 648 -111 278 620 73 -476 259 12 225 -64 -72 -127 324 804 563 -72 -270 -230 -165 -341
4880c41J9K20O99q24L65N54l55k31j10m10K21K19J2J59J52K4j201Q60m9J22p66
$$ -341 -322 -102 597 -227 138 692 337 106 -4 -414 -193 26 38 197 349 373 -828 32 -17 105 -661
4901f61Q38j25n21r3K6P51j27m3m08J1K81M05m95L79j58M57o79p0J07L22p9MJ230
$$ -661 177 52 -469 -562 -536 215 88 45 -363 -352 -71 334 -161 218 60 517 -162 -232 -125 197 118 122 1352
4924A352j241o49L28L21j35K81L72j086N89o08O1M85n37K87m54K38J34k99J08
$$ 1352 111 -538 -210 111 -24 257 629 -457 132 -476 -415 70 -467 -180 -634 -396 -262 -561 -453
4943d53K74O34k07k57m93O69j57p70J252o85n67J054m05R87j651L68Q46K95o37
$$ -453 -179 455 248 -9 -502 167 10 -760 492 -193 -760 294 -111 876 -775 -407 439 734 97
4962I7k48l10O15K59q37l1N30O1k91N91j006R87j86L04j51o57J78O62J7j119J114
$$ 97 -151 -461 154 413 -424 -455 75 136 -155 436 -570 417 231 535 384 -273 -95 567 584 -535 579
4983E79q4m75K58m67J39o07k73J201m77J26L66m0m9j34M7l67j65Q33K81p12o55
$$ 579 495 20 278 -189 -50 -657 -930 271 -206 -80 286 246 197 63 110 -257 -422 411 692 -20 -675
5004f75R65q34Q11K04q30O64j95M28L12q95K02J61j4n52q7M21o88Q29J00p7l52
$$ -675 290 -544 267 471 -359 305 110 538 850 -45 157 318 304 -248 -335 86 -602 227 327 250 -102
5025a02M19l55M52j36n22L07P2O5m80J2K95K27l35K42P9l74n58J173l29l62j39
$$ -102 317 -38 414 278 -244 63 135 200 -280 -268 27 254 -81 161 240 -134 -692 481 152 -210 -349
5046c49N06J77j15m65J49J80J07J01k30J20l89N44k95k58N52p46M29P55p81n10
$$ -349 157 334 219 -246 -97 83 190 291 61 181 -208 336 41 -217 335 -411 18 773 -8 -518
5066e18k73J344k92j174R80N3p51M33k27L41l11N39L2K10q2m25k39k75K73N42
$$ -518 -791 553 261 -913 67 120 -631 -198 -425 -84 -395 144 176 386 304 -121 -360 -635 -362 180
5086A80l47J29J69j22J50p16K75K01K59N25j166M13oJ97n76m0L45P81K65Ml38
$$ 180 -167 -38 131 9 159 -557 -282 -81 178 703 -463 -50 -56 141 -435 -475 -130 651 916 920 582
5107E82q59R21j139k3Q60n20J50m60O42n43P4P79l13Q4p81Q41p37O03l14k58J303
$$ 582 -277 644 -495 -518 342 -178 -28 -488 154 -389 -315 464 151 235 -546 295 -442 161 -153 -411 892
5128H92k185R15R77m76r0O07l48q22R31O7o14R16o49P9r99O81r9n61O79R40j062
$$ 892 -1293 -378 599 123 33 640 292 -530 401 468 -146 770 121 200 -799 -118 -217 -778 -99 841 -221
5149b21O8k22P77j97k29J3r8P94p50N64j589J306K39n35l63O93M17j342J115n2
$$ -221 -153 -375 402 205 -24 -11 -109 685 -65 499 -1090 216 455 -80 -443 250 667 -675 440 388
5169C88j009M96Q15l1k80n11K44j28K1j26k03l2P13o25N31k16j12M03m35M93p32
$$ 388 -621 -125 690 659 379 -132 112 -16 5 -121 -324 -356 357 -268 263 47 -65 338 -97 396 -336
5190c36J026j364O53J41j607J004P5J003n28k43k74O35m11Q92p29k49K86J67m05
$$ -336 690 -674 -21 120 -1487 -483 -408 595 67 -176 -450 185 -226 666 -63 -312 -26 141 -264
5209b64r3M75n4n9j37o3M56n83M67l74L27L49K38r41O06Q3l37q7l29M18m09N18
$$ -264 -357 118 64 5 -132 -195 261 -322 145 -229 98 447 685 -256 350 433 96 9 -320 98 -311 207
5231B07K20m86L70l37O44j065P63J1n83l14J24P7Q06n32p07O33O62k8o08k77N52
$$ 207 427 -59 311 -26 618 -447 316 327 -256 -570 -446 -369 437 -95 -802 -169 493 465 -143 -420 132
5252A32J5k77M35P0J9l65n4m69Q64k53m7N80q10M32l91J054m54r94P64m00M25
$$ 132 147 -130 305 375 394 29 -25 -494 370 117 70 650 -160 272 -119 935 481 -513 251 -149 276
5273B76l35J99M9o13Q88K28n68j26M67r46L72R72q73k48J50j34p9m12R07o91P39
$$ 276 -59 140 189 -424 464 692 124 -2 465 -481 -109 863 -10 -258 -108 -242 -321 -733 174 -517 222
5294B22p57P70pq65P38K60jk39O76j341N56l64K89J93L82m12K89j40m70L75O92
$$ 222 -535 235 228 -637 101 361 360 121 797 -544 12 -352 -63 130 512 100 389 249 -221 154 846
5315H46o92M56Q7j03l41J3K79k34l81m47K50K04K0L75n26J54p67P18j31L00o10
$$ 846 154 610 697 594 253 266 545 311 -70 -517 -267 -63 -43 332 -194 -40 -807 -89 -220 80 -530
5336e30J91N37Q7K69m13o5m65M7O14j79m70k32M67k1K8O97j089K15j33M49k67
$$ -530 -339 198 285 554 141 76 -389 -342 272 93 -377 -609 -142 -163 -135 562 -527 -312 -445 4 -263
5357b63k74J037j087O28P72l12o63k8M39o35pR65p23n40R40J18q77k88J031l78
$$ -263 -537 500 -587 41 813 501 -162 -190 249 -386 -393 572 -151 -691 249 367 -510 -798 233 -145
5377a45l41P81O3p56O15k24L36m66M76n3l03m7M14j98j197J078R6j32q2O70n30
$$ -145 -486 295 358 -398 217 -7 329 -137 339 286 -17 -64 350 152 -1045 33 129 -3 -85 585 55
5398E5j25L11n14O01mk01Lr8k58L08k03k98J44Q52p25N1j57L41n83L15n4PQ26
$$ 55 -70 241 -273 328 324 123 126 28 -230 78 -125 -423 -279 573 -152 -101 -258 83 -500 -185 -239 -232 594
5421E94j19j148Q97p24L40J15M38j29n09o3Q89P5r38P2J89k45j16M38Q7k33k19
$$ 594 475 -673 224 -500 -160 -45 393 264 -245 -308 581 656 -282 -210 -21 -266 -382 56 143 -90 -309
5442c09N99L67m38j32J10K16m90q2K11J92J47o1k65j57L26L47o98J99L0n22k17
$$ -309 290 657 219 87 197 413 -77 -159 52 244 391 330 65 -92 234 581 -117 82 112 -410 -627
5463f27O24M78o34O36L66r91O2O86o22J78J35L29n6o98N93L09o25O16r35m0N40
$$ -627 -3 475 -159 477 843 -148 -86 600 -22 156 291 620 564 -134 459 768 143 759 -176 -216 324
5484C24l64K7M7l11L33p5L73O00p94Q4O0r76L73O65l12q0M19M24k16k84m88R24
$$ 324 -40 -13 34 -277 56 -19 354 954 160 244 304 -672 -299 366 54 -26 393 817 601 317 -171 753
5506G53j50l89K78l54J16o66P28l53K90j40j0K02p71N43J7p98N15o64P27N55m40
$$ 753 603 214 492 138 254 -412 316 -37 253 113 103 305 -466 77 94 -704 -189 -853 -126 429 -11
5527a1j78j13Q34n38k36N78L71j88p65N22j17J23l60N56n48r7L1l91l46J526n16
$$ -11 -189 -302 532 -6 -242 336 707 519 -246 276 159 282 -78 478 -70 -167 -136 -527 -873 653 137
5548A37k35R4K03L49j284L98k11O03k25m02J17j2k74N04Q03n70K1P3R7m82L75
$$ 137 -98 -4 199 548 -736 -338 -549 54 -171 -573 -456 -468 -742 -238 565 -5 16 89 186 -296 79
5569G9J80j05k70J116j120m0K05k87n6P56j31k96r1L82J97k86j18j29r12M66Q20
$$ 79 259 154 -116 1000 -120 -160 45 -242 -298 458 327 31 -60 322 519 233 115 -14 -926 -460 360
5590C60r21j51J237k82o19j67Q29m67r0J86K03l42o7K32O3K20l18L59p50O5N00
$$ 360 -561 -712 525 243 -376 -543 286 -181 -271 -85 118 -224 -291 -59 4 224 -94 265 -485 -420 80
5611H0m94P42m21m81M22L74n62J49m55N69n7l14N65N80k70n09J71o46M25R28m07
$$ 80 -414 328 -93 -574 -152 222 -340 -191 -646 -77 -134 -448 117 697 427 -82 89 -557 -132 796 389
5632C89o80j8O86o09K60m5l03L42J88n12N90j18l34K61J9L35l20j20k12r9L49
$$ 389 -291 -309 377 -232 28 -17 -320 22 210 -302 288 170 -164 97 116 451 131 11 -201 -300 49
5653D9j62k30O3O59o2k05m93K04M0L02l97O67j069P77L2k48n39Q54m2o57N38N07
$$ 49 -113 -343 -280 379 317 112 -381 -177 -137 165 -232 435 -634 143 175 -73 -612 242 200 -457 81 588
5675E88n22j16j60L12q5m96P86q88K3J97L82J89l0j6m53K59Q1r81J122q06J086
$$ 588 66 -50 -210 102 17 -479 307 -581 -558 -361 21 210 180 164 -289 -30 51 -930 192 -614 472
5696D72l80J03L62l25n23K30L33n44K26k92M42m94M41l74N26m66R31m21j54J45
$$ 472 92 195 557 232 -291 -61 272 -272 -46 -338 104 -390 51 -323 203 -263 668 247 93 238
5716B38p26N85L60l91m63K72k67o18R06j04K04J17M8K16k69J5m86R69p45l93J064
$$ 238 -488 97 457 66 -397 -125 -392 -1010 -104 -208 -4 113 161 377 108 123 -363 606 -139 -532 532
5737E32k79p39J24N24l74K22M92n95j48M55K84j054K23P49r0o33r1Q32m83L36
$$ 532 253 -486 -362 162 -212 10 502 -93 -241 214 498 -556 -333 416 326 -307 -398 434 -49 287
5757B87k40j07N2m26J604r01m22J25J14J04j75J73k98k84l35J028o04M24p10J204
$$ 287 47 -60 -8 -434 1170 269 -153 -28 86 190 15 188 -110 -394 -729 299 -305 119 -591 613
5777F13K35j086Q55o23L62L11j267M49L50l84k18R07l13k85J19m64JP26n4J06
$$ 613 848 -238 617 -6 356 667 -600 -151 199 -185 -403 504 191 -94 25 -439 -438 288 234 340
5797C40k32k71L38q4o59R89k50K17m48k24M05K9o41J128p11K52K41p95n2J19J65
$$ 340 108 -163 175 91 -568 421 171 388 -60 -284 121 150 -491 637 -74 178 419 -376 -428 -309 -144
5818a44J14r26N40R61k01l07j40N46l5k82l08P0l37N09k53J14L67k05j97K09J11
$$ -144 -30 -956 -416 545 344 37 -103 443 408 126 -182 -112 -449 60 -193 -79 288 83 -114 95 206
5839B06k35J62m5O0p55N41M66q69K24M08n2k84N45j144N25P3Q82r91M54j14m89
$$ 206 -29 133 88 148 -607 -66 400 -469 -245 163 111 -173 372 -772 -247 -174 708 -283 171 57 -432
5860d32K81Q0O8J90n28l03Q22J65k33o71O0M31l8K5P3k29K2q2m01N00J21L97k25
$$ -432 -151 -71 -3 187 -341 -644 178 343 110 -561 -501 -70 -108 -83 -10 -239 -217 -299 -700 -200 -79 318 93
5883I3l51N39o77K96p0M24j000R81l34m81O63O15j106m04K49Q70m66o1k31O91
$$ 93 -258 281 -396 -100 -170 254 -746 235 -99 -580 83 698 -408 -812 -563 307 -159 -220 -451 240
5903B40l62j07K36J23p40L34L57M8J4l22L9J005k11o51q6m79J012n66J95p93M70
$$ 240 -122 -229 7 130 -610 -276 81 129 143 -179 -140 865 654 3 -83 -562 450 -116 79 -714 -244
5924b44n27J041OJ067j234N8n91J01j34L3J54K67L34m69o8Q25n31m44m70J009
$$ -244 -771 270 276 1343 109 167 -424 -323 -457 -424 -270 -3 331 -138 -206 619 88 -356 -826 183
5944A83m22n08L97O70o8k06Q10m85K27p53K95N41q44J03O58j88j13k47J97l33
$$ 183 -239 -747 -350 320 252 46 856 371 598 -155 140 681 -163 -60 598 410 297 50 247 -86
5964h6P1m84L47P66m74l38J181j097O32Q0r80L52L01k20L04k30j05n61P05l56
$$ -86 -15 -499 -152 614 140 -198 983 -114 518 598 -382 -30 271 51 355 125 20 -541 164 -192
5984a92O83m47L77j60j9J64M0p11R05j56j014M90K17m28n44O95J82P7k03K99L28
$$ -192 491 44 421 261 242 406 446 -265 640 484 -530 -40 177 -251 -795 -100 82 159 -44 255 583
6005E83j132J011k82p40R14m92q84O02P1P48m0n36P77m06p85Q17K82O56n04r95
$$ 583 -549 462 180 -560 354 -138 -1022 -420 -349 399 359 -177 600 194 -591 226 508 1164 660 -335
6025c35L96j29Q8j94M72J09m92M11P2l91P27r85K40J42J7L97q91k69J54K76P6
$$ -335 61 -68 20 -174 298 407 -85 326 398 7 734 -251 -11 131 148 545 -346 -615 -461 -185 -109
6046a09O18K46j80O8n08l35L38K06o30N92m22j251J617o21J23K03R0L74m58K85
$$ -109 509 755 575 643 135 -200 138 344 -286 306 -116 -1367 250 -371 -248 -45 45 419 -39 246
6066B46M0P18j132J12K58q39Q68m20M34k66k40K7P11r56J052j083k77N61O78j047
$$ 246 286 1004 -128 -16 242 -597 271 -149 285 19 -221 -194 517 -439 613 -470 -747 -186 492 -555
6086e55k52J471q34K78K42j18o04O1K77K58l06j48L98P64n53O72j010j72J60K57
$$ -555 -807 664 -170 108 350 232 -372 -311 -34 224 -82 -230 168 932 379 1051 41 -131 29 286
6106B86q83j89J291m44M71k34o85Q57p22k25M16J96p0J97j78k79p5K62l41L43
$$ 286 -597 -786 505 61 532 298 -387 470 -252 -477 -61 135 65 262 84 -195 -270 -8 -349 -6
6126fL43q48J090K19p41N88p96J036j848Q96L8l38M14j184J952j335N34l1K30
$$ -6 337 -511 579 798 57 645 -151 885 -963 -67 -29 -367 47 -1137 815 -520 14 -17 213
6145B13k17L9o39N45K39l85j51J94J75N71k84p91J89J77o46L62J04r2R39l38K50
$$ 213 -4 35 -604 -59 180 -205 -356 -162 13 584 300 -491 -302 -125 -771 -409 -305 -397 542 204 454
6166D54o84K68m71N28j25m52l92O01J72L66m21j19J098j170J396q08p75O69k02
$$ 454 -230 38 -433 95 -30 -482 -874 -273 -101 265 -156 -275 823 -347 1049 241 -534 135 -67
6185f7k95P17l82l07M01j88L16J60l12j188J332n82j20L27N12q61N37m12O65q38
$$ -67 -362 355 -27 -334 67 -121 195 355 43 -1145 187 -395 -515 -188 324 -537 0 -412 253 -585
6205e85M6J50Q73j15o78Q43P33l1m38l38j022J094n81J17n8k83O9K90j86Q23m7
$$ -585 -539 -389 484 369 -309 534 1267 1236 798 460 -562 532 -49 68 10 -273 -204 86 -100 723 676
6226F76p31M24M32j80p96J93l00O85k62o24o40J307m88j3P97L29k5j087O47k32
$$ 676 -55 369 801 621 -175 18 -282 403 141 -483 -1123 184 -304 -317 480 809 784 -303 344 112
6246A12K03l34j37Q96r26J10o64N67n94J183Q3o28N75m95R24j025P02p98M52m27
$$ 112 315 -19 -156 740 -186 -76 -740 -173 -767 416 499 -129 446 -49 875 -150 552 -246 206 -221
6266b21m00O80m80J84M00k80n98J179l12q5J45J08l04j00N14k83n30KP21q89O74
$$ -221 -621 59 -421 -237 163 -117 -715 464 152 67 212 320 16 -84 430 147 -383 -381 340 -549 125
6287A25o11K14K62N05r15Q06r0j26P84j806J466k49r44N02m25L98M41L14n7n16
$$ 125 -486 -272 -10 495 -420 386 296 170 954 -852 614 365 -579 -77 -502 -104 337 651 594 78
6307G8M31n18L16o10L08O79q87O38o39J20Q8n89K51m37J541p41N12p21K33L20
$$ 78 509 -9 307 -303 5 684 -203 435 -204 -84 4 -585 -334 -771 770 29 541 -180 53 373
6327C73j00k91J34M89q3m09m01J73K67L18p11K81J41K10o71M77p09O27m78L77
$$ 373 273 -18 116 605 522 113 -288 -115 152 470 -241 40 181 391 -280 197 -512 115 -363 14
6347A4L59j179P26J6k34l28O71j54k71J38P23o65K41N64l46l22n07M70lr23J218
$$ 14 373 -806 -80 -64 -298 -626 45 -109 -380 -242 481 -184 57 621 275 -47 -554 -84 -87 -1010 208
6368B08J21j86N5N22q05k58N11P07o33m08Q73p18K68l56J98k46q7M30r8m83M08
$$ 208 329 143 198 720 -85 -343 168 875 242 -166 707 -11 257 -99 99 -147 -234 196 98 -385 23
6389B3J52J46j20O6l3p76Q07L08j051r19J747P9k07Q9r7l38q4N30N24q11K66o97
$$ 23 175 321 201 267 234 -542 265 573 -478 -1397 350 429 222 311 214 -124 -208 322 846 35 301 -396
6411c96l15O79L85q74L14j28P70o11J93m5l11L82L14L53o18M2K65l68K46j208
$$ -396 -711 -32 353 -521 -207 -335 435 -176 17 -28 -339 43 357 710 92 134 399 31 277 -931
6431i31J244J03q06K94J32j52l49K70L97M72l40L27j085J098L37o07K7j280N09
$$ -931 313 416 -390 -96 36 -116 -465 -195 202 674 334 661 -424 674 1011 404 431 -849 -340
6450c40j5N17N03j215R19n98O82n94J0Q5K96o15k8J72o98K69J070q62P13m01K28
$$ -340 -355 162 665 -550 369 -229 453 -141 -131 -46 250 -365 -393 -221 -919 -650 420 -442 271 -130 98
6471I8J60q3M2M07k08k61o20J244m61n79j02L08N01m23q8M49j81k49N19o21l8
$$ 98 258 175 217 624 416 155 -465 779 318 -261 -363 -55 446 23 -65 384 203 -46 473 -148 -186
6492a86L19k98j07k84M58K69o84M29o3K4M90N60l40q05K25l73m56O74l6K24j53
$$ -186 133 -165 -272 -556 -98 171 -513 -84 -147 -123 367 927 587 -218 7 -366 -822 -148 -184 40 -113
6513a13K96L0J71r57J057o22K61q35L69M15j52k34O72j190K36L23n97J066j83
$$ -113 183 213 384 -573 484 -138 123 -712 -343 72 -80 -314 358 -832 -596 -273 -870 196 13
6532A3O74R6q16J12N59p02l51J280j458j45J068p03J59n18M17J13L98k25M18l82
$$ 13 687 783 -33 79 638 -64 -415 865 -593 -738 330 -373 -214 -732 -315 -202 196 -29 389 7
6552GP6J97k41Q22m08n14R5j11n54J154j074L54L67n66J246p88K92o22L23J91
$$ 7 83 280 39 861 453 -61 34 -77 -631 523 -551 -197 170 -396 850 62 354 -268 55 246
6572B46P2j91Q7p38L17J95K82j09l35L13N98n43O6N58o79l0n70N04J18J22n37
$$ 246 318 127 214 -524 -207 -12 270 161 -174 139 737 194 260 818 139 109 -461 43 161 283 -254
6593b54O42l95K6J22j07M06n08N71m51m12R83J62p52j93k39J91k72J97o3N06k0
$$ -254 388 -7 19 141 34 440 -68 503 52 -360 623 785 33 -160 -399 -208 -480 -283 -346 160 140
6614A40L67l80j73L70n78K13Q08k83r70L08R4p6J99K81j091M45N13K57m65L03
$$ 140 507 127 -46 324 -254 -41 767 484 -486 -178 -84 -160 39 320 -771 -326 187 444 -21 282
6634B82Q66p46n78o0L77j025Q94p69Q11m75J35Q88qj61n37l1J09L0J34m37k35
$$ 282 1148 402 -176 -236 141 -884 10 -759 52 -423 -288 600 592 431 -106 -137 -28 2 136 -301 -536
6655e36N39J67p95M7L82K00l17O26j61k87O52m3l14K13K12j295M99J15R9k0N25
$$ -536 3 170 -625 -578 -196 4 -313 313 152 -135 517 474 160 373 585 -710 -211 -96 3 -17 508
6676E08Op12o8Q61q5j113R33k18l84J23J16o36J29K17N47m86N91r95O14K86m93
$$ 508 514 -198 -266 595 510 -603 330 112 -272 -149 -33 -669 -540 -323 224 -262 329 -666 -52 234 -259
6697b59L11k22j74N4P54o83l80M02p68Q62k71M21k96N40m19k56P13K03l7p94L04
$$ -259 52 -170 -344 -290 464 -219 -599 -197 -965 -103 -374 47 -249 291 -128 -384 329 532 495 -299 5
6718Ej31K66n25M24L7l89K75L90j288P01N28p65M81L69k00p12N39l88L42k52o2
$$ 5 -126 140 -385 39 76 -313 -38 352 -936 -235 293 -472 9 378 178 -534 5 -383 -41 -293 -355
6739c55O05o38Q39k33L14J57o30M93P6l75J27j71L3o63L56q7K7k21Q32q9j18O8
$$ -355 250 -388 451 218 532 689 59 552 628 253 380 209 242 -421 -65 -152 -125 -346 486 397 279 347
6761C47l01j55j19M60m00L56o4j205J436p00j30L02K29P75j137N82q50K340j446
$$ 347 46 -109 -228 232 -168 188 124 -1081 355 -345 -475 -173 56 831 -306 276 -574 1766 320
6780C20o82l11J043j073O1R57k72q62J350j049L04Q38o47J14m73K56L57o74N05
$$ 320 -362 -673 370 -703 -642 315 43 -819 531 -518 -214 624 -23 91 -382 -126 231 -443 62
6799F2J19m92M20pl41p26J059q55P85O75q60l54L68K3M93n07l5M60m56j06L47
$$ 62 181 -311 109 102 -239 -965 94 -761 24 699 -161 -515 -147 -124 369 -138 -173 287 -169 -275 72
6820G2L22m37j28K92J46L47o87j28M72J53m75k46r72J516K87j190M02P6Q74r55
$$ 72 394 -43 -171 121 267 614 -73 -201 271 424 -51 -297 -1269 247 534 -656 -254 -178 696 -259
6840b59N6R26r25K19m28O73P45j189j19J8m07R77J11r30N60L31k60OK44j47k86
$$ -259 -203 723 -202 17 -411 262 1007 -182 -301 -283 -690 287 398 -532 28 359 99 105 349 202 -84
6861h4K90k11l39k75j78M16P4N73K06m06M08m42N60p2q13Q91o29M15j17K41j010
$$ -84 206 -5 -344 -619 -797 -381 -307 266 472 66 474 32 592 520 -293 598 -31 384 267 508 -502
6882e02K50O99k47k90j69R55o97N21m19l08N37J22j41j062M87M3l9n93Q60l2J25
$$ -502 -252 447 200 -90 -259 696 -1 520 101 -207 330 452 311 -751 -264 -221 -260 -853 7 -25 100
6903A00o33O29L71q32M07O89o29J6J95k56m4J6l60J37P25q93L67l87K32N48m02
$$ 100 -533 96 467 -365 42 731 102 118 313 57 13 29 -331 -194 531 -362 5 -382 -150 398 -4
6924dn65n45J198K83n29M91kj26j057L43l39P52J27N27l82l08o67Q07N20l46J86
$$ -4 -569 -1114 84 367 -162 329 327 201 -856 -513 -852 -100 27 554 172 -136 -803 4 524 178 364
6945C64l85l76J91K46n68N91R30p56p3j06O04j69m98N6J18M11l02q45P41n13r0
$$ 364 -21 -397 -206 40 -528 63 993 237 164 58 662 493 -5 51 169 580 278 -567 174 -339 -429
6966d29J90l3L45Q22m99l0N65n0n72k20r46O72J23r47P93P50j581J608L94l98
$$ -429 -239 -272 73 895 396 366 931 881 309 89 -857 -185 -62 -1009 -216 534 -1047 561 955 557
6986E57o24O38j39n51o51M40k05O16k39PJ85o75J38M59L58o0M7M4j0J29J19L11
$$ 557 -67 571 432 -119 -770 -330 -535 81 -158 -151 34 -641 -503 -44 314 254 301 345 335 464 583 894
7008H94j356K75J076o67p43M41N53n57M46m19l71j86J503j641J086K73j43n66
$$ 894 -462 -187 889 222 -521 -80 473 -84 362 -57 -428 -614 889 -752 334 607 464 -102
7026a02r2O42j95p46K21k95Q66l63R22o88p66J215j028R38n17O3q29O89K93q55
$$ -102 -194 448 253 -493 -272 -567 299 -64 858 170 -596 619 -409 529 12 75 -754 -65 228 -627
7046f27O88O76o20l9L82m06n6J22k37m21J085l18m0j73J79n09J68L39K40n17n68
$$ -627 61 737 117 78 460 54 -2 120 -117 -538 547 229 189 16 195 -314 -146 193 433 -84 -652
7067f52O39r49J685n46J82k84O51j390M65L84p62P12L46k43J70K04K23q52j17
$$ -652 -13 -962 723 177 359 75 726 -664 -199 185 -577 135 481 238 408 612 835 -17 -134
7086a34M33m5k59o58M02J72k85R48p86J7L5K69rq46Q97k4m86K31O91p70m9J79
$$ -134 299 254 -5 -663 -261 -89 -374 574 -212 -195 -160 109 100 -746 151 127 -359 -128 563 -207 -256 -77
7108g7M07k34j60P99n17O98J27j035n82P42J71p06K84j61N81j223K70J035o15
$$ -77 330 96 -64 735 218 916 1043 8 -574 168 339 -367 -83 -244 337 -886 -616 419 -196
7127a96j17Q00o84K63q8P03p51j97J26J89N99n97K61k38j42N02o33l16P8L35m27
$$ -196 -313 487 -197 66 -22 681 -70 -267 -141 48 647 50 311 73 -69 433 -200 -516 -438 -103 -530
7148e30M89K3K59n12L32po17Q89K19l39l65l26Q70k60j39m55K58R7J71M85K34
$$ -530 -41 -18 241 -271 61 54 -563 326 545 206 -159 -485 385 125 -14 -469 -211 -114 57 542 776
7169G76j120N19m0J42J61j1l02p75Q94l03L4L75p49N74r5M5O2m30K11q36J045
$$ 776 -344 175 135 277 438 427 125 -650 244 -59 -25 350 -399 175 80 125 187 -243 -32 -868 177
7190A77m94L51m32O41l87P33m56j05k26M61q57J72K71m9j78M07l06Q4J58J44o16
$$ 177 -317 34 -398 243 -144 589 133 28 -198 263 -594 -422 -151 -200 -378 29 -277 -193 -35 109 -507
7211e07j80J435q69m12J095o23O03n41l05P55m70m00p9R26m04j22L52o5k8p57
$$ -507 -687 748 -121 -533 562 -61 542 1 -304 451 -19 -419 -498 428 24 -98 254 189 161 -596
7231e96Q73K05j96l56O68K07q67q0k02L89j63Q85j554J810j81p60K43Q9p01K60
$$ -596 277 482 286 -70 598 805 -62 -142 -344 45 -118 767 -787 1023 842 82 325 414 -287 -27
7251b7L01q39N13mj83o0J33K90n17N67K49p02L06k49N52m41p31R16j03L51r73
$$ -27 274 -565 -52 -56 -239 -299 -166 124 -393 174 423 -279 27 -222 330 -111 -842 74 -29 322 -651
7272f51J017j11o20Q12p91R70j276L66O73l67p22R37r61J140q74K60n80J503m89
$$ -651 366 255 -365 447 -344 626 -650 -284 389 22 -700 237 -724 416 -458 -198 -778 725 236
7291B36k66k6K92j49j05J63N59j38r12N19J45j356P02P10r8p05N61l2K45L55R14
$$ 236 -30 -56 236 87 -18 145 704 566 -346 173 318 -1038 -336 374 276 -429 132 100 345 700 1614
7312A614j455m04L10K53p80M66j0K8m09K48R7m34M42K98K33p18K12p7M53j59k39
$$ 1614 159 -245 65 318 -462 4 -6 22 -387 -139 -42 -476 -34 264 497 -221 -9 -86 367 208 -31
7333c1J73Kj41j069O06R38Q4n44J95K40o14L98p8L00n85L39M46o54l67L08n11
$$ -31 142 144 3 -1066 -460 478 562 18 213 453 -161 237 159 459 -126 213 659 5 -362 -54 -565
7354e65M84o7O55m47r5m41L29N51n98r9M96p48L45L38op77K47P48o10M06L04J5
$$ -565 -81 -148 507 60 -35 -476 -147 404 -194 -293 203 -545 -200 138 132 -645 -398 350 -260 146 450 465
7376D65j27J18n44J84q75R15o39l6K11L76M49k15j1K55j64Qo59N00n36l7N5P19
$$ 465 338 456 -88 96 -779 136 -503 -539 -328 48 497 282 271 526 362 370 -289 211 -325 -362 -307 412
7398D12J48m75L55o21L00n6K26l12J07M39M2m96k79J4J006k49o98M33J82o6l89
$$ 412 560 85 440 -181 119 63 289 -23 84 523 565 69 -210 -196 810 561 -137 296 478 412 23
7419B3L66j62o6l12n23O67p6K36l87N78l24j97L22M76R0m36r7N7o42O11J41j26
$$ 23 389 227 161 -151 -674 -7 -83 153 -234 344 20 -177 145 621 711 275 178 235 -407 204 345 219
7441B19l54L96j34n93J73P90p54J69L63m73J51j0K08J17M2q33O78k32k67m24L47
$$ 219 -135 261 127 -466 -293 497 -257 -88 275 -198 -47 -57 151 268 310 -523 155 -77 -344 -768 -421
7462d21O00M72k14k66j30l61N37k80J20l65L51o73R08nq07K44Q03p74J73L5N30
$$ -421 179 651 437 171 41 -320 217 -63 57 -308 43 -630 278 273 -534 -290 513 -261 -88 -53 477
7483D77k6m06l42R04J1j004N83j26J04j3l78K53j50o25J020m54l1L75o3M27o15
$$ 477 451 45 -297 607 618 -386 197 71 175 162 -216 37 -113 -738 282 -172 -203 172 109 536 -79
7504g9j17K45M47j064J71M5O4L97p32J91N84K20j218P88j23L19k93n2N04K50q75
$$ -79 -196 49 496 -568 -397 -352 -288 109 -623 -432 152 372 -846 -58 -181 138 -155 -207 297 547 -328
7525c28P81o33L36m4l66M85J06l94L77p16Q19n06q5J38K23k74k5M41q29O16o38
$$ -328 453 -180 156 112 -254 231 337 -57 320 -396 423 -83 -168 -30 193 -81 -106 335 -494 122 -516
7546e16M26J13j1J26K43k46O5j81l10j03K58j52M95j174J194L43j101J494l36
$$ -516 -90 23 12 138 381 135 200 19 -291 -394 -136 -288 207 -967 227 570 -531 963 627
7565F27j17p67N53j36j3j06l89M23J99p3K75r18O27n56R4j35j8K33J69n2k09M25
$$ 627 510 -257 296 160 147 41 -348 75 274 201 476 -442 185 -371 -277 -412 -430 -197 -28 -80 -289 136
7587A36j61P82o51P6K27o20N20M8p97M60Q05q52k50K15k77J24L30r9k73P13l72
$$ 136 -25 757 106 182 409 -211 309 357 -440 20 825 -27 -277 -62 -339 -215 115 16 -257 456 84
7608H4N85j13n71N41n72r6J75K14R20j388O61N2l88k56P2k21q9P8J80J62L46j02
$$ 84 669 556 -15 526 -46 -142 33 247 1167 -221 440 492 104 -152 -80 -301 -390 -312 -132 30 376 274
7630B74r2n79M38J79o83m8r5J285r83O14m64j59j79P13J61j101Q08k11L25prj7
$$ 274 182 -397 41 220 -463 -511 -606 679 -304 310 -154 -313 -492 221 382 -719 89 -122 203 196 187 170
7652A70n54K22J044o5j166M44lK32l39p21J321n02l49j37j85j18Q82m12L61L71
$$ 170 -384 -162 882 817 -349 95 92 324 -15 -736 585 83 -266 -403 -588 -706 176 -236 125 496
7672D96q22O02o13Q50o17N6j78N71K1j90K9O99j172O05q5m31J31k26l5o70R74
$$ 496 -326 276 -337 513 -104 -48 -226 345 366 176 205 904 -268 337 252 -179 -48 -274 -309 -979 -5
7693eM42m25k33O24k6r89j01J150j13R5K3l8j181P76k27N14r4q1n41N54K29l18
$$ -5 437 12 -221 403 377 -612 -713 437 324 419 442 404 -777 -1 -228 286 192 111 -430 124 353 35
7715C5K06p96M35P6j77Q15p88L42k69k28L89j70o05J475n59q40J022j89p43j53
$$ 35 241 -555 -120 -44 -221 594 -194 148 -121 -349 40 -130 -735 740 181 -659 363 174 -569 -722
7735g22R74q8l99R25p39K82r67O71m73L27O74k76K48k53r0l63L15k86L57n54O68
$$ -722 252 164 -235 690 -49 233 -734 -63 -536 -209 465 189 437 184 94 -269 46 -240 117 -437 231
7756B31P4o04RQ79J7q20R38o97K82l03j3N34j37l40o67J62K98J85O6j59J012q73
$$ 231 305 -299 -290 589 606 -214 724 27 309 6 -7 527 390 50 -617 -455 -157 28 94 -65 947 74
7778G4m92N6K05K02l68JN32o99L06K60k78J8M31O28j585J360o36J42k26n65N48
$$ 74 -418 -362 -157 45 -323 -322 210 -489 -183 77 -201 -183 248 876 -709 651 15 157 -69 -634 -86
7799h6RM29N4r25R0P44j191Q20r6L0L58p11J67N76o33K14L38Q9j06m74J066m98
$$ -86 -77 352 406 -519 -429 315 -876 -56 -152 -122 236 -475 -308 268 -365 -151 187 276 170 -304 762 264
7821B64k2k66L33p6l11k39M30l66O85k82n94O78J43L9q19P51P4k90j56J46l83
$$ 264 242 -24 309 233 -78 -317 113 -253 432 150 -444 234 377 416 -403 348 422 132 -24 122 -261
7842b61J12kJ82K46o77O41n32P69k89r26Q37m18J82p6p3R78o58j95M14K00j09
$$ -261 -149 -151 31 277 -400 241 -291 478 189 -737 100 -318 -136 -212 -285 693 35 -160 254 454 345
7863C45l70L94l74p39R50J65l13o6L74o21k91Q88n71O15p71J167j24l38o60M80
$$ 345 -25 369 -5 -744 206 371 58 -8 366 -255 -546 342 -229 386 -385 782 658 320 -340 140
7883A40K99n67N41p18oR2P1Q36Ol28j58l38p08J84K93K41k98j60J15M02k77M35
$$ 140 439 -128 413 -305 -311 -219 -148 688 694 366 208 -130 -838 -654 -361 -120 -418 -578 -463 -61 -338 97
7905I7M6L40l34M9L05j43j25m87K16M17q50P64r3K00J25m64k24J19l8m47K56M9
$$ 97 143 483 149 198 503 360 235 -252 -36 381 -469 295 202 402 527 63 -161 -42 -80 -527 -271 -222
7927b22M98j33j81k12O49k63j88k45M86j72J69m13N74l94M60p43L94Rm96P15l51
$$ -222 276 143 -38 -250 399 136 -52 -297 189 17 186 -227 347 -47 413 -330 64 73 -423 292 -59
7948e9M69n18P44r55P12l90P16j036L17k72K52M65l7n28J08N99q28K48n8j71L09
$$ -59 410 -108 636 -319 393 3 719 -317 0 -272 -20 445 408 -120 -12 587 -241 7 -51 -222 87
7969H7j05K80q68N5M05K48k71K37J33l66R15j104L72k00K58Rp39O08Kk67J14M55
$$ 87 -18 262 -606 -551 -146 102 -169 68 201 -165 750 -354 18 -182 76 85 -654 -46 -44 -311 -197 258
7991B58L20p97M92N7K42j24o27R45m02p45L38O77j43j119J339r53K76m0M75k02
$$ 258 578 -219 273 330 572 448 -179 766 364 -381 -43 634 491 -628 711 -242 34 -6 469 267
8011B67m71P96l64M57k44k20Q0m54N8l78N41j29K66m63K23K5J60J36l13N05n63
$$ 267 -204 592 228 685 441 221 301 -153 -95 -473 68 -61 205 -258 -35 -10 150 286 -27 478 -85
8032h5L76L20j439Q88j95P46q15nJ175m11o15N11l48J4J36n96L4J38M03N16j025
$$ -85 291 611 -828 60 -135 611 -204 -209 966 555 -60 451 103 117 253 -343 -309 -171 232 748 -277
8053b77l98N09k03N01k19L31o40L48P0J73m44k0J33P18p69k54L00p5P55o37P14
$$ -277 -675 -166 -369 132 -87 244 -396 -48 22 195 -249 -269 -136 582 -187 -441 -141 -216 539 -98 616
8074F16r36k24P89o17O54P65j394O14j62j63l82M10k62Q06m40K03J3j122O79j80
$$ 616 -320 -544 245 -372 282 1047 -347 267 105 -58 -440 -30 -292 514 74 277 290 -832 -153 -333
8094c33k21O11N2j56l54N48n85L60k13O15j24j50l97L50J77P8r1J70l40l85R28
$$ -333 -554 57 109 -47 -401 147 -438 -78 -291 324 200 50 -347 3 180 258 167 337 -3 -388 540
8115E40k82J25m71k17J01K28m91R01k25k13m07P04j83L65m6q03Q38q47o68R65
$$ 540 258 383 -88 -305 -204 24 -467 434 209 -4 -411 293 110 475 429 -374 464 -383 -1051 -86
8135h6K89L48p59k12j01J75J66Q44p68k46j06k31M20J29O97n90k74R57j214R55
$$ -86 203 551 -208 -420 -521 -346 -180 664 -104 -350 -456 -687 -267 -138 559 -31 -305 652 -562 393
8155C93j064P97o21R06K43r04l69N33J03K86o30l37J150m16j66N56j43Q2n02o02
$$ 393 -671 126 -495 411 654 -250 -619 -86 17 303 -327 -664 486 70 -96 460 317 399 -103 -705
8175g05J72J16J128r9j177J539j002j23P00l15n11l30O19K10k76N15
$$ -705 -533 -417 711 612 -565 974 -28 -151 549 234 -277 -607 12 222 -54 461
8191D61
$$ Imaginary data points
##PAGE= N=2
##DATA TABLE= (X++(I..I)), XYDATA
0@%%%%%%%%%%%%%%%m1J05j28J28j28J28j92K56k56L20l84M48n12N76o95P72q47
$$ 0 0 0 0 0 0 0 0 0 0 0 0 0 0 0 0 -41 64 -64 64 -64 64 -128 128 -128 192 -192 256 -256 320 -375 397 -450
32d50R65j106J281j460J626j817K043k287K543k823L134l472L842m248M688n172
$$ -450 515 -591 690 -770 856 -961 1082 -1205 1338 -1485 1649 -1823 2019 -2229 2459 -2713
48b713N705o286O927p630Q405r271J0235j1320J2554j3963J5584j7480J9736k2480
$$ -2713 2992 -3294 3633 -3997 4408 -4863 5372 -5948 6606 -7357 8227 -9253 10483 -11997
62a1997K5891l0259L6096m4337N6971p8942J28109m67906J46843L99621o05262
$$ -11997 13894 -16365 19731 -24606 32365 -46577 81532 -386374 -239531 160090 -445172
73d45172K51122N75822k39722l56353N17110Q8012n24968M4417M13750l29770
$$ -445172 -194050 381772 142050 -214303 302807 390819 -134149 -89732 324018 -5752
83e752k86283L87076J25978m16623R0403L69119k12668k80209L09070J04585l78805
$$ -5752 -292035 95041 221019 -195604 -105201 263918 51250 -228959 80111 184696 -194109
94a94109q93L49952j62507k71703K94198J82695l45204k311L69381j39561l02213
$$ -194109 -195002 154950 -7557 -279260 14938 197633 -147571 -149882 219499 79938 -222275
105b22275K85697J82816l58454j5856L72188j53236l04778K77776J60334l73333
$$ -222275 63422 246238 -112216 -128072 244116 90880 -213898 63878 224212 -149121
115a49121j4648L45752j62321k84638K79297J59141l18841J9491L40774j28709
$$ -149121 -163769 181983 19662 -264976 14321 173462 -145379 -125888 214886 86177
125H6177k41420K43134J22613l17942k8745K63925j40122k37387K15888J39884
$$ 86177 -155243 87891 210504 -107438 -136183 127742 -12380 -249767 -33879 106005
135A06005k43180J3884K92983p8026j98425K05612J35172k54756l4083K36422
$$ 106005 -137175 -123291 169692 91666 -106759 98853 234025 -20731 -54814 181608
145A81608j15323k37437J59279J08547k52252k7191K49802p4735j87251J95119
$$ 181608 66285 -171152 -11873 96674 -155578 -182769 67033 -7702 -194953 166
155A66J41520k12410q666K39975q0276j92028J65868J10363k20428k6456K12034
$$ 166 141686 -70724 -79390 160585 80309 -111719 54149 164512 -55916 -82372 129662
166A29662q1551j88289J49249J10645j97225k2353K10484o1100j76210J37113
$$ 129662 48111 -140178 9071 119716 -77509 -99862 110622 49522 -126688 10425
176A0425J09542j95100m2638J92165o1905j77397J36371J26199j66885j4895K17233
$$ 10425 119967 -75133 -117771 74394 12489 -164908 -28537 97662 -69223 -84118 133115
187A33115l7984j64000J32315J07640j93981n1505J74274o9518j78810J18523
$$ 133115 95131 -68869 63446 171086 -22895 -74400 99874 30356 -148454 -29931
197b9931J05060j67826k6733J88453l7584j45878J25384J11871j49671k7018J67291
$$ -29931 75129 -92697 -119430 69023 31439 -114439 10945 122816 -26855 -53873 113418
208A13418m5029j55355R3099Q7700j54823m8821J53774k7060j39284R9280J19321
$$ 113418 68389 -86966 6133 93833 -60990 -109811 43963 16903 -122381 -23101 96220
219I6220j18858l7601J62825j4182j47403P4931J00804j40328o7615J40813k1259
$$ 96220 -22638 -60239 102586 88404 -58999 15932 116736 -23592 -91207 49606 28347
230B8347j51379P6744J17287j19276m7037J63256J453j39069P7100J11593j26399
$$ 28347 -123032 -46288 70999 -48277 -95314 67942 69395 -69674 7426 119019 -7380
241g380o5448J35554j4650j47078O3405J08512j11538n2597J43534P381j26549
$$ -7380 -72828 62726 48076 -99002 -35597 72915 -38623 -91220 52314 59695 -66854
252f6854O4661J10368j03384o3880J23502k714j39207M0880J00486j00755o7477
$$ -66854 -2193 108175 4791 -59089 64413 61699 -77508 -36628 63858 -36897 -104374
263a04374J21903J7993j18433N1992J20173p8120o1136J22415J7956j30816K6266
$$ -104374 17529 35522 -82911 -30919 89254 11134 -50002 72413 90369 -40447 -14181
274a4181R8832r3376q1440J05982J8257j23912L4801J15051p2470o5172J20390
$$ -14181 84651 -8725 -90165 15817 34074 -89838 -55037 60014 -12456 -77628 42762
285D2762L3847j15413K9966J07955q0001q3868R7493J7331j29064J8645J09048
$$ 42762 76609 -38804 -8838 99117 19116 -64752 32741 50072 -78992 -60347 48701
296D8701o7457o9507J15338M0895j08462K6409J09177o9018q3395R2952K4915
$$ 48701 -18756 -88263 27075 67970 -40492 -14083 95094 26076 -57319 35633 60548
307F0548j22752Q838J03576o3285p7426J00170M1464j05844J8682J12371n1286
$$ 60548 -62204 -53366 50210 -13075 -90501 9669 51133 -54711 -36029 76342 25056
318B5056p6662R3602M1032j11249K79R6284o1021r1530Q1229L8489j07167Q318
$$ 25056 -51606 41996 83028 -28221 -27942 68342 7321 -84209 -2980 35509 -71658 -63340
330f3340J12940l9383p2750R4567N3044j03599j667J01153n5550r4440P5945M1431
$$ -63340 49600 10217 -62533 32034 85078 -18521 -20188 80965 25415 -69025 6920 48351
342D8351j10515m535J09150l8573p9663R0401N8193r8083j293J08543m4084r5061
$$ 48351 -62164 -66699 42451 3878 -75785 14616 72809 -25274 -26567 81976 37892 -57169
354e7169P2351M7730j11232j4567J04325l8027q8067P9954O2009r4555o630J11344
$$ -57169 15182 62912 -48320 -62887 41438 3411 -84656 -4702 57307 -37248 -43878 67466
366F7466k8366q9152P3622N5763j01965k2786R7646l7864r6760O6953O0298r2959
$$ 67466 39100 -50052 23570 79333 -22632 -45418 52228 14364 -82396 -15443 44855 -48104
378d8104j3506J11955j7143q4649P2126O4811r3894k4490R4779l1818j00398N5609
$$ -48104 -61610 50345 33202 -51447 20679 85490 -8404 -32894 61885 30067 -70331 -14722
390a4722N7764r2702k3283J03939j3331q3929O6426P3023q1930k4311J01455j8389
$$ -14722 43042 -49660 -72943 30996 17665 -66264 162 73185 -8745 -33056 68399 50010
402E0010r6732M9095O1439r3496l6842R3846j1678r1820N7781P8452p7149k8029
$$ 50010 -46722 2373 63812 -29684 -66526 27320 15642 -76178 -18397 60055 -17094 -45123
414d5123J02192o437r5475M5514O7319q6155m3353R2946r071r4585M6124P6792
$$ -45123 57069 50632 -44843 671 67990 -18165 -61518 31428 22357 -72228 -26104 50688
426E0688p3814l4872R9646L281q6354M6655P5190p4397m3738Q5934o755r9961
$$ 50688 -23126 -57998 41648 44929 -41425 5230 80420 6023 -37715 48219 41464 -58497
438e8497K9905O7532p3766m1670R0901J1425q0659M3435Q1843o1280m3865Q3768
$$ -58497 -28592 38940 -34826 -76496 14405 25830 -54829 -11394 70449 9169 -34696 49072
450D9072L436r4215K3265O7538o7167m8871Q2436J2898q3402L2969Q1902n5200
$$ 49072 52508 -41707 -18442 49096 -18071 -66942 15494 28392 -55010 -22041 59861 4661
462D661m4958Q2632J3753q9545J9344P1198o3186n5312P4821J3223q5650K1096
$$ 4661 -40297 42335 56088 -33457 -14113 57085 -6101 -61413 13408 26631 -59019 -37923
474c7923P9390n0386m7479Q2504K4030p9890K1290P7796n2461n7545O9327J5906
$$ -37923 41467 -8919 -56398 26106 50136 -29754 -8464 69332 16871 -40674 28653 44559
486D4559q9584P015P3413m8367n3684P7216K9361p4722J8844Q0695m3718n7269
$$ 44559 -45025 -38010 35403 -12964 -66648 10568 39929 -34793 -15949 64746 21028 -36241
498c6241O5226J9070q7107K454O9340m5443n6831O9423L0185p0927J4210P9302
$$ -36241 28985 48055 -39052 -36598 32742 -12701 -69532 -109 30076 -40851 -26641 52661
510E2661l3872n1996O6636K7619p6689J701O7218m3418o3050N5905K5634p6977
$$ 52661 18789 -33207 33429 61048 -15641 -13940 53278 9860 -53190 2715 28349 -48628
522d8628J915P6090k7877n2675O2531L8119p0330j646P4968l2743o5026N3064
$$ -48628 -46713 29377 1500 -51175 11356 49475 -20855 -22501 52467 19724 -45302 7762
534G762L5294p4365p317P4888k7072o1351N8591M2850p0724l662P9463k5983o5781
$$ 7762 43056 -31309 -38626 36262 9190 -52161 6430 49280 -21444 -25106 54357 28374 -37407
547c7407N1922L4311p8345j4279O9929l0293o4505N6078M4517o3407L67Q1456
$$ -37407 14515 48826 -29519 -43798 26131 -4162 -68667 -12589 31928 -31479 -31112 50344
559E0344j9826n9174N2765L6390p3723j3846O6251k8406o6010M7148L9762o5407
$$ 50344 30518 -28656 24109 60499 -13224 -27070 39181 10775 -55235 -8087 31675 -33732
571c3732q898P4852j4948n8392M9883M3955o3230j5950P0176j8896o8125L9828
$$ -33732 -42630 32222 17274 -41118 8765 52720 -10510 -26460 43716 24820 -43305 -3477
583c477M1274o5696k0760P1901j1619o5315M7234N3125n9604j6168P7287j0853
$$ -3477 37797 -27899 -48659 23242 11623 -53692 -6458 46667 -12937 -29105 48182 37329
595C7329o9258M0623M5256p1150k4705O9537j6960p0754M4602N2988o1519j3205
$$ 37329 -31929 8694 53950 -17200 -41905 27632 10672 -60082 -15480 37508 -24011 -37216
607c7216P9654j0242o6551M3673M3551o8635k3405O7195j5337o5702M1840M9390
$$ -37216 42438 32196 -34355 9318 52869 -15766 -39171 28024 12687 -53015 -11175 38215
619C8215n8434j6012P2037q496o2591M1525M7799o0037k3025O5658j1680o8574
$$ 38215 -20219 -36231 35806 27310 -35281 6244 54043 -5994 -29019 36639 24959 -43615
631d3615L0801M5174n9914k4307O9256l189n9875M0395N4107n2707k1824O9003
$$ -43615 -12814 32360 -27554 -51861 17395 14206 -45669 -5274 48833 -3874 -25698 43305
643D3305o321o8481L1332M7375o2967k9225O6503n506o7525L4612N4338n2350
$$ 43305 36984 -31497 -165 47210 -15757 -44982 21521 16015 -51510 -16898 37440 -14910
655a4910k3322P1787n23o4997L3516M9490n7216l1337O3070o661o8634L0749N2451
$$ -14910 -38232 33555 33032 -31965 1551 51041 -6175 -37512 25558 18897 -49737 -18988 33463
668C3463n1763k2897P1540J889o2220L3893N0072n7384k9431O1755o678o6356
$$ 33463 -18300 -41197 30343 32232 -29988 3905 53977 -3407 -32838 28917 22239 -44117
680d4117K9353M9458n3843k5410O6408j287n8652L2266N1021m7854k5850O0720
$$ -44117 -14764 34694 -19149 -44559 21849 20562 -38090 -5824 45197 -2657 -28507 32213
692C2213j483o2051K3381M5983m9859l0418N7715K537n9056K5560N1233m1461
$$ 32213 30730 -31321 -7940 38043 -11816 -42234 15481 18018 -41038 -15478 35755 -5706
704e706k5615O0784N990n8127K0652M8274m7615l6515N2700L201o2897K0587N3568
$$ -5706 -31321 29463 35453 -22674 -2022 46252 -1363 -37878 14822 18023 -44874 -24287 29281
717B9281m0417k6976O2894Q357n6968K2244M8745m5456l3421N2293J423o0544
$$ 29281 -11136 -38112 24782 33139 -23829 -1585 47160 1704 -31717 20576 21999 -38545
729c8545K0690M7298m0383k6570N5397P434n3942K0966M5490l7371k6859M8845
$$ -38545 -17855 29443 -10940 -37510 17887 25321 -28621 -7655 37835 464 -26395 22450
741B2450N118n2792J4229M1986l7958l0723M5108Q601m8926J5866M7533k7983
$$ 22450 27568 -25224 -10995 30991 -6967 -37690 7418 16019 -32907 -17041 30492 2509
753B509k8091M8663J1388n1738Q793M1864l3650l5210M3183J0214n1297J2805
$$ 2509 -25582 23081 34469 -17269 -8476 33388 -262 -35472 7711 17925 -33372 -20567
765b0567M6602k9512k8597M7598J4933m8613J1950M3188l2036l1461M0028P518
$$ -20567 26035 -3477 -32074 15524 30457 -18156 -6206 36982 4946 -26515 13513 21031
777B1031n0037Q404M1991k7789k6384M2491J3855m1577J0780L9888k5071k9337
$$ 21031 -29006 -20602 21389 -6400 -32784 9707 23562 -18015 -7235 32653 7582 -21755
789b1755L5470J0057m3587L391L7079k2158k9703L4740J4950l7741M111L9364
$$ -21755 13715 23772 -19815 -16424 20655 -1503 -31206 3534 18484 -19257 -15146 24218
801B4218j6696k8395L3658J5290l9678J146L5508k1197l1608K8883J5134l9831
$$ 24218 7522 -20873 12785 28075 -11603 -10457 25051 3854 -27754 1129 16263 -23568
813b3568J291M0052j4536k6651L2853J8405l6106O03L6207j8828l1243K5209J3038
$$ -23568 -22277 17775 3239 -23412 9441 27846 -8260 -7657 28550 9722 -21521 3688 16726
826A6726l7547j996L6036j3502k5873K9657J9904l1120m17L3331j3015k9881K2392
$$ 16726 -20821 -22817 13219 -283 -26156 3501 23405 -7715 -8132 25199 12184 -17697 4695
839D695J4412l2621m899L3164j1411k6823K4175J7599k9529m880L3976q877k7543
$$ 4695 19107 -13514 -18413 14751 3340 -23483 692 18291 -11238 -16118 17858 8981 -18562
852a8562K2257J9528k9443o407L0210j0815k7988J7350J8080k8764n356L3884
$$ -18562 3695 23223 -6220 -12627 17583 6768 -21220 -3870 14210 -14554 -19910 13974
864A3974m118k5116K0771K1917k7546q622K7899q329l2347J4284J9186k5812r901
$$ 13974 9856 -15260 5511 27428 -118 -8740 19159 10830 -21517 -7233 11953 -13859 -23760
877b3760L0918j208k6491J8306K2800k3046r418K9977l335k8352J4403J9743k5337
$$ -23760 7158 5950 -20541 -2235 20565 -2481 -11899 18078 14743 -13609 794 20537 -4800
890d800j3571K8736j227k9178J4685K2231k2220j0734K8917l22k7587J2795K1739
$$ -4800 -18371 10365 9138 -20040 -5355 16876 -5344 -16078 12839 12517 -15070 -2275 19464
903A9464k3206j2843K5759k62k7872J0774K3538k0590j2456K7825K528k5488J1661
$$ 19464 -3742 -16585 9174 8912 -18960 -8186 15352 -5238 -17694 10131 12659 -12829 -1168
916a168K3568k0465j4484K5338j8k9195Q256K2038k1298j4735K7252M787k5810
$$ -1168 22400 1935 -12549 12789 12771 -16424 -8168 13870 -7428 -22163 5089 9876 -15934
929a5934J1278K5152j8538j4971K6861K381k9216N235K2326j8828j7520K5610
$$ -15934 -4656 20496 1958 -13013 13848 16229 -12987 -7752 14574 -4254 -21774 3836
941C836M976k4726P766K7159j6540j4749K4953N206k7923M713K3216j8275j8635
$$ 3836 8812 -15914 -8148 19011 2471 -12278 12675 17881 -10042 -5329 17887 -388 -19023
954a9023K4643N700k8039N741K5140j6633j8175K4351Q675k6439N703K7450j4260
$$ -19023 5620 11320 -16719 -10978 14162 -2471 -20646 3705 12380 -14059 -8356 19094 4834
967D834j7035K4341P320k8876K002K4796j7202j9971K3039R782k6256N014K6881
$$ 4834 -12201 12140 19460 -9416 -7414 17382 180 -19791 3248 13030 -13226 -8212 18669
980A8669j4618j9963K1505Q293k8673K58K4927j3529j8316K4224J1933k5720M874
$$ 18669 4051 -15912 5593 13886 -14787 -14529 10398 -3131 -21447 2777 14710 -11010 -6136
993f136K6804j3256k0043K1950R708k7779M62K4537j2775k1260J9460J0388k6140
$$ -6136 20668 7412 -12631 9319 19027 -8752 -8290 16247 3472 -17788 1672 12060 -14080
1006a4080m9K4767r922j9943K0828J2676k4144R57K6477j0632k1783J9680J2004
$$ -14080 -14129 10638 716 -19227 1601 14277 -9867 -8910 17567 6935 -14848 4832 16836
1019A6836k5644k978K4794r872k2049J9220J4803k4750o54K7386q789k2761J8660
$$ 16836 -8808 -11786 13008 3136 -18913 307 15110 -9640 -10294 17092 8303 -14458 4202
1032D202J3126k6744l414K5864j1227k1156J8871J3023k3200j343K6242q208j9843
$$ 4202 17328 -9416 -12830 13034 1807 -19349 -478 12545 -10655 -11998 14244 6036 -13807
1045a3807J7308J2842k3037l405K3205p684k0878J6740J3286k1161m580K4102
$$ -13807 3501 16343 -6694 -10099 13106 5422 -15456 1284 14570 -6591 -11171 12931
1057A2931n600k0983J5534J4163k1630o716K2286n336k1837J3828J6151k0781
$$ 12931 7331 -13652 1882 16045 -5585 -12301 9985 4649 -17188 -3360 12791 -7990
1069g990n661K4668l713k2364J5447J4895k0452n882K4126k177k1670J3401J5398
$$ -7990 -13651 11017 7304 -15060 387 15282 -5170 -11052 13074 10897 -10773 2628 18026
1082A8026k1341q490K0759n515k1829J2699J5661j8146n865K4970j816k0372J2784
$$ 18026 -3315 -11805 8954 3439 -18390 -5691 9970 -8176 -14041 10929 9113 -11259 1525
1095A525J3978j8423q250K0711l089k0459J1602J7252j7827p203K2082k466k1763
$$ 1525 15503 -2920 -11170 9541 6452 -14007 -2405 14847 -2980 -10183 11899 9433 -12330
1108a2330R759J5712j8017q904K0721K93k0450J1088J6350j7136r154K0333j488
$$ -12330 -2571 13141 -4876 -13780 6941 7234 -13216 -2128 14222 -2914 -12068 8265 6777
1121F777j9211R325J5567j5150p656J9108J639j9435P399J5965j6157r813J8052
$$ 6777 -12434 -3109 12458 -2692 -10348 8760 10399 -9036 -1637 14328 -1829 -11642 6410
1134F410k08k0117Q360J6832j3794r583J9702K390k0163P828J7088j5661j1435
$$ 6410 6202 -13915 -5555 11277 -2517 -12100 7602 9992 -10171 -2343 14745 -916 -12351
1147a2351J8943J769j9881O561J6956j3333r977J9146J984k0460O339J7611j5255
$$ -12351 6592 8361 -11520 -4959 11997 -1336 -11313 7833 9817 -10643 -4304 13307 -1948
1160a948j0482J8980J670j9762O640J7203j3115j0201J7709K513j8491N114J5433
$$ -1948 -12430 6550 8220 -11542 -4902 12301 -814 -11015 6694 9207 -9284 -4170 11263
1173A1263j1959j0618J6721L686j8136M482J6478j1989j0982J5861M753j9003
$$ 11263 -696 -11314 5407 9093 -9043 -4561 11917 -72 -11054 4807 9560 -9443
1185i443M583J5194j1364j1764J6654M710j7131L893J7148j0921j2555J5511M315
$$ -9443 -4860 10334 -1030 -12794 3860 8570 -8561 -4668 12480 1559 -10996 4515 8830
1198H830j8193K349J7313j0507j2423J8224O227j9628M481J7134j2665j3226J6088
$$ 8830 -9363 -7014 10299 -208 -12631 5593 11820 -7808 -3327 13807 1142 -12084 4004
1211D004M195j8752M415J7125r932j1564J6024M029j8555J519J6467j1618j0183
$$ 4004 8199 -10553 -6138 10987 1055 -10509 5515 9544 -9011 -7492 8975 -2643 -12826
1224a2826J5531N894j6177M519J6969r292j2030J3532N558j8307P19J5671r628
$$ -12826 2705 8599 -7578 -3059 13910 4618 -7412 6120 11678 -6629 -5910 9761 133
1237A33j2383J4857O053j7920J958J6532r331j3362J5306O413j6628K349J7128
$$ 133 -12250 2607 8660 -9260 -7302 9230 -101 -13463 1843 8256 -8372 -6023 11105
1250A1105q959j1159J5895M387j7255K479J4937r411j3031J4124M975j7403K555
$$ 11105 2146 -9013 6882 11269 -5986 -3507 11430 2019 -11012 3112 8087 -9316 -6761
1263f761J7453r360j1509J4186M559j7419J284J6675r862j1251J5266O103j5819
$$ -6761 10692 1332 -10177 4009 8568 -8851 -7567 9108 -754 -12005 3261 9364 -6455
1276f455K486J6852q910j2714J2862O433j7745N08J5748p659j2882J3139O355
$$ -6455 -3969 12883 3973 -8741 4121 10554 -7191 -6683 9065 1406 -11476 1663 8018
1289H018j5071N59J5901p246j2459J3940O411j6500R82J5407q662j2420J2367
$$ 8018 -7053 -6494 9407 2161 -10298 3642 10053 -6447 -5465 9942 1280 -11140 1227
1302A227O232j5901J71J6933o810j1865J3172P218j6213J220J6132p623j1874
$$ 1227 7459 -8442 -8271 8662 1852 -10013 3159 10377 -5836 -4616 11516 3893 -7981
1315g981J2209O450j6059l22J4162q334j3222J2555O067j4803Q84J6667o780j0618
$$ -7981 4228 10678 -5381 -5703 8459 125 -13097 -542 5525 -9278 -8394 8273 1493 -9125
1329i125J2298O379j5623K80J4471o660j2283J1886P240j3750R01J4909o051j0795
$$ -9125 3173 9552 -6071 -5791 8680 2020 -10263 1623 8863 -4887 -3986 10923 4872 -5923
1343e923R479N472j4615j548J3282o387j1262J0855O972j2644l81J3438n385j0755
$$ -5923 3556 9028 -5587 -7135 6147 -240 -11502 -647 6325 -6319 -6700 6738 1353 -9402
1357i402J0397O390j1961n64J3735l499j1134R128N889j2863j779J2076n862j0824
$$ -9402 995 7385 -4576 -5140 8595 5096 -6038 3090 8979 -3884 -5663 6413 551 -10273
1371a0273J0640O308j1275j04J2725k922j0752P600O538j2849j963J0844n333
$$ -10273 367 6675 -4600 -4704 8021 5099 -5653 1947 8485 -4364 -6327 4517 -816
1384h16r387Q032P088r638Q75J1423k872r317O794O238j0752j446R261l066r470
$$ -816 -10203 -2171 4917 -4721 -3846 7577 4705 -4612 2182 8420 -2332 -3778 5483 2417 -7053
1399g053O935O221j0437j003R823k120r501O083O630q121k570J1590k868r301
$$ -7053 -118 6103 -4334 -5337 4486 2366 -7135 -1052 5578 -2543 -5113 6477 3609 -5692
1413e692N302O281r163k564Q977j545q602O482O723p167k381J0971k786q734N158
$$ -5692 -390 5891 -3272 -5836 3141 1596 -7006 -524 6199 -968 -3349 7622 4836 -3898 1260
1428A260N672r482l135Q659l020p855M444O851q212j5Q780k47o843L980O361p423
$$ 1260 6932 -2550 -5685 2974 -46 -7901 -3457 3394 -4818 -4833 3947 3700 -3143 837 7198 -225
1444b25k882O640j360p961L644O253n524k501Q406K30p148L156N173n886m782
$$ -225 -3107 3533 2173 -5788 -2144 4109 -1415 -3916 4490 4720 -2428 728 5901 15 -4767
1459d767O284M03q259L807N776o648k818P751O18p611L777O652n445k408P945
$$ -4767 1517 1920 -6339 -2532 3244 -3404 -6222 1529 2147 -5464 -1687 4965 -480 -2888 5057
1474E057O42p008L438M627o219m162M400k95p575L002O111m134k503P869J424
$$ 5057 5699 -1309 2129 6756 537 -3625 775 480 -7095 -4093 2018 -2116 -4619 3250 4674
1489D674o203J671N415m931m764N288L17p287K011P275m265k983O801K116p030
$$ 4674 -1529 142 5557 626 -4138 1150 1467 -5820 -3809 3466 -799 -3782 3019 5135 -1895
1504a895J438N954m643m738O331J035q030J630O855n354l488N440K005o930J589
$$ -1895 -457 5497 854 -3884 2447 3482 -4548 -2918 3937 -1417 -4905 535 2540 -4390 -2801
1519b801P099m159l690O956K152o912O49N101m214n343N510R73o736J413O764
$$ -2801 4298 139 -3551 3405 5557 -1355 -706 4395 181 -5162 348 1321 -5415 -4002 2762
1534B762k269l800P132J768o584J646M166m526n398N124J875o991P15O676k951
$$ 2762 493 -3307 3825 5593 -991 655 4821 295 -5103 21 1896 -5095 -4380 2296 -655
1549f55m448O394L896o474J419N981l906n309M539K326o898r79N811k805m893
$$ -655 -5103 1291 5187 -1287 132 6113 2207 -3102 1437 3763 -3135 -4114 1697 -1108 -6001
1564f001O365K730o162J172P432l559n409N298K746o459Q5O149l569n632M747
$$ -6001 364 3094 -3068 -1896 5536 1977 -3432 1866 4612 -1847 -1762 4387 818 -4814 -67
1579f7L182p127J062P029l218n049O407L584p131K34O238l907o641M702K242p668
$$ -67 3115 -4012 -2950 4079 861 -4188 2219 5803 -1328 -1094 5144 1237 -5404 -702 1540 -6128
1595f128K58O572j560m122O851M492n467N58O542m588o240N217J504p959j211
$$ -6128 -5870 702 -858 -4980 1871 6363 896 1454 7996 3408 -2832 2385 3889 -4070 -5281
1610e281P199k777n534O198M056p288N44O199k151n665N075L168o407K37O297
$$ -5281 1918 -859 -6393 -195 3861 -3427 -2883 3316 1165 -4500 575 3743 -2664 -2427 3870
1625C870k432n858N188M219p243j386Q177j593o498N182L379n613k040O883m000
$$ 3870 1438 -4420 768 4987 -2256 -3642 4535 2942 -3556 1626 5005 -608 -2648 4235 235
1640B35p721M784M298p620K11P990j450n354P734M538p073q36P497l943p572M863
$$ 235 -7486 -2702 1596 -6024 -5813 2177 727 -4627 3107 7645 572 -264 7233 3290 -4282 581
1656E81L048q065j763P725j845m806N230L724n539m42P158j743n681L736L534
$$ 581 3629 -4436 -6199 1526 -319 -5125 105 3829 -1710 -2152 5006 3263 -2418 1318 4852
1671D852o579k247N886k517o315M984M700n187r53O917r77o300N298M837o092
$$ 4852 -1727 -3974 1912 -605 -6920 -1936 2764 -2423 -3376 3541 2564 -3736 1562 6399 307
1686C07j496N944k286o721L990L980p070j800O972j442o310O258M074n657j650
$$ 307 -1189 4755 2469 -4252 -262 3718 -3352 -5152 1820 378 -5932 326 4400 -1257 -2907
1701b907P089k401o446L228L564n824j144P671j229m408M509N509n583j173N410
$$ -2907 4182 1781 -4665 -1437 2127 -3697 -4841 2830 1601 -2807 1702 7211 1628 455 5865
1716E865k304p121K400K971o428k339O278j098m301L414N074m005j339P839p00
$$ 5865 3561 -3560 -1160 1811 -4617 -6956 -678 -1776 -6077 -2663 2411 -1594 -2933 4906 4206
1731D206n429L987M123o045j890N961k497n836K538L553o750j657O545m61o096
$$ 4206 -1223 2764 6887 842 -1048 4913 2416 -3420 -882 2671 -4079 -5736 809 348 -5748
1746e748N135N479m988j265O032r50o548K825L105n853k217O259R6n357L898N181
$$ -5748 -613 4866 -122 -1387 4645 3695 -2853 -28 3077 -2776 -4993 1266 1362 -3995 -97 5084
1762E084m437k006M692m24o413K693L413n151j535O096l30n717M062M369l820
$$ 5084 647 -1359 3333 2909 -3504 -811 2602 -2549 -4084 2012 1682 -4035 27 4396 576
1777E76l258N970k16n208J691M043n135k804M659r79n108L089N115m933q03P113
$$ 576 -2682 3288 3072 -2136 -445 3598 -1537 -4341 318 -661 -5769 -2680 2435 -2498 -3301 3812
1793C812J31n124L490M872n206l514N581j781o375K116L418n520k661O400R07
$$ 3812 3943 -1181 2309 7181 1975 -1539 4042 2261 -4114 -1998 1420 -4100 -6761 -361 546
1808E46n443L357O445l831k321N813O0o250K151L255n137l867O515j02n544L107
$$ 546 -4897 -1540 4905 1074 -1247 4566 4626 -1624 527 3782 -1355 -5222 1293 1191 -4353 -1246
1824a246M673m372k058O125o22n571K989M355n573k232M848O08n951K554M837
$$ -1246 3427 -945 -3003 3122 2500 -3071 -82 4273 -1300 -3532 1316 1924 -4027 -1473 3364
1839C364l520k143N820K78o152K027M453m016l332M907L19n740J187M211l979
$$ 3364 -156 -2299 3521 3799 -2353 -326 4127 111 -3221 1686 2005 -3735 -2548 1663 -2316
1854b316k395O763q21m383L801N420m285k593O533j701o749J771L593n804k933
$$ -2316 -4711 2052 1231 -3152 649 6069 1784 -809 5724 4023 -2726 -955 2638 -3166 -6099
1869f099O415q20n405N111M521l889j929P473j218o644K600L495m613k688N411
$$ -6099 316 -504 -5909 -798 3723 -166 -2095 5378 4160 -2484 116 3611 -1002 -3690 1721
1884A721J078o303J870N294n426j819N823l60n364K663N681n092k174M697N7o657
$$ 1721 2799 -3504 -1634 3660 -1766 -3585 2238 1878 -3486 -823 4858 -234 -2408 2289 2346 -4311
1900d311K999M455m715k619O068R61o252L474N014m131l507O591j167o821L403
$$ -4311 -1312 3143 -1572 -4191 1877 2838 -3414 60 5074 943 -2564 4027 2860 -3961 -558
1915e58L391n302l519P418J66o590M230O009n417k513N794J062p101K495M362
$$ -558 2833 -2469 -5988 1430 1596 -4994 -764 5245 -172 -2685 3109 4171 -2930 -435 3927
1930C927n527l671O368K92o342L334M792l273l051O552O4n291J673N424m831l558
$$ 3927 -1600 -5271 1097 1389 -4953 -1619 3173 -100 -3151 3401 3465 -1826 -153 5271 440 -3118
1946c118N459l21o105J802N395m728l214O251M48n150K772N364m498k588N186
$$ -3118 2341 2020 -4085 -2283 3112 -1616 -4830 1421 1869 -3281 -509 4855 357 -2231 2955
1961B955L00o217P77M844m675k550N546R49n444K160N510l834k874O042O70o370
$$ 2955 3255 -2962 -2185 2659 -2016 -4566 980 1929 -3515 -1355 4155 321 -2553 3489 4159 -2211
1977b211J593M758n490m170N905J19m172K142O128l493k775M570Q09n367J159
$$ -2211 -618 4140 -1350 -5520 385 504 -3668 -1526 4602 1109 -1666 2904 3713 -1654 -495
1992d95M761m552l521N549J12n433J427M516l087l205M963J534n841K265N791
$$ -495 4266 -286 -3807 1742 1854 -3579 -2152 2364 -723 -3928 1035 2569 -3272 -1007 4784
2007D784l971l193N429P52n997M63M227k653m268M615K052n170J428O359m415
$$ 4784 813 -2380 3049 3801 -2196 -1733 2494 -159 -4427 188 2240 -2930 -1502 4857 442
2022D42k052L540Q68n602R66M069l999k893M443J963l920N04N352k122m268N075
$$ 442 -1610 1930 2798 -2804 -1838 2231 -1768 -4661 -218 1745 -2175 -1671 3681 1559 -2709 2366
2038B366J244n226P96M035l767k926M073R85m079M01M137k643l664N439J651m582
$$ 2366 3610 -1616 -820 3215 -552 -3478 595 1580 -2499 -2098 2039 -604 -4268 1171 2822 -1760
2054a760O14M884k043l921L361K427n337N76L934k462l742M133J027m484J125
$$ -1760 -1146 3738 1695 -2226 1135 3562 -1775 -1199 2735 273 -3469 664 1691 -2793 -1668
2069a668M743k126l396L333J816m871j96M565k112m189L681L100n328P94M744
$$ -1668 3075 949 -2447 886 2702 -2169 -2365 2200 88 -4101 -420 2680 -2648 -1854 2890
2084B890j491l004L001K684n047n92L943k316m092L285K542l906m0M680j165l951
$$ 2890 1399 -1605 1396 4080 -967 -1559 2384 68 -4024 -739 1803 -2103 -2143 2537 1372 -2579
2100b579L680K582m934J31L494j444l466K129K460l222p74M359j913l787L272
$$ -2579 1101 3683 -1251 -1120 2374 930 -2536 -407 2053 -1169 -1943 2416 503 -3284 -12
2115a2K698m347l30N013r96l666K686L235m926q20L172j425m483K874K684l182
$$ -12 2686 -1661 -1991 3022 2026 -1640 1046 4281 -645 -1465 1707 282 -4201 -1327 1357 -1825
2131a825q19N043l23m670K607L484m739p50M329j635l698K982L114l876l09L718
$$ -1825 -2644 2399 2076 -2594 13 3497 -1242 -1992 2337 702 -2996 -14 3100 -776 -1085 2633
2147B633q07l425J494K474l785j345M153j139l214J554M049m517r82M562qm237
$$ 2633 1826 -1599 -105 2369 -1416 -2761 1392 253 -2961 -1407 2642 -1875 -2857 1705 1697 -2540
2163b540K453L726l865q78M028n70l350J222K956l317k257M491r17n065K228M072
$$ -2540 -87 3639 -226 -1104 2924 2354 -996 226 3182 -135 -2392 2099 1182 -3883 -1655 2417
2179B417m137j604M996O41m651J767L778l638k017M790o67m902K616L599m201
$$ 2417 -1720 -3324 1672 2313 -2338 -571 3207 -431 -2448 2342 1675 -3227 -611 2988 -1213
2194a213k86L510R2m349J231L738m325j014M693k23m704K516K823k864j508M295
$$ -1213 -1499 2011 2103 -2246 -1015 2723 -1602 -2616 2077 1854 -2850 -334 2489 -375 -1883 2412
2210B412k97m883J882M125l711j733M024l70m441K621M156l551k429M411l9m954
$$ 2412 2115 -2768 -886 3239 -472 -2205 1819 1449 -2992 -371 3785 234 -2195 2216 2177 -2777
2226b777K656K538k640k175M266J92m494J473L839l799k358M039J073n872K368
$$ -2777 -121 2417 -223 -2398 1868 2060 -2434 -961 2878 -921 -3279 760 1833 -4039 -1671
2241a671L470l320j998N878M83m259J036M456l396k936L740J213m210L64M534
$$ -1671 1799 -1521 -3519 2359 2842 -1417 -381 4075 679 -2257 1483 2696 -1514 -1150 3384
2256C384l568k372M133J89m599J029M533l773l116M812J180m383J378N028l047
$$ 3384 -184 -2556 1577 1766 -2833 -1804 2729 -1044 -4160 652 1832 -2551 -1173 3855 808
2271H08k961L709Q85m938J967L404l918j990M408J057l954J66M201l368k787M487
$$ 808 -2153 1556 2441 -2497 -530 2874 -1044 -3034 1374 2431 -1523 -1357 2844 -524 -3311 1176
2287A176Q35m522L06M602k419k687M227J932n727J069L197k426l391M142R12m139
$$ 1176 2011 -2511 -2205 2397 -22 -2709 1518 3450 -2277 -1208 1989 -437 -3828 314 1226 -2913
2303b913J461M603k447l066L358J915m943L85L940j576l402L328J617m198K56
$$ -2913 -1452 3151 704 -2362 996 2911 -2032 -1647 2293 717 -2685 643 2260 -1938 -1682
2318a682M933k914k962M049P05m633M62L803j408m155L571K042l978L90M470j180
$$ -1682 3251 337 -2625 1424 2129 -2504 -2042 1761 353 -3802 -231 1811 -2167 -1777 2693 1513
2334A513m147M023J639m332r42M630j969l108L111J507m113j71M492k020l400
$$ 1513 -2634 1389 3028 -1304 -2246 2384 415 -2693 418 1925 -2188 -2359 2133 113 -3287
2349c287M158K236n161M4N472j832m282L303K590l701j563M472k343l503L838
$$ -3287 871 3107 -2054 -2010 3462 1630 -2652 651 3241 -460 -2023 2449 106 -3397 441
2364D41J773m279k03M167m07l900L353K843m979r50M299j653l229K672K814m318
$$ 441 2214 -2065 -2268 1899 1492 -2408 945 3788 -1191 -2141 2158 505 -2724 -52 2762 -1556
2380a556n14M188k3m055K113L309m176j388L794n47m768K781L309m242q66M682
$$ -1556 -2070 2118 2095 -1960 153 3462 -714 -2102 1692 1145 -3623 -842 2467 -1775 -2641 2041
2396B041j370l330K768K355l496j711M942q97m105L864J892l999j381M621j384
$$ 2041 671 -2659 109 2464 -1032 -2743 2199 1302 -2803 1061 2953 -1046 -2427 2194 810
2411H10m150K543K409l304k06M167k9m378K599K971l934j635L004l10m086L135
$$ 810 -3340 -797 1612 -1692 -1898 2269 2240 -2138 461 3432 -502 -2137 867 557 -3529 -394
2427c94K373l156j041M757p01l208J751K475l276j010K923k18l886J568L259l744
$$ -394 1979 -1177 -2218 2539 1838 -1370 381 2856 -420 -1430 1493 1275 -2611 -1043 2216 -1528
2443a528r25M146j85l845K200L150l798r35M183l01m319J672K875l974p61L798
$$ -1528 -2453 1693 1508 -2337 -137 3013 -785 -1720 2463 2162 -2157 -485 2390 -1584 -2345 1453
2459A453M3l720J102L682k864j969M209m63l359J510K978k539k177L238L33m662
$$ 1453 1496 -2224 -1122 2560 -304 -2273 1936 1473 -1886 -376 2602 63 -2114 1124 1457 -3205
2475c205J801L076k845q81L467M90l331J739K991k793k940L977m53l565K49L796
$$ -3205 -1404 1672 -1173 -2054 1413 1903 -1428 311 3302 509 -2431 1546 1093 -2472 -2223 1573
2491A573k579k977N363J403m321O37M402k649l213M545m24m138J510L676l443
$$ 1573 -1006 -3983 1380 2783 -1538 -901 3501 852 -2361 2184 1760 -2378 -868 2808 -635
2506f35k447M152n03l373J843L124k718j172L346J281m243J277K550k400k287
$$ -635 -3082 1070 567 -2806 -963 2161 -557 -1729 1617 2898 -1345 -68 2482 82 -2205
2521b205L078jm241J870K817k455j535M932l11l244J533K709k645k260L388q6
$$ -2205 873 872 -3369 -1499 1318 -1137 -2672 2260 1949 -1295 238 2947 302 -1958 1430 1344
2537A344n133J614M008k155j767L544J405l811O58L488k512k377L314M8m081R29
$$ 1344 -3789 -2175 1833 -322 -2089 1455 2860 -951 -293 3195 683 -1694 1620 1668 -2413 -1484
2553a484L452k847k197L962N79m159J450L484k495r52L475P39m723J310L085k180
$$ -1484 1968 -879 -3076 886 1465 -2694 -1244 2240 -255 -1207 2268 3007 -1716 -406 2679 499
2569D99l046K994m05k218M37L619j989k002L953J209m336P12L709k309k844K831
$$ 499 -2547 447 42 -2176 -1739 1880 -109 -2111 1842 3051 -1285 -573 3136 827 -2017 814
2585H14j20l976O92L737k223k229L908J336k510R87K668j759k348K145J011m682
$$ 814 694 -3282 -2590 1147 -1076 -3305 603 1939 -571 416 3084 1325 -1023 1122 2133 -2549
2601b549M6M111k256k277K913J319k194K14K887j028k490K129J094l218l95L458
$$ -2549 -2503 1608 -648 -2925 -12 1307 -887 -673 2214 1186 -1304 825 1919 -1299 -1694 1764
2617A764k158j658K240J594m001R81L937k568j681L548O33l050m36L905k195l346
$$ 1764 -394 -2052 188 1782 -2219 -1238 2699 131 -1550 1998 2631 -419 -855 3050 855 -2491
2633b491K234N45k634n14L594j375j931K853K762l362J36K913q38k883K178M48
$$ -2491 -257 288 -2346 -2860 734 -641 -2572 281 3043 -319 -183 2730 1892 -991 1187 1635
2649A635l516k79L296j702k572L070K299k966k84L602r08k905K180J292l392m55
$$ 1635 -1881 -2160 1136 -566 -3138 -68 2231 -735 -1019 2583 1675 -1230 950 2242 -1150 -1605
2665a605K464l03l604K310K228k458m15K915q15k778L163J226j902p56K423j936
$$ -1605 859 556 -3048 -738 1490 -968 -1383 1532 717 -2061 1102 2328 426 -330 2093 157
2681A57k843J983J375k425n36K945l54j868J941L032l328p12K886n82k872J732
$$ 157 -2686 -703 672 -1753 -2289 656 302 -1566 375 3407 79 -633 2253 1671 -1201 531
2697E31M49k426j235L329r65k715K412K143j136j475L597m13k357O23J276j721
$$ 531 980 -1446 -2681 648 -317 -3032 -620 1523 387 -1088 2509 2096 -261 362 1638 -83
2713h3k288K823r05k695J462K247j639p42L819k02k405L82K932k376j295K287
$$ -83 -2371 452 -453 -3148 -1686 561 -1078 -1820 1999 1797 -608 -226 2706 330 -965 1322
2729A322L85l631R59J530j693p93K685pl044K045K649p29k304K881r51k417O93
$$ 1322 1707 -1924 -965 565 -1128 -1921 764 757 -2287 -242 2407 1678 -626 2255 1304 -1113 -420
2746d20P63j404j665K600P72k669J014L472r83k102K388Q14k623J33K761k829
$$ -420 343 -1061 -2726 -126 646 -2023 -1009 2463 1480 -622 1766 2580 -43 90 2851 22
2762B2k158J977K55k739J298L010k164j75J608J476k654R68J244j770j479K739
$$ 22 -2136 -159 96 -2643 -1345 1665 -499 -674 934 2410 -244 724 1968 198 -1281 1458
2778A458j038l283J895J937k264q23K166J448k289L98L078j554j329J654K97k343
$$ 1458 420 -2863 -968 969 -1295 -2118 48 1496 -793 -395 2683 1129 -200 1454 1751 -592
2794e92j165K453j182k256J614J909k435O01L403p94k621K579J203l381O8K126
$$ -592 -1757 696 -486 -2742 -1128 781 -1654 -1053 2350 1556 -1065 1514 2717 -664 -596 1530
2810A530j941k050J588P77k157M43K428p32k063L128K025k834p44K592k003j739
$$ 1530 -411 -2461 -873 -96 -2253 -1810 618 -114 -2177 951 2976 142 -602 1990 -13 -1752
2826a752K135M60k528p45L223k411j396L755Q84j814J218N46n30k144K435K19
$$ -1752 383 843 -1685 -2430 793 -1618 -3014 741 1625 -189 1029 1575 1045 -1099 1336 1555
2842A555l149j25J957j340k032K929O22j572P37K275r03q27J542Q21j929o67J166
$$ 1555 -1594 -1719 238 -1102 -3134 -205 417 -1155 -418 1857 954 127 1669 2490 561 -106 1060
2859A060j060l291J630K211k459P33K627q74j245J555J947l189K51J684j394k359
$$ 1060 0 -3291 -1661 550 -1909 -1176 1451 577 -668 887 2834 -355 -104 1580 186 -2173
2875b173J799J141k856lK888n58k296J719K757l051J383K474j756k333J621J85
$$ -2173 -374 767 -2089 -2092 796 238 -2058 -339 2418 -633 750 3224 1468 -865 756 941
2891I41j679j312K261r80j950K235J614k637J125K369m14j949J912J453l664l97
$$ 941 -738 -2050 211 -769 -2719 -484 1130 -1507 -382 1987 1573 -376 1536 2989 -675 -1072
2907a072J499p84k594O42K062j481K42L175p09j091J493J082j849j488J996j452
$$ -1072 427 -357 -2951 -2309 -247 -1728 -1486 1689 980 -111 1382 2464 615 -873 1123 -329
2923c29k262J741J162j615n43K641j54j548J125J851k436J01K274o03k609J450
$$ -329 -2591 -850 312 -1303 -1846 795 641 -907 218 2069 -367 -266 2008 1405 -1204 246
2939B46J212l022l27J332J24j432J082J473l85j142K982j33k146J777R5j576j780
$$ 246 1458 -1564 -1891 -559 -435 -1867 -785 688 303 -839 2143 2010 -136 1641 1736 160 -1620
2956a620K169k048r25N12K047j390n16L477m95j870K229N94j581l19P84k78l061
$$ -1620 549 -1499 -2424 -1912 135 -1255 -1771 1706 1211 -659 1570 2164 583 264 1048 770 -2291
2973b291P10J605j758k1K351j19j358J054K160k470p2J583k30k484O84J243k150
$$ -2291 -1581 24 -1734 -1755 596 477 -881 173 2333 -137 -209 1374 1144 -1340 -656 587 -1563
2990a563j352L293l03j802R73K031p51j759K792K57j597M89J194k222j263R04
$$ -1563 -2915 378 75 -1727 -754 1277 526 -1233 1559 1816 219 708 1902 -320 -1583 -679
3006f79L27j362r44L207q59j218K935k93j607J988Q68j983j163P61L35k256K31
$$ -679 -352 -1714 -2658 549 -310 -1528 1407 1114 -493 1495 2363 380 -783 -22 313 -1943 -1712
3023a712J309p27j305K834J80m38L08K271j424r04M54r9j258q99J874q41j676
$$ -1712 -403 -1130 -2435 399 579 141 449 2720 1296 392 846 747 -511 -1410 464 -377 -2053
3040b053J633R26j894K40K056J71j464K418j88j848n80J269o63j502J213Q25l011
$$ -2053 -420 506 -1388 -1148 908 1079 -385 2033 1845 -3 -583 686 23 -1479 -266 559 -2452
3057b452J210K288j260o79K030P53q63j71Q24q29k402P83J31n29q51K251m13j587
$$ -2452 -1242 1046 -214 -893 1137 1890 1027 856 1680 851 -1551 -768 -637 -1166 -2017 234 -179 -1766
3075a766J369K011j492O23J826j123j550N60P83k573o68J402k94j263P94J590
$$ -1766 -397 1614 122 745 2571 1448 -102 458 1241 -1332 -2000 -598 -892 -2155 -1361 229
3091B29j174N12K375n99j405J656j02j322q98J894o99k600J828K54j619m1K896
$$ 229 -945 -433 1942 1343 -62 1594 1492 170 -728 1166 467 -2133 -305 -51 -1670 -1711 1185
3108A185j943K58J914J02r45j81J115r49j640J314N90j963o37R78Q64o03R02K052
$$ 1185 -758 -500 1414 1516 571 390 1505 556 -1084 230 820 -1143 -1780 -802 62 -541 361 2413
3126B413j517p23J498j93j258j83O70j525o99J720j131r12R05J353n86q6K410
$$ 2413 896 173 1671 1478 220 37 707 -818 -1517 203 -928 -1840 -935 418 -168 -254 2156
3143B156p26j880K128n72o66p79R88j496J24l15J041j442M21K538n55q00L26J571
$$ 2156 1430 -450 1678 1106 440 -339 649 -847 -723 -1038 3 -1439 -1018 1520 965 165 491 2062
3161B062j687J4J300l86k111O53%o62n75J111j72j221J732J113l58m55J728j147
$$ 2062 375 389 1689 1303 -808 -155 -155 -817 -1392 -281 -453 -1674 58 1171 813 358 2086 939
3179I39r46l1N07j702r52K101n06r11J459J173j028q80K529p20j006O49R68j150
$$ 939 -7 -38 469 -1233 -2185 -84 -590 -1501 -42 1131 103 -777 1752 1032 26 675 1643 493
3197D93j195J281q40j091K71R26l17m30R12J75p10J876O28j383o22N19k76q18
$$ 493 -702 579 -261 -1352 -1081 -155 -472 -902 10 185 -525 1351 1979 596 -26 493 217 -601
3215f01J98J010k218K0J436k13j019K066J036j375o6J456j54k321M98K48j073
$$ -601 -403 607 -1611 -1591 -155 -368 -1387 679 1715 340 274 1730 1576 -745 -247 1 -1072
3232a072J08J14M11q48J350J206o07m53J498k01j167N0R96k242J27N8n24m25O12
$$ -1072 -964 -850 -439 -1287 63 1269 662 209 1707 1506 339 389 1385 -857 -730 -672 -1196 -1621 -1009
3251a009J980j253o48J907Q12j651O77J365k062m84J075j110q87J96Q14o49k68
$$ -1009 971 -282 -930 977 1789 138 815 2180 118 -366 709 -401 -1288 -1092 -278 -927 -1195
3268a195J279j33l95J70J749m59m73KK53j846L21J163k003J89J120K35p68P78
$$ -1195 84 -49 -444 -274 1475 1016 543 545 798 -1048 -727 436 -1567 -1378 -258 -23 -791 -13
3286a3Q40m95Q5O55M60o80q25L80p54j291J132n56j54O72J305k03j150J641M29
$$ -13 827 332 417 1072 1532 852 27 407 -347 -1638 -506 -1062 -1216 -544 761 558 -592 1049 1478
3305A478j341n17J341n96n50M60n11o68p04J560m90r13J307M81m14r8K405j369
$$ 1478 137 -380 961 365 -185 275 -236 -904 -1608 -48 -538 -1451 -144 337 -77 -175 2230 861
3323H61p84K56Q5j790Q3J230j243p28J668P19j197P46R82j38p9L79P01j786k8
$$ 861 77 333 418 -1372 -1289 -59 -1302 -2030 -362 357 -840 -94 888 750 671 1050 1751 -35 -63
3342f3J46o42j175J537J69j036J43J778r95J85Q39J57j109N60J045j068j521J10
$$ -63 83 -559 -1734 -197 -28 -1064 -921 857 -138 47 886 1043 -66 494 1539 471 -1050 -940
3360i40R74r22j41J463r73M05k99Q43l91K66O87J78j228L73k2r9j618Q60k90j123
$$ -940 34 -888 -1029 434 -539 -134 -433 410 19 285 972 1150 -78 295 273 174 -1444 -584 -874 -1997
3380a997J335M57l03Q47J42N52q44O05L50j237q04M14L17j015n5O70k09K53J105
$$ -1997 -662 -205 -508 339 481 1033 189 794 1144 -93 -897 -483 -166 -1181 -1236 -566 -775 -522 583
3399E83J3l84N65N71r16k81j53k73l48M84o52n34N6P77N69q80J514K80m10J32
$$ 583 596 212 777 1348 432 151 -2 -275 -623 -139 -791 -1325 -1269 -492 77 -803 711 991 581 713
3419G13O69n09p12j72K70m35p10QJ019j537J069L90l10n89K352l6j165L17P32
$$ 713 1382 873 161 -11 259 -176 -886 -878 141 -1396 -327 63 -247 -836 1516 1480 315 632 1364
3438A364q77j582P26J09p94k19J465j094O98O16J016p80M25K80l75o54K88K15
$$ 1364 487 -1095 -369 -260 -1054 -1273 192 -902 -204 412 1428 648 1073 1353 978 324 612 827
3456H27j730q2O93j23q10J280r0n25J114N68K2j129R87Qj498N00o86n17J22J152
$$ 827 -903 -985 -292 -415 -1225 55 -35 -560 554 1122 1144 15 1002 1010 -488 12 -674 -1191 -1069 83
3476H3j82R6L39P54j209j38J744m59j209O28L4n33q82n1P98k07l91O37j74L30
$$ 83 -99 -3 336 1090 -119 -257 1487 1028 -181 447 481 -52 -934 -985 -187 -394 -785 -148 -322 8
3496HO32J253j761O16M41q51j275R85o65j105J430n37O1o50J529P80p97N60O1
$$ 8 640 1893 132 748 1189 338 -937 48 -617 -1722 -292 -829 -768 -1418 111 891 94 654 715
3515G15J97r5O3j82j587K64N88p04P7M08J27o87R28P11o42K43p5J210k431P11
$$ 715 912 817 880 698 -889 -625 -37 -741 -664 -256 -129 -816 112 823 181 424 349 1559 -872 -161
3535a61O92j317K37K50r6o17N64Q28o66k25Q00N53m56J15j61rK69j060k19l89
$$ -161 531 -786 -549 -299 -395 -1012 -448 380 -286 -511 289 842 386 501 340 331 600 -460 -679 -1068
3555a068J13Q54j74j117J282j17J73J28J092Q8j574N94K99q00P01k50o83Q1l21
$$ -1068 -955 -101 -275 -1392 -110 -227 -54 74 1166 1254 -320 274 573 -227 474 224 -459 -378 -699
3574f99N72j12O45k08j41N7R77M38j476J72j20n80k94N62n2j61M32m94N18K60
$$ -699 -127 -239 406 198 57 114 1091 1529 53 225 105 -475 -769 -207 -259 -420 12 -482 36 296
3594B96N77j88k19L37L4p25p08N3P77j040K82n10J245j017J16J163m62R54m27
$$ 296 873 685 466 803 837 112 -596 -543 234 -806 -524 -1034 211 -806 -690 473 11 965 538
3613E38j045M03P36m4j114O2L56j96q91J261k61N51n54M69P72p30N43m62k57o02
$$ 538 -507 -104 632 588 -526 -464 -108 -304 -1195 66 -195 356 -198 271 1043 313 856 394 137 -465
3633d65K83N9r44J89J321j105j13J185M21r71L68J59l99L75j67L33p87n92N42
$$ -465 -182 -123 -1067 -878 443 -662 -775 410 831 -140 228 387 -12 363 196 529 -258 -850 -308
3652c08q09Q40n7j14Q06k65L74R98j056N94k90o55K88M7j042o20J302k2o65M77
$$ -308 -1117 -277 -334 -448 358 93 467 1465 409 1003 713 58 346 393 -649 -1269 33 11 -654 -177
3672a77M63j53J14M91K28p95o20Q45j023M62o13M76o63J295j72o27l88J239l36
$$ -177 286 133 247 738 966 171 -449 396 -627 -165 -778 -302 -965 330 158 -469 -857 382 46
3691D6L77M23j10r43jJ56j86j78L58P4l03J57l86M66N09o19L27O13j001N23M26
$$ 46 423 846 736 -207 -208 -52 -238 -416 -58 16 -287 -130 -516 -50 459 -160 167 780 -221 302 728
3712G28j01n15J04n46l65Q79m21l18L5P30N7K70n32J461j801Q2R57q83l01K12
$$ 728 627 112 216 -330 -695 184 -237 -555 -520 210 267 537 5 1466 -335 -253 704 -179 -480 -268
3732b68J94J09m74K66O2M33l00N62k48ll72J07n47J400k90q76o73O05K26j052
$$ -268 -74 35 -439 -173 -111 322 22 584 336 333 -39 68 -479 921 631 -245 -918 -313 -87 -1139
3752a139O88P05p0o8Q80j379J24L21N42q43o70J745j452k25k27M42N36m43J220
$$ -1139 -451 254 184 116 996 -383 -259 62 604 -239 -909 836 -616 -841 -1068 -626 -90 -533 687
3771F87p46J007o62p7k03m71R30p18m07N94L47q84j65J413m72L90r8q5N17q84
$$ 687 -59 948 286 209 6 -465 465 -253 -660 -66 281 -603 -768 645 173 563 465 380 897 13
3791A3P06p98o72l74J473j231J087m4j49J15n32O73J59l04K58N74j435N32Q77
$$ 13 719 -79 -751 -1125 348 -883 204 160 11 126 -406 267 426 122 380 954 -481 51 928
3810I28j197l93M85m4L70p08K37P4L12O03O70j046M36k93%o75q3k63k22O6p4L49
$$ 928 -269 -662 -177 -221 149 -559 -322 -248 64 667 1337 291 727 434 434 -241 -324 -587 -809 -743 -817 -468
3832d68K77J436j383J37M85O2n08l32K85J34p58J297k84p82J12M79o01R04n3q4
$$ -468 -191 1245 -138 -1 484 546 38 -294 -9 125 -633 664 380 -402 -290 189 -412 492 439 355
3852C55L8n30O35l82m68J053l46l09o5p19Q0P30O5L54q28J028q4K8n80K3N22o7
$$ 355 393 -137 498 116 -352 701 355 46 -19 -738 -658 72 137 491 -337 691 607 635 55 78 600 533
3874E33j03l99k26k87m32L22j13J130m77K95n81J074j34j10o84M57j99m49J79
$$ 533 430 31 -195 -482 -914 -592 -705 425 -52 243 -338 736 602 492 -192 265 66 -383 -204
3893b04Q3j99l20M39n62Q65J039o04j84k89K3m5LM91J04r11Nk45L10l68R49J83
$$ -204 -121 -320 -640 -201 -763 102 1141 537 353 64 87 42 45 536 640 -271 -266 -511 -201 -569 380 563
3915E63J60n88l48J301q39J33P78j205n66N28q87j01O89L29o94M65J083j118O52
$$ 563 723 135 -213 1088 249 382 1160 -45 -611 -83 -970 -1071 -382 -53 -747 -282 801 -317 335
3934C35K2j49L36j173J225j476P17m07Q40m61n28Q02K56r62P43k30O25j35J03
$$ 335 357 208 544 -629 596 -880 -163 -570 270 -191 -719 83 339 -623 120 -110 515 380 483
3953D83o17P78j71j019Q48q49J094j144Q42n09l16J187l44L47N73r10m57N40j154
$$ 483 -134 644 473 -546 302 -547 547 -597 245 -264 -580 607 263 610 1183 273 -184 356 -798
3972g98O16M41n67P25n70K45P3L00j96k76m3m03J104J59j096PN80j559J933r26
$$ -798 -182 259 -308 417 -153 92 165 465 269 -7 -50 -453 651 810 -286 -279 301 -1258 675 -251
3992b51k1M67j82K60m91O61n42n7K00M4R02j145k87o00L32j43O66J33Q98n27m13
$$ -251 -272 195 13 273 -218 443 -99 -156 44 88 990 -155 -442 -1042 -710 -853 -187 -54 844 317 -96
4013i6O15l50N19l15m44m80K0o3M35P24q54k32j13O52L01pm10L01p56K58R73l58
$$ -96 519 169 688 373 -71 -551 -531 -594 -159 565 -289 -521 -634 18 319 312 -98 203 -553 -295 678 320
4035C20m22K23M90q75m48M08J73N49L80k93p29O45l48j40P00m60J06m43R2N5j49
$$ 320 -102 121 611 -264 -712 -304 -131 418 798 505 -224 421 73 -67 633 173 279 -164 -72 -17 -166
4056a66n62Q66K04J01O3k32L55j289O82M5L57l11k53J18n61O14k6o62K66J74P0
$$ -166 -728 138 342 443 506 274 629 -660 22 67 424 113 -140 -22 -583 31 5 -657 -391 -217 -147
4077a47j0J198j276J66R16p86m65J067j10l74m5n37L54J94K46m77o7N3o41P07
$$ -147 -157 1041 -235 -69 847 61 -404 663 553 179 134 -403 -49 145 391 -86 -153 -100 -741 -34
4097c4N49j109P35k40r89J153m7j032Q51j69O80l29K51l06O22q57o03J072m21
$$ -34 515 -594 141 -99 -1088 65 18 -1014 -163 -332 348 19 270 -36 586 -271 -874 198 -223
4116b23L22K38K1n39Ln5O17M1L42m40p30K87k80L98K85r5J8K22o67P2o54J258
$$ -223 99 337 358 -181 -178 -233 384 425 767 327 -403 -116 -396 2 287 192 210 432 -235 -163 -817 441
4138D41K02j045L36J0R73j106j08L2L70K43n68k82P89O13j288QL44K96n45L36
$$ 441 643 -402 -66 -56 917 -189 -297 -265 105 348 -220 -502 287 900 -388 -380 -36 260 -285 51
4158E1j08L55J25l38q24R41j28n11R07j596J262n91P40p30L05O15p1l22l06J35
$$ 51 -57 298 423 85 -739 202 74 -437 470 -1126 136 -455 285 -445 -140 475 404 82 -224 -89
4178h9j4k28J09P1L08o31O94O6m08O5J29l53N16n54J40k39N92j88r3M5P00j366
$$ -89 -103 -331 -222 -151 157 -474 220 286 -122 -57 72 -281 235 -319 -179 -418 174 -14 -107 -62 638 -728
4200g28P70k39J95m18L70k15K62k79M60o65M62Q12j180K8Jj1m86O1O87K91l5M36
$$ -728 42 -197 -2 -420 -50 -265 -3 -282 178 -487 -25 787 -393 -365 -364 -375 -861 -800 -113 178 143 579
4222E79n17J045j315K61m49J080k20q83J016k61l07j33l7N99k85J27K80l45n64
$$ 579 62 1107 -208 53 -396 684 464 -419 597 336 29 -104 -141 458 173 300 580 235 -329
4241c29Q48n45K89l95K15n87J21N94l64k19O55m3L66k12K4n3n36m68J319k79l32
$$ -329 519 -26 263 -132 83 -504 -383 211 -153 -372 283 240 606 394 418 365 -171 -639 680 401 69
4262F9n05k84K07N00oJ79l25L73L11l71Q3k89j51k53J40K8M35m81j23P9K67L02
$$ 69 -436 -720 -513 -13 -19 160 -165 208 519 148 231 -58 -209 -462 -322 -294 141 -340 -463 -384 -117 185
4284A85k02k70N7O25Mp05O46m40J82m34L94m18K1M84m92K51L14L48m36o55J529
$$ 185 -17 -287 -230 395 399 -306 340 -100 82 -352 42 -376 -355 129 -363 -112 202 550 114 -541 988
4305I88m66j346R22l64J119r74m7J11m71M55k11J97l59n5M92K3n44M88L74k02
$$ 988 522 -824 98 -266 853 -121 -168 -57 -528 -73 -284 -87 -446 -501 -9 14 -530 -42 332 130
4325A30k73O35m10j76L17p80K30J03K76j224J331j36m80O30J07k43q0M37m35J43
$$ 130 -143 492 82 -94 223 -557 -327 -224 52 -1172 159 23 -457 173 280 37 -43 394 -41 102
4345A02J57k09p0l5Jj68m04J043K90j493N77M5J35K94q73M24O71j17p94L50j02
$$ 102 259 50 -20 -55 -54 -222 -626 417 707 -786 -209 -164 -29 265 -608 -184 487 370 -424 -74 -176
4366a76l07J14J57K25k74N34l5J25J49r16N75l11L2P60j153O77m47l87O62Q29
$$ -176 -483 -369 -212 13 -261 273 238 363 512 -404 171 -140 -108 652 -501 176 -271 -658 4 833
4386H33k30j039P22r0K90o93K60N0J49n80L17M62q61R17j29l61k40L59J43l49
$$ 833 603 -436 286 196 486 -207 53 103 252 -328 -11 451 -410 507 378 17 -223 136 279 -70
4406g0K80l61P52l54k39j50j07N44l02L4K97K02j086N55q8L3K56q53P29p81P45
$$ -70 210 -151 601 247 8 -142 -249 295 -7 27 324 526 -560 -5 -93 -60 196 -657 72 -709 36
4427C6O6o3j66Q89l75r25K23N57p59N68m61J003k02j081M00L45P75j323L94J44
$$ 36 102 39 -127 762 387 -538 -315 242 -517 51 -410 593 391 -690 -290 55 830 -493 -99 45
4447D5J33l33k51Q11n85N6p0R1m93R96j063J22M91k46K83m4m58O38l46k59O48
$$ 45 178 -155 -406 405 -180 -124 -194 -103 -596 400 -663 -541 -50 -296 -13 -57 -515 123 -223 -482 166
4468A66n8J71K86n41O19k85l27k93P15n41R74m45M0l97M52j139M06N31p48O77
$$ 166 108 279 565 24 643 358 31 -262 453 -88 886 441 481 84 536 -603 -197 334 -414 263
4488B63Q49j218J58J65j341R20M46m6j022L22L62m11M01j47J262p32m75J59k23
$$ 263 1112 -106 52 217 -1124 -204 242 196 -826 -504 -142 -553 -152 -299 963 231 -244 -85 -308
4507c08M2J28O4J74o51O58r6l18K52J91j003O28q42J494m29J78k41l38N67l69
$$ -308 -266 -138 -74 100 -551 107 11 -307 -55 136 -867 -239 -1081 413 -16 162 -79 -417 150 -219
4527b19P2O03l9k90l12L31J12p51L07l83P04m1P46j276R56p68N73j94O1J58J87
$$ -219 -147 456 417 127 -185 146 258 -493 -186 -569 135 94 840 -436 520 -248 325 131 192 350 537
4548E37K77o53J33n95J040l70l34k42K06L65j041N15N95n06N24q51R78Qj532J093
$$ 537 814 161 294 -301 739 369 35 -207 -1 364 -677 -162 433 -73 451 -400 578 586 -946 147
$$ [...]
8191A82
##END NTUPLES=NMR FID
##END=
