##TITLE=1H_UK_26_2_9
 CD2Cl2
 8 sc, 
 13.04.2022
##JCAMPDX= 6.0         $$ Bruker NMR JCAMP-DX V2.0
##DATA TYPE= NMR FID
##DATA CLASS= NTUPLES
##ORIGIN= UXNMR, Bruker Analytische Messtechnik GmbH
##OWNER= root
$$ XWIN-NMR		Version 3.5
$$ Wed Apr 13 10:48:01 2022 Russian Standard Time (UT+4h)  she@DPX200
##.OBSERVE FREQUENCY= 200.13135
##.OBSERVE NUCLEUS= ^1H
##.DELAY= (6, 6)
##.ACQUISITION MODE= SIMULTANEOUS
##.ACQUISITION SCHEME= undefined
##.AVERAGES= 8
##.DIGITISER RES= 18
##SPECTROMETER/DATA SYSTEM= spect
##.PULSE SEQUENCE= zg30
##.SOLVENT NAME= CD2Cl2
##.SHIFT REFERENCE= (INTERNAL, CD2Cl2, 0, 15.7039)
##AUDIT TRAIL= $$ (NUMBER, WHEN, WHO, WHERE, WHAT)
$$ ##TITLE= Audit trail, XWIN-NMR		Version 3.5
$$ ##JCAMPDX= 5.01
$$ ##ORIGIN= Bruker BioSpin GmbH
$$ ##OWNER= she
$$ F:/spectra/data/she/nmr/H-F/1/audita.txt
$$ ##AUDIT TRAIL=  $$ (NUMBER, WHEN, WHO, WHERE, WHAT)
(   1,<2022-04-13 10:46:47.60 +0400>,<she>,<DPX200>,
      <created by zg, POWCHK disabled, PULCHK disabled
       configuration hash MD5:
       00 E9 B6 7A A2 85 ED C7 34 08 36 98 17 FE 4E 26
       data hash MD5: 16K
       D9 01 A3 41 79 E6 D5 30 D1 2B 8F BE 7D 6C 3C 55>)
$$ ##END=
$$ 
$$ hash MD5
$$ 5F 25 16 05 9C 49 BB 7F 82 DF E4 D3 D8 07 68 02
##$RELAX= 
##$RELAX= 
##$RELAX= 
##$RELAX= 
##$RELAX= 
##$RELAX= 
$$ Bruker specific parameters
$$ --------------------------
##$DU= <F:/spectra>
##$EXPNO= 1
##$NAME= <H-F>
##$PROCNO= 1
##$TYPE= <nmr>
##$USER= <she>
##$AMP= (0..31)
100 100 100 100 100 100 100 100 100 100 100 100 100 100 100 100 100 100 
100 100 100 100 100 100 100 100 100 100 100 100 100 100 
##$AQSEQ= 0
##$AQ_mod= 1
##$AUNM= <au_zg>
##$AUTOPOS= <>
##$BF1= 200.13
##$BF2= 200.13
##$BF3= 200.13
##$BF4= 200.13
##$BF5= 200.13
##$BF6= 200.13
##$BF7= 200.13
##$BF8= 200.13
##$BYTORDA= 1
##$CFDGTYP= 0
##$CFRGTYP= 5
##$CHEMSTR= <none>
##$CNST= (0..31)
1 1 145 1 1 1 1 1 1 1 1 1 1 1 1 1 1 1 1 1 1 1 1 1 1 1 1 1 1 1 1 1 
##$CPDPRG= <>
##$CPDPRG1= <>
##$CPDPRG2= <>
##$CPDPRG3= <>
##$CPDPRG4= <mlev>
##$CPDPRG5= <mlev>
##$CPDPRG6= <mlev>
##$CPDPRG7= <mlev>
##$CPDPRG8= <mlev>
##$CPDPRGB= <>
##$CPDPRGT= <>
##$D= (0..31)
0 1.2 0 0 0 0 0 0 0 0.06 0 0.03 0 0 0 0 0.0002 0 0 0 0 0 0 0 0 0 0 0 0 
0 0 0 
##$DATE= 1649832406
##$DBL= (0..7)
120 120 120 120 120 120 120 120 
##$DBP= (0..7)
150 150 150 150 150 150 150 150 
##$DBP07= 0
##$DBPNAM0= <>
##$DBPNAM1= <>
##$DBPNAM2= <>
##$DBPNAM3= <>
##$DBPNAM4= <>
##$DBPNAM5= <>
##$DBPNAM6= <>
##$DBPNAM7= <>
##$DBPOAL= (0..7)
0.5 0.5 0.5 0.5 0.5 0.5 0.5 0.5 
##$DBPOFFS= (0..7)
0 0 0 0 0 0 0 0 
##$DE= 6
##$DECBNUC= <off>
##$DECIM= 32
##$DECNUC= <off>
##$DECSTAT= 4
##$DIGMOD= 1
##$DIGTYP= 9
##$DL= (0..7)
0 120 120 120 120 120 120 120 
##$DP= (0..7)
150 150 150 150 150 150 150 150 
##$DP07= 0
##$DPNAME0= <>
##$DPNAME1= <>
##$DPNAME2= <>
##$DPNAME3= <>
##$DPNAME4= <>
##$DPNAME5= <>
##$DPNAME6= <>
##$DPNAME7= <>
##$DPOAL= (0..7)
0.5 0.5 0.5 0.5 0.5 0.5 0.5 0.5 
##$DPOFFS= (0..7)
0 0 0 0 0 0 0 0 
##$DQDMODE= 0
##$DR= 18
##$DS= 0
##$DSLIST= <SSSSSSSSSSSSSSS>
$$ [...]
##$SUBNAM2= <"">
##$SUBNAM3= <"">
##$SUBNAM4= <"">
##$SUBNAM5= <"">
##$SUBNAM6= <"">
##$SUBNAM7= <"">
##$SUBNAM8= <"">
##$SUBNAM9= <"">
##$SW= 18.05172834244
##$SWIBOX= (0..15)
0 0 2 0 0 0 0 0 0 0 0 0 0 0 0 0 
##$SW_h= 3612.71676300578
##$TD= 16384
##$TD0= 1
##$TE= 0
##$TE2= 300
##$TE3= 300
##$TEG= 300
##$TL= (0..7)
0 120 120 120 120 120 120 120 
##$TP= (0..7)
150 150 150 150 150 150 150 150 
##$TP07= 0
##$TPNAME0= <>
##$TPNAME1= <>
##$TPNAME2= <>
##$TPNAME3= <>
##$TPNAME4= <>
##$TPNAME5= <>
##$TPNAME6= <>
##$TPNAME7= <>
##$TPOAL= (0..7)
0.5 0.5 0.5 0.5 0.5 0.5 0.5 0.5 
##$TPOFFS= (0..7)
0 0 0 0 0 0 0 0 
##$TUNHIN= 0
##$TUNHOUT= 0
##$TUNXOUT= 0
##$USERA1= <user>
##$USERA2= <user>
##$USERA3= <user>
##$USERA4= <user>
##$USERA5= <user>
##$V9= 5
##$VALIST= <valist>
##$VCLIST= <CCCCCCCCCCCCCCC>
##$VD= 0
##$VDLIST= <DDDDDDDDDDDDDDD>
##$VPLIST= <PPPPPPPPPPPPPPP>
##$VTLIST= <TTTTTTTTTTTTTTT>
##$WBST= 1024
##$WBSW= 4
##$XGAIN= (0..3)
0 0 0 0 
##$XL= 0
##$YL= 0
##$YMAX_a= 513131
##$YMIN_a= -485843
##$ZGOPTNS= <>
##$ZL1= 120
##$ZL2= 120
##$ZL3= 120
##$ZL4= 120
##$ABSF1= 10
##$ABSF2= 0
##$ABSG= 5
##$ABSL= 3
##$ALPHA= 0
##$AQORDER= 0
##$ASSFAC= 0
##$ASSFACI= 0
##$ASSFACX= 0
##$ASSWID= 0
##$AUNMP= <proc_1d>
##$AZFE= 0.1
##$AZFW= 0.1
##$BCFW= 1
##$BC_mod= 2
##$BYTORDP= 1
##$COROFFS= 0
##$CY= 11.3945322036743
##$DATMOD= 1
##$DC= 2
##$DFILT= <>
##$DTYPP= 0
##$F1P= 2.36226072786647
##$F2P= -0.459571619588291
##$FCOR= 0.5
##$FTSIZE= 0
##$FT_mod= 4
##$GAMMA= 1
##$GB= 0.15
##$INTBC= 1
##$INTSCL= 1
##$ISEN= 128
##$LB= 0.24
##$LEV0= 0
##$LPBIN= 0
##$MAXI= 10000
##$MC2= 0
##$MEAN= 0
##$ME_mod= 0
##$MI= 1.114404
##$NCOEF= 0
##$NC_proc= 0
##$NLEV= 6
##$NOISF1= 3.799351
##$NOISF2= 2.8
##$NSP= 1
##$NTH_PI= 0
##$NZP= 0
##$OFFSET= 15.70392
##$PC= 1
##$PHC0= -18386.41
##$PHC1= 6.40078
##$PH_mod= 1
##$PKNL= yes
##$PPARMOD= 0
##$PSCAL= 0
##$PSIGN= 0
##$REVERSE= no
##$SF= 200.130013532006
##$SI= 16384
##$SIGF1= 3
##$SIGF2= 2
##$SINO= 400
##$SIOLD= 16384
##$SREGLST= <1H.CDCl3>
##$SSB= 0
##$STSI= 0
##$STSR= 0
##$SW_p= 3612.71676300578
##$SYMM= 0
##$S_DEV= 0
##$TDeff= 0
##$TDoff= 0
##$TI= <>
##$TILT= no
##$TM1= 0
##$TM2= 0
##$TOPLEV= 0
##$USERP1= <user>
##$USERP2= <user>
##$USERP3= <user>
##$USERP4= <user>
##$USERP5= <user>
##$WDW= 1
##$XDIM= 8192
##$YMAX_p= 0
##$YMIN_p= 0
$$ End of Bruker specific parameters
$$ ---------------------------------
##NTUPLES= NMR FID
##VAR_NAME=  TIME,          FID/REAL,        FID/IMAG
##SYMBOL=    X,             R,               I
##VAR_TYPE=  INDEPENDENT,   DEPENDENT,       DEPENDENT
##VAR_FORM=  AFFN,          ASDF,            ASDF
##VAR_DIM=   8192,          8192,            8192
##UNITS=     SECONDS,       ARBITRARY UNITS, ARBITRARY UNITS
##FACTOR=    0.0002768,     1,               1
##FIRST=     0,             0,               0
##LAST=      2.2672688,     0,               0
##MIN=       0,             -485843,         0
##MAX=       2.2672688,     513131,          0
$$ Real data points
##PAGE= N=1
##DATA TABLE= (X++(R..R)), XYDATA
$$ [...]
2123B590m552J037L148k994j072M004j508l606L588K016l788M78K438k937n52
2138a710L844j482l950K863K118k709L52K183k681l84M060r21l731J729K066k621
2154i74P69J810k662q71L528J7k996J494J154k104N59K195k280j729K976J06k630
2171a638J372J568k229l03K643j052j805K420nj984J109J678k012n12J638l89
2187D99j471J829m7k191R32J930j660p27J706p54j220J495N04k278O16J368o05
2204g4q46J156l42r93J240J120j707l32J764p23q96J511O4j859Q56J389j719k61
2222f52J257k90j144J273O20j498j0J342j124q49J443j40j348R01P55j148o6J241
2240E63m52o69J021J68j157P76Q58j200j72R67l77j158P80R54j331L8J377j162
$$ y = [2590, -1962, -925, 2223, -771, -1843, 2161, 653, -2953, 635, 2651, -1137, -659, 1779, -1158, -1710, 2134, 652, -3298, -435, 1683, -1026, -674, 1509, -1172, -1556, 2504, 1583, -2148, -419, 1647, -974, -205, 1605, -1057, -1928, 1600, 1617, -1379, 115, 1269, -835, -276, 1919, -361, -2090, 886, 992, -1638, -266, 1302, -927, -1230, 1413, 361, -1444, 976, 971, -1013, 96, 1774, -238, -750, 888, 499, -972, 857, 810, -1381, -449, 1481, -179, -906, 800, 46, -1174, 321, 825, -1453, -837, 531, -74, -920, 236, -106, -1099, 141, 1261, -446, -778, 986, 263, -633, 878, 942, -917, -61, 1328, -391, -652, 605, 315, -829, 444, 1064, -434, -444, 898, -226, -1075, 368, 228, -1120, -219, 536, -612, -678, 563, 111, -558, 463, 631, -526, 250, 1108, -92, -264, 703, 326, -832, -52, 902, -429, -391, 986, -176]
2258a76m02J364l96j137Q69N80j339K40R75r31m75J342l7j298J019N24j088L14
2276e2R16p48o58J263n1j290N33R85j502k6J170p67o07J096K91j175K43J117j196
2295d58j48J237p75p23J143o3r34M06J114j119k75J670q24o54J075K10j507P56
2313A31O37j226l4J210o98r85J206K32j045O19Q74j499K98J132j039q02J454k53
2331B12j163Q31O83r85k68J724r69m64J054j09r91O15O56j637M03J075r87m58
2349g78J559n35j165R54J068j631K28J175r66p36J359k09j150J185J58j489O88
2366b85J365j374l38J620o03j313J510K90j998N30J495j156o58J426l14j385J438
2383B50O74j918N57J265j266m2J494r49j439J583J004k175N16J391j373l05K168
$$ y = [-176, -578, 786, 390, -747, 122, 702, -637, -397, 578, -353, -828, 514, 477, -821, 198, 722, -366, -52, 864, 116, -542, 721, 670, -620, -87, 898, -604, -630, 540, -227, -834, 262, 553, -622, -379, 738, -458, -606, 631, -144, -867, 276, 213, -721, -315, 799, -320, -595, 1075, 251, -403, 672, 882, -625, 131, 768, -458, -492, 718, 20, -965, 241, 473, -572, 47, 921, -578, -280, 852, -187, -989, 465, 212, -951, -120, 563, -422, -690, 1034, 65, -399, 655, 546, -445, 170, 826, -811, -408, 667, -320, -778, 781, 246, -919, 35, 1103, -528, -300, 875, -91, -827, 532, 323, -827, 358, 516, -973, -285, 1080, -294, -632, 988, 385, -928, 582, 872, -1126, -596, 899, -257, -915, 511, 197, -1188, 250, 924, -994, -437, 828, -438, -480, 1014, 65, -1374, 209, 1213, -962, -446, 945, -428, -733, 1435]
2400A435j077j859K036P14k246J131J224j952o03K423q18j847J944K75j988J006
2416b02J766j922o68K193j014j629K430O1k825J248K184j972p67K334j149j754
2432a686L057M85l472R56K201j672o96K427j464k337L071J003l078O71K173k311
2448f72o50L129j311k906L031J341l435R22K603k912r46L508r75k817K811N50
2464A271l104J248K933k790j412L496p54l197L331J021m352J001M033k812k008
2479b095L470o76k920L154J800m650K12M009k389j621L238j352l007L240K481
2494B894m664m0L767k059j728M078r33m222K471L341m399p2L614k418k121M184
2510A693J89m365K213K597l536k75L915k529k850M057R60l998J677K666l973o55
$$ y = [1435, 358, -1501, 535, 1249, -997, 134, 1358, -594, -1197, 1226, 408, -1439, 505, 780, -1208, -202, 1564, -358, -1026, 1167, 153, -1476, 954, 1015, -1810, -562, 1622, -350, -1117, 1217, 68, -1686, 1371, 1856, -1616, -660, 1541, -131, -827, 1600, 136, -2201, 870, 1873, -1205, -534, 1639, -672, -1322, 1807, 496, -2410, 621, 1962, -1473, -551, 2052, -860, -1806, 1702, 727, -2090, 721, 1271, -1833, -585, 2348, -442, -1854, 1642, 888, -2309, 1022, 2043, -2309, -1308, 2725, -87, -2095, 1375, 699, -2221, 933, 2733, -1917, -1705, 2304, -85, -1706, 1532, 180, -2827, 413, 2894, -1770, -1810, 1957, -102, -1830, 2248, 1315, -2907, -436, 2905, -1494, -1566, 2048, -370, -2491, 1693, 1882, -2483, -270, 2327, -1209, -1484, 2431, -98, -2948, 1109, 2069, -1929, -252, 2414, -1559, -2214]
2526b214M818j758l518L391Q30l509J842L176m221j338M869j230l319K733R05
2541A457l910J841L602l450k135M433q60k813L095N20m485J524L796l054j943
2556b382L888q75l145L458J249m102O55L957k640j658L217r04l540K995J895l449
2572a381L99L039k523j307L798p82l526J935K371l453%K953k234j671L522N20
2588A660l603J468J875k305J28L128k382k502L546J33k757J624J398k773K95L095
2604B028j436k534K438M94k565J425J833k963k27L104q51k123K209O7k538J551
2620h8K100k786q63K695q24j631K070N43k700J240K034j928r96K025r47j803K489
2637F30Q26k900P88K144j683p09K007q20j948K137P41k405O28J599j679l05K287
$$ y = [-2214, 2604, 846, -2672, 719, 1549, -1960, -118, 3058, -1163, -2501, 2368, 1138, -2181, 552, 1457, -2453, -612, 2990, -460, -2595, 1838, 978, -1835, 1260, 1780, -2705, -1181, 2615, -439, -2382, 1506, 631, -2514, 944, 2193, -1909, -1254, 2703, 63, -1595, 1622, 718, -2822, 173, 2068, -1381, -982, 2057, -466, -1773, 2025, 1243, -2283, -348, 2023, -1430, -1430, 1523, -711, -2382, 1140, 1660, -1943, -475, 1400, -905, -777, 2351, -31, -2533, 1013, 1146, -1611, 13, 1411, -1362, -1067, 2028, 592, -1942, 496, 990, -1575, -150, 1683, -1280, -1507, 1597, 746, -1377, 832, 899, -1639, -88, 2012, -774, -1637, 1058, 234, -1397, 673, 1216, -1484, -244, 1790, -138, -1134, 891, -56, -1859, 630, 1456, -1444, -656, 1488, -195, -904, 1103, 283, -1665, 472, 1213, -1192, -564, 1035, -644, -949, 1338]
2654A338n94k115J727J202k249N00J430j866o34K074k67j783J360J118k039M47
2670c51J822j568j122J686k18j408J218J072j972K6K019j169j234J877k6j836
2686a184J188J301j979j87J701q02p69J424J7j871J303J182j959n36K037r33j126
2703a193J722L03j710O40J545j222o14J353p24j381J607R7j551R25J029j104l29
2720f07J598m27j572J357O71k050L74J384j045n03J504l05j146J147O98j599K02
2737c19J155j116p05J661m56r43M75R03j070j22J600r75o12J259j61j470R07O72
2755F83j675M89J250r76l20J311l60r81O29N10r11j52R82p44o58J334J56j347
2773g80J089N66j091k10J157p97o35R87P8j267R40P78j255J47J310q12j005J102
$$ y = [1338, 744, -1371, 356, 1558, -691, -191, 1239, -627, -1261, 813, 546, -1237, 123, 1241, -798, -351, 1471, -97, -1219, 467, 249, -1159, 59, 1131, -841, -815, 1204, 35, -1199, 678, 652, -1184, 4, 1305, -674, -861, 840, 38, -731, 693, 710, -1161, 142, 1324, -635, -1171, 866, -67, -1193, 529, 832, -878, -238, 1307, 85, -529, 824, 100, -1281, 326, 423, -1128, -203, 826, -278, -607, 991, 564, -1008, 349, 1020, -1030, -656, 728, -317, -820, 684, 379, -767, 380, 1078, -521, -319, 836, -280, -985, 676, 220, -723, -248, 655, -415, -537, 1063, 88, -524, 735, 574, -896, 11, 683, -992, -503, 747, -229, -549, 762, 402, -579, 50, 560, -351, -503, 479, -265, -923, 411, 567, -780, 309, 875, -216, -426, 731, -66, -701, 286, 364, -903, 37, 815, -440, -293, 1017, 205, -800, 302]
2791C02k24q47O37M78q16r2J393o39o83J252k12j177N97N71j047l43J310m08p28
2810f76J136K41j156L63J248j463M5Q95o92j090J312M1p54K93J056j086k08J536
2828A041q84r40J117K08j263O16P03j360J99J229n32j079J309J49j233O09Q43
2845G32j169l71J386p71q04J496K07j493Q19J128j473l87J547q59p86J139K43
2862E84j482O20J339j029l26J298r02j146J424K53j621L90J537j110k71J580p43
2879C95j315J296N02j803O26R85j424l05J841o18j440J656P92j728N93J303j493
2896a37n80J429n20j596J763L59j820O31J748j526o84J942r75j349J709P65k560
2913a401N92J890j357p35K001o38j612J904O51j943n2J544j177o05K015p06j594
$$ y = [302, 78, -769, -132, 346, -470, -562, 831, 192, -491, 761, 549, -628, -31, 540, -507, -850, 460, 52, -676, 460, 701, -455, -92, 1156, -307, -262, 633, -59, -1149, 163, 204, -550, -257, 799, -287, -495, 1041, 157, -783, 334, 542, -721, -105, 598, -762, -563, 666, 134, -945, 364, 513, -720, -111, 732, -437, -808, 578, -193, -997, 499, 706, -787, 32, 1160, -313, -700, 847, -12, -798, 341, 584, -898, -278, 1061, 32, -294, 1004, 102, -1044, 380, 633, -988, -598, 939, -171, -442, 1138, 395, -920, 376, 878, -925, -299, 686, -738, -1043, 798, 180, -1260, 396, 1188, -540, 53, 1356, -137, -717, 712, 192, -1404, 359, 718, -1102, -471, 1277, -249, -933, 1009, 34, -1315, 394, 1159, -1401, -809, 1081, -276, -1011, 990, 352, -1260, 644, 1295, -648, -700, 844, -333, -938, 1077, 371, -1223]
2930a223J693J072k120p8J758j701o75K412n78k507J913J477k191L16J586j184
2946c0r57K119m13k332J513J301k143J1J904j102p71J949n0k177J440J272k337
2963h03m69K277j125j247K078j20k283J828J765k358n26K326j356j358K322m72
2979D79k599J558K240k072j068K410n99j057J880k22k835J058K574k278p24K008
2995G53o00j454K564J37k837R85K046j822j070K219o93j725K113N80k440O43K380
3012A779j953j023K016l71j947K106L76k379Q57K374j833j654K420k16j371J427
3028F08K87k284N31K290j513j531K153k08j317K014N80k731l7K829j394j488J446
3045B35j71j329J980Q10k398K7K403q99j312J211k77j543J618J025k422m3K225
$$ y = [-1223, 470, 1542, -578, -656, 1102, -599, -1274, 1138, 560, -1947, -34, 1443, -748, -432, 1154, -30, -987, 1132, 719, -1613, -100, 1201, -942, -931, 973, -129, -900, 1049, 999, -1178, 262, 1534, -803, -1272, 1005, -120, -1367, 711, 591, -1692, 136, 1901, -457, -983, 1343, -13, -1371, 951, 479, -2120, -562, 1678, -394, -1462, 948, 349, -708, 1172, 950, -1885, -827, 1747, -531, -1255, 753, 153, -1301, 1263, 1400, -1437, -452, 1594, -228, -1298, 921, 228, -1497, 616, 1196, -1244, -601, 1779, -174, -1197, 819, 448, -1499, 607, 983, -1396, -539, 1835, 2, -1652, 768, 552, -819, 608, 895, -1389, -858, 1432, -81, -1612, 541, 333, -984, 1030, 1610, -1121, -1158, 1671, 277, -1211, 235, 64, -1265, 715, 1525, -873, -846, 1557, 658, -654, 557, 280, -1263, 355, 1380, -1042, -1085, 1140]
3062A140r39r52J539n3j922J313R57k295M88J582p56j366J590J43j178R06P71
3079I68j765p6K367j147j682J413L58j060Q77J165k160l62K221o51j150N94J98
3096A08j326J272J018j768m12J837r2j126Q82L2j404J095J170j828n94J592k11
3113B45j082J304Oj361J071J111j449l96J062m95j013J159K29j318Q90J046j138
3130a29j98J478q07r54Q58P8j130O71P90j482M9J367j75r29J184n4j051N33P48
3149H47j264n05J236l1r02R09j12o33P51P35j102p95J329k11o77N71K27j137P05
3168e9J042p99m62P18l37p39R67K12j211L17J030q87J72P31l77p54R41p2r27J92
3188c02O66o42n48J280o7p87O48N31j147L46P21r77l07P17j49p08N82L80p92O05
$$ y = [1140, 201, -751, 788, 735, -1187, 126, 1083, -1212, -724, 858, 102, -1264, 326, 469, -709, 197, 968, -797, -873, 1494, 347, -1335, 78, 436, -624, 253, 1418, -742, -1104, 1117, 466, -684, -90, 108, -1218, 54, 1072, -696, -1108, 729, 637, -489, 393, 425, -979, 116, 1286, -542, -1136, 456, 245, -837, 467, 473, -888, 183, 1294, -155, -551, 511, 16, -997, 162, 391, -927, -37, 1009, -129, -327, 1151, 344, -610, 248, 326, -804, -133, 657, -825, -776, 591, 416, -513, 671, 617, -434, 99, 847, -417, -922, 314, 283, -619, 290, 178, -455, 296, 1031, -71, -866, 463, 252, -425, 146, 373, -764, -59, 983, 184, -278, 440, 103, -636, 331, 543, -668, -351, 679, -208, -36, 695, 318, -436, 505, 433, -494, -302, 364, -278, -826, 454, 387, -400, 248, 779, -368, -22, 699, -278, -585, 132, -17, -725, -143, 237, -555, 50]
3208E0R56p55m58P40l14n19O56k0q80J31Q13o17j7Q40l28o19O94N3q93L39N18
3229C70p77q9Q47l34m47M19K43l94J41O64r73j73O34k46k05M14J11k83m5N82k84
3250A75l72N11k39l41K7L25m37kO64l53j82P88k66m89L54K09j006N61N08p79j31
3271d75L83L14l49M83K31p00L00J62n06k85N67j16l74M41L62q97L56M96l57J83
3291B19L68m68p89Q93l57n15L20N33k01j10N65lo59J82L01n05j69N57l99k48R47
3312D62q7o76N22R8l37l8M53m75o58P10J10m75M42O9m22J82O66o90k40M03J02
3333A21l80k31O92n49J13P42k60l07L77K86o93Q9J43m32Q6J63m56K35K31J80k52
3354a02J47L99o10J5L22j71o27N70J32o25O25M66n25q9N94k77l66J52K75r28J47
$$ y = [50, 1006, 251, -207, 533, 219, -300, 356, 336, -544, -413, 400, -217, -234, 606, 278, -341, 353, 406, -487, -148, 370, -407, -496, 351, 17, -430, -11, 232, -162, -21, 643, -330, -503, 131, -115, -320, 94, 205, -78, -123, 459, 175, -197, 314, 75, -266, -239, 86, -351, -353, 311, -42, -224, 564, 298, -191, 163, 372, -634, -73, 435, -344, -475, -92, 222, -127, 356, 587, -113, 187, 349, -157, -442, 125, 9, -365, 76, 438, -459, -103, 393, 36, 219, 587, 119, -670, 223, -134, -649, -329, 204, 3, -107, 458, 455, -204, -22, 279, -226, -395, 162, -237, -485, 462, 375, -301, 221, 319, -18, -56, 397, -78, -736, -26, 84, -391, 51, 120, -302, -120, 546, -144, -384, 19, 121, -259, -490, 202, -347, -234, 508, 248, -59, 318, 604, -89, 0, 143, -289, -203, -40, -496, -261, -30, 150, -102, 45, 444, -166, -151, 171, 0, -627, -57, 75, -550, 75, 541, 16, -73, 521, 244, -122, 30, 305, -623, -476]
3375d76P69n25j65M84Rl38O82k6l19j84R3j34j20N22o16p2L74M63l86q9L28j17
3397A57k98L79j8n69K70M85m98j7N99m00j73M61Q8q89L92M28o28k51Q32p44K97
3418i7K79J41o01K40N60n45j43K00Ln64N42J7m53L75M74k15m44O66n3q13L99K45
3440B13q43J26Q49l77k68N02R0l40J41N64r04m24Q60R3o00J29L5k51N17P21r05
3461g2m0O20l20k52k2Q1k98J03M34l87j69P27l36l44N55R7n55j52L24j23j53L91
3483A09r2r3L11L48p56J97L67l18m96L64J55n70R5Q70l55o8L72o97j84Q20j56
3504B23m37r3L44k75j53P71m56k97M77J65j98j8J08n45Q2M00L7l36K1M18l54J85
3526F9L39k94n47P41l0m76q2O11p91K52M75l01l35N84P8k59J58J7n09J3L88k97
$$ y = [-476, 293, -232, -397, 87, 96, -242, 440, 414, 95, -89, 4, -130, -250, 272, -344, -416, -42, 421, 35, -54, 274, 157, -141, 238, 220, -349, -79, 406, -92, -109, 490, 90, -83, 378, 466, -423, -31, 397, -231, -482, 350, -394, -97, 182, 323, -278, -38, 522, -23, -166, 34, 37, -527, 15, 32, -421, -46, 428, 213, -231, 435, 382, -431, -32, 213, -630, -504, 345, -32, -300, 202, 292, -48, 93, 657, -247, -671, 189, 282, -318, -189, -154, -405, 112, 833, -72, -112, 508, 188, -64, -86, -5, -303, -200, 234, -153, -322, 405, 69, -275, 280, 377, -178, -330, -6, -129, -282, 109, 17, -76, 235, 583, -173, 24, 391, 73, -423, -59, 96, -474, -379, 491, 136, 68, 440, -257, -441, 379, 223, -214, -307, 37, -238, -391, 380, -76, -373, 104, 269, 71, 53, 161, -384, -302, 98, 135, -201, -180, 238, -116, 69, 408, 114, -433, 308, 278, -198, -280, 331, -460, -208, 267, -34, -369, 215, 293, 34, 192, 209, -300, -287, 101, -196]
3548a96KJ04L43o13N70K96l35l73K89j73k35M95q2j63O5K68l05J54j27l4p7L46
3570B19k41m83J42L73j21j37M57K31l08J2L63l27k92j10M8L0K62l73K0QN33l10
3592dM8K60m16M6K32n9k38j05J06J55m8J41%m5J06l5j59j8K32l90J51L6Jl01J77
3617a27Q8o7K84j24K53l73L1j0R8M2k59k4n7K53N6N9l45L6K82j53k68J7j0J36
3641a82M63l54j28L61O2rm1k42j85N6q4P8J81J51J13O5k96j71K65k9j10J94l25
3664a67ML45l75K51K4M2O6l28M69n70O8M29l77m20L85o1J87l6j2j21L68J10k38
3687D3j76K15j78j36K95j29k73J9N19j48m8L03k11m76K76K35l14P4L59k10j73
3708a34M05j24nJ2Q2m58K38P6l76J46J33P8k72RK66j52Q7J63l36n9M39l54n1l0
$$ y = [-196, -194, -90, 253, -360, 210, 506, 171, -202, 87, -86, -321, 174, 92, -71, -6, 262, -43, 111, -16, -50, -127, 219, -22, -505, -363, 10, -111, -248, 209, 440, 132, 144, 507, 180, -112, -222, -174, -144, 118, -255, -235, -227, 306, -4, 44, 304, -112, -66, 166, 107, -131, -236, -130, 25, -23, 118, 118, 73, 179, 144, -15, -33, 199, -191, -40, -4, -3, -304, -127, -39, -106, 178, 54, 307, -66, -35, -45, 53, 95, -164, -188, -245, 8, 64, 123, -222, -186, 96, -57, -325, -308, -318, -182, 281, -73, -201, 160, 222, 213, 172, -70, -255, -199, -283, -205, -24, 127, 240, 305, 9, -162, 103, 74, -36, 158, -167, -163, 182, -193, 58, 82, 124, 190, -138, 331, -239, -171, 258, -119, -539, -154, -215, -28, -64, -76, -197, 171, 281, 43, -133, 82, -96, -232, 63, -66, -339, -320, 199, 51, 3, 306, 95, -381, -105, 130, -184, -110, 249, 39, -134, 271, 147, 142, 154, 236, -222, 16, 92, -284, -138, -5, 73, -199, -190, 76, -76, 11, 174, -162, -221, 218, -136, -187, -217]
3732b17J97j57J75L63l81J56K46l18k82M68k04k57j10K38m8J04L17k44j08M43
3752C81l71J3j41K78j30l28M43j81J7N26l45k34k0M65l72Q1k0o1j80k0N02n86
3774b83J47K44k8j07K03n7l59L40K8n21K40K98l49K7L93q3k32K55L9l93K19j5
3796Fl72K04J18R2lK36O5n57K83L27l89l91L10N6m62K06J05j16L08K28l51n0K85
3819A38j24r5K59k24k05K05K77j62j95M43k46k76M29l93m9nM50m73L69J31m31
3840a77K96J55k8m79M22q2j9p0J29n1k44L10j18j59J7K80j33l10M10j93r7K45
3862A04j71k40L74M4k57K46L65l39l62N86l33l03K11K94k57k19L81k79N4L23l7
3883A85l11J77K40m29K21M0k37j28N96m72r6K43J61l29o5L09j25j38K24j46k31
$$ y = [-217, -20, -177, -2, 361, -20, 136, 382, 64, -218, 250, 46, -211, -321, -83, -131, -27, 290, 46, -62, 381, 10, 23, -118, 160, 30, -298, 145, -36, -19, 507, 162, -72, -92, 373, 1, 82, 62, 1, -179, -199, 303, -283, -136, 108, 80, -27, 176, 119, -240, 100, 128, -393, -153, 145, -204, -177, 216, 133, -99, 156, 195, -198, 21, 6, -366, -162, -44, 48, 45, 281, 346, -211, 72, 399, 10, -381, -71, -15, -477, -271, -166, -282, 26, 254, -97, -147, 138, 14, -81, 178, -46, -251, -46, 231, 69, -126, 317, 71, -205, 224, -169, -218, -223, 227, -246, 123, 254, -177, 119, 274, 246, -233, 189, 107, 88, 18, 147, 96, -148, 162, 44, -115, -98, 182, 49, -261, 149, -44, -141, 104, -67, -307, 67, 111, -146, 100, 465, 126, -236, 350, 17, -286, -75, 219, -38, -257, 124, -155, -101, 222, 185, -126, 51, 291, -138, 83, 123, -114, -242, 354, -118, -214, 29, 190, -139, -204, 105, -20, -158, 66, -80, -311]
3904c11K71M37p94K30M98l92j79M03Q3m33J25j98O6N5J67m7O4M12n28k68N67J60
3926C88l35p5J24l24R8O63n37k34M30Kl48J43K87m97Q9N55n80k83K51K58j61j19
3948b05L34j42n9M94l10m57K66k3j17LK75L7j89M72M8q29M72J18o25K39P32o18
3970h4j12M55k65n41O48L99p66L86L15n71l01R54j38q44L01L31l41J49N93p38
3990a70r8O94k31m67K02M01m89j59O17m05k38Q88l57k17R4M55q52L08K62p06N
4011d63O15K34n62J34L84n13N2O53n62k68M53J44o50J95O90q37L4N57l49l12O10
4032B39n5o94K20N11l27L6K28k0k49M44k16m89K31L35l35q7O47m54m78Q79L04
4053F70r96kP02m66k50O45m16n42N13N16o06M3L97l17p4O20m05n27L81N53n69
$$ y = [-311, -40, 397, -397, -167, 331, -61, -240, 163, 246, -187, -62, -260, -194, -139, 28, -19, 45, 457, -71, -339, 228, 388, 53, -22, 102, -222, -124, 539, 2, -232, 198, 200, -148, -5, 282, -215, -126, 429, -151, -434, -183, 75, -86, -205, 129, -13, -72, 422, 112, -345, -79, -102, -219, -216, 59, 96, -93, 379, 427, -402, 70, 188, -437, -198, 534, -84, -196, 259, -6, -547, 101, 500, -266, 120, 435, -136, -437, 517, 379, -465, -164, 167, -174, -25, 568, -170, -268, 426, 195, -272, -70, 331, -158, -317, 300, -105, -343, 545, 188, -29, 65, 520, -332, -24, 238, -468, -463, 152, 386, -176, -42, 342, -171, -119, 534, -28, -296, 157, 301, -349, -154, 536, -301, -267, 290, -59, -371, 239, 184, -510, -290, 221, -106, -70, 158, 138, -111, 333, 117, -372, -141, 194, -141, -228, 419, -35, -513, 366, 670, -326, -328, 374, -92, -342, 303, -113, -655, -142, 374, -232, -189, 208, -109, -183, 437, 32, -495, -114, 439, -130]
4074a30J19K26m13j16M81M0n45N06K75p02J51L97l98n15P68l29p1J90L14l70P6
4095d6L53j57j17L87n44k69M73L36k78j59J77j9j92L65k69l78M70J0l94J37N73
4116D59k49m95N06J20p57L28K74m65J74K28l08k77L69K77m05L77m0k79K7L91j89
4137F6k29K89n0l67L41K38l94L10j39J13l76L50N8l61M84ml57l6N3L40o62N15
4159A82K96n48l13O72m83n1M78k96L8K62k55m66L32L29l59j02L95R1k05j1J49
4180A35k58L10K57n08j20J95K36k34R1j95j6J34L14m46J19Q4J81n13K50P1o7k78
4202b58N28j70m55L05K83m38L59P6m51o8M63j08j71K95M4m83K57L63m43j71L25
4223H2R9l10J37L64n25K21K64l08l81N03n6l41K02J75l57L4L23k02J74pn7j38
$$ y = [-130, -11, 215, -198, -314, 167, 207, -338, 168, 443, -259, -108, 289, -109, -624, 144, -185, -256, -66, 248, -122, -46, 307, 150, 33, 420, -124, -393, 80, 416, 138, -21, 156, 137, -55, 310, 41, -337, 133, 143, -251, -114, 459, 210, -285, 221, 341, -416, -88, 186, -279, -105, 123, -185, -462, -93, 184, -221, 156, 116, -163, -136, 255, 66, -163, 126, 76, -291, 50, 288, -106, 204, 65, 178, -198, 152, 210, -151, 333, 329, -28, -64, -11, 329, -333, 182, 478, -70, -383, 289, -194, -245, 233, -63, -25, 237, -18, -484, -152, 177, -182, -284, 111, 202, -3, -14, 135, -123, 187, 444, -64, -184, 11, 247, 13, 104, -91, -107, 27, 341, -105, 14, 98, 279, -234, 16, 87, 20, -258, 270, 100, -355, -50, 233, -205, 154, 230, -221, -289, 174, 66, -105, 190, 234, -249, 8, 371, -72, -243, 82, 181, -129, 8, 372, -153, 68, 332, 24, -357, 146, 90, -251, -49, 126, -231, -197, 126, -76, 98, 91, 34, -104]
4245a04J26J1j07J40j73m0j08M72j57l27K18J30l36K85Q2j85j08L94l13Q4K41
4266B25K5m05p7M24k56q2M86k17J6L09k48j98K85k39k51J5K51K11m30J07J40l05
4288b14L56J32k20o4J97n1k56J67j27l8r1K36q9r4L24j27k81O6O33n60J82K09
4310B90l83k98N39J39o24O17j97k44N6N34m31l00M27n7m36L08L21l79l3K48j07
4331a0J20N7N3j83k18N70n13K23J14m33k8M29j60k18L23Q4j37j55L86n15j19O44
4353C14n5l75k7M14n65J36O44m65j40J78P0l0l1P0k66j78N15j42m8j4K56k14J35
4376A82L5j92j67M26l74l10O37j5m22K54o7k44J24M45j09m91O69k84l67J36K96
4397A62n27L05K88l07k70P95k47l61K04K41m31J71L08n73o6O55k91k75L50J40
$$ y = [-104, 22, 33, -74, 66, -107, -147, -255, 217, 60, -267, -49, 81, -255, 30, 112, -73, -181, 213, -100, -16, 225, 250, -155, -232, 192, -64, -146, 340, 123, 139, 448, 200, 2, 287, 48, -203, -188, 63, 274, -156, -49, 91, -214, 142, 274, 54, -10, 187, 136, -120, 47, -80, -118, -209, 27, -62, -156, 168, 41, -240, -174, 459, -101, 81, 290, -93, -391, 148, 287, -337, 280, 83, -161, -105, 429, -2, -302, 125, 68, -368, -60, 261, -118, -151, 97, -10, 110, 167, 220, 37, -181, 389, -124, 99, 213, -220, -248, 181, 21, -197, 126, 210, 73, -82, 304, -211, -330, 314, 259, -116, -143, 271, -294, -158, 486, 21, -119, 59, 129, 99, 68, 138, -128, -306, 209, 67, 19, 5, 261, 47, 182, 217, 25, -142, 284, -90, -400, 237, 222, -200, 54, -13, -257, -133, 312, 203, -288, 381, 97, -270, -134, 162, -365, -60, 228, -79, -349, 446, 199, -162, 42, 283, -148, 23, 331, -242, -308, 347, 56, -219, 131, 271]
4417B71l48k16N97l50l62P38k61j96O0K38k88j33O34j01m05L72N1n71K18L77m03
4438g8k80Q10m13k11N00j00m35K12L50n40Q3K94k38m28N22J44n01K12K45n07K22
4459a37M35j02n18N09J56m15L46p7l50o7O48r1q62N11N31q31K29L60o02M6N92
4480C11n3p33M51L31l81n5M63m06l97N63J24p20O06P1n34L49O64o33m09N24J8
4501A54n21N32p4l83L2M60m06n3O83l11l85K48K28l44k45Q99n80k25L57K0m57
4522c71J26M36m62L71K76j13o73N59k3m13L72J00m32kM93o5p25O71M26n23J25
4543A53J30l93J31K07k68l78M73J36l36L31k7m53J07N56k03n55M46Jk67L02L42
4564D35n60J38J74k36r6K13Pj78J70K52l49j56L91l7l54N1L59o86L49O48o80J1
$$ y = [271, -77, -293, 304, -46, -408, 330, 69, -127, -67, 171, -117, -250, 384, 283, -122, 250, 301, -270, -52, 325, -78, -358, 452, 39, -172, 328, 228, -207, 5, 355, -185, -102, 192, -46, -474, 48, 192, -309, -97, 148, -359, -137, 298, 196, -322, 187, 343, -72, 274, 197, -153, -220, 428, 337, -525, -14, 517, -314, -85, 275, -327, -281, 311, 258, -475, -24, 307, -74, -129, 334, -72, -469, 94, 218, -502, 104, 175, -359, -10, 654, 21, -388, 136, 154, -367, 165, 91, -292, -260, 200, -206, -259, 424, 113, -272, -24, 204, -140, -385, 514, -66, -291, 66, 86, -371, -245, 191, -271, 100, 376, 263, -410, 149, 126, -287, 85, 185, -247, -249, 244, 179, -546, 125, 551, 28, 153, 283, -110, 21, 228, -40, -418, 55, 191, -145, 186, 159, -294, -187, 369, 166, -389, 57, 58, -209, 93, 435, -125, 13, 187, -49, -145, 68, 75, -103, 67, 319, -30, -186, 205, 168, -186, -135, 224, -462, -113, 535, -145, -134]
4586a34J57n2k86L97K47m39k23O07k73k25M92j74k19K28M3m11K79p2j99J05L60
4607B08J59m80l1N02o68J46J71N4l44O55j61l83L18k6j67rL98k59l60L10Q4k52
4629a35P7Q6J31n38O25n45K19K33r8j08j74M89m35K25j17l83L36K41k42k18M96
4650A65N2n09j0N04m04J98J96m5l28K13q0k2J0Q4k51J44K10j36j00J74K27m96
4672b04J30K86l21K7j44J79k91K45J54j07K85j61J83m72L85m59O7L03j0j69j02
4693a96L18k43n2K50k1n9R8l7J33n1J28r6m2K2j57J20j04K38n50L68q6q7j25k3
4717b54M00k03j1K90l59K40o5J01j50J84M2l51P8J05N1Q8j31r8j59K02J69j13
4739E6MQ1k17QK18k2j49NK0J04j16j5K19j88M4j26k33L18J69l06K59n2J02k11
$$ y = [-134, 23, -29, -315, 82, 329, -110, -333, 274, 1, -224, 268, 94, -125, 103, 146, -265, 14, -58, -257, -152, 208, 367, -113, -144, 358, -310, -164, 7, 61, -283, 372, 211, -172, 146, 120, -47, -56, 342, 83, -277, 33, 117, -135, -58, 28, 159, -379, 246, -299, -80, 153, 55, -53, -227, 262, -173, 52, -65, -448, -112, 129, -113, -331, 165, 217, -292, -302, 202, -202, -4, 192, 147, -181, 32, -48, -70, -60, 24, -227, -83, 127, -9, -109, 65, 292, -204, -74, 212, -109, -82, -226, -47, -338, -93, 61, -46, 239, 78, 261, -211, 174, -285, -218, 85, 75, -94, -196, 122, -121, -173, 77, 56, -3, 95, 58, 191, 140, 268, 172, 130, 152, -5, 115, 11, 249, -301, 67, -19, -106, -231, -254, 146, -57, -68, 222, -137, 103, 38, 139, -11, 173, 215, -136, -58, 47, 98, 186, 55, -43, -202, 0, 169, 56, 60, 141, -76, -68, 150, 128, -21, -16, 4, 108, -8, -23, 196, 8, 52, -74, -307, 11, 180, -126, 133, 81, 183, -28]
4763b8q8J91jm8J48k80r1K17j63K71R0pl78L10j43j88J04kK49j69K02p0j40K04
4787A90r1j11J6Q3k21j9J61j0o3J05k53J46NL53l86J0N9K12j85R6j39q5L6J49
4811E8J36l85K33R8q9%O7m6q7J11k5k23LK56l06K07K11K2j37k02K19j02k3L71
4835C67l94O0J46j82J71l70J03j03K90O8l30J50l7p8PR0J58k25L00j39j99J36
4857a1R2j36j90K85J65q6o1R0j66o1J17L4l6m2N4K2L3r9k65M78k1rl26K99l51
4882a91k9J64L24o38L65J95k78N2O2K0j45L24j12l08J61Q5j61L3K7J37l00L03
4904I0J24k52QK39j18k99N21j89k57Q8J92m32L00J46K8k06K26N5l96K49K12m40
4926a11P5K69k93J10j12J65l9n6o0J74l78K54j31j00M01l53Q0K0J14j51j9L15
$$ y = [-28, -116, 75, 74, 26, 174, -106, -197, 20, -143, 128, 218, 211, -167, 143, 0, -188, -84, -86, 163, -6, 196, 126, -14, 190, 99, -12, 4, 87, -134, -153, 8, -2, -65, 40, -213, -67, -62, 291, -95, -85, -26, 186, 1, 97, -42, -127, -91, 58, 194, -191, 42, 140, 51, 51, 118, 72, -15, 96, 71, -152, -149, 107, -199, 8, 219, 241, 104, -98, 121, 19, -4, 367, -27, 33, 179, -3, 168, -202, -99, -202, 88, 156, -174, -24, -61, -139, -132, -42, 116, -109, 191, 52, -147, -11, 81, -55, -245, 40, 205, 119, 58, 148, -18, -79, 38, 72, 36, -6, 48, 70, 103, 4, -261, 217, 196, 187, -139, 160, -191, -220, -56, 268, -370, -5, 190, -88, -36, 26, 46, -99, 225, 113, -195, -34, 51, -110, -77, -50, 87, -213, 90, 214, -38, -30, 209, 91, -208, 313, 124, -133, -45, 147, -285, 15, 161, 189, -17, 209, 264, -132, 117, 329, -111, -36, 233, -60, 50, -62, 103, 64, 8, -52, 122, -256, -2, -133, -233, 168, -185, -105, -85, 29, -122, -141, 174]
4948A74p4m10L23N20p87L05K34k85K17O6k03k47M12J06n75J60J28o8k32L04o8
4969@J27O5M6k20O9J75l63k2M2J86l50M31k5l14k66L70J35j86J79j29j37K53J05
4992A71j70j89L10k10O7J24o4k97J87K54k12j86L59m9j06m9L96n58J57P5q3r2
5014a65J87K86m59L20l19j00R1J05J63l81K97P2l14J55K63j74j15P0j03J27J65
5035A71j40n2J78p7m1j99L44j44l24M69j18o8J4k2j94J84Q5J70l70k38N57k83
5057i8K09o4k5j40J94o4k05R6K06l73M30K63m41k17J52J18l5K75p5m84L48K30
5079C00l33j09K66j17M1OP1r3k5j15L9J34j85j16K01M6M4J22l04K98j54J5j81
5102a49O7P0J56k18M5Q0M5o7l11L79j36q0P4M0j16K12r5jn6J02J06J69m64L23
$$ y = [174, 100, -310, 13, 533, -254, 51, 285, 0, 217, 283, 80, -167, 245, 351, -224, -64, 64, -4, -236, 68, 0, 127, 192, 238, 18, 87, 262, -101, -123, -81, 105, -245, 186, 161, -153, -419, -49, 86, -100, 79, -50, -187, 66, 171, 1, -188, 122, -88, -21, 103, 39, -258, -71, 183, -29, -215, 144, 95, -11, -60, 336, -222, -65, 10, -73, -165, 22, 308, -151, 169, -150, -250, -159, -54, 109, -272, 25, 97, -217, -62, 201, 27, -88, -18, -121, 6, 171, 31, -21, 157, 80, 39, -160, 184, 40, -284, 185, 67, -1, 13, -9, -203, -19, 66, 236, -134, -372, 185, -98, 111, 47, 22, -118, 76, 12, -193, -97, 109, -264, 166, 429, -12, -229, -77, 41, 6, 281, 206, -278, 70, 300, -33, -142, 124, 7, 48, 54, 125, 32, 7, -108, -69, 65, -120, -236, -35, 11, 55, 177, -127, 171, 17, 32, -149, -82, -12, 144, -74, -29, 51, 96, 29, -282, 97, -39, -119, -45, -5, -121, 91, -4, -5, -61, 41, 147, 316, -148, 175]
5126A75k08n2L26m85K34j28O3J60k58K02j0o9L6K17j29o3J21m07K71P0j57K25
5148A34k89J12k07K55r6o0j85L06o1L2J43k5J42k00LJ7o0qP7L4r6j3J78J14m68
5173b21L85k21j71L20l87J36J37L3k42J43Om2K44k05J20j23Q3M3J18q6k16L97
5195B51k1l79J23M0MP4k88K20L2k6jR8l36L02k00oK55j94K82k28l9J33k56N2K62
5220A54j85j0J71j04m9Q1j20K99j90O3l62K42j8K37o8k75p8K75k92L40j23k33
5242b45K63k26K7n2P7R9n6j28L19m3R1l59L17k29M4J06J12l5m72N04j85J98j11
5265A6J27j30j57J81j91L44j11NN9k63L14j71O4k87J38r2K99l71K16j58J98RM4
5288H3M5j57o8q1J61N0P7j2m6m4j9L3j41O3K57l25q2K10mk80L69j67J19m4k37
$$ y = [175, -33, -85, 241, -244, -10, -138, -75, 85, -173, 29, 19, -50, -14, 203, 74, 11, 132, -275, -4, 66, -91, 134, -155, -43, -250, 5, -91, -151, -336, -30, -91, -59, 84, 59, 201, 1, 4, 21, -39, -47, 30, 64, -32, -45, 133, 247, -221, 164, -57, -228, 92, -295, -159, -22, 11, -231, -88, -82, -124, 120, -85, 35, -88, -5, 38, 156, 70, -146, 251, 230, -149, -26, 14, 18, 92, -196, 24, 56, 30, 29, 127, -209, 93, -107, -113, 142, -52, 230, 2, -37, 96, -160, -108, 154, -31, -41, 130, 26, -23, 58, -62, 237, 47, 110, -252, -10, -28, 209, 141, -134, -212, 63, -229, 111, -12, -245, 18, -208, -181, -233, -156, -57, -113, -241, 78, 35, 126, -233, 84, -145, -101, 5, 117, 82, -390, 114, -71, 127, 16, 143, 13, -144, 37, -154, 190, 79, 84, 143, -120, 194, 23, 87, -200, -62, -154, 145, -226, -10, -168, 30, 39, 83, 128, -29, -97, -178, -17, 33, 110, 98, 52, 8, -11, 22, -119, -56, 201, -124, -206, 4, 0, -280, 89, -78, 41, -3, -240]
5313b40J72pJ0o5M3P1qJ60j76p8j2l4K23j89K61j78k23K96K2L11k84k37J38j9
5337d3k5P7o5J94r1N7O7l7j63O3J25k90P6J31J7j10K48R8j51L2j32L2k43k0k6
5362a79L55j40j10L78p6q9j19K9j52o2K02J32j55m1j37Q7K15J3m74K89j45J98
5384A9k7J14n5j82J38j82N0R6r6K27l26L41N8k46N9J11l7r0l9J4L4R1K95m19j7
5409f9q1J9K27L1N8k86M1J11J64k26m0j66J64K81j68R0j95J97M0r4kk48P2K29
5433A49n6K2l7N3k82J97J69q6m57K45K43l74N38l70J32oK7j48k66M15k24k4J64
5456B4N8j78J4O55m86R7k42R4K7j40LmJ63M0j03j18J36J16j29k86J71%l3k4J13
5481c2k75L69p1J08o5n4OJ27R2l21K78P2k83N5P8p6j30N9l4J81k41K1P8pJ03K75
$$ y = [-240, -68, -75, -65, -130, -87, -16, -24, 136, -40, -118, -130, -164, 59, -130, 131, -47, -270, 26, 48, 359, 75, -162, -24, -43, -68, 9, -56, 138, 47, 104, 171, 134, -29, 34, 159, -131, -55, 76, 93, -17, 231, 329, 178, 210, 78, 110, -133, -153, -179, 176, 36, -74, 304, 228, 139, 20, 49, -103, -165, 37, 169, 14, -27, -164, -77, 138, 151, -323, -34, -179, 19, -8, 106, 51, -131, 7, -175, -125, -29, -125, 102, -224, 117, 175, -71, -12, 99, 62, -28, -67, -53, -19, 72, 367, -52, -69, -150, -131, 96, 127, 185, -101, -60, 51, 215, -11, -51, -217, -53, 228, 60, 150, -45, 152, 192, 98, 96, -152, -80, 149, 93, 115, 78, 131, -151, 46, 215, 129, -328, -83, 160, -214, 324, -46, 86, 80, 107, -41, -307, 108, -116, -140, 24, 82, -96, -82, 573, 87, 184, -58, 36, 63, -77, -74, -78, 85, 125, 22, -96, 40, 156, 27, -259, -88, -88, -121, -145, -32, -307, 62, -9, 99, 34, -20, -14, 113, 205, -116, 162, 234, -49, 6, 84, 8, -122, -63, -97, 84, -157, -136, -58, -65, 38, 313]
5507C13k67M2j44R2P5k21J78m8j18K68ok04K56m55j50N89j05j06O0K8j80J13M4
5530E4O8k1j54K12k69J60l00L04O6j1k09l7k1K63k40K63o7L5j75j77J73R6n9J21
5554G5n2Ql7O4l12K68J34k33L27p5k10j53J37J53k33K09J60j78o0M8L9J88j01
5577A66k10J2K03j18k10JL53j54M0J2K9m47M20R3l85J33K24o1k47j5k0P4K89O8
5601B50l22J21j44j71k3L01j91J05j06K09q7m1K73k94J73k22K64j82nJ17j43K3
5623i5p4K58lj61j0m9K9l1L25l67R0Nl0J50k7k22o4J71J84OQ5k0j54k44K30J33
5649A15J52k15m0j27M33k28j61K63j36k2K5l0j12m2K0J23j06J74Po0o6J68k32
5672i7R7O4k0J41q1j33K32j39J53k79N1J94k17J09j67lM33m04q9K30k7k4n8q1
$$ y = [313, 46, 88, -56, 36, 111, -110, 68, 20, -98, 170, 164, -40, 216, -239, -389, 200, 95, -11, 49, 77, -103, 10, 54, 122, 101, -53, 159, -110, 50, -250, 54, 120, 109, -100, -137, -158, 105, -135, 128, 61, 96, -79, -256, -83, 13, -46, 75, 23, 31, -6, 58, -254, 14, 148, -85, 242, 167, -43, -196, -59, 94, -139, 70, 230, 52, -8, 40, 79, 267, 166, -44, -32, 171, 53, -157, -156, 197, 43, 83, 95, 124, -323, 97, 190, -195, -62, 162, 101, -146, -161, -181, -107, 182, 250, -72, 49, -95, -266, -289, 12, -179, -74, -180, 29, -58, -99, 174, -120, 53, -169, 95, -87, -92, 25, -118, -95, -169, 89, 86, -75, -85, -134, -105, -136, 189, -178, -88, -83, -113, 37, 10, -212, -276, -105, 79, 85, 170, 150, -4, -248, -18, 115, 267, 52, 12, -115, 318, 90, -71, 192, 56, 34, 59, 29, -83, -125, -105, 18, -88, 86, 93, 33, -33, 135, -97, 0, 64, 44, 185, 104, -29, 203, 64, 217, -62, -11, 183, -34, 75, -92, -95, 338, -66, -155, 75, 48, 24, -34, -115]
5696a15L7J92M9j29L4q8k80K67J36J26k89n3J94K7j92p1M08r3k56j62L60O4k87
5719a21j04J38K95j38r8k49K49k90J40OL34k82K31j59J00l1p9O5J29k51j97L04
5741hJ38J8k85R0J58k87K66k99J43j19J78qm4O6j09q5K66k44K32J50M4n13K10
5764d2j6m4R7J48j79k17L31l36RK8R3J89%O2j1l92N09k97J73R4j97j43R9j01J38
5789ej4l3J49k33J25r0K14l63L59j36qR6j44j77K72mJ46m7r6j31K0m7MJ30l8j8
5815f9N4k10K05j20K19K8k81L06j12K7R9l42J53R0M2k5L6k8j12K06l00J24k76
5838b86K70J50k76J57J00j09J20j41n1jR8LO7P5r3j1j85n8J96J19j60l6J04O9
5862A21Q7k90K03n3J00j10m6J91l28J66j21Pj52J79R3j57o8M13j59o3j30L0K57
$$ y = [-115, -78, 114, 163, 34, 68, -20, -300, -33, 103, 229, -60, -113, 81, 108, -84, -155, 253, 160, -96, -258, 102, 166, -121, -225, -87, 208, 70, -28, -277, -28, -318, -178, -172, 162, -120, 111, -48, 52, 21, -58, 7, 136, -115, -312, -8, 130, 148, -137, -47, 111, -176, 90, -209, -66, -185, -7, -15, -59, 7, -102, -187, 79, -165, 67, 217, 261, -252, -42, -58, -102, -5, 143, -36, -253, 78, -258, -249, -221, -128, 61, 61, 123, 112, -280, 229, -68, 105, 199, 2, -141, -42, -143, -5, -19, -52, 97, -136, -11, -101, 113, -250, 109, -27, -35, 61, -83, -260, 12, 8, 154, 107, 11, -120, -100, -147, -143, -13, -51, -69, -15, -225, -20, -140, 79, 107, -174, 132, 20, 47, 146, -196, -43, 47, 89, 64, 100, 72, -40, 166, -134, -10, -286, -16, 134, -142, 15, 115, 6, 126, -15, -66, -67, 31, 34, 101, 176, 83, 72, -113, -171, 25, 144, -16, -52, 52, 121, 208, -82, 121, 68, 168, 58, 12, 203, -125, 41, -80, -73, -225, -46, 47, -110, -178, 235, 76, 13, -117, -87, 170]
5885A70k61K10k64J84K8n2J62j33K4J53k94J19L2Q6j34r9L11k75Q7n6k13L25j22
5908a2O0j30Q6N5l54K25k85L82j32M13k11k40L9L19l60J32oP7kM3j76Q6J59k80
5932a12L04k33J80m9k04k9K04j69J28j2J36k10o5K03k55K5K10r4P0Qk11J90j51
5955a36p7M45k42l80K63O6j37J97l3K8j28K21k8O4l79J37J50Q1O1oj44k24J24
5978g7j3L8Q0n0J46n8j83O6M1k39L55j22j73K17n1J77r6J7p5j6jj73J97J98l42
6003a37P9K83m78O1R7l8J54nj02j39J89J10j36o7J43K1j57J05M4m1J76oj28j39
6027a11J41j4j13N1J42n3n1j00K10k73J84m8o3P4J52m1k90L05N1l0l07J18L2N3
6051A9q7J09J47k00n6m7P2N9N4l19K65J14j80J35Jk10P7o7L51l41L87J56m89J03
$$ y = [170, -91, 119, -145, 39, 67, 15, 177, 44, 68, 221, -73, 46, 78, 164, 30, -69, 242, -33, 54, -2, -215, 110, -12, 48, -82, 4, 59, -295, -70, -355, 27, -105, 308, 97, -143, -104, 215, -145, -13, -19, 58, 56, 99, -77, 9, 168, -112, 192, -41, 139, 90, -114, -143, 61, -108, 20, 8, 144, -66, -131, 72, -183, -158, 52, -42, 28, 36, -175, 15, -136, -213, 232, -10, -390, -127, -61, -198, -1, -34, -6, -134, 87, 59, 123, -256, -119, 31, 112, 173, 167, 23, -201, -77, -90, -52, 28, -22, 124, 66, -117, -51, -10, -249, 106, -16, -189, 28, -23, 154, 58, 75, 0, -16, -17, -190, 7, 205, -137, -58, 225, -253, -192, -95, -133, 21, 16, -86, -225, -36, 74, -62, -129, 14, 35, -122, -17, 27, -14, 162, 156, 28, -111, 30, 16, -97, -46, 96, 43, -8, -108, 102, -171, 13, -35, -98, -24, 128, 87, -203, 102, 153, 123, -184, -66, -34, 19, -68, 41, 188, -12, -68, -115, -43, 16, 70, -249, 16, 130, -50, 85, 86, -124, -47, -114, 237, -104, 283, 439, -50, 53]
6075E3q9P7p9R3j74K07j01J00j32J15j89K51j41j55J72j14J01P8k8J91k60mQj4
6099c4k07Q0J61n3M5K07m9k75k9J70j28J16%K1J96l39Km9j9J12q9K07j09J39j63
6124h7O3j83M50k7m20K70J45k08Q2j01j5J9J55r5N8j52J18m6j83N8J82r6j97K71
6148F1j95K31orM4j76k8N5P5k15J7M6K43oj07j33K13j10M5q2O5j74J97k68J55
6173f2O1j5j6q3m7M9J63o7q0L00j51j25K7J81J28k51J28k35J65k00J03N8j01J14
6197D4j36L0P1%R6n6n0l0J72j3Q8k32L3K41m11oN1jJ52j1n8J72Nl00M2J05Nj2
6225iL9Nl8N5J51l85N7m6N3O5k12L85L2m1l51M6L13j64k78N99l08j02R1M4p2O8
6251cK4K2p2j01L52m6j23j33J06j22Q0L7J1N7L4j20N4j42J63j85J5R9l7o5N5j94
$$ y = [53, -36, 41, -38, 55, -119, 88, -13, 87, -45, 70, -119, 132, -9, -164, 8, -106, -5, 73, 45, 236, -24, -28, -20, -34, -241, -161, 0, -53, -8, 199, 150, -125, -154, 16, -112, 4, 4, 25, 221, -118, -116, -165, -184, -72, -161, 46, -63, 76, -87, -24, -207, 243, 216, -204, 66, 211, 3, 85, -16, -31, -12, 143, 48, 106, -46, 72, 26, -157, -99, 83, -13, -210, 61, -134, 97, 91, 82, 126, -50, -78, -23, 52, -163, -146, -100, 143, 137, 30, -103, 110, 0, 45, -37, 28, -146, 51, -217, -62, -1, -16, -32, -115, -162, -113, 50, -17, -97, 203, 52, -73, -46, 135, 263, 12, 140, -95, 70, -130, -27, 31, -70, 44, -92, -62, 9, 9, 105, 49, -1, -31, 141, 128, 216, -16, 17, 258, -153, -159, -108, -109, 43, 32, -26, 146, 151, -149, -107, -2, 3, -9, 30, 35, -3, 52, 203, -182, -125, -171, -118, -53, -265, 120, 152, 111, -240, -194, 119, -45, -323, 276, -32, -134, -43, 1, -71, -3, 21, 43, -29, -130, 222, 176, 53, -80, 26, -96, -16, 21, 32, 89, 123, 3, 57, -85, 78, -107, -92, 7, -30, -95, -40, -234]
6277b34K89K45k90k26J67J34k72L30K9k52o2J13J00O7j04j33K18L4L0j79K10k41
6299b7J16R2m09K72m2j3J88j94R2j25j52J30J40k27J92q9L5J43j38N7j30K45k52
6322i6J49L01l06J21m31K26J69q8o6k64J25K62O9k15J71j82n8J63J3p6k2L2J5
6345A2NJ29J4k43K51j92L27m10L54j67l7k63K48k08R0K48j61J90j55K38l97J43
6367A6R1J67k31j93L13j17J00l41K10PK20L3k10j30K82m01J54J63m80K72l0L4
6389g1P6j86K32rJ18j07j65P2n8k49L04o4J64k1L3QJ4j89K10j87j20J76n5N0J76
6414A52k65K25n1j69K09n0k21K07J76l36J28j89K30j82K5o7K1K1J42l68K70R8
6436Fq9j42J87j56N8K52k34L75j38j70J30k90L64M7l8k6p1j43m9J05K09k31k4
$$ y = [-234, 55, 300, 10, -216, -49, 85, -187, 143, 172, -80, -142, -29, 71, 138, 34, -99, 119, 153, 183, 4, 214, -27, 89, 181, -228, 44, 2, -11, 177, -17, 75, -50, -202, -72, 68, -159, 33, -56, -21, 122, -16, 41, -89, 156, -96, 53, 354, 48, 169, -262, -36, 133, 45, -21, -285, -160, 102, 171, -44, 127, -55, -113, 50, 63, -13, -35, -3, 12, 17, 146, 160, -83, 168, -24, 303, -107, 247, 80, 43, -220, 28, -180, -90, 158, -3, 187, 32, 270, -127, 16, 107, 274, 43, -150, 163, 46, 146, -195, 15, 22, 242, 275, 65, -65, 217, -184, -30, 133, -347, -75, -105, -71, 5, -181, 51, 42, 160, 53, -112, -40, -98, -347, -43, -107, 57, 36, 69, 77, 91, -98, 112, -75, -195, -19, -74, -24, 152, -113, 112, 61, -108, 101, 51, -170, 37, 213, -123, 5, -184, 46, -136, -111, -178, -157, -136, 6, -362, -92, 6, -83, -225, -38, -194, -136, 116, -118, 257, 119, -51, 79, -211, 153, 200, 162, 136, 65, -78, -127, -22, 187, -44, -68]
6459f8K49k43R6j18L19m59L79k88l0M21k76P4j10K45k36J67k9r2L9j48O7J63k96
6482a74M03l43M3j09J57L35m40L24j30o6l74M87j63J35K4j83Q6J10m1j36J62K
6504A09k0q2L3J40m99N31j40J73k74m4K10k46M40k89j07O8P1k2j59K90k28R4j12
6527f3J5j22K05L5j30K6N0O5P8j22K40l28K9K5N6O1j6p2l77M25k28L97o5k8m15
6552b59L83m8k00l6K15K4m9r2R2j56N4J87Q6l19J09K41r1j28j21qq7L41j47J93
6576A84k63K05j97J23lj5Q9l6O3m29J21M6O1K63R3l72O9N9j08J4L9Q1o7J94pk46
6602c9P7J96l67J25L89m02K1P5k5q0q7M27l17j7j9K56k17J51k56J15O5J1p9J50
6626A53kQ4l7k75K0l4M02j17j6ok35J68l28K29J18l26K5K63k01K54m9J5j16q1
$$ y = [-68, 181, -62, 34, -84, 235, -224, 155, -133, -163, 258, -18, 56, -54, 191, -45, 122, 93, 1, 40, -108, -41, 122, -174, 229, -114, -71, -180, -23, 312, -128, 196, 66, 0, -374, 113, -50, 85, 109, -74, 12, 122, 81, -55, 107, 109, 89, 7, 40, 180, -319, 212, 72, 245, -29, -73, 137, -109, 331, 42, -65, 3, 74, 52, -107, 183, -45, 49, -63, -48, -170, 35, 70, -60, -34, 16, 81, 159, 37, 277, -51, -22, 3, 59, 120, 104, 32, -345, 80, -148, 249, 184, 156, -259, 124, 76, -124, -160, 55, 79, 30, -62, 30, -126, -72, 115, 201, -118, -9, 232, 141, 13, -108, -116, -203, 138, -9, 184, -79, 126, -71, 52, 49, 34, 123, 87, 150, -279, -158, -112, -51, 212, 305, -67, 2, 61, -47, -33, 6, 87, 20, 214, 207, -39, 38, 234, -133, -8, 381, -21, 0, 75, 50, -30, -117, 310, -7, -24, -43, 213, -4, 147, -109, 6, 71, 82, 3, 153, 151, 235, 198, -77, -57, -91, 311, 194, 178, 172, -63, 105, -223, 6, 124, -202, -177, 86, -115, 139, 90, 105, -11, -92]
6650i2o0P0j14K24N0j14L0j13P2k7R4J20j83K08k11j13K88M4j36K08k50p3K60
6673A82k95j35L42J21k00j20R7p4L6l1P1J18m49K98J08k62N47n02J8J12j5Q0m25
6696c78K46j3L4J35n5J24J71k49L1j06J02R0q2Oj69K94k42m7M0J40j6k08K48q6
6720A0K19l33l4M29n65L93l33J65k64L30n2Q9j30Q1N7j4rK29j44l63L80l2k57
6743a48K22m6J91j54j76L1P8J10k42R7k6L22m27rJ93K92l47j74J76j7K07r6K23
6766B80n85L09j24o2J6L57j50R4J2j15j1j59j00J99p9P4k2o5J97l2j54K10P7p0
6790I7N9J73n59J85j19L29l05K73k7J26l42J07q6R6r4L19j87pj17r6J29l4K45
6813A65k85J63J21l43J64J05j56J6m3J31J17j77m0LL8o5OK70k78kl9OJ11Rj33
$$ y = [-92, -152, -82, -196, 28, 78, -36, -6, -119, -47, -74, 20, 140, -43, 165, -46, -159, 129, 173, 37, 245, -5, -78, 182, -113, -248, 94, 215, 15, -105, -8, -82, -46, -77, -6, 112, -337, -39, 69, -193, 354, -148, -130, -18, -33, 47, -378, -132, -145, -111, 24, -31, 93, 264, 15, 46, -60, 42, 132, 50, 56, -113, 181, -61, -108, -68, 72, 56, -152, 96, 10, 229, -104, -138, 291, -274, 119, -214, -49, -313, 17, -35, 54, -76, 5, 62, 48, 39, 268, 124, -239, 141, 109, -148, 74, 28, 219, 65, -111, -80, -2, 108, -134, -37, -63, 259, -168, -177, 16, 308, -39, -213, -37, -54, 153, 57, 280, -305, 4, -120, -182, -166, 191, 41, 135, 147, 32, 21, -138, -238, -39, -118, -44, -66, -131, 66, 34, -120, 90, 167, 97, 156, 329, -230, -45, -164, 165, -140, 133, 106, 232, -110, -3, -89, 7, -87, 232, 45, 38, -79, -175, -46, -80, 165, -120, 43, 164, -179, -15, 90, -66, -50, -93, 38, 155, -22, -62, -59, -21, -86, -80, 190, -88, -90, -129, -123, -12, -3, -136]
6838a36J85l5K18k70K83l20K27M0k62Q6M6o6q2m9N5K29m4l0q9K18n8o9l9j7l33
6863c12L33Mk96L74l46J78j6N6o9K18o0K0L7p8o3J88o2oL8q2J37l53J91o6q3K20
6889A02j66P6J56k07K1p9j76P2L22J1m48K10K0n9K8j09K88k29K00p4k6K67k74
6912g4J22k92M28k15K14k75J08k38K05o6o9J70J2k15K24K9k2p8k5R9o8n4P2l07
6936c15L75j58J61L4L2j27K39k1j91j59J24R9n5J3k1M6J2n0r6p8K23N6n6LK7j62
6962d5j21J97j89J26J38j13J79j69n4K95l50K58r9J09j75j35J62j1J07j80N3q6
6984a03m4J08N8j62J76p0j0K91j20Jl4jj22K9K5K2k37N9J38O0r3lJ58r9N4k93
7010b12K82l6Q8NlL0r8Q5J57j67j06m0Q6r5J40k60J99k08J83j6j31P5O2j83l7
$$ y = [-136, 49, 14, 232, -38, 245, -75, 152, 192, -70, 16, 62, -4, -86, -135, -80, 149, 105, 75, -14, 204, 146, 77, 38, 21, -312, 21, 25, -271, 103, -243, -65, -81, -25, -94, 124, 64, 84, 121, 43, -20, 168, 106, 100, 138, 56, 193, -160, 31, -35, -118, 102, -64, 12, 168, -39, -18, -97, -273, -201, 121, 132, -316, -106, -86, -145, -117, -226, 62, -167, 33, -41, -67, 200, -74, 48, -244, 184, -31, 183, -92, 16, -222, -17, -83, -152, 18, 30, -185, 39, 68, 46, -32, -57, 42, -26, -80, -8, -315, 60, -98, 63, 97, 129, 2, 241, 220, 29, -130, -6, 93, 38, 51, 30, 76, 88, 38, -58, -136, 87, 143, 87, 90, 117, -45, -166, 31, -158, -32, 106, -7, 172, 3, -51, 244, -106, 152, 53, 162, -13, -148, 14, 3, 110, -70, -17, -103, -147, -39, 19, -143, 33, -37, -47, 244, 124, 125, 91, 90, -32, -3, 22, 44, -193, -134, 4, 64, -29, -32, 126, 27, 81, -212, 70, 34, 122, 127, 124, 154, 56, 141, 298, 131, 25, -15, 71, -24, 116, -144, 55, -153, 30, 14, -117, -42, 20, -163, -200]
7035b00kJ46O5j09L8J17J0j76K25n3J77j6l59j11L62r5J16j51o3J88j22Q1K7m
7059I1j29j9j10J25o7j6K51n19L21L57j30k11L0l2l1L50m04r1M88l21J70p0J68
7082B01q7j75K07j26k7J94k01J10L4j50k1J2K65j53K2l01K62j84N7R0L32n73M15
7105B03k27J2K4j20J16R2j59n0p0N9k1J82K25m33K81Po8j23r9J48J2j86J91j9
7129b3R6j11J77k73J16J6Q4n5L6j79P0R7N9j69qM9p0J25j37LJ47k6M0K42n19N17
7155C04k69K0K5M0j18j7j70K23r7R7N1k13J05k21J67K37J47k94j20J35O6k34R3
7178d3j95L13j47kJ80k30J01j25J07K14k26K31m06K96j98l6K85l12J81L8n6JL3
7201Dok9j72L63j85q2K44J4j38O6k48n8K56P7k31K4K82k04j92J07m7J67l3l0P6
$$ y = [-200, -202, -56, 9, -100, -62, 55, 65, -111, 114, 61, 238, 222, -137, -248, 114, 19, 135, -16, -79, 109, -13, 68, 95, 91, -38, -57, -167, -42, -109, -125, 126, -393, -72, 285, 155, -56, -26, -58, -89, 261, -143, -234, 254, -67, 103, 33, 201, 114, -61, 146, 20, -7, 187, -14, 96, 130, -20, -41, -29, 236, 83, 105, -196, 66, -118, -61, 29, 361, -212, 203, -24, -12, 12, -108, 8, 100, -59, -109, -179, -120, -141, 41, 266, -167, 114, 121, 53, -70, -169, -21, -9, -195, -4, -23, 73, -38, 139, -134, -18, -2, 82, 27, 63, -116, -46, 51, 110, -59, -67, -18, -88, 37, -100, -97, 50, 24, 64, 306, -213, 304, 35, 55, 80, 120, 2, -15, -185, 38, -59, 38, 89, -124, -19, -240, -73, 164, 311, 17, -103, 32, 98, -136, -43, -238, 75, -72, -74, 106, -124, -23, -148, -41, 173, -53, 178, -228, 68, -130, -166, 119, -193, -12, 26, -30, -29, 4, -2, -31, -203, 160, -25, -107, 137, 151, 13, 79, -169, -227, 29, 106, -125, -101, 181, -23, -215, -108, -155, 12, -21, -51, 25]
7226B5n1J68k48J25l5j7J34R3k77L29k05j07o8p8J90O2rk42P0Q7M4k12K7j7k1
7251b33R0J66n5K3J10j61N5J26l6R8J17m44J82K08j89k09L09k48n5o3J52j56K60
7274D7j57J06K7J50P6n5j40j11M4j4LP1J12J4j91J52j96R8r5J0K75l45Q2j00K45
7299A08k65L06j87p4nR4J38j82R9J89j58k03o0J31J63R1k16L9j7m1Q5J29m95N05
7323A74j68j51j3j21M70j78K43k73L23j76j65J22l6l9o6N9k6PR0K8j48J4l9J21
7347E2j83L4L9r2J98o3j58K7J74K46j92n5L7k07n3J89p5j50J84J40n6j1j39p4
7371a88R5j83K54n0O3J63j93L7L4Q1j05O7r8m4RQ0j53J22J92l4q6k17K75l1r0
7396@l25K5M10j95R0r7N4L3j94L07q4k3j23L5L75j34j42J6JJ29j41q6j08K21L8
$$ y = [25, -26, 142, -106, 19, -16, -33, 101, 194, -83, 246, 41, -66, -134, -212, -22, 40, 31, -211, -141, -54, -10, -222, -195, -212, -233, -143, 23, -32, -9, 101, -60, -5, 121, 85, 183, 300, -144, 38, 246, 57, -152, 157, -91, -146, -209, -57, -213, 47, -110, -4, 23, 173, 249, 194, 54, -57, -13, -27, -24, 47, 159, 173, -18, 134, -62, 36, -59, -49, 226, -119, -37, -137, 108, -157, 149, -38, -112, -117, -23, 115, -67, 32, 221, 63, -140, -200, -69, 94, 185, -31, 8, -9, -50, 35, 164, -331, 174, 6, -145, -158, -279, 191, 13, 256, -17, 306, 130, -35, 87, 51, 12, -54, 5, -21, -14, 76, 104, -44, -30, -69, 52, -131, -97, -58, -150, 48, -15, -173, -146, 28, 274, 82, 27, 64, -143, -196, -7, -82, -232, -48, 92, 36, 25, -114, -188, -93, -276, -22, -72, -9, 154, -39, -2, 32, 113, 8, 75, -23, -67, -58, 22, -131, -9, 183, 149, 63, -154, 121, 90, 0, -325, -300, 110, -85, 5, -92, -38, -5, -199, 108, 24, 1, -122, -87, 288, 154, 12, 28, 29, 158, 17, -69, -177, 44, 82]
7421H2k12K11O2k16J25Q4n0j69L64k07J72j87n1J83j84L0n4J97k09n7J95j66J83
7444A26j46P7R0j77J34j15J8j03K29j68l1j15Q7k64M49N5l40Q4P8M0J35j04j10
7467g1K99k15J3K8q6Q0n9R8o2j44K7N4J19P6l54L17j66l6j64M31k66J27l62K58
7491e8M29m90J34j03M04k24j34R2q5m1j05J33J74k26K24J03m80K72k8R4j18K03
7513A70k11J32j60K19k41J02k2l83K04M42j64k2l4N7l3KJ12k01R5K22k68r4M6
7536c0J23r8o5jJ40p9J04Jk12J59q7K16ok0j18j9K55j53J52l32J83o0J5j27j28
7561a87j1L20q7r6R9pJ20j85K9J61m6Jj18K2J55k38L7n6K47j84J81K5j03k48K56
7586H7m3J1J01j64k11J66j20JL10K16k31j34K42j30P9m13L44o6L3J4j96J69j67
$$ y = [82, -130, 81, 143, -73, 52, 136, 86, -83, 281, 74, 246, 59, 8, 191, 7, 37, -17, 180, -29, -86, 109, -57, 126, -20, 57, 147, -30, 104, -11, 7, -96, 133, -35, -66, -181, -94, -358, 91, 146, -194, -110, -32, 8, 143, 39, -71, 228, 13, 26, 54, -32, 48, -11, 87, 25, -119, -92, -38, 81, 157, -197, 120, -46, -82, -246, 185, -81, 46, -316, -58, 371, -119, 15, -88, 316, 92, -42, 50, -35, -76, -181, -48, 126, -100, 124, 227, -253, 19, -9, 85, -33, 170, -41, 91, -69, 150, -91, 11, -11, -394, -190, 252, 88, 66, 32, 89, 56, 58, 170, -31, 64, 286, 18, -76, -30, 93, -5, -70, -71, 69, -10, 94, 95, -117, 42, -45, 171, 165, 145, 27, 8, 263, 110, 262, -70, 113, 53, 68, -59, -187, -198, 122, 35, -61, 38, 31, 151, -34, -5, 156, 110, 111, -7, 15, 170, -68, -31, -87, 160, -24, 157, 182, 79, -169, 87, 44, 55, 156, -8, -219, -53, -173, -172, 138, 354, 123, -11, 231, 101, 180, -233, 111, 45, 78, 92, -104, 65, -102]
7609a02K90k91L75m13L8K19k24K36j22j43N19k55J40k55l98L83N0R7k85L44k19
7630a6Q9j99j63K14r4K64RK7l23J67L2J37l06L89k61K09m9q6Q2M7j49n2K1q8J0
7655h9K42j97j86L26K3nr6K0p2j49R5K87j54j89K55O7k87k01J95K7J43P3k7p0
7679C1m4p5j12J27O3LJ27J15k94l2q7q3M04l54L5L18P7m81K73J2J57j25j18Q0
7703A7p6J05J9K5j85j29N95m70l8K89l39J94PP7J3j23K99l28l07M61k35K82k03
7726e0K61l80o5K51O6m03K20K61k12l2O0J58k61K30j52k8q1K47k34J85J74l15
7748a00K87l32L34j76J89j59jj68O3K24r0j43K29l38PR8J66l40L96k15P5J40k08
7771f2k4k3J56mM6n4o8K39j81j31j9m9K04j04L21o3l38j6J75k38M96k32K14j69
$$ y = [-102, 188, -103, 272, -141, -103, 116, -108, 128, 6, -137, 382, 127, 267, 12, -386, -3, 47, 144, -141, 203, -16, 73, -126, -289, -75, -169, 95, 104, 131, -192, -25, 7, 144, -162, 227, -34, 175, 126, 40, 122, 169, 20, -32, -11, -99, -89, 153, -44, -230, 96, 119, 114, 18, 38, -34, -183, -88, 199, 45, -144, 111, 178, -109, -310, -115, -88, 55, 128, 101, 31, -13, -88, -200, -73, -10, -7, 120, 235, -59, -91, -178, -261, 143, -211, -176, 142, 219, -262, 11, 23, 180, 55, -63, 17, -59, 46, 65, 90, -95, -224, 371, -99, -137, 152, -187, 7, 14, 91, 104, -19, 280, -48, -355, 106, -129, 153, -50, 211, -169, -234, 17, 83, -320, -100, 161, -51, -83, -23, 135, -126, 104, -48, -76, -157, 90, -144, 41, 215, -100, 187, -145, 189, 13, 202, 43, 42, -126, -63, 161, 71, -72, 157, -181, -174, -76, 90, -250, 146, -69, 6, 146, -62, -86, -109, 47, 43, 89, 35, -33, 206, 25, -106, -125, -174, 30, -74, 247, 184, -154, -170, 5, -233, 263, 31, 245, 76]
7795G6l28P7j1K82j69o0K49nk00m5J97J3Q5j14P4k82Q2O1j69L8K21r2j10J75N1
7820I6j03J96j22n3O9j07k1l6J78m9L2p4j4p9J44J00l28J78J1k05J33R5k13J67
7844eK76k45N5k4j10Q6r9L3P7J03p8R2l29Q0J33oR6j67J06j26J76l22k7M75l04
7869e4K58Qm99J29K35j32J51P3k18j7J53l9J11j38j98K61L5k65N77n01K23j5k40
7892a02R6r5q9L3L5m6K96j44k98K52j45K13j03L65j66K8j50K06r5L7j15Q2n1j21
7916g7M59o01K58l7j36J9L12l14k2LJ13l1j07R6L5j06o2K72%nQ2k27R2l57M20
7941G9J6m01L27N8j1N7p0j11q6O8o6N0K61l18p5K64l49O32l76P9J24mj25j27R1
7966a3j2O2j48K18p7K4N2j54j03L01m7j74o7K93k30j02J22K37q2n7J01j17K40
$$ y = [76, -252, -175, -186, 96, -73, -133, 116, 111, -89, -134, 63, 76, 161, 47, 121, -161, -79, -18, -187, -149, 72, -20, -130, 45, 96, -7, 189, 67, 14, 83, -24, -45, -81, 97, 48, 80, 6, -8, -87, 57, 157, -171, 7, 18, -187, -54, 41, -172, -5, 271, 26, 81, 57, -53, 33, -66, -33, 44, 147, 69, 161, -168, -88, 45, 39, 135, -32, 74, -52, 124, -198, -225, 250, -54, 204, 212, -287, -158, 77, -55, 96, 169, -49, -66, 87, 48, 159, 21, -177, 84, 119, -146, 431, -70, 153, 138, -102, -6, -101, -190, -157, -122, -168, 128, -16, -314, -62, -207, 6, -97, 268, 102, 130, -20, 186, 91, 128, 13, 95, 44, -77, 382, -219, 39, 2, -134, -115, 197, -117, -139, -136, -23, -54, -161, -65, -30, -136, -198, 74, 74, 69, 151, -76, 16, -341, 79, 95, -306, 21, 79, 68, 125, 55, -56, -142, -74, -140, -90, 171, -147, -222, 42, -307, 325, -51, 28, 152, 148, 23, -104, -13, -25, 37, -111, 107, 30, 54, 106, -48, -151, 150, 103, -71, -138, 155, -75, -177, -55, 182, 100, 43, 144, 27, 267]
7989B67k51N6J3j64p2K07j58J50Q4Rk76L72q0n2j12j64Q6L08l58R8jJ65J61l17
8013b9o1n9M15p2j29r7p9L8q1J61M2j5J56k47J06O7j71L83j47l2j17l4J21m91
8037c72K54K06k15K45j46J93n0J0j07j70K67j97p9K10k0J27j61k7QJ52l66M21
8059A83j54j00r3R1Q9k9j60K41j07K19l93J50LL28l65NJ33j66O8K3J29j06r7L5
8083g3L92k85j8q4K4P8R1l38L23l05M15k61J60N4p1k58J08K55j29k88J6J71J58
8106A35j43Q1P6j76K54k71q9R1mj5o1n9R3j22K58j72K14o4J62k26m2J2K1J16j10
8131d1qm7P8L2J55j5k90L9J81J23k52R3OL1O8j1l43K73lj80Q1r7J11j32J34j30
8157a44L57k36K47k92K1j56L94k71K01j21j29J69L4l19L85k54L1J19k63L65O6
$$ y = [267, 16, 72, 85, -79, -151, 56, -102, 48, 132, 141, -135, 237, 157, 105, -7, -171, -85, 223, -135, -37, -38, 127, 288, -29, -90, -149, 266, 194, 65, -32, -111, -73, -154, 7, 49, 34, 190, -57, 49, 116, -55, 328, 181, 149, 32, -2, 119, -372, -118, 88, -127, 118, -28, 165, 115, 125, 18, -152, 115, -82, -161, 49, 29, 156, -5, -32, -24, 128, -238, 183, 29, -71, -164, -73, 16, -13, -173, 68, -39, 180, -213, -63, -60, 268, -97, -92, 41, -125, -57, -34, 95, -11, -108, -73, 319, 34, 16, -68, -44, 34, 125, -213, 110, -195, 220, -41, 119, 173, 102, -156, -48, 207, 78, -210, -194, -23, 135, -8, 73, 149, -27, 227, -44, -133, -42, -46, -61, -122, -181, -88, -210, 48, -124, 90, 26, 188, -38, -80, -68, -47, 69, -41, -49, -96, -18, 14, 169, 154, -136, -97, 84, 207, -45, 48, 54, 85, 153, 142, -201, 72, 69, -111, -30, -127, -16, -148, -14, -144, 213, -23, 224, -68, -47, -203, 191, -80, 121, 0, -129, 40, 74, -245, 140, -114, -83, 36, -227, 138, 204]
8178B04j94K7N7l08K39n0M4O1J16j28j4m7q
$$ y = [204, 10, 37, 94, -214, 25, -25, 19, 80, 196, 68, 54, 7, -1]
8191a
$$ Imaginary data points
##PAGE= N=2
##DATA TABLE= (X++(I..I)), XYDATA
0@%%%%%%%%%%%qJ6j6J6j6K4l2L3m1N6o5P3q8J04j20J41j65J86k10K41k77L13l53
34a88L99m48N03n63O26o98P78q62R55j056J166j289J423j566J721j896K092k306
52a209K543k806L102l439L823m267M788n407O157p085Q270r838J2016j5248K0507
67A1907l0431N5132k20285l02166P14343L6533m30646K52541O3415m77729L36317
78H931N04200n71945l72945N92159P9255l98450K20957Q9214m41754K35315M82527
89D27464m50216l48496N00413P4929l83170K00534J26619m17230J53050M63927
99C47824l75477l46282M69359J24207l73098J47471J57168l49764J16659M18793
109C36860l43009l45231M24755J43684l40766J11158J37063l17821J13893M14481
$$ y = [0, 0, 0, 0, 0, 0, 0, 0, 0, 0, 0, 0, -8, 8, -8, 8, -8, 16, -16, 17, -24, 32, -33, 40, -48, 56, -64, 77, -88, 98, -112, 129, -148, 165, -188, 211, -237, 266, -297, 329, -369, 409, -453, 502, -554, 612, -677, 746, -820, 901, -995, 1097, -1209, 1334, -1472, 1630, -1809, 2014, -2253, 2535, -2872, 3285, -3800, 4470, -5368, 6648, -8600, 11907, -18524, 36608, -183677, -485843, 228500, 265033, -165613, 86928, 150343, -327386, 8931, 513131, -58814, -431759, 160400, 239655, -158795, 62162, 151376, -290378, -55063, 427464, -22752, -371248, 129165, 204094, -179076, 21458, 148077, -269153, -116103, 347824, -27653, -373935, 95424, 219631, -153467, -5996, 151172, -198592, -81933, 336860, -6149, -351380, 73375, 217059, -123707, -12549, 124514, -193307, -79414, 335067]
119C35067l01584l59997L58448J67919k84165P8391J07449k95523Q8273L99848
129B94126k25557l40408K77681J60592k21841Q1164R8341k85177M2454L65616
139B46991j60400l07072K14658J33041j92051Q3343J06972k57683M125L13713
149A85637j20963k60137J81471J06264j78381P6238J13663k13023j894K68337
159A57212j02307k20195J64711R5477j59553O0426R9210j80285M848K39333r1672
170F7205k00270J43702R1382j37111M6993P6704j71379j510K18942p5290j85526
181a26158J15090P9963j12250N3167P0468j61595j0881J96394n6712j58044R5675
192a4883N6682j01175O4692P8221j45607j8970J71735m0750j29626Q4886L9361
$$ y = [335067, 33483, -326514, 31934, 199853, -84312, -5921, 101528, -193995, -105722, 294126, 68569, -271839, 5842, 166434, -55407, 25757, 124098, -161079, -118625, 246991, 86591, -220481, -5823, 127218, -64833, 18510, 125482, -132201, -128076, 185637, 64674, -195463, -13992, 92272, -86109, -9871, 103792, -109231, -111125, 157212, 54905, -165290, -579, 94898, -64655, -4229, 94981, -85304, -80456, 158877, 67205, -133065, 10637, 102019, -35092, 11901, 88605, -82774, -84284, 134658, 59368, -126158, -11068, 68895, -43355, 9812, 80280, -81315, -92196, 104198, 47486, -110558, -14883, 41799, -59376, 5316, 83537, -62070, -81040, 90695, 49945, -79681, 5205, 44566]
203D4566r8873N7083P6098j23368k2408J42907l5495j05912P9764L1465r6116
214e0289M6175P1037j05955k2137J23894l3400r4059P7052L3754q8295L7668O7149
226F2594r2591k3911J08486l0319q5807O8746L2082p8897L5368O3828q1786k3478
238d5685R6501k6023p8403N7461K4473p3800L0643O0964o9262k1419Q6334j6803
250B4981o4567N1085K1111o7408K2188N3563n8771k2303O9874j2420n1701M7511
262A3143K1421n7503J8111M6991m8352k2604N5655j4857m6962L9862J8522n0655
274b7228J5222M3999l8510j8047M9237j1503m1740L2611J5834m5234J1243L6884
286B2768l3402j3048M4575r865l3862L1832J3683m1130J0157L2514l1655j3011
$$ y = [44566, -54307, 2776, 78874, -44494, -66902, 76005, 40510, -65402, 14362, 45827, -50289, -4114, 66923, -39032, -61169, 62725, 29325, -64734, 12318, 46072, -42223, -4555, 62594, -29997, -53908, 54578, 24259, -61548, 7198, 39280, -39617, -4249, 59579, -22207, -45685, 50816, 24793, -53610, 3851, 28324, -45476, -14833, 46131, -23131, -44550, 41784, 24981, -39586, 11499, 32610, -34798, -12610, 40953, -17818, -40121, 29753, 17333, -34368, 13143, 34564, -22939, -4828, 42163, -6189, -28793, 26862, 12005, -34957, 4905, 23427, -27228, -12006, 31993, -6517, -24564, 24673, 13170, -28570, 4041, 19875, -25359, -14116, 22768, -10634, -23682, 20893, 11028, -22834, 8998, 22681, -18449, -8292, 24222, -7433, -20444]
298b0444M0462j0136l0989L0416J3393l7619Q271K8855k8632j2654L4242j0080
310E085k7432K7852J1788l3410J0096K7405k7654j1861L3465j0275k9317K5705
322A447J2452l2924Q491K9888k3451j1369L4256o329k9551K3675J3416l4525M442
335a0082K8683k3604j4184L4977l528l0086K5740J7852l5837J211L1093k4931
347b696k1367L4372j556l5401K3140K4563l4659j446L6772k0575k3949L5421J726
360A4345m0172J9239K8855l4630o676L9315j6603k6288L8152P376m4333J6206
372e214L4892l5485j4345M0322j4882l3180L8839J4611m7271J1387M1861l2943
384a408k0403M1600j1967l9828L6921J9978n0133Q697M8007l1094k3834M6240
$$ y = [-20444, 20018, 9882, -21107, 9309, 22702, -14917, -6646, 22209, -6423, -19077, 15165, 5085, -22347, 5505, 17293, -16117, -6021, 21384, -6270, -18131, 15334, 5059, -24258, 1447, 13899, -19025, -10534, 19354, -4097, -15466, 18790, 12461, -17090, 6585, 20001, -14524, -10082, 18601, -5003, -19187, 15790, 12262, -17824, 7916, 25768, -10069, -8858, 22235, -2696, -24063, 10309, 8753, -26648, -3508, 21055, -13604, -15050, 21722, 1147, -22802, 12619, 14345, -25827, -6588, 22267, -12363, -19039, 20276, 3673, -22615, 15537, 22913, -21420, -5214, 29678, -5807, -20152, 20170, 5288, -27892, 10947, 25558, -21713, -10326, 31535, -1408, -21811, 19789, 7822, -32006, 4915, 24893, -25240, -16543, 31464, 370, -23464, 22776]
396B2776p989m5278L7249K3610n8148L099N5975l0773l2550M9027j438m6753L9091
409G898K8950o3673j838O3153k9103l9739M6577r24m9058M4932L6090o9187n713
422c1635P1747k3164m3596M6396k669n6968M6884M4888p5404j6637P4953j7647
434A7148m4323N0014k837o5500M6720N3676p7981k4535P6987j9438m8454N8555
446B0032K714p5339M6035O3977q0127k7047Q4750k1243n8355O4983J0744q1760
458e0636M6434P1302q6205l2529R6346j8387p0100O2479J3834q6877N0119Q0092
470G5872r5958m4155J06807q042p4705O0990J2057r7740N2165R6389j00133o2912
482g9365J07313K988p2593O6325J6177j11075M7320J16557r2847p8008J00668
$$ y = [22776, 14787, -30491, 6758, 30368, -27780, -24681, 31294, 521, -32029, 16998, 15560, -31193, 7898, 36848, -26825, -28663, 34490, 5387, -34352, 12225, 11301, -37757, 7175, 43265, -25922, -31635, 40112, 16948, -26648, 19748, 17079, -39889, 6995, 51883, -23521, -40158, 34795, 17148, -27175, 22839, 20002, -45498, 1222, 54898, -23083, -47618, 29369, 9931, -38523, 20032, 22746, -52593, -6558, 57419, -22708, -49755, 34995, 13752, -44603, 20380, 31124, -50636, -4202, 67100, -19105, -51634, 44712, 26325, -43775, 18704, 32538, -54339, -4220, 75872, -20086, -64241, 42566, 34524, -40181, 20809, 32866, -64874, -12709, 83680, -16453, -79365, 27948, 30936, -41657, 24668, 40845, -70230, -22910, 93647, 800, -77208, 23460]
493B3460K367p6330P5535K6849j25589L4474J31624q1016q3225J01929J373q9719
505e8268Q0578M3006j34320J7465J37421p5811q7408J10134R715j03103P5280
516A4689N8920j31479Q532J39775p6652j00473J14561K3626j10162O3512O5825
527G0674j28862L897J50673p0350j20419J06426M0520j05208N4928O6667j33079
538f4133o650J63781n0704j31174Q8748M6910r7047N5697P3675j37319k7152J67765
550H2397k6254j29752P4738M4757r8788N5370R1221j32942n2163J56515q067j22438
562f5406O8128M4936j05143M6430J04634j16228o3994J41416l546j18808O6876
573g05N2785j06957K8112J06203r7435o3761J33941K281j20138N7708O3093r5613
$$ y = [23460, 25827, -50503, 25032, 51881, -73708, -39234, 92390, 11374, -71851, 30078, 31451, -58268, 22310, 65316, -69004, -51539, 85882, 10071, -77337, 32797, 42512, -60591, 14689, 73609, -57870, -49338, 90437, 13785, -86688, 27873, 51499, -58663, 4849, 70674, -58188, -54291, 96382, 26032, -94387, 12039, 52559, -52649, 2279, 68946, -64133, -70783, 92998, 42294, -88880, -132, 46778, -50269, 5428, 79103, -58216, -85368, 82397, 56143, -73609, 1129, 45886, -52902, 2468, 93689, -39253, -91416, 65099, 57032, -65406, 2722, 47658, -57485, -11055, 93579, -22649, -86643, 54773, 51227, -67581, -705, 52080, -54877, -26765, 79438, -17997, -81758, 52183, 54464, -65674, -7966, 55127, -40486]
585d0486J4894R6375q8349o3947J28866J3857j18081M0723O4017p8626J3157Q9360
597G1760q4487p1346J19008K7954j05980K4625N4507o9953J6862R1127p6062p9964
609h1949J02054L7973q8741J8097M3799o9200J3928R3706o0224q0273Q2633L6822
621D8625p4595K0878L9111p0426M515Q8929m5761p1858O9793K9963o6891K3604
633d113M1702o4059k951P5990l8216o2134O2653K5535o2369J9503M0002n1078
645a9535j49O5010l7162n4554N7975K3740n6921J2588L1332m4745M014O0875l4613
658G855n2844N1056K5932m5292J0598K3168m4814M216N8296k9540m9940M0621
670f88K2266l5449J6227K0156m5722K334N6177k3232m4221L4298J4014l3235K0014
$$ y = [-40486, -25592, 70783, -17566, -81513, 47353, 61210, -56871, -16148, 47869, -30757, -17600, 71760, -12727, -84073, 34935, 62889, -43091, -18466, 36041, -33912, -17050, 74077, -1985, -81949, 20105, 58078, -30663, -12566, 31233, -37967, -24039, 69667, 9443, -70830, 11803, 48625, -25970, -5092, 34019, -36407, -31892, 57037, 11276, -60582, 9211, 39174, -27717, -4113, 37589, -26470, -29421, 46569, 8353, -53781, 8872, 34407, -27962, -8459, 31543, -19535, -19684, 45326, 8164, -46390, 11585, 35325, -21596, -9008, 22324, -22421, -18407, 42468, 7855, -44989, 6067, 31999, -13293, -2695, 20473, -24341, -20125, 38171, 8631, -41309, -688, 21578, -13871, 2356, 22512, -23210, -20876, 35301, 12069, -32152, 2146, 16160, -17075, 2939]
683B939K1631m4055j094M9251j8765l5241L0982R022l2674J9224K1101l7390j454
696a6523M0403j8054k8643L0102N927l0670J6829J8678l2324m58L5786j6649k5236
709b0832K7229P129k6157J3759J5503k9356l48L1763j5167k3242K3277N841k1206
722a1807J4413J3555k6600O66K8412j3917k0165J9422J994j9865J4205J2418k3133
735a0402R5K4691j0561j4069J7011j01j7704J2346J0061k0329Q5J8685r993r627
749i812J6021j070j4164J1738P953j7103J845J4513j0702q089J4238k305j1889
762h826J0433O165j4064L582J2090j0383n856J2596m112j0281J0487L363j2431
775g237N382J0117j0481k650J1954n533r431J0824J973j2423N767Q786j0120j183
$$ y = [2939, 24570, -19485, -20579, 28672, 9907, -25334, 5648, 14670, -18004, 1220, 22321, -15069, -16523, 23880, 5826, -22817, 7285, 13212, -17458, -629, 18049, -14275, -14733, 21053, 4404, -20832, 6397, 13526, -12631, 1128, 16631, -12725, -13073, 18690, 3523, -19719, 3558, 9399, -11807, 2606, 16161, -10439, -9773, 18639, 4722, -15443, 3979, 5973, -13892, 313, 12731, -10402, -10307, 14384, 3823, -10246, 6765, 6664, -11040, 1306, 11367, -8962, -8877, 9808, -185, -9812, 6209, 5139, -9025, 2713, 10666, -6437, -4592, 9921, -781, -8870, 5368, 3063, -8826, 1607, 7772, -6292, -2710, 9380, -1003, -6859, 5737, 1625, -8656, 1831, 5194, -7237, -1855, 8262, -2219, -4869, 7085, 1552, -7879, 2945, 4918, -7505, -1738, 7048, -3072, -4255]
789d255J1440n772p272J0200K75j1053N864P122j1420q1J1107o531o914J1427
803D137N73j1003O670P554j1756q23J1346o941p468J0417J256j0548O508P320
817G242r805q46J0923o175p661R998P08j1125N530P853j0131j506J1140m681p920
832f456Q713K177j0432L585Q265q378l137J0082k032q344O970L953r504K065Q705
847F232p173n015J0155j49q691N580M859q701M28R346n296p968Q473K098r206
862e028K674N930p277j608J0377l054q213P233N217r000R9O850o638l689R958
877C831j162j0181O930Q425q163k470R201m466o091R459J41j3547M408J1533q660
892h12o345R994k278p108J0863K884j6166K894J6218p747r944R170j367q602J2384
$$ y = [-4255, 7185, 1413, -5859, 4341, 4616, -6437, -573, 6549, -4871, -4952, 6155, -376, -7290, 4137, 4710, -6293, 377, 7931, -3825, -4648, 6698, -243, -7711, 2706, 3962, -6586, -78, 7242, -2563, -3409, 7514, 1339, -6322, 3676, 4384, -6741, -1211, 6642, -3489, -4995, 6145, 1464, -6456, 2257, 4434, -5998, -2413, 5852, -2526, -5663, 4419, 2387, -5957, 1013, 4966, -4538, -2473, 6232, -941, -5956, 4199, 4050, -4641, 939, 5798, -2903, -2475, 6871, 1575, -6393, 2080, 4178, -5028, -2354, 3576, -3701, -5309, 5068, 2014, -6199, 1034, 6251, -2749, -2650, 4200, -2438, -6127, 3831, 2669, -7512, -582, 7843, -320, -2790, 6411, 1945, -4146, 5313, 5454, -8093, -3685, 7848, -812, -7157, 2837, 559, -6549, 4314, 7198, -8968, -6074, 10144, 2397, -7547, 1623, 256, -8346, 4038]
907D038N428j9109O11K0430n745j1774R800n64j1843J3608Q715k2237l841K2374
921I891l776j3839J0587J36j4584J3664J2680k3401n554K4259l634j6516J2953
934B866K588j7713J3323J6005k5452p960K8623k320k1614J3214O269j8613J2663
947A879J8189k8356j1399L3835l23k6587J1396P170k0644J5548K2865l3401j7378
960b7206L9046N957k8779J0238P478k4377J6681L0613l5035k5737L9566J0681
972A9126k8299J1158P991k9524J5511L8054l3401l2035L7960J2077l0329J2648
984I37J2165l4087J0189M2464k9464l4749L8465J3668l4466J2617J8254l4159
996a8166M818M3943k7105l7421M0725J7783l7958Q242K2051l2130L258M5504k7973
$$ y = [4038, 9466, -9643, -9032, 11398, 5653, -6121, 3679, 3115, -8728, 4880, 13595, -8642, -12483, 9891, 6115, -7724, 2863, 2999, -11585, 2079, 14759, -8642, -14196, 10063, 6429, -10087, 2866, 5454, -12259, 1064, 17069, -8383, -16343, 12280, 9960, -11654, 1560, 7829, -10784, 1879, 20068, -8288, -19687, 14148, 13825, -12762, -1366, 5804, -14840, 708, 23573, -9828, -27206, 11840, 17797, -10982, -744, 6734, -17643, -962, 29651, -5384, -31121, 8445, 19126, -9173, 1985, 9976, -19548, -4037, 34017, 616, -31419, 6541, 18618, -11711, 937, 13102, -20985, -10796, 31668, 2204, -32545, 5920, 19588, -14878, -2261, 15993, -18166, -13348, 30595, 3490, -33931, 6794, 24577, -13381, -5139, 16912, -15218, -11960, 33544, 5571]
1009E571m3720M2321K5605l9860K872K2412l2643L007N1473k6806n2803L8839
1021c732L3037l6660J60K1817l4405P0N7387j9716n7158L1057L4906l2791J749
1034d279K3270l7659p174N8515r909n6929K4648L4095l1457J245K8381l4640j6343
1047b8236N3791l139n3326K0670L4051l2085l089L1839k7861j7909M8653j509
1059B1850n2158K0366L7122l1368q980L0152k3224j7798M7885r0n4617J6179M1422
1072B6741k5368j1777K5278k2684j7528M8229M633n4978P846L9698j8489r741
1084h140K2865k3201j9960M6403J1510m9763J813L4152j4842p094K3773k1061
1096c545k4777L9493J5849m1528j152K9257j4534o746K4777j5635k5166L1216
$$ y = [5571, -38149, 4172, 29777, -10083, -7211, 15201, -17442, -14435, 37038, 10232, -42571, -3732, 29305, -7355, -7195, 14622, -19783, -19713, 37674, 17958, -39200, -8143, 26763, -6028, -4279, 18991, -18668, -25842, 32673, 22764, -34165, -9517, 24578, -6879, -5634, 22747, -11893, -28236, 25555, 22416, -30910, -10240, 23811, -8274, -11363, 20476, -7385, -25294, 23359, 21850, -30308, -9942, 27180, -4188, -13168, 16984, -6240, -24038, 23847, 23757, -30860, -14681, 26741, 1373, -10404, 14874, -7810, -25338, 22891, 27524, -27454, -19608, 20090, 1601, -8140, 14725, -8476, -28436, 17967, 29477, -20286, -18473, 15679, 837, -6257, 17516, -3545, -28322, 11171, 27020, -14508, -15660, 13597, -937, -7683, 17094, 1459, -23707, 7509]
1108G509J5281l4993m46K6090j4925r287K3025j1159k1442K7295J3009l2606R3
1121a2556K6525j2244j0381J8310r890j7972K5470J1980l1202k409K4611p045
1133C197q015J4827j0649j7108K4400J3468k7886m837J9523o262m943J5077j0994
1146b02j8255K0708J5391k1803n232J4694o746k885J5207q753j7793J5791J2584
1159A2706j6345k732J2048q234l248J4761n383j5194J2539R673j4385j035J1751
1172F922p292n119J1893l847j2181J1028P688j3430q81J0981n903l806R680m610
1186A123j0225J0395P237j2220j953R498m465k588Q711m226r540Q401P513r548
1200a887j591O834m397j403P929l444q736O522N669o987q24M902m329j254O948
$$ y = [7509, 22790, -12203, -12649, 13441, -1484, -10771, 12254, 1095, -20347, 6948, 19957, -12649, -12556, 13969, 1725, -8656, 9654, -236, -18208, 7262, 19242, -11960, -14369, 10242, 3197, -4818, 10009, -640, -17748, 6652, 20120, -7766, -12603, 6920, 658, -4285, 10792, -202, -18457, 2251, 17642, -4161, -9393, 5301, -1445, -4330, 10877, 2124, -15669, 122, 12706, -3639, -6371, 5677, -2557, -5805, 8956, 3573, -11621, 918, 10591, -3794, -4829, 6922, -370, -5489, 6404, 2557, -9624, 1404, 9092, -4338, -5219, 5762, -141, -3947, 5733, 1123, -9102, 1293, 8530, -3690, -5643, 3855, -610, -3198, 5513, 1287, -8253, 148, 7661, -1887, -3478, 3356, -1041, -2444, 5485, 2041, -6695, -173, 5496, -1491, -2315, 2587, -1742, -2996, 3952]
1215C952j982o786M273L745m547J42L697l626j464N126q96m530K501L038l704
1230a061J97L084j712j250K795p28k808K600M54k984qK102j739p8K056j275j683
1247b038J976O44j764O62O90r09N97N10j183oQ63l20k79J478l80q39K140L34k029
1266A47O86R64j852L32J173j417j160J752m07j865J911P27k965J288J939k118
1282h65p00K516q67k506K591N28l108J062K532j992p21K894k59k288K425R76l219
1299a001J012K142k869j029L154r58k739K533J361l125N55K867k085j209K887
1314A496m44k931K041J083k836O88K168j771q28K828l12j681J527J021k315l4
1330c00J517j607j240J801k53j692J119R66j273Q8J332q39p62J052K58j194K55
$$ y = [3952, 1970, -4816, -543, 3202, -1345, -1203, 2494, -1132, -2596, 2530, 1634, -2896, -395, 2643, -1061, -864, 2220, 508, -742, 2053, 1325, -1483, 1117, 1571, -1413, -1421, 681, -1058, -1136, 920, -355, -2038, -62, 582, -1182, -520, 170, -739, -142, 368, -815, -821, 42, -278, -557, 921, 541, -298, 1842, 2176, 147, 833, 1797, -55, 277, 1450, 33, -1127, 625, 218, -1647, 264, 991, -1974, -686, 1253, -865, -1565, 951, 84, -2422, 169, 697, -2411, -1349, 1183, -809, -1530, 1364, 1105, -1183, 1242, 2218, -1001, 11, 2153, -716, -1745, 1409, 451, -2288, 245, 1606, -1519, -964, 1903, -182, -1391, 1496, 1052, -1879, 162, 1245, -1591, -903, 1265, -506, -1334, 1494, 1182, -499, 1028, 2049, -266, -300, 1217, -390, -1630, 171, -82, -1774, -655, 311, -962, -874, 458, -381, -1143, -91, 167, -1027, -772]
1347g72J095n83n9L84K46J50K63q7K15K79J37M2m71l20L38J71j192L11J90o62
1367c25k90J347j115j630J780P84k055L25J524j487l02K822r13l240J948J963
1383A136k163J2J840j441m89L534n14l887K325K466l583O1L313l323k225N356
1399B418k71n318K723L306m436m5M959l517l338N912K57o232L354M184o513K94
1415b263O321m301l742P508n90p739M673N402p685j094P604m695m218Q611q0j0093
1431f381M761P039p470j232P348n413n261J0891J287j1961M139Q610p574j554
1445b771R351o997p969J2549L428j3305L112R017r157r48J2202p350j0773J2845
1459C234M986j4243L173R634j1603k300J4747n982j2306J2483N486j4348M645
$$ y = [-772, 323, -260, -319, 65, 311, 461, 724, 637, 852, 1131, 1268, 1310, 839, 519, 857, 1028, -164, 147, 337, -325, -615, 732, -383, -2013, -233, 551, -1504, -1179, 345, -1142, -1444, 1378, 465, -2775, -827, 1136, -1027, -1015, 825, -616, -1105, 2429, 1915, -1972, 353, 2819, -764, -703, 2610, -713, -2938, 2418, 2147, -3171, -448, 2858, -1578, -1623, 3336, -181, -3519, 2393, 2650, -3582, -228, 3956, -2557, -2263, 4058, -243, -3985, 3523, 2933, -4806, -133, 5269, -2416, -3510, 4094, -601, -4819, 3792, 3712, -6381, -1620, 5419, -2051, -3283, 4065, -1348, -6609, 4282, 5569, -6392, -2253, 6357, -1217, -2771, 6580, -417, -8386, 4163, 7591, -5714, -2602, 6415, -2742, -3690, 8512, 1162, -9611, 3234, 8220, -6023, -2850, 6784, -4819, -7119, 7628, 1646, -10660, 1823, 7309, -7039, -2394]
1472b394J1984j2949m677J5760m887j3179J2882N982j6715L818J5071j1448o938
1485g690J5455m217j4198J4280P618j9147J104J6242j0028p476J6156m661j6603
1498a3165J5050J1194j9128j680J6187r225p503J7377l630j9709J2789J4253j6982
1511d172k966J5282j0151q536K0093p57k2100J0122J5219j5559k706J6386j1043
1524h88j1579K0208K106k1333P848J4879j5746k926J8301q864j4137J7730M359
1537I958k0199P125J4981j6308n539J8926n713j4368J5337M489j9567P530J7107
1550A3759j5065q782J6726l361j3114J4560M369k0527M716J9047j1384r783J4234
1563E395k968j2110J5002O093k0703Q98J8146q460q176J2725m033j3393J5184
$$ y = [-2394, 9590, -3359, -8036, 7724, 2837, -10342, 2540, 8522, -8193, -4375, 10696, -752, -7690, 7765, 3548, -10650, 3630, 11248, -7899, -6795, 9447, -581, -8057, 8099, 3438, -13165, 1885, 13079, -6049, -7729, 8458, -767, -8270, 9107, 5477, -14232, -1443, 12810, -4172, -7138, 8144, -2007, -10543, 9550, 8793, -13307, -3185, 12034, -3525, -6231, 10155, -888, -12467, 7741, 9847, -11486, -3638, 11241, -4505, -7431, 10870, 2006, -12131, 5599, 9958, -10241, -3116, 11865, -4443, -9982, 8944, 3231, -11137, 4200, 8689, -10878, -3348, 13759, -1306, -10088, 6638, 3277, -9837, 4723, 9092, -11435, -6719, 12328, 944, -8839, 5395, 2427, -9683, 5319, 11412, -9291, -8393, 9753, 1293, -6883, 5842, 1809, -11584, 3600]
1576C600Q976j8879j409J6079p733p193J3355l307j4782J1768J0286j5423j508
1589f170J3237p337p159J3218j002j3854Q460R279j3108j021J3019p007q345J1632
1603C842J278j2047O945P636j2455j553J3432m609q971Q898J664r827P003P570
1617H806j2143l195J1812k404p645P307m98r244P424Q483j1156m259J0368j657
1631A999n781P102r97r918N862Q961q537m192P984k107m374P929k77r284M403
1646a227P244o240k973O611k774n004O855J496q115K837O274n844k359O782j857
1661A706n485N107J749o574K561N339n752k724O378r31m711M115O89n465L076
1676i22N234m831k961N427j61l713L084P55n410J755N306l579l087L887P9k459
$$ y = [3600, 12576, -6303, -7712, 8367, 634, -6559, 6796, 3489, -11293, 475, 10761, -4662, -6170, 7067, -270, -7429, 5789, 4787, -9067, -607, 8672, -4436, -5457, 7562, 555, -7790, 3842, 5120, -6927, 18, 7654, -4801, -6354, 7078, 2469, -6502, 2396, 4060, -5767, 1236, 8806, -3337, -6532, 5280, 2876, -4769, 2538, 2040, -7204, 220, 8703, -2453, -6712, 3656, 1999, -3782, 3320, 2323, -7595, -1733, 7228, -1309, -5501, 2483, 376, -3998, 3931, 3654, -5630, -1227, 6017, -223, -3196, 3415, 641, -4363, 2492, 3988, -4127, -1290, 4984, -860, -3219, 3563, 1706, -3779, 1328, 3077, -3497, -936, 4403, -1349, -4073, 2305, 1374, -3337, 778, 1467, -3998, -922, 4312, -519, -3480, 1947, 1786, -1927, 1157, 1912, -3498, -1743, 3563, -16, -3103, 784, 863, -1596]
1692a596K976J333m904Q10M571k693k590K795j94k827K866J433l708L36L900j750
1708G58j934K845k37k668J368J352k548l57K321j248j399K138P69k221P94J402
1724A135j641q23J813n14j810J271P82j514M56J411q50l74J339O46j665K29J132
1741A023m08m07O33n00p64J158K74j002J62O86n03l80O40k90q79M29P99o88q93
1760i10J226j94q20K47L78j140M11O18J21j009J065L95o33N3P70n83n91R99k9
1779C74j219P38Q63r50k91J476o79m69P56L01j247M09Q82j436j12J054o29q15
1797i94J194K76p92L46R39q47l07Q11o50n83O36K68j060N65N32n95k98J209m63
1816A87q66O85J54j263P12P32r43P3P31rp93O97K27p63N66L67r78J58J000l88
$$ y = [-1596, 1380, 2713, -2191, -1381, 3190, 497, -2093, 702, 508, -2319, 547, 1980, -1728, -1392, 2508, 758, -1176, 1669, 1432, -1236, 132, 1484, -1064, -1421, 900, -348, -1747, 391, 1160, -1061, -267, 1135, -506, -1329, 484, -30, -1840, -569, 213, -1301, -845, 566, -284, -658, 681, 1327, -338, -109, 1023, 615, 208, 841, 341, -423, 735, 1009, 7, 169, 855, 352, -28, 612, 322, -557, -128, 671, -17, -910, 316, 122, -698, -451, -73, -1213, -802, -184, -63, -1072, -7, 388, -245, -192, 578, -5, -596, 403, 374, -845, -107, 756, -194, -485, 991, 312, -157, 599, 900, -347, 62, 944, -492, -604, 450, -179, -994, 200, 476, -316, 30, 969, 122, -185, 626, -24, -607, 29, 297, -763, -198, 334, -261, -559, 650, 187, -679, 6, 160, -1103, -391, 341, -602, -529, 202, 193, -600, 97, 324, -439, 127, 494, -484, -326, 674, 286]
1836B86k29R79n23l38N93J29r69J04Q38r99j93N38l78m16J106m58q51P58L94j071
1856g00L87L29j132J07J242n98j081J431N30o09M68R41j807J77J697q66j270J147
1874C93r9j005J243P37k074K54K198j252j055J578k25j879J408R91k658K72K794
1891A621j558j590K276n4k197K014P03k536M28L111k120j679K628k88k033K210
1907I36N83l758Q54L992k506k383L094kk576L014J025m878R90M542k175k879K828
1924G01o48k358L762J352n450P04N510k522k562L458j009m026M111K433o367K89
1940b622N477k801k682M713n29m731L942K806o046ON598l254l899N775J9n370
1956c598L998L278o450N67P004l665n013N244O47n127M104L006p510k85Q653k703
$$ y = [286, 57, 1036, 513, 175, 768, 897, -72, 32, 870, -129, -322, 216, -162, -578, 528, 70, -781, -23, 371, -700, -313, 16, -1116, -1009, 233, -365, -1446, -15, 515, -94, 374, 1315, -492, -315, 1382, 516, -754, 393, 294, -711, 532, 1269, -805, -551, 1647, 395, -660, 918, 693, -1186, 222, 1213, -1445, -1173, 1621, 63, -1527, 749, 695, -1502, 512, 1215, -1321, -893, 2218, 98, -1581, 1047, 759, -1274, 936, 1519, -2239, -1385, 2607, 101, -2282, 812, 810, -1766, 1248, 2273, -2605, -1615, 2927, 752, -2127, 701, 53, -2305, 1457, 2809, -2641, -1937, 3573, 1051, -1511, 1947, 938, -3088, 1023, 3456, -2911, -2622, 2855, 54, -2628, 2085, 1556, -3175, 767, 3573, -2473, -2467, 3131, -123, -4022, 1753, 1772, -3598, 400, 3678, -2772, -2205, 4799, 1134, -3879, 1365, 2012, -3115, 989, 3995, -3515, -3800, 4853, 2150]
1972B150n996N026N42n002M612L979q606j451Q717k088n463M980K29o256M948
1987C21N803q653k782Q616j138n532N078R56p494M180P188p612l846Q288j479
2002A894o227N944J917p803K522P147o550k869Q324j703p743N679L671p643J860
2017a580O660o876m073R731l73q106L976L916o126K208O356p425m987R989J097
2032D387q051L099L276o639K670P952o865o551Q760K472p141K638L335p392J631
2047b419Q585n144o791O686K220o415L248L917p128p2Q154l662n950O301J518
2062C048o736L254M891o405j144O863k953n522O472K410p327J438N207m361j196
2077b061O087l510n665O509K900o752J72M544l671o30O221l163n845N379L896
$$ y = [2150, -3846, 1180, 1722, -3280, 1332, 5311, -3295, -4746, 3971, 1883, -3580, 1400, 1629, -4627, 321, 6124, -2529, -5311, 3305, 2167, -3365, 1713, 2669, -4825, -645, 6543, -1069, -4915, 3373, 1894, -4333, 1611, 3528, -4275, -1753, 5394, -1156, -4025, 4299, 2596, -5147, 532, 4203, -3440, -1580, 5080, -1796, -5869, 3862, 3489, -4617, -641, 3275, -2851, -643, 5713, -1712, -6699, 3290, 4387, -3664, -565, 2711, -3928, -1258, 6694, -171, -6722, 2038, 4510, -2631, 7, 3342, -4050, -2419, 6166, 1022, -5769, 917, 3137, -3278, -30, 3887, -3241, -3313, 4841, 1179, -4771, 1530, 3048, -3688, -434, 4457, -1948, -3092, 3771, 818, -4704, 1768, 4178, -3149, -1711, 3496, -865, -2061, 4026, 516, -5149, 1360, 4260, -2492, -2320, 2224, -1447, -2077, 4144, 981, -4864, 515, 4411]
2092D411n534J77L333m053j196O826j827o550L921L543m026N79L199m019j365
2107b581N796q42n737K785K515l933R11L524l511k094M871Rm219K421K712m236
2123a609n4L948k247k152L631o94l132K637K385l641m58L305j810j292L601j088
2139A330m184K593K967l062j043K365j657j257L663j36m267J678K936j859o41
2154e74K068j904j396L171K79l388Q50K371j895l06K269j222k005K803Q47k986
2170a018L71K100j937q86K595r26k227K104P39k181P43K014j288j351K332k15
2186I69j836J060R74k142L20K269j506j163J585J41j529J224Q85j796m70J984
2202I69o79j354J267K07j396P51J021j463o01J609Q1j132R04L58j467O66J540
$$ y = [4411, -1123, -946, 2387, -1666, -2862, 3964, 2137, -4413, -492, 3051, -975, -396, 2803, -1216, -2581, 3215, 2373, -3364, -579, 1936, -1997, -1086, 2438, -1073, -3167, 1704, 1713, -2506, -85, 2627, -1609, -1663, 2285, 38, -2114, 1517, 823, -2309, 328, 2713, -928, -1386, 1919, 109, -1183, 2418, 1330, -2854, -261, 2706, -356, -1399, 966, -691, -1948, 1715, 1579, -2688, -1010, 1926, 67, -574, 1494, -410, -1806, 1365, 1644, -1744, -894, 1477, -418, -724, 1545, 323, -1682, 1121, 1968, -1018, -647, 1453, -484, -1370, 1225, 299, -1928, 176, 915, -1266, -523, 1491, 203, -1148, 1184, 969, -867, 193, 1167, -975, -655, 1614, 108, -1055, 530, 671, -858, 366, 1251, -545, -1015, 969, 290, -1064, 203, 410, -986, -235, 786, -677, -1278, 331, 412, -720, 184, 542, -925, -259, 1281]
2219A281j237j027J666k16j390J281P60j269k25J199k85j351J082L26j381N14
2235b72J317j317n57J400p35q21J128J25j223L30J389q98m04J371m88j276J156
2252B25O99j211l14J575q93p02J202k88p64L99R14j082n10J351n41p67J073P3
2270D39j347N18Q03q05k66J324l59r71J164P99j640L66J137j141n56J289n46r00
2288f92Q97N23j526O52Q28j180n6J035k65j048R58N12j145j30J264q64p04J241
2306C00j06j243J071Q53j506N81J140j044n27J292n76j133J107M68j438P88P44
2323G71r58k12J085k91j187J099K90j106L70Q78j427l86J349m58o36J172K11j170
2341f06M71Q01j003q8J284n30j135J447J2j414N98R10j380j60J701o95j357J596
$$ y = [1281, 44, -983, 683, 467, -923, 358, 1118, -151, -376, 823, 538, -813, 269, 595, -786, -272, 1045, -272, -829, 571, -164, -985, 143, 268, -955, -625, 764, -134, -538, 833, 345, -931, 225, 924, -287, -601, 974, 81, -621, 581, 293, -471, -72, 842, -240, -750, 601, 60, -707, 366, 439, -908, -390, 413, -392, -658, 666, 307, -664, 500, 1299, -341, 25, 1162, 21, -535, 754, 208, -692, 205, 728, -798, -146, 682, -498, -554, 481, 216, -832, 126, 638, -507, -637, 627, -237, -941, 300, 194, -1049, 22, 875, -631, -50, 1090, 46, -481, 811, 235, -898, 209, 677, -761, 27, 771, -187, -399, 686, 395, -792, 307, 597, -509, -139, 739, -688, -1074, 275, -183, -819, 353, 564, -606, -135, 666, -337, -425, 859, 329, -806, 641, 653, -761, -163, 747, -633, -793, 908, 213, -1144, 452]
2359D52K79j353N50R74j505j65J606q09j009J307q0j300J315Q31j456j59J711
2376A189r00j177J443M0j837J121R73j882K36J946j074r70J595j74j894J482R55
2393A072j759l43J881r76j002K027l43j949J561J262k278L05K004j492j116K221
2409A075l44k035J419J070k296M96K384j785j400K134J37k290J910R10k958N87
2425i86K842j705j697K470l23k222K385J163l637J86L014j236j582K243l15k671
2441b071K831J262l172j86K950j682j549L052m43l261K548J953l396j76L323j993
2457a0k133L428K58l611J494K403l368L33L535k471k215L643M49l546J651K346
2473B186l883j54M370j970l125L597N86l646K339K432m169m95M246j480k971L012
$$ y = [452, 731, -622, -72, 902, -603, -768, 838, 29, -980, 327, 247, -1053, 262, 1093, -363, -522, 1189, 289, -888, 555, 595, -1242, -121, 852, -1030, -794, 1152, 78, -892, 703, 529, -1365, 117, 1072, -687, -1030, 851, -125, -1127, 900, 557, -1392, 169, 1431, -847, -542, 1462, -30, -1146, 1075, 731, -1304, 115, 1185, -1111, -615, 1769, -16, -1416, 718, 855, -1435, 475, 1385, -1573, -986, 1856, 151, -1546, 924, 601, -1621, 764, 1927, -1710, -1524, 1490, 254, -1328, 915, 600, -2071, 760, 2022, -1150, -1336, 1614, -68, -1617, 1435, 992, -2269, 279, 2232, -1164, -1340, 1983, -10, -2143, 1285, 1543, -2068, -574, 1829, -1539, -1206, 2329, -142, -2357, 1286, 1735, -1811, -160, 2186, -1697, -1851, 2519, 549, -2576, 1021, 1607, -2039, 300, 2732, -1437, -1932, 2314, 834, -2137, 875]
2489H75M28l772K607K832l967j619M438j005l044L272P72m452J782L812l240j825
2505b106L825q67l184L375J310m851J141L766k888j860M425j157l561L503K030
2520B901m224K80L459l227j456M373q00m480L054K154l457N32L686l369k104M794
2536B116j81m095J589K251l501Q20L767k743k953M286P28l668J785K055m124L15
2552a553M635k982k827L178O42l000J995K256l806l25L926j569k417K737M62l312
2568a960J714K921l688r80L749j086k692L340K58l769J361L225k761r93L044j314
2584C69k458K992J420l965O11K663k397o79K958j306k595L219J336l448P47K067
2600A534k090r62L195j009k834K152J540k662O45K301j907j448L146k49k804J545
$$ y = [875, 1303, -2469, 138, 2970, -997, -2616, 1822, 817, -2227, 1045, 1817, -2635, -853, 2959, -281, -2106, 1719, 852, -2332, 1043, 2353, -2498, -1357, 2409, -479, -2339, 2086, 929, -2632, 871, 2901, -1323, -1043, 2416, -811, -2267, 2106, 1306, -3174, -120, 2034, -1423, -891, 2795, -574, -2678, 2116, 1935, -2160, -571, 1680, -1821, -1001, 2766, 23, -2930, 1356, 2084, -1584, 201, 2256, -1868, -1553, 3082, 100, -2727, 451, 1093, -1907, 88, 2344, -1462, -1787, 2139, 570, -1847, 890, 1352, -1960, -246, 2675, -1013, -1993, 1756, 670, -2022, 1318, 1576, -2193, -832, 2393, -368, -1361, 1683, 369, -2089, 903, 2323, -1642, -1031, 1632, -765, -1444, 1514, 208, -2387, 832, 2168, -1280, -533, 1534, -556, -1518, 1677, 668, -2166, -14, 1526, -1136, -491, 1810, -97, -1545, 1601, 1352, -1452, 93]
2616I3J040k553P07K404k234j537K990m1k364J853Q84k394L28K518j531j762K251
2633F52K20k215J639J177k622K9K714j249j537K272l84k404J795J408k458J0K047
2650A094j148r74J984Jk471J251J646k201k92K369j230j189J803O07k311R76J357
2667A272j563l15J771j102j584K157K41j878R33J256j616k13K139r57j856J609
2683B94N28k009P39J406j328q39K120k65j510J119R24k070M19J518j473q04J720
2700D89j88j188J256N11j377L02J491j209q75J527j75j693J466O51j788K92J566
2717A058r38q39J266r7j271P30J088j643PJ512q52q12J261L26j658N32J175j241
2735c96m00J327o47q49J443J94j188O15R12j262j08J128p83j058J315Lj090M48
$$ y = [93, 1133, -1420, -713, 1691, -543, -2080, 910, 869, -1495, 358, 1242, -1152, -824, 1694, 163, -1599, 652, 872, -1343, 296, 1473, -1149, -1120, 1594, 345, -1192, 1080, 696, -1708, 87, 1495, -963, -953, 1094, -54, -1028, 956, 957, -1514, -263, 1383, -818, -1110, 1259, 29, -1160, 643, 1250, -1061, -85, 1272, -291, -606, 1165, 63, -1521, 636, 877, -1001, -68, 1188, -428, -641, 1498, 541, -1315, 294, 822, -1187, -448, 958, -370, -1209, 911, 646, -864, 255, 1179, -891, -472, 1046, -427, -1231, 489, 301, -887, 369, 880, -497, -195, 1296, 87, -788, 739, 564, -1129, 337, 988, -800, -508, 1058, 120, -719, 547, 450, -821, -91, 997, -646, -639, 873, 21, -791, 470, 796, -862, -330, 845, -396, -796, 531, -116, -965, 478, 672, -516, 99, 1011, -251, -359, 769, -14, -1072, 243, 246, -844, -396]
2753c96J304j215j86J306m24q00R32L08j693N89P71j027l91J431l41p28J009M70
2771I19j136J73Q37j153m01R15l05r55J087M03j111O54P73q92n39J486l74q65
2789d84N59M57j497L31J361o07p25J191p6j167R81M29j514N58R00j293nJ116j31
2808C84j239J164O07j403L61Q82r99o14J086p0j066R59Q35j329J92J187r94n65
2826f22J332l68j346J162M24j207K99J009q81k74J389n01j242J261J87j484R6
2843g66J382r99n50J482K3j291J193M38j562K18J418j115p11J292l75r99J066
2860A44O01j650K96J669q61r12J450n49j278J187P85j686J90J398n58q55J103
2877D74J36j574J357M99j845J00J696j004j075K127k98j766J301R19j607k05J952
$$ y = [-396, 908, -307, -493, 813, 389, -411, 521, 829, -864, -275, 496, -531, -922, 509, 168, -560, 449, 919, -217, -44, 793, -360, -761, 154, -151, -1106, -19, 384, -727, -73, 700, -192, -731, 755, 381, -484, 75, 532, -965, -634, 727, 120, -605, 586, 510, -657, 324, 753, -761, -203, 697, -596, -601, 515, 384, -855, 309, 916, -487, -126, 756, -243, -857, 229, 159, -907, 52, 887, -442, -250, 937, -57, -622, 710, 342, -1004, 158, 582, -625, -326, 683, -198, -472, 917, 416, -826, 435, 622, -862, -766, 616, -383, -933, 549, 572, -719, 474, 912, -650, -432, 986, -129, -840, 452, 77, -922, 144, 745, -905, -609, 1060, 199, -713, 737, 188, -1090, 97, 882, -804, -614, 784, 226, -629, 474, 610, -964, 393, 892, -953, -853, 843, -161, -1236, 891, 593, -1173, 128, 1047, -560, -765, 1187]
2894A187j041j101J369P4j338J031J076j878J18J749j000j369J729K5j848J223
2910FR73j939M1K041m79j399J553k28j757J392J063k166m75J842m99j115J907
2927G61j72j923J764J248k126n35J819o89j301J676K70k428J478J686j786q21
2943a079K018o12j589K010N7k229J081J626k085l77K295p34j779K177M21k416
2959a215R65J626j830r17K294k82j897J929L49k148Q08K235k233j274K341j67
2975E84j737J299J158k634Q16K656k167j399J956j36j516J361O70k536P25K893
2991A993j986j546K313r6j724J581P38k536J30K565j350j653K175r6j987J835
3007C56J005k086J86K175j433j723K201L7k205J195J487k085O3K448j191j700
$$ y = [1187, 146, -955, 414, 488, -850, 181, 1257, -621, -503, 1246, 246, -1123, 606, 631, -1217, 6, 979, -960, -919, 1122, 643, -756, 797, 569, -1188, 204, 1267, -899, -1374, 468, -31, -1146, 761, 589, -1334, 430, 1678, -448, -983, 836, 147, -1154, 522, 792, -1636, -158, 1528, -258, -1079, 939, 327, -1262, 748, 805, -1424, -343, 1283, -802, -1179, 1116, 382, -1397, 780, 1201, -1215, -250, 1376, -454, -1371, 923, 641, -1256, 673, 1022, -1126, -318, 1917, -316, -1590, 751, 584, -1153, 146, 1304, -1330, -514, 2142, -25, -1424, 532, 396, -1120, 241, 911, -1625, -900, 1993, 7, -1539, 774, 678, -1046, 535, 1273, -1263, -1133, 1432, 82, -1571, 604, 508, -1479, 356, 1361, -725, -539, 1636, 203, -1520, 681, 718, -1487, -292, 1195, -890, -827, 1621, 430, -1270]
3023a270J653P22j932Q20R65k064J01K450r25k107J880O19j811J133Q03k396j17
3040a476K970q53k203J320P55j349J227J144k165o69K536p10j621R41M37j512
3056a228J477J279j755o25K110l10k068J497M57j941O09J662j787o44J991o8j664
3073a008J285O44j486M37J266j817m45K068n90j738J347R77j378L99J508j782
3089c13p00J993k25j748P93N56j010L95J055j319o75J911M00j978P08N69j288
3106h76P77J114j599p77J730N03j280O17O19j342M52R92j070o20J243o7j120R58
3124B54N13j145J18J140q38p26J273k72j519R93P01j093L08J118q80p25J358j45
3142D33j059M88N90j104L93J049j148m95J361K79j073N51K98q82k5J154r55r60
$$ y = [-1270, 383, 1105, -827, -7, 958, -1106, -1005, 1445, 520, -1587, 293, 912, -899, 234, 1037, -1359, -1476, 1494, 641, -1562, -242, 513, -836, 391, 1535, -630, -1299, 1237, 527, -1094, -153, 284, -1228, 249, 1528, -227, -852, 1258, 948, -1120, 377, 834, -1107, -498, 1164, -623, -1267, 724, 656, -1008, 277, 921, -565, -128, 1138, -679, -1124, 944, 354, -1384, -37, 940, -438, -39, 1469, -313, -1013, 980, 755, -993, -200, 356, -654, -259, 796, -523, -1198, 713, 1113, -865, -157, 412, -876, -99, 1015, -584, -1361, 369, 872, -408, 209, 828, -514, -62, 930, -140, -760, 483, 416, -704, 254, 767, -378, -260, 880, 42, -684, 589, 317, -1202, -209, 492, -601, -293, 825, -55, -780, 578, 433, -626, -138, 452, -652, -259, 790, -358, -853, 508, 787, -286, 265, 563, -319, -344, 810, -145, -1105]
3160a105J170M86j152M80M32o97N35P95q54p68Q70j10o75N72K82r70L54R27m95
3179G7n42J059j23q66L28O97j078j47J359j173j12P46K48o82K51N73o69l16R68
3198E98p46o15R99Q5o83N32K30n56J13P55r52j63L70Nn19M50N34n59k38R25o24
3219e9l15P92R0r28M62J77q89J28P70m14j63O35K5m63M44K27p55R5L35l07n61
3240f74R39j65o22O06M93p94L05M37r9o92M55o2p01O16J44o69L63P12m80l08O03
3261D07r4q45P91l5n34o5L12Q3l25M18J35m67K15L97p04J01N11m31k39M93r0j55
3283a21J31O39o29K49pq2l45K37L35j029L05Q17r08M20M20j59m86M66p9n94L44
3304g6R6m35j20Q10l73k49N80J60n42M00L46q53j08O53n78PL84J47m80L34K93
$$ y = [-1105, 65, 551, -601, -121, 311, -386, 149, 944, 90, -678, 192, 82, -593, -21, 261, -709, -355, 572, 77, -465, 594, 471, -395, -67, 630, -448, -595, 764, -409, -521, 225, 473, -209, 42, 615, -54, -370, 598, -148, -763, 236, 321, -362, 170, 400, -156, -43, 712, -240, -403, -33, -28, -547, -97, 437, -122, -360, 565, -59, -374, 418, 508, -420, 42, 219, -670, -542, 228, -186, -349, 286, 311, -152, 292, 519, -236, -141, 194, -113, -674, 265, 100, -522, 84, 577, -217, 88, 525, 426, -266, 189, 127, -574, 42, 186, -483, -120, 592, 112, -196, 407, 313, -532, 259, 224, -310, -375, -63, 20, -305, 113, 248, -219, -4, 393, -311, -210, 301, -130, -369, 124, 34, -121, 10, 649, 20, 269, 262, 180, -165, 72, 407, -622, -317, 500, -408, 12, 432, 273, -213, 253, 174, -420, -76, 20, -415, -535, 275, -98, -347, 233, 393, -149, 251, 597, -256, -364, 289, -289, -282, 102, 249, -231, 103, 396]
3325C96j50m79Q02n62k35J8J56l91L5O66n26rN97j74l34L58L75p17Q9K90l54j45
3347b94M23R5o15N72J78l68k49M95l93j18K59n4k09L30Ol7k52O84l93l70L63j21
3369f8l74K65K47n20K15Q49l61l11O13n7n69L79J91o38n10L49L23m24N97J23p50
3390d31M94K49m59k50M38j62l92N44l8q12K60P97j20l89O41n8l34L69Q3r41K21
3411b90N33m97j59N04n0j73L22J21n22J6L76j82n03N50ok55K00J79l98J2Q05n00
3433H3l00J25L88n71J54L01m69O2O96l46k93P20l32l98K36Q8o69m1O86J57o03
3454c26K29M27m02K92M55o13l01L88K5l46j31O74o50K78M14l69OM45j57m07M05
3475C36j6n13j75M55%l71K68L69o27K74M75m35m04J06J96m14M87K23m17k13O30
$$ y = [396, 246, -233, 569, 7, -228, -210, -54, -445, -410, 256, -270, -279, 318, 144, -190, 168, 543, -174, -85, 205, -149, -294, 129, 224, -391, 181, 359, -9, -258, 237, -156, -274, -15, -69, -278, 52, 58, 21, -231, 453, 60, -310, 53, -68, -442, -177, 70, -450, -235, 614, 253, -58, 555, 498, -71, 308, 499, -139, -649, -300, 23, -401, 196, 319, -431, 63, 312, -147, -397, 41, -121, -513, 31, -7, -819, -559, 238, 118, -271, 370, 312, -22, 347, 430, -511, -290, 243, -254, -413, 91, 41, -132, 190, 311, -211, -195, 181, -1, -504, 46, 40, -215, -15, 164, -234, -222, 583, 83, -217, -92, 296, -275, -121, 180, -289, -227, 469, 123, -170, 550, 218, -180, 56, 144, -525, -566, 120, 277, -326, -97, 330, -72, 220, 675, 62, -239, 149, 174, -172, -303, 371, -279, -1, 413, 44, 50, 495, 338, -69, 336, 320, -193, -368, 87, 87, -284, -16, 353, -274, 0, 475, 40, -364, -258, -62, -476, 11, 234, -183, -396, 234]
3496B34j74j59M68n20l38P75J28p27k05N22r6jN03k05n25M88K72n16l8j2j3k21
3518c60O75j15n22K61P05l51j95P1m37j52O12J41n35J02Q2J19m6M61k85m04K32
3539E9M44p40m1M66o67J82O10r2m68N17k4j84Q3J19k80k36O0j33N7J29K50j49
3561c8j77N57k02k77J28k4k56K90Q8k35l02N72O1N4j03j88J51K10J01m79k25J54
3583a40J24k32N18M4o47M89M02n17j35R2q9J9J49J4k89NM62k10Q4J41j02l52n
3606a75L03k90J27r4r1J95K22J88k68Q5r8m8m6K30n06J37MJ00l7j7j63K57J55
3629A70k6J77m72rO6P5k71K10n7K23J86J86j42j09j90J78J0m64ML32j78J23J40
3652A62j96k27M76J41j85m6l89J17L34j51l58L06J64j86m8N07l56j32K51j04l26
$$ y = [234, 60, -99, 369, -151, -489, 286, 414, -313, -518, 4, -92, -93, 410, 205, -320, 168, 440, -76, -114, -126, -139, -360, 315, 200, -322, -61, 644, 293, 98, 169, -268, -420, 192, 333, -202, -100, -18, 101, 55, 516, 231, -173, 59, 503, -237, -278, 188, -479, -297, 313, 221, -247, 270, 246, 62, 145, 264, -16, -252, -192, -325, -268, -139, 111, -38, -215, 342, 140, -137, -9, -33, -289, 1, 89, -146, -448, 124, 185, 239, 136, -52, 99, 309, 410, -69, -294, -140, -16, -248, 270, 314, -333, 156, 558, 41, -94, -2, -91, -72, 77, 91, -198, -193, 269, 59, 143, 284, 182, -170, -175, 128, -162, -35, -129, -220, -25, 197, 385, 117, 202, 104, 56, 10, 240, -266, -129, -125, -25, -62, -79, -242, 15, 170, 144, 321, -151, -160, -94, -19, -290, -80, -137, 86, 272, 458, 316, 207, 17, 195, 205, -259, -255, 77, -101, 22, 162, -34, -261, 215, 356, 171, 125, -264, -147, 187, 36, -322, -16, 148, -38, -86, 421, 65, -67, 184, 80, -246]
3673b46M13k65k64L52PL73l32J37q1q0l3N3k12JJ19j98K11PL71o42M74Q9m5j62
3697D7ml5j16J61j21k26o2O48k05j03L8l0j27J90J4l34K67K06l42k3K97O8m43
3720b35L25L58l78j4J77l23n9K25k41j01K30J80k65J05R8r3jP5N3m94L12K56n25
3743c35K75L97n47J15L33k52%j00J86j00k11K57l51J4M33M7m85L15K36m11J87
3764CJ26l96J95R0N6k46J31M18j93m84N30k1l89L45k94j19L94k26k34J51M61j65
3786A33j21J66n7q1J03n6l12J24L22m19M0R1M16n33L56k6l03k4L09N6m81K50j26
3809a73o9K81K66l77K67j90k2j4j1J38l65K18J27l46K56K39p8l20N4M05o26K99
3831d1jJ06l04K40n3j95K64J57l69J50m8k78N29Q9l76p0MJ55j35N27n5m16qM13
$$ y = [-246, 167, -98, -362, -10, -3, 370, 38, 175, 94, 14, -19, 34, -178, -177, -58, -256, -45, -38, 333, -309, 165, 254, 209, 47, 43, 8, -108, 53, -68, -294, -356, 292, 87, -16, 22, -8, -135, 55, 69, -265, 2, 208, -134, -157, 140, 208, -235, 90, 448, 70, 56, 233, -90, -149, 76, -165, -266, -36, 144, -121, -16, 82, -11, -12, 63, 116, -378, -66, 190, -335, -60, 337, -210, -95, 238, -14, -14, -114, 72, -28, -239, 18, -333, -319, 114, 161, -324, -9, 227, -184, 3, 129, -267, -72, 18, 74, -172, -41, 377, 184, -300, 230, 209, -180, 165, -129, -248, 146, -80, -314, -163, 298, 133, 12, 178, 121, 40, 143, 87, -225, -101, 221, -198, -158, -67, 349, -184, 172, 146, -157, -181, 128, 184, -297, -47, -173, -242, 39, 305, -72, 195, 5, -17, -31, -42, 96, -269, -51, 76, -270, -14, 225, 147, -173, -119, 286, -340, -41, -42, 64, -240, 0, -53, -248, 16, 173, -196, -46, -94, -372, 157, 246, -130, -200, -196, -41, -176, 351, 296, -120, -128, 285]
3855B85j1l94K26N4l42K91Q4k11J42J59o3k82J72j29j47K83J40n04Q6L38k57k67
3877c47M40j07r5K86o8p0k01M34l39J6J42m42L81J12K03l76j91O66o29K57Q6j00
3899E8j58J71j3l32K82n1m5j73L72l99K96J06L2m66L4Q08o77j2L05k6k00L63k53
3922B2m85M69J24k85k82N96j14k92P42l14n88L65R5j63L4L00o42R1M48L2n36M48
3944F5O30p18l6M47n83k6O29m26o00L46O22l26j37L91n82l5P60j79m79K33L60
3965C56o77J97L86l39m48R46j25o51J13Q61p95o9K70n2k58P71k85o74M06M28n12
3986a51j82O27m21r2K98J47o65J88O40o19K90J94l51k18O46L2o42mO00l27j05
4007a15L94l14m19Q63K15p06j75N74m43k07O28n15r0N64J51q90M52N77m42l73
$$ y = [285, 274, -120, 106, 160, -182, 109, 193, -18, 124, 283, 220, -62, 110, -19, -166, 117, 257, -247, -161, 177, -80, -347, 93, -14, -109, 177, 109, 39, -162, 272, -67, -51, 91, -351, 30, 142, 345, -31, -222, 444, -185, 72, 158, 58, -100, 71, 58, -274, 8, -43, -88, -261, 111, -288, 8, 114, 146, -320, -286, 522, -155, -167, 138, 112, -88, 275, 22, -463, 6, 130, -155, -437, 159, 45, -247, 495, 181, -407, -42, 53, -110, -76, 224, -418, -327, 121, 153, -383, 65, 695, -23, -59, 388, -195, -221, 408, -18, -618, -272, 350, 24, -113, 278, -304, -339, 421, 242, -237, -4, 356, -321, -124, 262, -77, -525, 421, 296, -355, -242, 619, -176, -245, 25, -27, -285, 486, 201, -473, -67, 361, -151, -333, 294, -127, -219, 79, 226, -439, -251, 389, -230, 60, 254, -97, -315, 331, 363, -279, -283, 317, -10, -115, 279, -35, -454, 409, 624, -82, -257, 317, -126, -333, 295, -220, -310, 254, 405, -485, -33, 544, 102, -271]
4027b71R19p45k66M55L03p91L01O03m85k64K91J57p16O24K53o47J74N33o62k10
4047d44N45j28l95P78K00o68k69R21p21j08N59j12m73L48M41o46L0N07l82j90
4067b07L93k80l58L64O60p78P9N75m78n82R17%n34J77M06n61k43N60M4k75M86
4088C65l33l54M72L08n11l15O78j47n60N50J67n89L75J59k91k45N39j25k45K14
4108A12n0m78J02O58j15n48M28K25n80P33l85l80K34N85q50N0J66L9l14K77K27
4129A36m09J94K66k04l9M35l73k58N03j86j59j0N79n54k35P80k52n79L12L54n34
4150b33m9N96j09o09O82j00k14K86k53l77K92M52l69m34N50q7k65M48K34o54j83
4171c96O55j34l41M1L41l15K95K61m86k8L67k03j25L96j03j12j21K35m59R1M36
$$ y = [-271, 648, -97, -363, 92, 395, -396, -95, 508, 23, -241, 50, 207, -509, 115, 368, -279, -105, 428, -234, -444, 101, -27, -422, 356, 556, -112, -381, 540, -181, -289, 270, 158, -315, 33, 474, -172, -142, 365, -17, -207, 186, -94, -452, -88, 572, -206, -127, 448, -30, -612, 305, 305, -229, -52, 354, -207, -450, 110, 154, -121, 365, 32, -322, 150, 458, -53, -368, 310, 163, -397, 153, 320, -269, 106, 265, -26, -271, 268, 143, -102, 112, 62, -416, -314, 344, 229, -319, 109, 334, -246, 487, 102, -278, -44, 541, -309, -259, -93, -54, -368, -91, 136, -273, -79, 187, -17, -56, 379, 6, -252, 251, 65, -94, -104, 475, -79, -314, 466, 214, -365, -53, 301, -233, -282, 314, 205, -404, 278, 178, -36, 250, -3, -380, -88, 364, -5, -439, 111, 24, -241, 207, 441, -213, -396, 259, 125, -216, -175, 166, -149, 146, 407, -79, -107, 260, 57, -68, 328, 225, 113, -8, 227, -232, -141, 295]
4192B95j94j66L04J33n26K48K9j92R5k54L13l08K86K57m50q0M61k37k72M64l03
4213i7j68L01J30k28j42J78K36l33K54J60l56J72q9n8k46M97q2k32L43j2j78P7
4235A27O5l40J37J25k69j5K84k03K1K37k39J96k36L11k22j47K23K5j79K9K7k31
4257b74J66M31m97LL03k46mK64k5m97L50L4p0K6N9j69o8K55pO7j08J51j26l00
4281b82L09J31n82L07J94k54J58J00j83n3J99L7k36K63J20j48l7J13M2j80R5J00
4303B13l36J38K07j36l34O46o0n08L03k1k36J32L4k24P1M6j5j59J94N8j57L14
4325A70R8k76j26L59l60J67J17j7j66l5L31k67j08J81j11r2M74n07N5Q4J15j10
4347b4k55L40o0j71J98J78k46n7M35l81j34M48l5m11K15J28l32j2L85l27M0K84
$$ y = [295, 101, -65, 239, 372, -154, 94, 123, -69, 26, -228, 85, -223, 63, 320, -130, -210, 251, 14, -258, 206, -97, -265, 36, 166, -62, -204, -26, 210, -123, 131, 291, -65, 107, 18, -40, -286, 211, 129, -103, 240, 228, 50, 127, 192, -148, -11, 114, -155, -170, 114, -89, -68, 169, -70, 126, -110, 201, -21, -168, 55, 80, -99, -70, -43, -274, -108, 323, -174, -171, 132, -114, -118, 146, 121, -376, -26, 8, -62, -36, 23, -146, -214, 41, 34, 101, -7, 144, 18, -282, 27, 158, -424, -117, 77, -177, -19, 81, -102, -155, 44, 81, -155, 108, 228, 80, 43, 156, 198, 18, 113, 213, -123, 15, 222, 86, -248, 398, 338, -170, 133, 112, -124, 8, 42, -182, -111, -65, -80, -239, -45, 13, -144, 170, 268, -8, -134, 225, -135, 32, 149, 132, -34, -69, 262, -5, -113, 68, -43, -135, 339, -168, -113, -29, 86, -24, -279, 61, 1, -170, 28, 206, -40, -97, 338, -43, -177, 271, 236, -175, 40, 168, -164, -176, 209, -118, -78, 206]
4369B06k51k25L03J00l45N4L61j79k47K95j30k4K13N8m82L96L37m76k32M89k72
4390e1N2L80q9m59K40L61p18kL74K6n19M91R2o66L70L26j78j65L85m39m7J43M17
4413C24m39J83M62o84JJ11J50o61O38M19o90R4N00m28l61N72J01p37L58L87m44
4434a44P2L80n05j82O02p6k30M4L27k90k63M82m0n42L11K99m90N50K4o85O9P57
4456D70o67j80N66m29j37L07M77n91m4M91l69m07Q03J01n98J18K11j69j21M86
4476C18l72j76L59l0r8j89O35m11q0L35k63j01M72k68j92N5J85l59j50O33L6o73
4498c34N79l05j03K95J10l37o1M01k92l83N32kk98J16K30l51j20L76L7l11L37
4519A16K90q06K75M68n37L2L58k66m91P61m6m54J58M13l53kJ67m6l61J58N44o02
$$ y = [206, -45, -270, 33, 133, -212, -158, 203, 24, -223, 72, -58, -82, 131, 189, -293, 103, 440, -36, -268, 221, -51, 1, 381, 292, -167, 73, 434, -284, -286, 88, 114, -405, 86, 178, -488, -118, 208, 30, -135, 250, -189, -236, -93, 324, -115, 68, 530, -154, -153, -42, 108, -553, 85, 504, -186, -92, 408, -20, -381, 191, 292, -445, -87, 300, -144, -72, 308, -197, -379, 223, 147, -83, -39, 288, -2, -265, 217, 177, -365, -54, 245, -245, 305, 329, -356, -287, 470, -197, -377, 189, -240, -377, -70, 407, -184, -228, 263, -106, -513, 290, 391, -207, -89, 122, -47, -168, 318, -54, -230, 129, 99, 1, -188, 447, 36, -44, 291, 28, -73, 399, 131, -61, -6, 179, -180, -330, 303, 339, -334, 245, -60, -163, 132, 242, -95, -156, 245, -47, -430, 102, 100, -198, -82, 148, -203, -323, 53, 90, -221, 116, 406, -400, -125, 343, -194, -162, 196, -70, -561, 200, 154, -300, -142, 271, -82, -84, 83, 37, -324, -166, 378, -224]
4541b24L7K70j64j22N91m02j94K71M71o21L5L13l79lP0Oj47L54j7j30n3K59k22
4564am11O23q3r3K46L1o18M76K66l52k00J83L6l44M7J49o5k06M49r5j05K17q9
4587F1l96N25J69l74o2N34k74m00L41J41k94P1L88n50K16K95o79J99J94J07n68
4608c56K89K70k08j19M81m18K1K35J1l91rL22j64K0J77L1l62J96M13o23J71K75
4630B62l30KK33q2j51K05J7l09J45K31k15k55N44l09k49J91K55k02o2L71n12L83
4652A63j73J15j03J30j2k11K8L28l93m0L28j98j06M50k18l32K74M5k61N2K56r6
4674B6j10o2K45k50K16j25J49l55J66R4j67R5M3j62J51R4k07N5J45M7j68J88K9
4697A37l36K34J57k06j04L02j49L8j71K41m0l20O73o45l4K44O9j95J41K07m40
$$ y = [-224, -187, 83, -81, -203, 388, -14, -208, 63, 534, -87, -52, 261, -118, -121, -51, -45, -192, 162, 145, 15, -38, 221, -1, -412, 211, 128, 35, 281, 312, -306, 170, 436, 84, -116, 67, 103, -241, -194, -45, -110, -316, 133, 38, -67, 150, 61, -335, 190, 359, -15, -77, 457, 183, -217, 124, 265, -29, 42, 430, -120, 96, 391, -288, -89, 105, 212, -356, -67, 203, -5, -124, 357, -61, -40, 195, 206, -185, -194, 128, -36, -16, 161, 192, -170, 26, 439, -184, -13, 262, -68, -66, 167, 85, -66, 139, 156, -153, -8, 223, 8, -247, 297, -12, -261, -70, 185, -17, -79, 292, -220, 163, -10, 105, 2, 132, 120, -91, -63, 265, -128, -168, 160, -38, -144, 306, 88, -244, 30, 75, -186, -134, 122, 26, -84, -146, 99, -151, 65, -60, 89, -266, -100, -6, -173, -78, -35, -197, -46, 48, -159, -104, 41, 88, -80, 108, 137, -199, 35, 192, -14, -118, 184, 35, 73, -98, 143, 103, -217, 456, -189, -223, 21, 90, -105, 36, 243, -197]
4718a97j36L54J30j53J91k54J43j89kK13l78M28m39Q5M61k46R9k36K21j55P0K1
4740C1j00K17k0o8K4J58m3n2j19J32j54j12J08p3J89p6N9j19J00r1Q1j75L2J04
4764C3k40K54j4p7NL58j65j34oQ5k27K30O9j49O6l0k1q7J18J77n40L58l19K83
4788B7L1J24m35J36J31K57m11J71J17k45J84J41j14l18J69J07L3or5j20N6R6N8
4811I4N3L9o5k66QJ30k45L68K4J9l33M30k79r4n2J23l4p7P1j99J14J51J25k06
4835a01K4L28l33N4K75l48Q4L24j98m11J46M31k83l8J32j65M3J46K2j03o3J63
4857A29k40M6R5M8j54O8L56m15j74N13l22N3K31m6l25L93j67k21j6N87l99j3%
4880B7Lm9K07o7m13L08l2j08j16M48l0l19j3L49j44k81N32k29l41O8K12k25K36
$$ y = [-197, -333, 21, 151, -2, 189, -65, 78, -111, -113, 100, -278, 150, -289, -204, 257, 11, 110, -126, 95, -60, 10, 31, -69, 148, 128, 60, 84, 242, 199, 147, 28, 160, 6, -106, 2, -71, 118, 42, 101, -18, 82, -9, 72, -103, -71, 33, -207, 47, 33, -44, -39, 319, 154, 20, 14, 99, -128, 102, 171, 22, 88, 58, 37, -50, 68, 245, -295, 63, -256, 27, 58, 182, -253, -117, 14, 271, -140, 31, 148, -97, 87, 228, 114, -204, -35, 72, 105, 99, 4, -116, -60, 36, 94, 147, 186, 121, -145, -137, -7, -252, 116, 140, 159, -174, 256, -23, -117, -169, -46, -80, -157, -86, -285, -171, -20, 105, -101, -77, 251, -82, -28, 247, -101, -17, 307, 109, -302, -156, 275, -8, -46, 86, -79, -36, 110, 132, 29, -34, 129, -111, -65, 30, 78, -76, -8, 348, -67, -241, 272, -50, 3, 234, 188, -137, 256, 89, -132, -148, 439, 40, 27, 27, 30, -19, 188, 121, -292, 16, -16, -124, -240, 208, 178, -141, -154, 195, 51, -230, 302, 73, -268, -200, 12, -213, 23]
$$ [...]
8191b15
##END NTUPLES=NMR FID
##END=
