##TITLE=1H_UK_26_2_8
 CD2Cl2
 8 sc, 
 12.04.2022
##JCAMPDX= 6.0         $$ Bruker NMR JCAMP-DX V2.0
##DATA TYPE= NMR FID
##DATA CLASS= NTUPLES
##ORIGIN= UXNMR, Bruker Analytische Messtechnik GmbH
##OWNER= root
$$ XWIN-NMR		Version 3.5
$$ Tue Apr 12 10:30:37 2022 Russian Standard Time (UT+4h)  she@DPX200
##.OBSERVE FREQUENCY= 200.13135
##.OBSERVE NUCLEUS= ^1H
##.DELAY= (6, 6)
##.ACQUISITION MODE= SIMULTANEOUS
##.ACQUISITION SCHEME= undefined
##.AVERAGES= 8
##.DIGITISER RES= 18
##SPECTROMETER/DATA SYSTEM= spect
##.PULSE SEQUENCE= zg30
##.SOLVENT NAME= CD2Cl2
##.SHIFT REFERENCE= (INTERNAL, CD2Cl2, 0, 15.7039)
##AUDIT TRAIL= $$ (NUMBER, WHEN, WHO, WHERE, WHAT)
$$ ##TITLE= Audit trail, XWIN-NMR		Version 3.5
$$ ##JCAMPDX= 5.01
$$ ##ORIGIN= Bruker BioSpin GmbH
$$ ##OWNER= she
$$ F:/spectra/data/she/nmr/H-F/1/audita.txt
$$ ##AUDIT TRAIL=  $$ (NUMBER, WHEN, WHO, WHERE, WHAT)
(   1,<2022-04-12 10:29:39.76 +0400>,<she>,<DPX200>,
      <created by zg, POWCHK disabled, PULCHK disabled
       configuration hash MD5:
       00 E9 B6 7A A2 85 ED C7 34 08 36 98 17 FE 4E 26
       data hash MD5: 16K
       6C 20 D8 5C 40 1C FF 71 2A DC 20 29 DB 76 F6 A3>)
$$ ##END=
$$ 
$$ hash MD5
$$ C2 98 C7 67 ED 7F 0F 4C 60 1C 01 25 6A B6 37 C0
##$RELAX= 
##$RELAX= 
##$RELAX= 
##$RELAX= 
##$RELAX= 
##$RELAX= 
$$ Bruker specific parameters
$$ --------------------------
##$DU= <F:/spectra>
##$EXPNO= 1
##$NAME= <H-F>
##$PROCNO= 1
##$TYPE= <nmr>
##$USER= <she>
##$AMP= (0..31)
100 100 100 100 100 100 100 100 100 100 100 100 100 100 100 100 100 100 
100 100 100 100 100 100 100 100 100 100 100 100 100 100 
##$AQSEQ= 0
##$AQ_mod= 1
##$AUNM= <au_zg>
##$AUTOPOS= <>
##$BF1= 200.13
##$BF2= 200.13
##$BF3= 200.13
##$BF4= 200.13
##$BF5= 200.13
##$BF6= 200.13
##$BF7= 200.13
##$BF8= 200.13
##$BYTORDA= 1
##$CFDGTYP= 0
##$CFRGTYP= 5
##$CHEMSTR= <none>
##$CNST= (0..31)
1 1 145 1 1 1 1 1 1 1 1 1 1 1 1 1 1 1 1 1 1 1 1 1 1 1 1 1 1 1 1 1 
##$CPDPRG= <>
##$CPDPRG1= <>
##$CPDPRG2= <>
##$CPDPRG3= <>
##$CPDPRG4= <mlev>
##$CPDPRG5= <mlev>
##$CPDPRG6= <mlev>
##$CPDPRG7= <mlev>
##$CPDPRG8= <mlev>
##$CPDPRGB= <>
##$CPDPRGT= <>
##$D= (0..31)
0 1.2 0 0 0 0 0 0 0 0.06 0 0.03 0 0 0 0 0.0002 0 0 0 0 0 0 0 0 0 0 0 0 
0 0 0 
##$DATE= 1649744979
##$DBL= (0..7)
120 120 120 120 120 120 120 120 
##$DBP= (0..7)
150 150 150 150 150 150 150 150 
##$DBP07= 0
##$DBPNAM0= <>
##$DBPNAM1= <>
##$DBPNAM2= <>
##$DBPNAM3= <>
##$DBPNAM4= <>
##$DBPNAM5= <>
##$DBPNAM6= <>
##$DBPNAM7= <>
##$DBPOAL= (0..7)
0.5 0.5 0.5 0.5 0.5 0.5 0.5 0.5 
##$DBPOFFS= (0..7)
0 0 0 0 0 0 0 0 
##$DE= 6
##$DECBNUC= <off>
##$DECIM= 32
##$DECNUC= <off>
##$DECSTAT= 4
##$DIGMOD= 1
##$DIGTYP= 9
##$DL= (0..7)
0 120 120 120 120 120 120 120 
##$DP= (0..7)
150 150 150 150 150 150 150 150 
##$DP07= 0
##$DPNAME0= <>
##$DPNAME1= <>
##$DPNAME2= <>
##$DPNAME3= <>
##$DPNAME4= <>
##$DPNAME5= <>
##$DPNAME6= <>
##$DPNAME7= <>
##$DPOAL= (0..7)
0.5 0.5 0.5 0.5 0.5 0.5 0.5 0.5 
##$DPOFFS= (0..7)
0 0 0 0 0 0 0 0 
##$DQDMODE= 0
##$DR= 18
##$DS= 0
##$DSLIST= <SSSSSSSSSSSSSSS>
$$ [...]
##$SUBNAM2= <"">
##$SUBNAM3= <"">
##$SUBNAM4= <"">
##$SUBNAM5= <"">
##$SUBNAM6= <"">
##$SUBNAM7= <"">
##$SUBNAM8= <"">
##$SUBNAM9= <"">
##$SW= 18.05172834244
##$SWIBOX= (0..15)
0 0 2 0 0 0 0 0 0 0 0 0 0 0 0 0 
##$SW_h= 3612.71676300578
##$TD= 16384
##$TD0= 1
##$TE= 0
##$TE2= 300
##$TE3= 300
##$TEG= 300
##$TL= (0..7)
0 120 120 120 120 120 120 120 
##$TP= (0..7)
150 150 150 150 150 150 150 150 
##$TP07= 0
##$TPNAME0= <>
##$TPNAME1= <>
##$TPNAME2= <>
##$TPNAME3= <>
##$TPNAME4= <>
##$TPNAME5= <>
##$TPNAME6= <>
##$TPNAME7= <>
##$TPOAL= (0..7)
0.5 0.5 0.5 0.5 0.5 0.5 0.5 0.5 
##$TPOFFS= (0..7)
0 0 0 0 0 0 0 0 
##$TUNHIN= 0
##$TUNHOUT= 0
##$TUNXOUT= 0
##$USERA1= <user>
##$USERA2= <user>
##$USERA3= <user>
##$USERA4= <user>
##$USERA5= <user>
##$V9= 5
##$VALIST= <valist>
##$VCLIST= <CCCCCCCCCCCCCCC>
##$VD= 0
##$VDLIST= <DDDDDDDDDDDDDDD>
##$VPLIST= <PPPPPPPPPPPPPPP>
##$VTLIST= <TTTTTTTTTTTTTTT>
##$WBST= 1024
##$WBSW= 4
##$XGAIN= (0..3)
0 0 0 0 
##$XL= 0
##$YL= 0
##$YMAX_a= 392151
##$YMIN_a= -483107
##$ZGOPTNS= <>
##$ZL1= 120
##$ZL2= 120
##$ZL3= 120
##$ZL4= 120
##$ABSF1= 10
##$ABSF2= 0
##$ABSG= 5
##$ABSL= 3
##$ALPHA= 0
##$AQORDER= 0
##$ASSFAC= 0
##$ASSFACI= 0
##$ASSFACX= 0
##$ASSWID= 0
##$AUNMP= <proc_1d>
##$AZFE= 0.1
##$AZFW= 0.1
##$BCFW= 1
##$BC_mod= 2
##$BYTORDP= 1
##$COROFFS= 0
##$CY= 11.3945322036743
##$DATMOD= 1
##$DC= 2
##$DFILT= <>
##$DTYPP= 0
##$F1P= 2.36226072786647
##$F2P= -0.459571619588291
##$FCOR= 0.5
##$FTSIZE= 0
##$FT_mod= 4
##$GAMMA= 1
##$GB= 0.15
##$INTBC= 1
##$INTSCL= 1
##$ISEN= 128
##$LB= 0.24
##$LEV0= 0
##$LPBIN= 0
##$MAXI= 10000
##$MC2= 0
##$MEAN= 0
##$ME_mod= 0
##$MI= 1.114404
##$NCOEF= 0
##$NC_proc= 0
##$NLEV= 6
##$NOISF1= 3.799351
##$NOISF2= 2.8
##$NSP= 1
##$NTH_PI= 0
##$NZP= 0
##$OFFSET= 15.70392
##$PC= 1
##$PHC0= -18388.36
##$PHC1= 12.60078
##$PH_mod= 1
##$PKNL= yes
##$PPARMOD= 0
##$PSCAL= 0
##$PSIGN= 0
##$REVERSE= no
##$SF= 200.130013532006
##$SI= 16384
##$SIGF1= 3
##$SIGF2= 2
##$SINO= 400
##$SIOLD= 16384
##$SREGLST= <1H.CDCl3>
##$SSB= 0
##$STSI= 0
##$STSR= 0
##$SW_p= 3612.71676300578
##$SYMM= 0
##$S_DEV= 0
##$TDeff= 0
##$TDoff= 0
##$TI= <>
##$TILT= no
##$TM1= 0
##$TM2= 0
##$TOPLEV= 0
##$USERP1= <user>
##$USERP2= <user>
##$USERP3= <user>
##$USERP4= <user>
##$USERP5= <user>
##$WDW= 1
##$XDIM= 8192
##$YMAX_p= 0
##$YMIN_p= 0
$$ End of Bruker specific parameters
$$ ---------------------------------
##NTUPLES= NMR FID
##VAR_NAME=  TIME,          FID/REAL,        FID/IMAG
##SYMBOL=    X,             R,               I
##VAR_TYPE=  INDEPENDENT,   DEPENDENT,       DEPENDENT
##VAR_FORM=  AFFN,          ASDF,            ASDF
##VAR_DIM=   8192,          8192,            8192
##UNITS=     SECONDS,       ARBITRARY UNITS, ARBITRARY UNITS
##FACTOR=    0.0002768,     1,               1
##FIRST=     0,             0,               0
##LAST=      2.2672688,     0,               0
##MIN=       0,             -483107,         0
##MAX=       2.2672688,     392151,          0
$$ Real data points
##PAGE= N=1
##DATA TABLE= (X++(R..R)), XYDATA
0 0 0 0 0 0 0 0 0 0 -8 8 -8 8 -14 16 -20 24 -32 40 -48 56 -65 80 -96 113 -132 154 -178 208 -240 277 -316
31 -316 360 -410 465 -524 591 -664 744 -831 928 -1034 1148 -1274 1412 -1562 1726 -1903 2101
48 2101 -2313 2548 -2808 3095 -3410 3762 -4155 4599 -5102 5680 -6348 7133 -8074 9224
62 9224 -10661 12521 -15035 18633 -24241 34229 -57380 224267 -97401 -365001 317296 72891
74 72891 -181082 137464 32436 -203430 243492 115211 -364491 33401 345160 -206387
84 -206387 -221440 207592 68401 -99210 17783 -140111 -80488 226230 -8811 -265847
94 -265847 81988 173326 -106005 -68830 28362 -20920 76571 -1384 -166375 95991 207291
105 207291 -162619 -142769 165731 59284 -39014 45319 -96344 -37321 218996 -48526 -256869
116 -256869 147824 178040 -198975 -34357 169853 -60498 -25912 85852 -136302 -14027
126 -14027 242270 -106677 -249899 179140 139518 -181062 -2194 95109 -71993 61282
136 61282 84199 -159064 11224 191701 -127892 -154050 167661 45210 -144475 18003
146 18003 16280 -51890 97424 575 -174520 64967 149918 -128194 -81092 113627 -13958
157 -13958 -53008 57348 -28378 -15587 117709 -34385 -116914 113636 95732 -112337 -23059
168 -23059 74661 -12879 14737 24720 -72459 21491 101887 -61112 -68528 81853 9774 -73235
180 -73235 6842 -596 -20030 39228 -35507 -77137 72160 54805 -90720 -11736 59945 -31905
192 -31905 -6304 30311 -58546 -377 81419 -54371 -57891 103849 21794 -86244 42609
203 42609 53401 -51886 21643 34419 -75235 13495 86658 -65131 -56476 90534 7180
214 7180 -71609 41739 29638 -54740 18349 27029 -59326 6252 55119 -49186 -37869 60085
226 60085 8802 -41153 18241 15608 -20589 10989 6317 -27353 4905 19120 -18700 -10598 18372
239 18372 6766 -4984 -2351 1660 11637 -566 -19220 403 9227 -12205 -2330 8868 -10234
252 -10234 4294 22546 -11617 -10954 28027 -334 -27430 14587 13081 -26166 2364 19323 -17790
265 -17790 -218 28892 -11394 -16052 26593 869 -28242 10905 10548 -26100 -986 17658 -15717
278 -15717 -6046 22791 -4790 -14383 18508 4757 -21095 4659 11302 -16974 -5208 15094 -5492
291 -5492 -8161 16495 5157 -11825 8512 10993 -12708 -4711 11566 -6957 -11952 9781 4031
304 4031 -10873 7044 13066 -8442 -3334 12957 -5131 -13782 6642 1524 -16063 891 10593
317 10593 -9384 -3551 15838 -563 -10633 10149 5074 -15035 79 9839 -11274 -7145 14843
330 14843 965 -9499 13058 11081 -10445 3331 14176 -9550 -9952 11789 -2823 -15492 8459
343 8459 8454 -12754 2634 15001 -8824 -7633 12778 -3889 -15955 5578 2214 -16264 515
356 515 9595 -9775 -2523 13299 -2553 -7705 8995 2929 -8531 968 3367 -3506 1746 5030
370 5030 877 2986 5850 3131 1165 -291 2203 2909 -7095 -6386 7503 154 -11167 4426 7973
385 7973 -7525 2579 7308 -13228 -1550 14064 -15597 -15743 18925 -1370 -22125 13616 13639
398 13639 -15526 9143 12990 -20790 6227 24841 -26766 -18380 31653 -4853 -27081 20639
410 20639 7850 -20622 19579 10601 -29545 16838 27187 -38265 -11125 40089 -12279 -25743
422 -25743 22546 -499 -12595 28871 -3673 -32270 29849 21551 -41021 -359 32001 -18276
434 -18276 -12233 16488 -10696 4352 25622 -27526 -19512 42524 1310 -41065 7458 10226 -14469
447 -14469 11274 -7757 -27635 32659 19763 -50591 5107 49245 -26294 -25010 26347 -11385
459 -11385 -2259 37076 -35317 -32638 74520 15115 -71721 27248 51070 -42120 -2338 31361
471 31361 -39319 6400 48656 -58855 -30523 88999 -7227 -82623 38446 42292 -42607 6230
483 6230 7672 -47825 32044 42767 -74862 -16835 81693 -19804 -56004 39750 17885 -20315
495 -20315 17981 -22662 -28079 65383 10218 -84167 17373 68266 -28273 -20481 19922 -16724
507 -16724 21307 32055 -64518 -12773 85997 -28162 -77903 53047 37710 -43268 10741 -545
519 -545 -35535 61989 26695 -104897 7847 101881 -49414 -62285 60881 4572 -31493 39384
531 39384 -23018 -38518 82606 4440 -111290 37606 89572 -65055 -43106 44935 -11664
542 -11664 5572 37145 -62429 -20108 98271 -19654 -92468 53796 50493 -58681 -5254
553 -5254 19923 -20012 42711 16213 -87322 22065 103370 -51141 -70252 59092 17256
564 17256 -31305 21299 -23530 -26736 73900 -4013 -93985 49201 77900 -73124 -36653 53053
576 53053 -8722 -4814 19680 -60551 -5419 94634 -32211 -86990 62406 47461 -59526
587 -59526 794 21868 -24909 31424 9876 -75611 30452 86930 -63537 -56601 72592 16544
599 16544 -36137 17930 -20303 -19477 68408 -13152 -87531 53056 65744 -74901 -20604 62619
611 62619 -15734 -13628 25041 -44380 -2749 78940 -40809 -81863 68635 46271 -67557 -529
623 -529 35490 -24141 16547 19213 -57130 13087 67808 -51883 -51726 65153 17713 -46933 9068
636 9068 6666 -9204 37329 -10222 -57345 36868 45753 -53429 -18344 41820 -7943 -9852 14037
649 14037 -23579 8784 46689 -37731 -41007 58082 16397 -53168 8079 20610 -18723 19906
661 19906 6102 -46481 24854 49242 -51344 -26522 58124 -6786 -42039 23290 3652 -20684
673 -20684 30712 -3891 -46153 36067 39743 -52180 -13560 46370 -12807 -21776 20887 -11135
685 -11135 -10745 32379 -11845 -32498 35567 19756 -39533 1330 26822 -12975 -4061 7144 -18295
698 -18295 6823 24505 -22647 -15691 29946 1766 -20729 9632 4053 -8894 9894 -5450
710 -5450 -17836 18782 11143 -26598 1537 22456 -9126 -5745 10068 -9793 -365 16317 -14939
723 -14939 -13927 22814 1082 -21677 11511 11590 -12715 5023 7525 -14870 6131 14502 -19336
736 -19336 -7098 21245 -5615 -14848 13745 2751 -11140 10460 3314 -14241 8172 9761 -17222
749 -17222 -1951 15380 -7933 -8885 11257 -211 -6807 8903 770 -9570 6783 5232 -10703
762 -10703 -782 8310 -4151 -3895 5597 84 -2131 3635 -36 -2791 2083 1091 -3392 -1567 1005
777 1005 330 -1161 -1121 1463 2029 -1436 -130 2640 -1430 -2242 2092 -801 -3624 2283 1541 -4318 1593
794 1593 4876 -3193 -1504 5182 -1541 -4227 3239 735 -5470 1812 3489 -4315 -432 5672 -1605
809 -1605 -3018 4858 1101 -5077 1587 2669 -4360 -1104 4043 -1687 -2140 4424 1205 -3397 2423
824 2423 2724 -4143 -1028 2629 -2420 -3099 2646 785 -2838 1940 2698 -2319 12 2920 -1847 -2570
840 -2570 1728 -348 -3475 350 1862 -1771 -853 2908 302 -1733 1979 1484 -2524 -391 2997 -2028
856 -2028 -2293 3352 944 -3531 2334 3478 -3516 -61 4405 -3193 -2979 4875 -1591 -5891 5246
871 5246 3153 -7352 1641 6545 -5452 -1947 6460 -4205 -4446 7145 -2224 -8062 6809 4087
885 4087 -9368 2515 7938 -5627 -1191 5922 -4701 -1989 7609 -4751 -7017 8404 1771 -7629
899 -7629 3865 4235 -3882 2465 1972 -5752 4275 4566 -9291 -1086 8385 -3575 -4046 4717 -2820
914 -2820 592 8181 -7335 -6639 13348 -351 -14053 7120 6979 -10212 2983 4986 -10600 6735
928 6735 11608 -18562 -4638 22386 -6738 -17184 12981 3036 -11565 10611 749 -16288 14848
941 14848 11679 -24864 941 24889 -13088 -14069 15594 -2132 -6282 14259 -9211 -14432 24860
954 24860 6133 -28568 7818 20091 -15862 -4561 10728 -10618 3406 13676 -21078 -6534
966 -6534 31195 -6487 -27334 15995 11695 -14023 5251 -1276 -15478 19409 10358 -32490 3938
979 3938 31934 -17274 -17641 19782 -756 -6971 12360 -15183 -11204 34123 -1769 -39054 17137
992 17137 27341 -22465 -5398 13177 -12118 7909 15169 -30396 -2859 41208 -16349 -34551
1004 -34551 28513 15007 -22422 6075 1059 -15643 26085 8115 -44397 9513 43065 -26623
1016 -26623 -24777 29268 171 -13906 15746 -13259 -13419 37808 -4083 -47509 23612 36317
1028 36317 -32969 -13292 22623 -7568 3406 14546 -29884 -2900 44552 -16992 -39530 31726
1040 31726 20006 -28822 1007 8026 -9664 20742 2004 -40851 16613 42192 -31839 -25549
1052 -25549 31329 2804 -13296 10693 -14223 -6574 36981 -12602 -42944 33227 30033 -40374
1064 -40374 -8056 26286 -9388 2612 10858 -32628 4717 47207 -26421 -39798 40790 16972
1076 16972 -36057 6102 12864 -15512 17367 4763 -39369 18389 43240 -37886 -27544 41133
1088 41133 5063 -24191 10104 -4808 -8365 29947 -8740 -39131 29126 29678 -38541 -9550
1100 -9550 30482 -6180 -6662 7136 -19606 6752 33840 -25886 -30513 37673 13417 -32474 3929
1113 3929 11758 -9963 13088 -424 -29737 20068 29483 -36678 -15428 37972 -2200 -21642
1125 -21642 10967 -3521 -5166 25007 -12397 -31386 30523 21237 -37783 -2876 28584 -10834
1137 -10834 -6836 11364 -15412 3132 26937 -22964 -23153 35647 8612 -32993 6218 15570 -11473
1150 -11473 6548 2854 -21655 13918 23149 -28587 -11763 31967 -3235 -20865 11196 2118
1162 2118 -6927 14014 -7054 -20195 22405 14129 -28922 -1302 22384 -8716 -7678 8745 -8045
1175 -8045 1001 15940 -14819 -13177 23554 2785 -22572 6725 11601 -8979 2858 1958 -12523
1188 -12523 9965 12425 -19592 -4909 20612 -5516 -13052 9966 525 -5592 9529 -4760 -11757
1201 -11757 15741 6150 -20356 3510 15732 -9481 -4382 8888 -6387 -574 11853 -9786
1213 -9786 -8628 16835 664 -16409 7514 8963 -10334 1164 5446 -8095 2901 8934 -10910
1226 -10910 -3896 13429 -2606 -10108 6574 2694 -6052 3530 699 -5958 5033 3857 -8433
1239 -8433 446 7650 -3838 -3175 4045 -1001 -669 3260 -3378 -1865 5936 -534 -5127 3431 1749
1254 1749 -3455 1703 940 -3335 2502 2135 -5303 793 5244 -3641 -2222 4448 -947 -2803 3539
1269 3539 -669 -3517 3852 956 -5010 2096 3745 -4094 -617 3852 -2183 -1727 3248 -1055 -2804
1284 -2804 2792 512 -3345 1378 2336 -2659 -559 2414 -1176 -1140 1947 -443 -1636 1244 657 -1622
1300 -1622 486 1478 -719 -467 1487 124 -961 750 305 -1035 -74 812 -154 -717 618 284 -1012
1317 -1012 151 652 -620 -846 638 -54 -1236 334 615 -1063 -172 1334 -508 -827 1260 131
1333 131 -1308 639 791 -1759 -321 1572 -735 -1175 2098 397 -1636 1330 1264 -1925 238 2055
1349 2055 -1377 -1145 2001 -473 -1819 1770 1065 -1519 809 1237 -1779 105 1444 -1673 -1006 2130
1365 2130 -88 -1616 1239 510 -797 780 237 -1096 941 542 -1433 64 806 -819 137 269
1381 269 -917 1236 955 -2647 -201 2499 -1757 -1477 2331 -1053 -1225 2683 -1346 -2517 4322 634
1397 634 -5159 2187 3956 -4150 -640 3390 -3166 -157 4932 -4128 -3159 7294 -438 -7002 4491
1412 4491 3602 -6115 1065 3065 -5109 2171 5265 -7421 -1559 9891 -3071 -7308 6474 1855
1426 1855 -5461 3653 510 -5939 5828 3303 -9930 2021 10103 -6091 -4321 6712 -1226 -2123
1440 -2123 4821 -5393 -4134 10739 -715 -11365 6223 6898 -7357 227 3697 -4739 3933 4092
1454 4092 -11165 876 13521 -7264 -9834 10124 2101 -6410 5069 -2575 -6430 11769 1136
1467 1136 -16653 6627 13667 -12773 -5495 11837 -3589 -2832 7921 -9018 -4033 17871 -4682
1480 -4682 -19225 12624 11497 -15161 -725 8590 -7026 3829 7041 -15369 780 20271 -11073
1493 -11073 -16439 16194 5858 -12932 3433 1349 -6548 12387 1474 -20216 8486 18731
1505 18731 -15977 -9798 15030 -1263 -5653 6015 -8157 -2107 18576 -7382 -20125 16683
1517 16683 12858 -18455 -2310 9857 -5537 4285 3725 -17135 5380 21727 -16017 -15868 21498
1530 21498 4806 -16336 4770 2503 -6162 13164 -2109 -22168 14560 20787 -22306 -9864
1542 -9864 20924 -1940 -8734 6963 -7656 -2684 19747 -9995 -21835 21727 14212 -24173 -1689
1555 -1689 15641 -5824 679 4259 -16085 5844 22060 -18384 -17297 24636 5717 -19515 4943
1568 4943 6004 -6091 9814 -2406 -19641 15288 18270 -24566 -9005 23276 -2161 -11628 6490
1581 6490 -4251 -877 16286 -11084 -18636 21284 10738 -24936 33 16489 -6193 -1818 3440
1594 3440 -11868 7183 17849 -19692 -13183 25068 2765 -20211 5768 6641 -6278 8075 -2372
1607 -2372 -16086 15750 14393 -24746 -4988 23509 -5047 -12932 7831 -2586 -1846 14002 -10165
1620 -10165 -15355 21563 8156 -24713 2511 16749 -8892 -3619 6034 -8822 4823 14023 -16437
1633 -16437 -9819 23229 814 -19846 6484 8568 -7119 3515 -398 -11133 11287 10208 -19073
1646 -19073 -2210 19416 -4721 -11760 7016 267 -2412 7668 -7722 -8920 16410 3560 -18166
1659 -18166 3864 13010 -7645 -2885 4783 -6397 3664 8700 -13116 -4727 17471 -2591 -14427
1672 -14427 8218 6137 -7223 3491 275 -8361 8428 6370 -15189 -100 14991 -6267 -8535
1685 -8535 8313 282 -4032 6253 -3940 -6900 11255 2064 -13710 3674 10078 -6924 -3109
1698 -3109 5834 -3045 200 5791 -6851 -3225 10240 -2063 -9603 5438 4422 -5674 1166 1897
1712 1897 -4031 4388 3065 -8287 373 8118 -4681 -5004 5158 -108 -2600 3334 -1740 -2996
1726 -2996 6396 353 -7154 3087 4618 -5166 -966 3807 -2530 395 3349 -4167 -1259 6405 -2159
1741 -2159 -5010 4421 1425 -4386 1301 1519 -2995 2090 2352 -4410 703 4863 -2891 -2621 3859 -174
1757 -174 -2800 2073 -122 -2533 2489 793 -3298 1508 2892 -2679 -605 2345 -986 -1110 1397
1772 1397 -968 -1127 1914 -111 -1695 1419 917 -1291 231 761 -836 138 116 -1044 37 916 -701
1789 -701 -161 955 -309 -229 532 -574 -416 775 -221 -1041 862 210 -1381 596 772 -761 286
1806 286 892 -554 -359 810 -262 -1102 769 -152 -940 565 738 -675 343 763 -747 -506 903
1823 903 -223 -859 665 179 -790 635 677 -375 201 730 -417 -405 392 -256 -620 171 180 -280 258 418
1843 418 -60 -33 332 -70 -183 -131 -91 -152 -300 -240 249 -67 -343 300 188 -384 387 428 -641 -7 676 -843
1865 -843 -729 973 -299 -878 981 440 -971 821 899 -1391 359 1389 -1410 -893 1604 -482 -1288
1882 -1288 1833 -129 -1276 1594 591 -2472 900 1808 -2164 -643 1665 -1148 -746 2003 -1412
1897 -1412 -1120 2552 -374 -2763 1613 1008 -2624 626 1078 -1604 873 1495 -2576 393 3283 -2062
1913 -2062 -1863 2513 -533 -1693 1770 -870 -1554 3492 -88 -4037 2565 2864 -3770 -320 2858 -1783
1929 -1783 -260 2377 -3746 -1053 5655 -2532 -4799 5154 1845 -4688 1884 1736 -3275 2582 1971
1944 1971 -6449 1597 6755 -5075 -4139 6566 48 -4155 3209 -770 -2989 5434 -87 -7722 4248
1959 4248 6264 -7119 -1857 6432 -1961 -1471 3326 -4237 -786 7584 -3891 -7732 7376 3900
1973 3900 -7558 743 3808 -2789 2683 1675 -7576 3009 8259 -7917 -5388 8904 637 -5963
1987 -5963 3035 -396 -2131 6986 -1921 -9299 7279 7102 -10433 -2109 8381 -2734 -2074 4016
2001 4016 -5067 513 9718 -6843 -9099 11484 4025 -11448 1368 5361 -4202 2913 1600 -9173
2015 -9173 4612 10495 -11116 -6321 13254 -234 -9434 4216 1084 -3622 7277 -2803 -10506
2028 -10506 10070 8447 -13751 -2389 12076 -3440 -4574 4232 -4235 132 9588 -7699 -9089
2041 -9089 13834 4243 -13773 1679 7928 -3938 754 823 -7960 5785 9548 -12393 -5670 14523
2055 14523 -487 -10328 4217 2089 -2834 5860 -3745 -9390 11490 6736 -15751 -381 13269
2068 13269 -4456 -5267 4546 -3442 922 9047 -9186 -8073 15441 2224 -15425 3769 9291
2081 9291 -6216 183 2124 -7462 5978 8711 -13746 -4343 16596 -2231 -12326 6312 3567
2094 3567 -4420 4343 -2101 -8190 10403 5755 -15450 105 14053 -5026 -7240 5477 -1119
2107 -1119 -206 6403 -7484 -5898 13265 1522 -14258 3950 8874 -6097 -1101 2320 -4531 4993
2121 4993 5727 -11468 -2077 13967 -3509 -10600 6311 3397 -4495 3189 -2168 -5979 9254 2897
2135 2897 -13242 2406 11776 -6910 -5542 6114 -1243 -1140 4876 -6378 -4143 12032 -313
2148 -313 -12379 5451 7796 -6982 -860 3383 -3863 2981 4615 -9152 -1178 11601 -3555 -8984
2162 -8984 6602 3410 -5087 1838 70 -4391 5875 2472 -9660 1751 9034 -5276 -4850 5639
2176 5639 -125 -2079 3195 -3324 -2634 7385 -1180 -8171 4437 5323 -5430 -773 3182 -2339 1373
2191 1373 2626 -5654 168 7234 -3580 -5544 5226 1595 -3996 1944 66 -2427 4017 669
2205 669 -6245 2410 5628 -4891 -2530 4636 -872 -1678 2718 -2054 -1665 5029 -1102 -5346 3689
2220 3689 3149 -4708 -75 3321 -2267 57 2346 -3000 -533 4656 -2099 -3645 3808 1202 -3483
2235 -3483 988 1217 -1853 1505 1054 -3081 971 3099 -2696 -1803 2838 -237 -1647 1273 -487 -872
2251 -872 2070 -452 -2098 1871 1245 -2238 0 1394 -1006 -15 839 -1399 344 1795 -1529 -974
2267 -974 1901 -233 -1301 887 55 -978 1092 264 -1560 796 1520 -1548 -180 1421 -678 -777
2283 -777 1324 -393 -948 1049 -456 -1163 837 572 -1442 235 994 -782 -443 634 -348 -665 696
2300 696 -146 -741 950 346 -864 159 675 -437 -41 321 -187 51 506 -122 -78 143 286 -285 218
2319 218 122 -165 -205 -4 -214 -130 -1 -187 137 -136 12 215 -49 -194 9 4 -512 126 98 -257 -106 327
2341 327 -119 -398 359 -161 -725 474 309 -796 122 726 -295 -129 919 -265 -573 682 27 -741
2359 -741 282 338 -748 8 557 -613 62 957 -241 -446 732 -105 -825 480 186 -685 253 214 -799
2378 -799 437 572 -748 -208 591 -613 -207 577 -681 -103 1185 -647 -674 1224 71 -859 559
2395 559 43 -927 735 175 -1181 656 1170 -1278 -594 1439 -537 -384 1081 -984 -739 1744 -694
2412 -694 -2110 1741 1017 -2547 580 1690 -1339 297 1293 -1894 -340 2633 -1631 -1961 2772 511
2428 511 -2830 1218 1141 -1902 1435 945 -2770 1232 3095 -2800 -1483 3185 -504 -2025 1510 -434
2444 -434 -1378 2604 -563 -3204 2711 1969 -3517 -379 2645 -1422 -643 1644 -2139 277 3698 -2757
2460 -2757 -3042 4348 969 -3935 1240 1386 -1848 1779 313 -3715 2743 3680 -5051 -1264 5286 -1314
2476 -1314 -2957 2499 -854 -1380 3899 -1940 -4732 5386 2848 -6636 398 4535 -2865 -1065 2387
2491 2387 -3042 708 5050 -4324 -4097 7162 1148 -6435 2086 2831 -2790 1540 683 -4601 3233
2506 3233 4808 -6606 -2106 7374 -1258 -5049 2978 263 -1631 3672 -2435 -4737 6092 2915
2520 2915 -7888 483 6322 -2625 -1789 2481 -2334 1078 4871 -5488 -3671 8312 57 -7675
2534 -7675 2666 3845 -2961 1414 214 -4470 4427 3955 -8498 -1449 8884 -2437 -5635 4173
2548 4173 875 -1795 3872 -2528 -4793 7632 2067 -9583 1338 7579 -4261 -2903 3389 -2390
2562 -2390 858 4658 -5892 -3175 9612 -610 -9052 3722 4988 -4163 66 1348 -3664 4326
2576 4326 3940 -8362 -809 9327 -2741 -6655 4396 1409 -2802 2467 -2247 -3480 7222 1503
2590 1503 -9346 2404 7701 -4615 -3192 3763 -1447 525 3393 -5532 -2129 8974 -1310 -8069
2604 -8069 4544 4655 -4776 -154 1193 -3329 3724 2381 -7806 714 8931 -4112 -5929 5304
2618 5304 1357 -3293 2267 -1776 -3104 6102 744 -8490 2868 6952 -5185 -2951 4436 -966
2632 -966 -615 2864 -4187 -1734 7388 -2009 -7669 4412 4574 -5085 -170 2555 -2516 2397 1953 -5935
2648 -5935 603 6986 -3810 -5073 4940 1362 -3290 1738 -606 -1974 4463 -63 -6324 2909
2662 2909 5218 -4718 -2132 4042 -1005 -687 2095 -2975 -339 5503 -1923 -5594 4188 2783 -4778
2677 -4778 253 2290 -1815 1620 1680 -4187 1059 4961 -3536 -3371 4253 331 -3189 1556 51 -1847
2693 -1847 3197 337 -4502 2665 3961 -4047 -1395 3428 -1231 -1316 1492 -1637 -783 3614 -1061 -3615
2709 -3615 3195 1820 -3655 258 1804 -1348 388 1115 -2499 293 2908 -1954 -1686 2848 180
2724 180 -2181 1155 156 -1181 1364 -77 -2260 1419 1896 -2368 -425 2466 -756 -916 1185 -910
2740 -910 -469 1574 -843 -1779 1997 919 -2217 741 1396 -1280 23 823 -1261 214 1543 -1445
2756 -1445 -1033 2011 -112 -1427 1280 419 -1019 954 351 -1470 617 937 -1384 -325 1472 -662
2772 -662 -860 1187 -314 -650 1037 49 -1040 754 90 -1255 62 437 -447 -60 548 2 137 367
2790 367 -351 -440 795 -27 -733 0 -19 -448 335 289 -242 334 249 -252 5 216 -516 -315 290 -209 -112
2811 -112 172 -7 78 613 265 -531 336 -85 -611 187 288 -195 -78 214 -35 -70 623 -41 -210 501 -58
2832 -58 -466 59 175 -594 237 419 -346 128 705 58 -260 406 -235 -464 306 48 -473 238 185 -83 268
2853 268 521 -35 145 118 -242 -91 -76 -266 -426 158 118 31 404 271 -133 542 -128 -480 -106 209 -623
2874 -623 -25 175 -492 71 560 -438 -119 729 -186 -432 463 -18 -637 236 -20 -849 590 709 -759
2893 -759 172 1124 -395 -605 797 -256 -740 875 -528 -1009 1099 553 -1178 394 1053 -745 206
2910 206 538 -1172 -209 1063 -1012 -791 1411 109 -910 781 367 -673 352 191 -1427 647
2926 647 887 -1434 -287 1566 -451 -573 1299 -281 -290 1405 -780 -1732 1719 216 -2230 419 1637
2943 1637 -1305 235 684 -1398 388 2024 -1864 -1168 2482 -236 -2335 1334 865 -1258 1340 434
2959 434 -1929 1585 1640 -3224 -279 2814 -1335 -1687 1504 -518 -510 2090 -1000 -2012 2949 1024 -3466
2976 -3466 530 2399 -2182 -610 1112 -1798 445 2423 -2479 -1324 3902 -55 -3323 1435 1401
2991 1401 -2002 862 -105 -2504 2293 1723 -3825 273 4077 -1316 -2298 2368 -76 -951 1845 -1891
3007 -1891 -2222 4076 957 -4531 1430 3627 -2195 -656 1388 -1830 863 2192 -3763 -1520 5118
3022 5118 -900 -4158 2608 2203 -2175 1010 279 -2569 2720 1744 -5308 -172 5317 -2239 -2991 3123
3038 3123 461 -1134 2053 -1591 -2585 4403 371 -5845 1504 4218 -2862 -1350 2155 -1239 845
3053 845 2255 -3619 -1086 5412 -1192 -5060 2940 2265 -2735 496 561 -1877 3115 1551 -5010 697
3069 697 5419 -3008 -3688 2971 250 -1514 1687 -1646 -1777 4808 -68 -5326 2397 4057 -3901 -1681
3085 -1681 2559 -1393 356 2082 -3542 -560 5696 -1642 -4978 3583 2508 -3715 337 987 -1636
3100 -1636 2479 1234 -4801 1193 5519 -3274 -3536 3703 348 -2427 1270 -1264 -1555 3942 -277
3115 -277 -5160 2905 4260 -3608 -1218 2956 -769 -156 1525 -3117 -420 4482 -1935 -4107 3867
3130 3867 2243 -3458 518 1025 -1679 1638 580 -4148 1302 4111 -3182 -2630 4044 299 -2288
3145 -2288 1300 -391 -1151 2836 -910 -4274 2377 2853 -3849 -756 3040 -768 -529 1482 -2092 -34
3161 -34 3485 -2189 -3505 3335 1297 -3384 677 1826 -1190 1265 914 -2606 1329 3129 -3065 -2154
3177 -2154 3201 -35 -2227 1111 351 -802 2388 -305 -2888 2148 2142 -3182 -970 2306 -986 -919
3193 -919 1169 -1031 67 2428 -1523 -1984 2415 968 -2810 289 1233 -1136 478 767 -1805 1006
3209 1006 1970 -1826 -823 2477 -306 -1781 877 74 -1200 1160 -254 -1775 1679 1314 -2261 224
3225 224 2361 -843 -1057 881 -910 -174 1468 -857 -1383 1857 634 -1539 595 1064 -800 41
3241 41 648 -1099 386 1139 -1259 -727 1619 -250 -1163 833 285 -658 638 -65 -1461 744 529
3258 529 -1177 94 1142 -495 -371 548 -127 -263 371 -572 -959 630 -164 -1218 399 576 -422 240
3276 240 464 -523 154 395 -861 -686 852 -462 -685 380 277 -417 449 300 -366 287 372 -905 18
3295 18 547 -616 -531 470 -276 -122 489 -244 -282 369 28 -679 45 -18 -488 -318 323 -206 -17 552 -332
3316 -332 -21 409 -75 -213 -43 5 -443 -265 132 -82 229 177 98 126 420 -92 -21 207 -120 -51 228 -157
3338 -157 -113 454 281 -140 445 75 287 -108 9 -399 -240 297 -417 -216 283 -20 106 398 20 15 182
3359 182 168 -478 226 82 -488 137 277 -170 18 703 -75 -38 404 -217 -443 223 -45 -373 277 83 -368
3380 -368 520 601 -154 90 534 -190 -418 261 -100 -152 145 -156 -247 558 328 -261 331 142 -251 -51 134
3401 134 -706 7 426 -402 -51 1115 36 -540 676 20 -739 205 -210 -534 479 255 -960 42
3419 42 1100 -413 -73 782 68 -370 641 -483 -773 909 90 -1058 464 1017 -812 24 864 -685
3437 -685 144 820 -1073 -341 1347 -222 -1109 773 499 -493 795 396 -944 986 874 -1718 126
3454 126 1479 -932 -699 865 -176 -303 1175 -602 -900 1651 177 -1843 426 1066 -967 58
3470 58 578 -758 358 1093 -1555 -102 2298 -692 -1716 1312 562 -1172 712 -12 -1339 1329
3486 1329 743 -2066 593 2330 -1279 -1101 1226 -590 -543 1304 -1144 -897 2443 161 -2509 1331
3502 1331 1731 -1574 -336 774 -1113 298 1304 -1976 -322 3135 -702 -2147 1810 1005 -1498
3517 -1498 586 -115 -1316 1703 561 -2675 198 2697 -1474 -1229 2023 101 -565 1052 -1212 -975
3533 -975 2601 -393 -3150 1482 2103 -1922 -212 1286 -572 439 1067 -2550 -581 2952 -1131 -3019
3549 -3019 1968 871 -1630 1020 375 -1051 2026 554 -3337 862 2803 -2340 -2042 2280 25
3564 25 -809 1241 -1046 -915 2762 -396 -3264 1962 2081 -2891 -747 1706 -762 253 1123 -1943
3580 -1943 102 3257 -1758 -2704 2331 839 -2318 479 457 -1108 1439 650 -2842 1109 2773 -2496
3596 -2496 -1593 2577 26 -1417 616 -596 -591 2366 -749 -2737 2422 2190 -2704 -505 1836 -667
3612 -667 -397 833 -1913 -140 2873 -1716 -2427 2948 1209 -2233 272 540 -1016 854 373 -2429
3628 -2429 1087 2427 -2214 -1156 2642 77 -1689 614 -357 -755 1838 -826 -2422 1895 1535 -2571
3644 -2571 -7 2169 -471 -442 865 -1489 88 2159 -1687 -2135 2339 651 -2132 648 1077 -806
3660 -806 689 4 -1779 810 1785 -2249 -950 2319 -212 -1442 886 63 -482 1449 -533 -1643
3676 -1643 1461 1172 -2252 -139 1401 -1028 -632 899 -653 321 1411 -1141 -1472 2015 181 -1884
3692 -1884 452 993 -756 428 471 -1223 889 1307 -1575 -660 1803 -650 -1340 882 -120 -493 655
3709 655 76 -1024 1005 763 -1670 -130 1402 -864 -468 708 -395 -359 935 -542 -888 1346 -22
3726 -22 -1404 544 665 -870 -65 405 -817 34 810 -975 -328 1091 -243 -911 578 285 -513 351
3744 351 -77 -730 805 233 -1056 275 1040 -368 -256 396 -328 -40 296 -556 -391 732 -208 -815
3762 -815 371 468 -323 20 327 -403 77 486 -660 -224 696 -444 -410 632 7 -247 240 29 -492
3781 -492 310 117 -855 115 437 -397 -459 740 115 -218 216 114 -235 299 -127 -168 79 193 -69 0 156
3802 156 118 -40 314 -281 -133 366 -130 149 382 -59 -295 -10 221 122 196 228 -117 -9 212 -273 -247 110
3824 110 -218 -142 71 1 -12 397 110 -135 91 113 -419 -215 85 -365 15 58 -211 -104 449 -100 -89 172
3846 172 -24 -106 -161 210 -253 275 155 -148 -3 212 60 17 151 -63 -21 126 48 -135 -105 347 0 29
3868 29 407 78 82 110 -197 175 371 -327 -306 328 -118 -255 196 -62 18 47 184 -277 119 37 -365 -108 260
3891 260 -234 79 275 -270 39 559 223 -170 290 -75 -449 18 -33 -477 174 325 -162 278 563 -368
3911 -368 -253 388 -176 -507 209 -117 -517 630 -15 -440 444 452 -169 203 250 -375 211 161 -334 -352 572
3932 572 -217 -311 353 437 -408 329 -136 -508 276 52 -795 108 577 -440 -498 443 -469 -488 680 -437
3952 -437 -465 919 -129 -872 558 607 -524 77 531 -192 66 347 -605 -152 925 -457 -797 905
3970 905 376 -611 592 145 -595 807 294 -970 338 1037 -977 -445 856 -254 -438 697 -496
3987 -496 -425 1082 244 -1311 661 760 -952 -450 423 -895 471 597 -1033 247 1594 -442 -1028
4004 -1028 1005 457 -800 265 52 -705 1003 180 -1410 394 1420 -888 -886 1038 -214 -529 733
4021 733 -697 -456 1439 -92 -1594 1106 1064 -1241 -14 855 -608 27 669 -1176 -101 1725 -867
4038 -867 -1167 1450 637 -1058 626 165 -687 932 43 -1557 677 1278 -1285 -559 1246 -239 -560
4055 -560 651 -899 -293 1379 -633 -1435 1380 1247 -1673 -323 1202 -522 134 386 -913 87
4071 87 1647 -987 -1373 1564 559 -1383 393 145 -135 824 250 -1550 807 1424 -1714 -663 1360
4088 1360 -377 -666 687 -448 -304 1379 -568 -1765 1375 936 -1637 28 967 -713 -201 474
4104 474 -670 222 1818 -1225 -1222 1575 492 -1572 351 500 -441 833 29 -1375 618 1524 -1426
4121 -1426 -541 1484 -191 -997 701 93 -466 1007 -474 -1122 1315 869 -1387 52 1149 -753
4137 -753 -2 663 -640 12 1135 -1100 -1033 1527 96 -1512 722 385 -532 584 -11 -1081 786
4154 786 960 -1697 -448 1529 -408 -878 773 126 -391 780 -456 -839 1151 490 -1958 118 1154
4171 1154 -462 -377 287 -652 70 867 -895 -675 1204 386 -1233 550 820 -770 386 115 -654 646
4189 646 586 -1113 -248 1121 -286 -802 486 14 -206 613 -115 -647 618 244 -1323 43 682 -609
4207 -609 -209 336 -219 104 841 -602 -223 1096 21 -707 470 315 -524 153 -9 -543 517 304
4225 304 -750 -37 888 -376 -606 688 111 -299 231 -130 -537 477 421 -813 480 424 -413 -178 604
4244 604 -1 61 516 -435 -227 702 -21 -524 587 284 -351 120 57 -54 55 -12 -231 6 394 -214 -272
4265 -272 384 226 -392 124 363 -72 273 219 -355 131 431 -376 -233 283 -150 -79 304 -359 -83 327 33
4286 33 -238 321 161 -269 -51 257 -12 66 398 -410 86 293 -205 -196 363 4 -342 138 19 -193 19
4307 19 29 -91 -47 185 -282 -171 223 -212 -7 264 -91 -105 -1 353 -97 212 163 -67 -82 185 -337 104
4329 104 88 -31 137 326 55 10 283 -245 -140 -77 217 -265 -10 98 -201 -46 201 -195 27 -120 -25
4350 -25 100 349 -154 -121 294 -169 -421 149 -37 -136 -21 125 -66 46 195 -168 -36 172 123 -283 80
4371 80 -382 -92 296 108 -286 55 207 -39 -162 81 -85 30 21 -235 -4 306 -203 -83 214 -278 -112
4392 -112 77 -6 -206 179 180 -390 228 267 -31 -151 45 41 -114 207 237 -197 66 66 -163 263 177 -105 -174 134
4416 134 -188 93 234 -231 -128 223 -294 -107 308 85 -332 126 20 -153 405 -32 -203 99 393 -271
4436 -271 -351 324 -435 16 178 -151 -320 452 -89 -326 181 320 -205 -130 155 -313 -85 288 -154 -24 490
4457 490 -280 -589 300 83 -570 312 -12 -265 134 -43 -604 543 225 -603 -114 651 -78 -300 464 -288
4477 -288 -289 562 -229 -648 507 468 -886 -35 226 -330 3 3 -611 211 454 -468 -516 697 133 -350 91
4498 91 132 -261 471 -2 -547 366 638 -601 -262 590 -504 -199 338 -417 -206 558 -426 -478 564 402
4518 402 -603 141 341 -206 116 337 -726 -81 1000 -552 -615 1093 329 -438 240 257 -358 449 -5
4537 -5 -866 633 696 -691 -104 780 -109 -241 464 -281 -93 806 -196 -738 987 334 -864 320 623
4556 623 -311 168 309 -479 8 957 -643 -553 841 103 -872 304 231 -572 629 -9 -929 502 502 -1266
4576 -1266 -70 1036 -485 -534 502 -231 -139 701 -516 -1026 1075 553 -972 83 739 -310 -66
4593 -66 156 -529 216 624 -801 -408 970 118 -1068 483 360 -187 418 131 -408 226 539 -1111 -67
4612 -67 484 -306 -526 420 -135 -156 530 -576 -797 881 312 -910 -12 624 -523 70 355 -487 244
4631 244 684 -738 -126 1132 -196 -795 422 187 -303 -55 -62 -512 772 285 -942 158 911 -265
4649 -265 -742 582 -138 -238 519 -393 -326 800 247 -836 208 523 -632 68 375 -382 236 212 -605
4668 -605 -266 732 -368 -836 333 43 -469 169 121 -560 436 430 -550 240 662 -402 -421 556 246 -107
4688 -107 221 -136 -323 804 295 -741 462 515 -300 -50 275 -310 9 549 -373 5 470 -12 -682
4707 -682 400 221 -427 -107 108 -165 37 417 -563 156 484 -342 -126 321 -31 -188 327 -146 -219 591
4727 591 20 -746 204 193 -413 -308 125 -74 83 123 -558 124 412 6 -338 316 234 -184 116 169 -38
4748 -38 410 117 -142 100 650 -501 -245 381 -117 -264 86 -134 -152 177 12 -388 -27 197 -125 181
4768 181 427 -212 -161 252 -438 -115 462 -128 -349 270 257 -229 -106 -78 -145 280 287 -147 170 176 -188 -127 37
4791 37 116 -77 138 -88 -82 17 -217 -256 264 168 -263 -64 383 177 -48 65 -40 227 -27 -306 -278 81 11
4814 11 -118 -22 88 -180 186 -87 -354 131 276 -224 -84 141 205 43 125 -107 -72 42 138 -160 69 130
4836 130 -264 98 188 -290 -300 171 40 -24 93 16 -276 39 -52 14 100 79 -160 -59 113 -233 186 -120 -175
4859 -175 -127 149 55 -93 283 -183 -157 120 121 109 -31 48 -103 -18 150 154 79 108 -172 157 82 -78 103 -102
4883 -102 81 53 233 176 -261 16 260 -9 46 332 -192 -123 48 -341 -397 263 55 -244 -346 93 -13 22
4905 22 70 -5 111 -16 -195 92 207 -10 -50 293 14 -153 146 77 -141 236 50 -280 119 20 -492 -227
4927 -227 206 110 -111 317 58 229 421 71 -89 157 155 -302 83 -97 -130 94 168 -158 131 189 -197 -207
4949 -207 197 60 -49 192 -323 -289 43 -78 -353 477 204 -174 65 171 -150 -276 379 -300 149 282
4969 282 -246 -138 543 115 -329 44 280 -23 237 288 -269 154 431 -290 15 428 -39 -272 -60 115
4989 115 -167 416 -123 -199 144 211 -406 -49 234 -339 -55 216 -343 258 439 -269 -341 558 -20 -465 97
5010 97 231 -209 89 104 -217 579 403 -533 -61 416 2 -107 368 48 -268 372 171 -357 489 25 -495
5031 -495 62 522 -70 23 149 -272 158 343 -318 -358 404 49 -610 271 118 -246 138 58 -407 275 362
5052 362 -587 -188 564 -146 -423 84 112 68 319 -291 -372 491 322 -540 -101 730 -330 -112 296 -144 121
5073 121 512 -333 -362 486 234 -488 174 173 -270 104 8 -546 -4 372 -552 -50 571 -141 -298 402 -11
5094 -11 -326 121 -127 -70 165 55 -659 173 302 -329 -278 294 -107 -310 182 -329 -415 617 -149 -530 372
5115 372 369 -209 54 134 -349 -62 387 -626 -174 455 -315 -576 514 153 -71 119 -2 38 464 8 -451
5136 -451 -174 724 -135 -16 382 9 -178 262 -295 -105 246 45 -459 146 411 -354 215 270 -70 -26 153
5157 153 -311 85 298 -236 -427 393 -42 -383 319 -79 -263 106 375 -522 361 492 -367 -227 89 -6
5177 -6 10 179 -136 -92 410 116 -412 419 203 -502 60 71 -344 94 196 -79 78 172 -258 -257 471 97 -360
5200 -360 38 115 -156 266 45 -297 256 432 -454 -124 331 70 -226 224 -16 -217 96 -182 -450 76
5220 76 363 -148 -16 238 22 -90 207 -485 -150 255 -44 -138 223 154 -134 201 25 -156 108 27 -168
5241 -168 269 113 -96 -248 170 -139 105 -27 -27 71 252 -221 -548 187 -86 -137 121 72 79 -168 193 -143
5263 -143 171 148 -257 -124 397 35 -207 -274 159 -167 42 124 -80 -3 198 -95 -162 -48 -17 -231 164 57
5285 57 71 62 -114 97 130 -66 -325 100 140 3 59 117 -75 -124 -17 -91 -49 213 140 -150 194 -61 6 -10 -87
5310 -87 6 -128 95 -157 143 148 -36 -49 216 12 -269 -115 -77 -246 120 167 -134 -91 221 21 -58 144 50
5333 50 104 310 -197 33 -46 -268 -100 33 -39 -318 76 169 79 75 126 -223 -297 36 -257 0 -72 -169 -180 21
5357 21 24 -177 -124 -65 -140 109 -25 -95 26 94 -21 25 364 -152 -254 94 36 -199 140 15 -71 99 12 -87
5381 -87 -129 -95 -139 138 174 -82 125 342 74 201 161 97 -132 118 89 -116 -9 -82 86 -148 59 -152 19
5404 19 381 -34 67 9 39 -169 235 -18 -168 -8 -3 -53 -100 174 -93 46 -91 -213 -210 19 -50 -11 147 -27
5428 -27 -167 111 43 -177 210 63 -224 -70 182 -62 -11 -71 -338 -191 326 46 -142 95 56 -259 133 123
5450 123 -132 -197 118 99 50 103 -157 -165 -142 -2 -164 52 69 -193 -71 18 45 117 299 -61 139 67 -133 -154
5474 -154 238 219 -277 279 6 4 363 -26 -189 92 301 -246 35 17 1 -78 162 9 142 256 19 30
5496 30 257 235 -234 223 84 -364 199 40 -288 298 415 -285 26 369 -131 -221 191 147 -292 97 -141
5517 -141 -245 -30 -281 -345 128 312 -125 -160 106 -172 -76 246 -151 -140 314 -48 -81 126 -379 -352 26 178
5539 178 -6 70 118 -377 117 415 -229 -480 17 109 -213 159 -337 -269 351 87 -364 154 27 -184 -72
5560 -72 -175 -104 142 8 18 117 444 -83 -382 220 -23 -233 2 -22 -288 266 141 -285 -76 297 -264 -68
5582 -68 540 63 -7 3 -302 -128 273 54 -716 124 316 77 -237 51 131 -133 223 -447 109 273 -85
5603 -85 -393 82 288 -304 171 -38 49 215 148 -379 183 354 84 -219 359 39 -49 188 -107 -204 489 162
5625 162 -380 25 453 -380 -88 269 -104 -67 103 -46 118 336 -99 -483 175 361 91 181 33 18 135
5646 135 206 -74 89 333 -226 -277 209 -99 -149 346 80 -332 304 -176 -416 16 283 -107 229 200 -129
5667 -129 -72 79 -276 -58 242 3 -121 215 196 -381 59 268 110 256 -32 -159 55 334 -24 -176 166
5688 166 -1 -198 78 172 -150 59 30 -187 19 165 -101 -25 25 -81 -126 -71 -115 -300 271 160 -196 170
5710 170 -222 86 212 44 -56 -121 203 -131 85 372 -448 22 -74 -109 -154 -75 60 -207 -5 207 -90 158
5732 158 78 -263 -89 -12 194 -166 240 51 -21 164 36 -242 407 147 -162 -2 115 193 398 202 95
5753 95 121 186 -1 -142 127 -230 -68 168 94 -80 215 86 -32 -35 77 -309 -230 151 -17 -206 -73 160
5775 160 -209 -23 -117 -220 -13 -85 -29 -84 189 -196 112 -48 -97 138 182 17 50 232 -173 -159 -96 117 7
5798 7 165 -82 -253 -256 57 -240 177 107 181 -100 -1 -280 -152 147 181 -99 48 43 -85 205 -189 -95 -49 153
5822 153 -55 -180 -15 -154 -191 -33 -113 68 100 120 -90 -24 41 98 119 325 -91 148 71 -97 55 57 -47 -80
5846 -80 193 176 -26 -69 -121 -131 184 -230 -7 73 -142 -320 -19 239 -186 -85 28 152 104 -47 149 -95
5868 -95 114 -113 -134 241 80 220 253 136 -226 129 -210 28 0 -116 -88 -66 59 27 -18 -12 29 30 70 145 -219
5893 -219 -62 48 -318 43 57 26 90 153 97 -145 66 44 -260 -153 -72 40 -4 173 188 -23 133 -121 121
5916 121 137 -77 -38 86 23 -105 151 -124 21 -153 -198 -185 50 -42 -105 -148 163 -251 11 62 156 137 53 241
5940 241 33 -199 349 54 13 -99 -38 207 55 -110 55 159 -229 -116 337 -6 -134 116 -29 -27 -30 136
5962 136 -266 127 180 -197 33 27 -151 -52 106 -16 -31 242 93 -213 146 108 -93 71 111 -1 -113 284
5984 284 -38 -58 160 37 -288 183 9 -209 238 41 -50 261 160 -241 -93 90 -73 -116 312 221 -148
6005 -148 199 44 5 372 152 -161 -20 170 6 -50 353 -181 71 467 -131 -111 295 -408 -213 73 54
6026 54 -110 142 -51 -226 221 -2 -184 -91 111 158 -180 -44 -89 -183 91 -201 -122 265 50 -183 140 208
6048 208 -220 -201 342 77 -12 -164 -209 62 311 -160 -226 67 188 -78 -4 84 -370 -193 -159 -181 -159 126 -534
6071 -534 -191 45 -87 79 115 -43 -138 247 -117 -242 -2 353 -243 -78 169 -265 343 179 -54 11 158
6092 158 -87 -168 224 -59 -55 -48 100 -140 109 25 -201 -94 9 -228 -136 137 49 -147 480 -74 88 14 -48
6115 -48 -234 211 232 -384 -56 250 8 87 162 -210 62 324 -180 -54 418 168 -271 151 214 -95 32 -21
6137 -21 -269 351 220 -133 -3 254 -214 -227 121 -188 30 -153 -225 -79 183 268 -128 269 34 -66 61
6158 61 -15 -253 196 134 -222 188 187 -81 -132 153 32 -133 216 36 -250 314 -3 -245 -5 388 147 -150
6180 -150 112 -228 -111 169 -162 -79 520 159 -36 -81 28 97 -262 257 -98 237 221 -193 -289 259 64 -11
6202 -11 52 97 16 -90 100 -86 3 187 -229 -140 51 -233 -160 232 -47 166 259 -155 -67 -193 40 -372 -44
6225 -44 162 -76 -125 66 -10 230 5 22 -315 205 -53 -37 93 4 -138 -65 -30 66 188 -23 25 22 90 -37
6249 -37 -244 -120 349 286 -67 83 -30 24 -15 29 -27 247 -3 33 -95 246 -79 -167 -69 -30 231 77 -177
6272 -177 -42 166 17 -196 221 -130 -118 312 49 118 146 -31 42 118 111 -36 136 -40 192 94 123 -300 42
6295 42 -20 -262 -119 74 23 190 74 63 -22 47 -3 -256 315 -161 -204 228 -110 73 -150 183 -307 122 90
6318 90 -14 -110 15 -47 75 192 -61 -9 223 169 -98 93 -83 20 -129 -22 -96 -110 212 81 15 3 219
6341 219 -3 201 53 -37 107 149 -33 -56 131 58 91 -105 -6 162 -71 4 -54 -236 -96 56 39 69 104 -321
6365 -321 -114 -157 -37 -286 68 -208 -150 92 -203 -53 81 72 89 -143 -146 -122 49 -117 -33 230 13 -163 95
6388 95 -124 148 271 -58 -2 6 160 72 -248 266 -85 -136 28 -27 -141 -24 47 61 -150 47 61 71 -214 -123
6412 -123 -124 -217 -29 1 163 -117 -111 -114 78 21 -233 -147 -34 135 204 -110 53 -55 -129 279 44 -80 -78 -97 -162
6437 -162 267 -19 180 215 21 2 -34 273 184 40 159 207 -141 113 11 -143 262 89 18 -83 140 -58
6459 -58 -200 183 -257 25 259 79 79 51 19 -380 -111 295 -131 124 38 43 161 -64 172 -114 134 77 -140
6482 -140 -26 6 125 -34 -136 3 217 -25 -222 -140 129 194 -45 162 132 -100 -5 30 -80 170 -35 5
6504 5 -82 134 -124 71 62 47 154 140 -221 134 -107 43 32 44 142 92 130 284 -128 145 213 -265 128 25
6528 25 -201 -79 -171 -105 -74 3 20 -255 233 101 -36 -8 2 -100 -63 186 0 -85 238 -46 -58 113 22 -68
6552 -68 4 25 -112 -13 1 -163 275 163 -118 -58 103 -82 -222 -43 -51 -173 131 9 -98 146 31 -28 104
6575 104 96 -94 -32 -47 20 273 317 75 25 -79 -101 -135 193 -84 -151 -18 329 -122 -189 46 -119 39 125 -54
6599 -54 -174 151 -71 -35 28 -16 -162 284 166 -122 77 2 8 -47 150 -258 -269 151 -150 44 189 1 -403
6622 -403 157 198 -280 -116 68 35 186 221 -73 -59 125 70 -222 43 14 28 -47 2 -95 102 -31 56 -5 -64
6646 -64 -113 -159 -9 -149 81 126 54 5 63 -52 50 32 -3 -160 -135 105 -13 -122 66 -92 -188 -41 -222 -121
6670 -121 10 -31 101 139 -31 -17 281 -62 -116 188 78 22 -207 44 82 138 197 -52 -85 93 -70 -201 -24
6693 -24 139 -24 136 -115 -181 -9 178 -189 -150 134 100 -3 133 -85 1 31 38 -11 -58 155 -443 102 -92
6716 -92 -153 56 24 126 138 54 -205 -281 43 -36 -84 123 -145 -25 -78 20 29 -266 110 -25 68 54 -150 -152 -77 -5
6742 -5 -105 114 -65 158 140 -123 -160 85 86 -181 -177 -126 -173 4 -6 15 -151 131 -62 -31 89 6 -174 60 232
6767 232 27 -17 -40 81 -51 152 125 -108 7 -78 -171 17 17 163 105 94 -20 45 255 251 142 -14 -92 229
6791 229 -20 -32 42 31 -158 -203 249 148 -97 -54 52 -21 167 -61 66 -87 -28 152 -19 59 -50 -24 -133
6814 -133 13 -74 21 -323 13 146 -14 -124 -110 -148 -86 -9 -65 77 18 -212 34 -16 44 -31 -15 -125 220 140
6838 140 13 -255 -95 -233 -3 210 -223 -58 96 -131 83 112 142 8 66 242 3 45 7 98 -29 49
6860 49 -20 161 -372 5 -115 -24 24 139 11 -59 39 -143 -31 -22 -46 -84 110 -103 -120 -7 121 -31 -136 -42
6884 -42 246 -68 -189 -203 26 -2 69 4 143 -44 -127 -212 37 73 -110 -19 4 301 49 -115 -110 55 -61 92
6908 92 302 1 67 154 -62 18 -362 -83 -64 62 -50 20 -88 108 246 -295 124 -127 157 -178 165 48
6930 48 -272 7 -60 75 74 -110 142 -284 -31 31 87 -85 180 205 115 20 -46 110 31 -148 -47 -46 -95 -78 -110
6955 -110 -115 84 16 -13 -213 -199 26 45 -85 -109 -19 54 -91 -102 242 -194 -1 -80 103 105 43 -75 -434 -122 -56
6980 -56 -61 -86 39 -4 147 -95 -219 213 -2 -127 5 69 -59 -157 128 -136 130 222 253 -292 -200 127 -294
7003 -294 62 -122 -49 64 -80 212 12 -96 -113 -63 267 111 -276 -45 -191 -299 62 23 -59 40 -162 171
7025 171 21 270 -145 -309 22 37 -201 34 -5 -17 -176 -181 -33 -162 -24 -152 -26 114 213 132 -279 6
7047 6 -128 114 315 -126 8 340 -57 -155 -5 -85 0 53 65 -94 -110 188 -123 -92 -62 -231 -73 101 -187
7070 -187 147 -109 -15 -21 -39 -99 -72 -45 117 224 80 17 -122 21 117 66 -33 15 133 87 -277 210 49 -102
7094 -102 -214 -226 -27 -89 4 -76 41 97 308 -20 -52 129 -62 35 -222 334 -168 -33 345 12 -102 -178 -66
7117 -66 20 47 -86 18 -72 353 -118 -198 120 -174 -1 65 234 -25 56 131 -250 218 138 134 139 415 -136 -143 -5
7142 -5 -67 -68 146 -115 -109 29 236 2 145 -395 22 -67 67 -93 -65 325 -173 -91 -91 22 96 187 -158 -201 -145
7167 -145 44 -60 -73 188 -142 11 -5 -240 -147 -41 -254 -136 216 -89 -66 46 256 -136 128 -187 -145 167
7189 167 137 -109 91 -9 -45 -44 24 136 -73 109 89 -113 94 -97 -139 -29 182 -61 -131 -103 21 -127 95
7212 95 -15 -73 -113 -4 -205 100 46 -82 17 351 -31 227 -56 -2 60 11 -290 127 135 -101 96 -77 -132 91
7236 91 -131 43 108 -37 -3 -161 -53 67 -246 232 -78 118 45 0 -75 -199 253 84 143 84 64 -113 39
7259 39 -59 -29 81 187 14 -247 22 -217 -15 -89 42 -7 -319 69 138 -7 -94 4 -86 -20 -137 103 35 -76
7283 -76 -41 -2 -132 67 313 -13 43 84 168 143 -121 40 -50 110 -47 150 124 -19 -173 -75 -6 64 -64 -54
7307 -54 -8 14 -37 -45 54 123 97 -112 -84 72 -320 4 104 -19 7 142 -67 -187 126 56 -6 -66 18 78 89 145
7333 145 -63 49 -233 -79 12 100 107 53 -106 -125 -117 -89 -46 -64 4 65 22 -11 63 237 27 219 36 -66 -33 24
7359 24 -7 188 67 -147 10 121 160 46 -212 -137 191 23 36 50 213 -23 -209 2 -139 173 54 -45
7381 -45 -113 -30 214 -53 -160 -59 -99 -67 58 -23 -182 -128 -15 -129 34 28 -92 88 8 267 29 -53 -173 147
7405 147 89 -222 -156 -146 11 58 30 198 -265 71 -52 -68 -266 21 26 17 71 29 -256 201 123 6 120 4
7429 4 73 167 102 -190 26 -32 -97 -136 -42 -55 -138 29 -39 -106 -37 71 94 -65 1 -64 51 -56 -127 -85 -90 -207 -52
7456 -52 75 -93 -123 -50 17 131 -44 3 -2 228 53 -193 -26 -178 -30 159 -17 -375 -102 -169 -43 -111 -130
7479 -130 -74 -197 145 -130 4 180 118 -133 45 -151 -74 110 -119 112 -19 305 -48 52 -122 48 150
7500 150 126 -132 -67 -65 -63 -180 173 -29 -133 61 -45 -41 -17 3 -214 24 9 88 -54 -201 -146 224 -126 -88 -44
7525 -44 84 68 -142 -7 32 -123 -218 -30 37 36 44 123 -248 -186 26 -105 90 176 -182 -134 -58 80 129 81 -153
7550 -153 -97 43 -105 -139 -152 -10 -91 -129 39 -31 103 112 204 100 151 21 -144 -62 -177 -131 71 82 -26 9 260
7575 260 -132 -59 105 -115 70 -132 -65 120 -52 -61 -84 16 212 87 -17 -38 90 -152 204 -212 91 -87
7597 -87 -28 22 -158 256 60 148 -28 -248 -94 -171 -57 -1 102 -42 51 -94 -108 -86 78 -284 164 13 -55
7620 -55 143 35 163 -177 77 -137 -80 -81 132 -133 64 -198 -187 -106 -21 -41 -170 216 8 15 -49 5 -47 205
7644 205 -52 -188 84 257 49 -183 62 110 54 187 31 378 221 -316 -104 51 -3 -87 139 -52 -88 214
7666 214 -102 -198 -66 69 167 14 126 -252 -180 144 -164 53 93 54 74 -61 158 -299 -20 -37 -11 98 -36
7689 -36 6 -83 -5 -243 -228 131 100 -156 156 16 -17 -126 85 55 143 117 -285 8 113 135 54 67 90 -168 -27
7714 -27 -222 -24 129 -167 -60 -70 88 166 132 -23 -146 -83 7 -48 33 301 -21 64 29 2 -126 98 -63 -222
7738 -222 -76 -78 76 -167 31 42 138 -100 -77 -215 29 83 180 74 134 -323 -38 69 -129 252 81 42 47 54
7762 54 -199 65 65 -39 48 82 188 -63 5 128 174 -95 16 -146 45 233 65 -61 -26 -49 -438 -54 -46 70
7786 70 -43 -38 -244 260 70 -72 -87 -214 94 44 27 -95 -171 170 -137 -169 160 -76 -160 -79 -64 -199 158 -96
7810 -96 60 -143 60 -188 -56 38 -132 85 -62 215 272 134 51 -117 -21 -90 -136 105 307 -85 152 -288
7832 -288 77 233 117 -71 -87 88 143 -84 170 -149 -155 -194 -69 23 62 6 124 54 158 124 63 188 69 -23
7856 -23 -10 91 -250 241 88 -37 -93 9 -34 -19 66 175 -401 -10 -45 -244 66 108 17 184 -62 0 306
7879 306 36 -98 -85 -63 -52 122 175 -131 -65 97 -57 -72 73 -104 -68 101 -25 -64 -117 128 200 54 -2 -191
7903 -191 -43 87 38 64 51 33 -244 -31 -198 -90 -262 -6 98 203 -63 -53 -132 217 10 -9 287 91
7925 91 136 -16 224 271 41 154 -82 179 -34 163 104 117 6 9 201 -187 64 -147 169 -151 -41 -145
7947 -145 -88 29 18 12 46 -52 66 89 -54 -101 -207 -306 78 68 113 71 14 258 -151 34 -123 -196 177 -73 212
7972 212 -96 52 6 -16 -171 -33 60 63 178 -51 -72 99 156 -32 206 11 -81 -124 76 2 -195 122 73 -56
7996 -56 16 303 -19 81 -148 -14 122 -13 -1 259 294 85 -22 173 -44 -145 95 -93 -134 96 -69 217
8018 217 37 156 -307 -118 25 98 -130 140 47 -2 136 -92 -7 28 -58 -60 -91 -227 -5 182 87 -63 -28 54
8042 54 -87 132 -107 -134 -311 -56 424 77 77 254 -143 -46 -46 -21 -186 -45 -215 -211 -21 -4 167 15 331 -85
8066 -85 -25 104 -114 -23 23 3 -130 -125 -204 -142 -62 -42 -91 -202 122 92 17 16 -19 43 -155 -202 108 248 -40 160
8092 160 -33 -40 0 -42 -78 60 -123 -68 -197 117 49 126 -157 -79 50 178 -36 89 86 144 55 -225 156 -21
8116 -21 160 183 121 -106 52 110 -31 182 -149 -82 -75 -102 -154 69 145 171 70 46 -19 111 -52 251 114 193 111
8141 111 -107 223 213 106 -17 -41 77 264 56 -179 -235 -171 -47 -116 188 112 -19 252 27 53 4 235 -25
8164 -25 -118 126 21 -29 57 -183 -157 -348 -225 112 -86 129 -25 -124 215 -182 17 -38 4 -110 4 -35 73
8187 73 -126 46 -111 -45
8191d5
$$ Imaginary data points
##PAGE= N=2
##DATA TABLE= (X++(I..I)), XYDATA
0 0 0 0 0 0 0 0 0 0 0 0 0 -8 8 -8 8 -8 16 -16 16 -24 24 -32 38 -40 48 -56 65 -77 88 -101 114 -131 148 -165
34 -165 185 -209 233 -259 290 -324 358 -397 438 -485 536 -590 651 -716 788 -868 958 -1054
52 -1054 1162 -1287 1424 -1583 1763 -1975 2224 -2524 2893 -3360 3965 -4786 5964 -7775 10877
67 10877 -17143 34438 -172709 -483107 243925 217909 -243117 64810 152837 -163699 144142
78 144142 200447 -296675 -28603 392151 -116566 -275765 237894 152438 -165554 -13066
88 -13066 -19149 -55520 201421 49606 -259878 45473 218955 -117645 -136807 59625 -3437
99 -3437 5864 5840 -140536 33834 190453 -139692 -184430 178518 105489 -110155 2086 -27264
111 -27264 -54012 163395 -776 -253834 100459 232057 -178613 -103504 202052 -17521
121 -17521 -103245 89497 -53227 -56947 201244 -47439 -263684 148818 202878 -192774 -69365
132 -69365 148226 -44258 -16483 93371 -113890 -39097 191792 -66032 -174124 167313
142 167313 110780 -159378 -1500 90615 -42746 41947 28904 -152256 22995 161975 -113658
153 -113658 -131724 119188 22841 -95404 38584 7453 -49774 72376 -12589 -130296 72977
164 72977 107515 -123851 -61123 101847 6354 -23194 34884 -36749 6381 105111 -31931
175 -31931 -80785 84066 44940 -79133 5639 41311 -15997 24957 -2667 -62693 54965
186 54965 68802 -90334 -39306 74705 -20084 -43399 28110 -35850 -25481 71019 -30317
197 -30317 -77846 80479 39861 -102891 11127 73172 -53445 -16831 48432 -50511 -8675
208 -8675 92166 -35169 -70662 87282 36939 -82881 22120 53935 -53318 -6007 43663
219 43663 -42948 -11000 62318 -27758 -46954 59413 24065 -53548 5915 27455 -24296 -3994
231 -3994 12238 -23360 -1519 25487 -11515 -13196 21505 9175 -11137 -2833 2681 5571 -1915
244 -1915 -18397 -2070 14205 -6949 -5822 12338 -3917 -3415 17441 -8414 -19221 19407 4125
257 4125 -31371 6478 21457 -20824 -3854 26439 -8767 -8560 27126 -4232 -23030 20696 8774
270 8774 -29666 5474 20864 -19057 -4475 24926 -7148 -11977 21308 392 -20668 10957
282 10957 7697 -23218 -2168 15545 -12168 -8372 17576 25 -11375 12332 7075 -15122 971
295 971 10402 -12886 -9309 12042 -1068 -11069 10291 10391 -8989 3443 14354 -6874 -7817 11005
309 11005 -1848 -15183 5531 7861 -11296 376 15025 -4722 -6912 13283 1085 -14943
321 -14943 3892 5710 -15900 -4676 11536 -6761 -9282 13481 4305 -12282 6931 11282 -12195
334 -12195 -4414 12316 -6914 -12013 12222 5016 -11922 8391 15200 -8563 -812 16302 -5153
347 -5153 -12317 10801 1124 -15969 4978 9902 -11311 -94 13880 -5135 -6388 10819 -2207
360 -2207 -14152 2460 1672 -12984 -3629 4667 -3622 -916 5383 512 651 4607 1000 -1689 -1333
375 -1333 77 1549 -3593 -3563 9267 6072 -7148 5298 13029 -4114 -1248 8780 -8687 -6458
389 -6458 12875 -8465 -17332 16809 6993 -22708 7817 19184 -16270 -3275 15034 -16915 -5555
402 -5555 23524 -17874 -23893 31074 7755 -30837 14688 19172 -22742 5848 16509 -27527 1304
415 1304 28779 -30073 -21040 41923 -124 -33909 20625 14677 -19234 16479 5391 -33830 16020
428 16020 27905 -38312 -11451 39773 -9143 -21075 22368 2650 -5087 22485 -14663 -23813
440 -23813 37241 10971 -44761 4140 27071 -13099 1517 5566 -21732 19967 25695 -45112
452 -45112 -10470 49859 -21060 -43325 26091 3819 -19679 25109 -16848 -38749 57652 26826
464 26826 -76738 6823 66041 -36549 -26214 42841 -18751 -12452 51115 -30240 -40476 80409
476 80409 14976 -89077 26413 65712 -45198 -18133 27727 -31245 11378 49491 -56456
487 -56456 -32760 81815 -3463 -73799 31822 35372 -36554 -126 -1546 -27902 45073 21401
499 21401 -79177 4491 81470 -25042 -45305 27910 -477 -1811 28508 -44048 -26298 79876
511 79876 -6245 -85159 45658 62152 -51791 -11474 25379 -27204 30640 34635 -88801 -12778
523 -12778 108447 -30581 -85941 60577 34254 -49969 22734 7017 -43797 55227 24932
534 24932 -102374 17240 105895 -55470 -68487 60697 14284 -21994 29164 -35752 -34199
545 -34199 83625 -7 -102478 37882 72759 -62712 -27908 43262 -11358 10631 22509
556 22509 -68606 817 100808 -38712 -91394 59692 45298 -48261 6608 7591 -27037 53153
568 53153 16872 -87075 28166 91212 -65236 -59177 68508 11656 -32421 18230 -29029
579 -29029 -16270 82372 -12606 -96979 48936 68709 -67310 -24291 42340 -18968 2833 20703
591 20703 -57178 8955 86458 -48940 -74820 73520 37053 -58788 3787 8875 -23187 47078
603 47078 6689 -82046 34851 82210 -66598 -42970 74355 141 -41167 24758 -16434
614 -16434 -17645 65372 -18796 -85477 58145 67572 -72608 -22750 55173 -15727 -10796 25272
626 25272 -39849 -5782 66215 -33435 -62626 62698 35826 -59224 -1572 28782 -12423 16339
638 16339 623 -52082 23096 54316 -48449 -33175 51140 3656 -27376 14838 -7255 -5284
650 -5284 37825 -23744 -47615 49969 30065 -58986 -2688 39898 -15110 1175 16296 -35100
662 -35100 8810 51803 -39604 -40331 57513 9214 -53349 17360 24108 -25006 15389 10741 -41765
675 -41765 20349 45403 -47126 -28531 51340 -1368 -36381 19070 4963 -17980 24316 452
687 452 -34878 25610 27582 -40351 -9172 35135 -8990 -16063 11986 -7851 -348 24358 -14386
700 -14386 -20880 28414 9102 -27114 4920 12804 -11442 3475 2345 -15451 12749 16003 -23750
713 -23750 -4960 26162 -6148 -15319 10607 -3064 -6603 14038 -7568 -16704 20386 8432 -23387
726 -23387 6084 17823 -13722 -3576 11234 -11300 -1206 15640 -13573 -11836 21870 1067
738 1067 -18758 10971 9668 -13308 4251 7678 -13922 2371 12529 -13312 -6047 17402 -2837
751 -2837 -12171 10731 4290 -9605 5011 3469 -10488 2731 7488 -9614 -2977 10125 -1801
764 -1801 -5529 5837 2615 -3792 1835 871 -3707 724 1877 -2991 -946 2480 1183 -739 -270
779 -270 1663 1762 -1389 -1267 1484 -1331 -3379 1708 682 -3093 2059 3268 -3216 385 5069 -2476
795 -2476 -3263 3863 -357 -5521 2126 2374 -4669 440 4875 -2682 -1567 5402 -915 -4614 2673 1581
811 1581 -5441 67 3661 -3259 -1916 4479 -108 -3124 3855 2148 -4047 657 3177 -3184 -1943
826 -1943 3531 -890 -2943 3161 2081 -2701 952 2878 -2320 -1580 2618 -951 -3293 1475 1120 -2644
842 -2644 306 3000 -1011 -1295 2286 154 -2672 49 1086 -2703 -1168 2698 -862 -2412 3245
857 3245 2297 -3160 914 4068 -3044 -2201 4190 -1646 -4328 4174 1042 -5605 4118 5551 -6058
872 -6058 -512 7850 -3429 -4864 6142 -1446 -6299 5670 1157 -8264 4826 6318 -8380 -530
886 -530 9258 -4472 -5019 6109 -2291 -4315 6770 -1610 -7826 7014 4768 -8674 1261 6245
900 6245 -4279 -787 3297 -4789 1017 5880 -6989 -2514 9902 -1356 -6427 4973 338 -2437
914 -2437 6037 -3979 -8373 10913 3325 -14581 4184 11618 -9086 -1682 8897 -7452 808
927 808 12171 -13507 -9183 21225 -1473 -21751 10426 10677 -13553 4238 7180 -14575 7351
940 7351 15291 -21379 -6149 26190 -7962 -20810 15574 5812 -12519 9281 -1169 -15429 18335
953 18335 11308 -28109 1036 25678 -12659 -12471 15082 -3380 -4356 13935 -12522 -11581 27663
966 27663 26 -31047 12330 20499 -16590 -2823 7611 -11774 10617 14534 -27434 -3877
978 -3877 34165 -11860 -26512 20091 8296 -15695 7810 -3570 -13868 25902 6085 -38416
990 -38416 10176 35439 -21633 -16747 19433 -4705 -3909 15597 -20275 -10550 37763 -6453 -39872
1003 -39872 24389 26122 -27752 -3598 13564 -12818 12912 14219 -37351 -82 46669 -18828
1015 -18828 -35351 30449 12019 -23575 9422 746 -16984 26782 5693 -45577 14260 44221
1027 44221 -30215 -25706 30022 1501 -10972 13163 -17429 -10845 39605 -6844 -44424 25913
1039 25913 31027 -32746 -8854 20537 -7073 6357 7710 -32750 6873 44252 -25412 -35822
1051 -35822 34185 13952 -24331 6051 -136 -10612 27133 -1718 -42555 23575 38370 -39533
1063 -39533 -19508 36001 -2374 -12912 12477 -18625 -4947 42533 -15606 -46194 35688 29634
1075 29634 -41069 -4495 26070 -13495 2372 12453 -30277 5918 43727 -29171 -37490 41938
1087 41938 16037 -34619 4474 10449 -11022 18765 898 -36958 19928 36659 -36218 -19774
1099 -19774 37015 109 -19685 8705 -7022 -1656 29059 -16448 -34035 33940 23178 -37386
1111 -37386 -3940 23470 -9339 1197 6341 -23453 9810 31798 -29605 -23595 39434 6177
1123 6177 -31676 8323 9503 -10043 15474 -3027 -30557 22421 28109 -36114 -12176 35133
1135 35133 -5499 -18527 13279 -4725 -5365 22498 -13157 -27078 30704 16780 -36293 -566
1147 -566 25592 -10609 -4558 8823 -15674 4799 24214 -22088 -18418 31988 3880 -28005 8638
1160 8638 12230 -10501 6780 442 -18806 15238 18600 -27049 -7790 27282 -4626 -15715 10049
1173 10049 -945 -5002 13256 -8029 -15593 20315 8368 -24482 2646 17907 -8824 -4499
1185 -4499 6287 -8409 3661 13602 -15524 -9433 21455 -709 -17695 8563 6838 -8802 5003
1198 5003 838 -12055 11016 9710 -19416 -1386 18998 -7388 -10582 10288 -1635 -5434 10222
1211 10222 -4722 -11289 13816 5083 -17548 4162 13409 -9512 -3781 8705 -5179 -1461 9407
1224 9407 -7584 -7037 12716 458 -12382 5018 6450 -6817 708 3708 -5409 2175 5221 -7222
1238 -7222 -1773 8303 -2578 -5697 4170 798 -2535 2626 -1355 -3181 4994 1075 -5871 2288
1252 2288 3789 -3691 -137 2738 -2626 992 2869 -4219 -753 5651 -2405 -3859 4107 502 -3875
1267 -3875 2605 967 -3851 2317 2628 -4482 427 4678 -3026 -2181 4174 -955 -3122 3014 605
1282 605 -3340 2414 1854 -3080 337 2778 -2288 -1440 2645 -725 -2162 1653 168 -1961 1167 1148
1298 1148 -1478 -10 1744 -586 -1116 997 190 -1103 461 440 -794 -199 1333 -229 -512 841
1314 841 728 -525 48 722 -496 -833 815 166 -1284 -143 952 -666 -668 1183 -383 -973 579
1331 579 379 -1562 -66 1070 -1172 -698 1657 -357 -1477 1425 753 -1863 484 1895 -1517 -734
1347 -734 2010 -575 -1664 2151 700 -2077 1224 1650 -1696 -117 1612 -1690 -540 1948 -1020
1362 -1020 -1606 2032 718 -1653 811 1047 -1045 135 548 -1196 348 857 -1396 -13 1317 -465
1378 -465 -215 1068 -485 507 1128 -2098 -834 2302 -1063 -2239 2121 242 -1945 2341 66 -2795
1394 -2795 2946 1663 -5194 1017 4906 -3710 -2462 4253 -1492 -2230 4544 -1810 -4083 6440 1313
1409 1313 -7667 2865 5649 -5786 -1080 5188 -3705 -643 5876 -4998 -3630 9219 -900 -9044
1423 -9044 5022 4538 -6548 1102 3136 -5498 2791 5221 -8439 -646 10868 -4175 -7768 6996
1437 6996 1765 -4933 3499 -1563 -5311 8576 2093 -11410 3986 9599 -7519 -3239 6085 -3153
1451 -3153 -115 4935 -7836 -2048 12952 -4323 -12431 9475 6057 -9030 1840 2348 -6369 7131
1465 7131 4252 -15039 2651 15978 -10379 -9606 13314 865 -7983 6158 -3061 -6989 14252
1478 14252 -73 -19712 9053 16094 -14587 -5968 12966 -3976 -2641 8166 -10175 -3979 19002
1491 19002 -6045 -19605 14342 11626 -15982 -658 8143 -5815 5595 4626 -17448 3158 20723
1504 20723 -13002 -14969 16690 4068 -11081 4881 -933 -4851 14062 -2297 -20536 12764
1516 12764 17462 -18923 -7573 15062 -2569 -2844 5907 -11571 258 21059 -10948 -20058 19947
1529 19947 10640 -20517 551 9701 -6724 5846 3036 -18720 8170 22818 -19521 -16089 22818
1542 22818 3496 -15972 5710 456 -6057 14689 -2842 -22243 16495 19170 -24469 -7905
1554 -7905 21239 -3097 -8329 6206 -8974 -70 20669 -12521 -20915 22808 11728 -23431 596
1567 596 13481 -7017 2188 2727 -16106 8601 20316 -20968 -14113 25454 3248 -18624 5169
1580 5169 3739 -4963 11379 -4695 -19236 16925 15588 -24683 -5379 22166 -4127 -9509 6319
1593 6319 -5768 1235 15948 -14083 -16639 23366 8046 -24309 2543 14395 -7462 965 2953
1606 2953 -13362 8826 16277 -21186 -10224 25488 -761 -19268 7750 5218 -5872 9365
1618 9365 -3744 -16004 16567 12416 -24404 -2972 21751 -6643 -10697 8516 -2999 -1248 12749
1631 12749 -11025 -12810 20651 5431 -22655 3235 14691 -7770 -2184 4002 -8232 5880
1643 5880 11677 -15942 -6680 20186 -1611 -16216 6772 5966 -5674 4412 -2496 -9194 12793
1656 12793 7294 -18346 195 16662 -6497 -8578 6938 -2406 -1045 8452 -8735 -7461 16407
1669 16407 1323 -17030 6134 10839 -8509 -1250 4294 -6937 4293 8149 -12778 -3220 15979
1682 15979 -3162 -12391 8060 4440 -6903 3574 26 -7467 7506 5092 -13002 1002 12599
1695 12599 -5891 -6836 6786 -189 -2948 4663 -3893 -5151 9461 1128 -10741 4175 7675 -5881
1709 -5881 -1332 4264 -2925 1161 3812 -6512 -1628 8763 -2966 -6962 5346 2380 -4115 2060
1723 2060 631 -3968 4425 1748 -7313 1316 6266 -4724 -2963 4925 -1037 -1563 3402 -2052 -2362
1738 -2362 5579 -425 -6109 3460 3396 -4838 -93 2790 -2371 198 2790 -3416 -826 4970 -2152
1753 -2152 -4014 3414 1122 -3696 1351 1262 -2454 1459 1704 -3142 63 3353 -2161 -1945 2733 -260
1769 -260 -1981 1300 58 -1262 1622 526 -1932 910 1678 -1282 -655 1071 -634 -371 609 -646
1785 -646 149 1213 -365 -649 968 -92 -502 248 -221 -647 270 -45 -806 842 658 -864 323 929
1803 929 -574 -190 1038 -642 -622 732 -101 -986 741 618 -1110 392 961 -761 -235 678 -696
1820 -696 -790 599 -99 -614 410 618 -744 202 744 -380 -169 808 28 -661 457 79 -419 39 241
1839 241 -322 91 524 -213 -181 216 -94 -330 -116 -20 -46 69 44 467 246 -234 330 344 -401 -182 447 -803
1861 -803 -425 841 -335 -691 931 218 -1154 514 709 -1076 517 932 -1652 -360 1834 -830
1877 -830 -1261 1672 369 -1740 1186 797 -1877 653 1328 -2327 362 2243 -1561 -1058 2219 -326
1893 -326 -1223 2029 -370 -1822 1730 394 -2929 959 2183 -2348 -107 2129 -1138 130 1796
1908 1796 -1954 -621 3074 -1383 -2892 2473 651 -2624 1116 522 -1770 2187 855 -3975 1508
1923 1508 3829 -3596 -1755 3557 -916 -1805 2411 -1955 -1729 5119 -790 -5533 4060 3321 -5443 -83
1939 -83 3770 -2903 395 3088 -4700 -359 7084 -3197 -5999 6406 1911 -5675 1932 2166 -3856
1954 -3856 3218 2067 -7095 2386 7427 -6209 -4106 7125 -317 -4363 3115 -1178 -2465 6627
1968 6627 -1410 -8166 5961 6360 -7866 -1258 6091 -2419 -624 2751 -5271 107 8118 -5808
1982 -5808 -7423 8793 3136 -7992 1662 2986 -3360 3966 499 -8933 4701 8783 -9705 -4633
1996 -4633 10059 -577 -5511 4253 -1318 -1996 7830 -3349 -10236 9606 6939 -12310 -1213 9379
2010 9379 -3567 -1387 3808 -6411 1145 10701 -8505 -9171 13048 2804 -11862 2636 5545
2023 5545 -4388 3351 1076 -9551 6546 10351 -12792 -5710 13691 -829 -8730 4544 91
2036 91 -2353 7087 -3859 -10149 10883 7046 -14540 -968 11672 -3690 -3894 3094 -4670 2324
2050 2324 9303 -9315 -7936 14164 2619 -13161 3002 6694 -4428 1945 -37 -8391 7741
2063 7741 8732 -14151 -3752 15123 -2514 -9800 5162 506 -2274 6759 -5114 -9089 13032
2076 13032 5628 -16199 1249 12853 -5878 -4656 5004 -4502 1537 8803 -10249 -7186 15682
2089 15682 1265 -15018 4586 8372 -5899 704 1652 -6854 6436 7658 -13529 -3090 15557
2102 15557 -2790 -11032 5950 3134 -3410 4455 -3484 -7165 10860 4072 -14344 1537 12261
2115 12261 -5406 -5179 5024 -1827 929 5855 -8434 -4534 13625 -937 -12920 5565 7129
2128 7129 -5922 611 1621 -5080 5969 4945 -11900 -595 13097 -4763 -9139 7006 2070
2141 2070 -3606 3687 -2567 -5257 9551 2145 -12748 3225 10474 -6850 -4564 5867 -1893 -650
2155 -650 4934 -6385 -3184 10811 -1404 -10856 5435 6569 -6219 -416 2872 -3576 3278 3833
2169 3833 -8377 -334 9987 -4003 -7504 5942 2189 -4219 2081 -374 -3406 5387 853 -8503
2183 -8503 2925 7200 -5359 -2955 4852 -789 -1159 2879 -3667 -1664 6863 -1845 -6800 4793
2197 4793 3524 -5045 162 2180 -2664 2153 2026 -5507 927 6179 -3818 -4371 5290 738 -3657
2212 -3657 2178 -28 -2487 3586 659 -5578 2604 4658 -4495 -1593 4119 -1223 -1808 2722 -1898
2227 -1898 -1525 4163 -1017 -4325 3300 2800 -4008 -5 2572 -1726 -45 1967 -2306 -37 3234
2242 3234 -1843 -2426 3076 514 -2247 1218 662 -1212 1334 596 -2087 1257 1648 -2091 -638 2036
2258 2036 -663 -684 1046 -866 -648 1603 -960 -1383 1680 627 -1703 571 939 -1111 45 682
2274 682 -1462 59 1596 -1558 -561 1823 -80 -1468 1093 326 -1072 1198 273 -1460 354 955
2290 955 -1309 -246 1425 -563 -881 1100 -113 -1073 740 79 -986 650 502 -733 -45 731 -329
2307 -329 -469 838 -66 -412 179 50 -175 271 312 -287 138 176 -11 -52 -27 291 220 -42 -321 15 -154
2328 -154 -289 97 146 -292 136 263 -351 50 411 -23 84 489 -289 -672 270 265 -494 -8 342 -491 2
2349 2 684 -384 -292 618 -134 -725 469 176 -582 169 653 -764 224 714 -593 -299 620 -246 -799 680
2369 680 315 -848 575 475 -806 302 444 -575 442 953 -643 -437 765 -31 -434 526 -163
2386 -163 -195 746 -188 -520 514 385 -862 380 470 -662 384 576 -1206 203 1225 -1203 -708 1667
2404 1667 -114 -1319 1071 -133 -1278 1449 163 -1952 1213 1922 -2176 -274 2291 -1128 -926
2419 -926 1629 -1261 -948 2434 -713 -2476 2473 1241 -3073 371 1770 -1810 132 1532 -2287
2434 -2287 21 3461 -2285 -2477 3450 329 -2650 1328 919 -1412 1459 198 -3203 1852 3009
2449 3009 -3613 -1112 4048 -770 -1775 1655 -779 -688 3249 -1578 -3372 3665 1839 -4518 285
2464 285 2874 -1809 209 1521 -3134 1099 4012 -4093 -2584 5392 -33 -4546 2082 1380 -2177
2479 -2177 2596 -10 -4463 3702 3971 -6109 -1395 6030 -1941 -2972 2703 -1028 -1030 4532 -2484 -4753
2495 -4753 5778 2557 -7267 529 4745 -2800 -703 1956 -3447 1115 5296 -5129 -3452 7404
2509 7404 340 -6520 2282 2760 -2660 1742 -135 -4519 4244 4269 -7626 -1256 7465 -1864 -4208
2524 -4208 2821 -482 -1229 3766 -3386 -4259 7271 2255 -8352 1592 6098 -3399 -987 2209 -3274
2539 -3274 2076 4568 -6797 -2836 9160 -911 -7604 3629 3406 -3331 1965 -153 -4866 5194
2553 5194 3925 -9202 -608 9166 -2847 -5224 4169 177 -1672 4037 -3472 -4520 7893 1381
2567 1381 -10036 2489 7286 -4384 -2500 2998 -2132 1417 4225 -6439 -2696 9377 -1465
2580 -1465 -8510 4033 4240 -3844 1175 490 -3489 5186 3075 -8719 217 8871 -3795 -5810 4459
2595 4459 875 -1952 3054 -3158 -2920 7821 458 -8851 3223 6483 -5166 -2089 3259 -2166
2609 -2166 1085 3367 -6031 -1109 8879 -2248 -7684 5213 3827 -4606 599 961 -3091 3791 2303
2624 2303 -7547 1032 8327 -4644 -5216 5299 853 -2820 2296 -1915 -2775 6315 371 -7971 3392
2639 3392 6295 -5039 -2317 4256 -1693 -170 2519 -4407 -1118 6968 -1935 -6312 4568 3344
2653 3344 -4352 308 1493 -2198 2697 1076 -5635 1564 6118 -4056 -3609 4708 677 -2389 1962
2668 1962 -984 -1567 4324 -675 -5602 3243 4228 -4724 -982 3629 -1288 -278 2140 -2969 -359
2683 -359 4852 -2593 -4647 4139 1857 -4211 745 2086 -1812 1502 1222 -3952 1042 4097 -3592
2698 -3592 -2443 3935 169 -2671 1866 22 -1419 2635 -58 -3526 2292 2820 -3679 -827 2871
2713 2871 -1099 -882 1609 -1429 -250 2862 -1472 -2529 2786 1111 -2807 237 1354 -1452 385
2728 385 729 -1819 768 2168 -1867 -996 2431 -265 -1672 1130 84 -1185 1366 -184 -1962 1679
2744 1679 1494 -1992 -37 1938 -1214 -869 1084 -902 -547 1519 -951 -1210 1947 691 -1827 870
2760 870 980 -1204 137 622 -1270 -14 1278 -1104 -535 1759 18 -1079 1122 298 -908 367
2776 367 35 -1210 438 594 -993 -214 1128 -357 -279 1033 56 -598 455 -280 -792 603 166 -925
2794 -925 171 600 -294 142 443 -54 50 276 -706 -146 393 -412 -330 385 136 -160 378 -73 -287 428
2814 428 69 -566 30 -54 -652 -35 356 -35 -205 402 116 -286 139 -129 -680 -53 238 -701 -4 368
2834 368 -126 -172 620 -59 -101 408 -183 -397 -144 192 -236 159 147 -322 -88 777 157 11 350 -136 -242
2855 -242 -53 -339 -409 218 -101 -76 175 411 83 331 121 -427 -43 -60 -570 -134 337 -331 199 418 29
2876 29 -198 533 -219 -724 439 -93 -1059 73 307 -795 201 460 -460 488 953 -559 -381 1034 -354
2895 -354 -905 512 149 -625 715 282 -797 904 854 -1025 44 1225 -653 -669 536 -474 -400 957
2913 957 -236 -1211 1170 536 -1543 243 994 -998 44 614 -1180 153 1109 -1226 -667 2015 -3
2930 -3 -1015 849 92 -977 917 -384 -1481 1143 874 -2280 136 2004 -1042 -489 1220 -777
2946 -777 -469 1733 -1533 -1530 2154 570 -2775 897 1673 -1344 288 861 -1868 642 1887 -2642 -1267
2963 -1267 3341 -603 -2590 1618 705 -1296 1567 -160 -2302 1894 1766 -3519 -263 3051 -1357
2978 -1357 -1717 1690 -472 -407 2203 -1437 -1839 3479 667 -4136 852 2122 -2155 -75 1146 -1803
2994 -1803 1357 2703 -3203 -1030 4083 -839 -3630 1739 858 -1648 1156 -511 -2393 3040 1663
3009 1663 -4453 313 4016 -2000 -2176 1938 -719 -623 2266 -2430 -2126 4720 320 -4959 1482 3168
3025 3168 -2703 -388 1347 -2269 1180 2341 -4128 -1187 5483 -1107 -4317 3090 1934 -2427 1082
3040 1082 -372 -2819 2971 1423 -5450 530 5156 -2473 -2642 2911 -64 -1017 2079 -2240 -2189 4479
3056 4479 -17 -5658 2211 4007 -3024 -718 2008 -1359 1138 1980 -4547 -458 5376 -1962 -4248
3071 -4248 3426 2006 -2468 1055 98 -1902 3369 1026 -5481 1159 5219 -3573 -3221 3677 -122
3086 -122 -1025 2226 -2024 -1509 5009 -484 -5808 2707 3667 -3904 -1070 2608 -1267 911 1880 -3775
3102 -3775 -108 5450 -2267 -4874 3585 1637 -3449 673 573 -1697 3003 723 -4776 1564 4904
3117 4904 -3601 -2931 3492 -114 -2047 1472 -1508 -1064 3965 -524 -4483 3138 3535 -4025 -851 2529
3133 2529 -1358 180 1065 -3082 -172 4718 -2291 -3349 3948 1643 -3209 531 936 -1451 1743
3148 1743 136 -3888 1660 4037 -3353 -1853 3809 12 -1774 1129 -1094 -1212 2843 -1094 -3774
3163 -3774 2785 2407 -3561 -426 2837 -1144 -238 1333 -2277 68 3039 -2169 -3257 3287 1059
3178 1059 -2846 820 1335 -1216 1208 568 -2855 1068 2801 -3010 -1639 3053 -307 -1636 1246
3193 1246 90 -738 1982 -744 -2369 1871 1367 -3051 -90 2067 -967 -321 1111 -1173 333 2185
3209 2185 -1553 -1489 2396 328 -2389 654 893 -1231 941 666 -1451 1187 1544 -1927 -521 2238
3225 2238 -867 -1388 979 -72 -684 1479 -204 -1325 1408 1054 -2043 178 1347 -866 -502 900
3241 900 -668 -221 1424 -646 -793 1490 351 -1339 265 1023 -1066 61 270 -830 153 982 -846
3258 -846 -318 1567 -194 -606 700 122 -699 341 -154 -659 688 222 -782 289 948 -550 -26
3275 -26 524 -234 -194 298 -777 -786 903 65 -625 628 345 -632 167 312 -462 56 171 -784 -161 410
3295 410 -194 -397 552 216 -268 310 159 -482 121 134 -634 -25 210 -379 -245 529 -21 76 186 -147 -419
3316 -419 228 -86 -602 78 140 -361 184 332 3 -9 124 -121 41 145 -171 -405 -51 -127 -306 241 75
3337 75 -6 293 162 -66 214 73 -433 -96 -76 -149 -199 211 103 21 469 -28 -83 127 -16 -398 196 -244
3359 -244 -526 59 472 -206 -21 192 -84 -186 556 17 -311 186 -164 -747 59 134 -426 -92 675 -12
3379 -12 107 372 -400 -299 449 -138 -745 111 187 -127 262 11 -67 251 166 -483 -105 214 -283 -345 349 -217
3401 -217 17 663 90 -246 691 75 -774 353 268 -541 131 33 -517 450 580 -531 -65 1270 -390
3420 -390 -599 529 31 -440 445 -254 -999 693 455 -1037 523 1222 -654 -501 744 -756 -253 733
3438 733 -804 -863 1287 225 -1115 887 1030 -735 -26 348 -819 165 830 -1383 -616 1661 -148
3455 -148 -1240 997 572 -617 785 -106 -1265 1157 469 -2003 224 1457 -1039 -469 1037 -283
3471 -283 153 1059 -943 -805 2036 -94 -2155 737 1065 -1226 279 827 -766 788 1310 -2115 -394
3488 -394 2302 -973 -1916 1261 510 -983 1045 14 -1300 1970 546 -2343 776 2245 -1419 -1006
3504 -1006 1422 -749 -460 1227 -1388 -933 2852 -87 -2741 1113 1631 -1671 -505 575 -1243 658
3520 658 1151 -2074 -110 3109 -870 -1892 1773 752 -1678 364 -274 -1491 1939 589 -2838 1200
3536 1200 2752 -1856 -1271 1776 -548 -524 1100 -1959 -880 2682 -667 -3039 1888 2255 -2363 -98
3552 -98 1160 -1205 643 1049 -2538 1 3225 -1720 -2388 2571 941 -1719 594 273 -1165 1925
3568 1925 256 -3346 1151 2685 -2414 -1399 2399 -58 -656 1030 -1224 -548 2807 -918 -3192
3583 -3192 2114 1971 -2469 -213 1498 -713 645 971 -2269 309 3051 -1881 -2456 2483 457 -2080
3599 -2080 428 390 -861 1760 399 -2624 1307 2618 -2540 -1152 2284 -384 -1139 877 -1046 -398
3615 -398 2686 -741 -2641 2137 1841 -2817 -352 1645 -985 -17 910 -1893 433 2416 -1784 -1640
3631 -1640 2722 358 -2321 231 338 -1204 1313 24 -2428 1711 2506 -2203 -867 2418 -286
3646 -286 -1472 802 -636 -512 1841 -588 -2128 2033 1378 -2262 15 1998 -707 -388 757 -1670
3662 -1670 147 1753 -1563 -1442 2410 706 -1781 662 609 -807 929 -13 -1983 1107 1563 -2228
3678 -2228 -552 1874 -266 -1058 790 -186 -250 1345 -1023 -1515 1644 820 -1996 231 1469 -628
3694 -628 -100 820 -792 220 1305 -1332 -919 1825 23 -1544 704 761 -603 460 399 -859 944
3711 944 919 -1641 -491 1540 -374 -1210 721 46 -359 674 -274 -742 1259 472 -1485 131 1173
3728 1173 -759 -333 554 -393 4 589 -546 -493 1117 -248 -1345 686 377 -500 93 84 -395 613
3746 613 636 -1008 163 1057 -523 -479 697 39 -592 355 -223 -497 612 278 -839 391 523 -479
3764 -479 -92 544 -364 -225 544 -376 -395 579 271 -639 635 362 -357 53 165 -377 25 282 -545 -137
3784 -137 450 -19 -228 468 357 -61 56 -25 -183 316 54 -454 214 369 -134 -26 440 -150 55 134 -387
3805 -387 -85 8 -29 -127 91 161 -101 139 213 -259 50 96 -257 -93 187 -416 -309 11 -66 -130 165 298 -89
3828 -89 194 13 -326 212 103 -375 25 405 -42 -85 267 61 -127 224 114 -278 95 -81 -539 4 67
3849 67 -84 168 367 -44 -244 -19 -273 -228 216 -201 -90 207 -72 -89 -129 26 -60 58 173 -115 -127 23
3871 23 -213 -121 302 -51 -177 81 38 -100 486 -29 -227 417 91 -151 110 78 -123 19 83 -173 21 311
3893 311 -107 -234 470 -177 -478 185 -109 -414 222 156 -203 169 437 -349 156 480 -189 -520 416 -38
3913 -38 -223 236 -90 -430 396 216 -404 166 528 -289 -242 552 -235 -306 493 -333 -195 549 -10 -568 467
3934 467 334 -558 38 100 -279 143 346 -599 5 899 -169 -245 539 -177 -432 370 -219 -586 733 243
3954 243 -940 290 820 -705 -112 609 -43 -106 507 -426 -375 907 -175 -1171 496 449 -746 273
3972 273 627 -589 333 610 -1158 -277 1156 -585 -920 683 80 -590 652 -124 -553 1053 206 -1373
3990 -1373 90 661 -827 -385 679 -305 -49 758 -434 -372 1360 -433 -1347 695 1066 -867 -88
4007 -88 375 -645 353 539 -1018 153 1485 -730 -1032 1134 216 -1167 536 92 -469 1375 33
4024 33 -1567 821 1426 -1242 -626 1035 -198 -359 603 -910 -570 1657 -428 -1343 1374 1118 -1250
4041 -1250 27 663 -743 440 369 -1244 327 1814 -879 -1124 1440 338 -1050 299 67 -593
4057 -593 774 -128 -1542 1076 1364 -1195 -533 1447 -161 -483 528 -883 -176 1538 -713 -1708 1249
4074 1249 1111 -1493 9 658 -394 455 326 -1325 326 1576 -1282 -1154 1708 292 -1064 401
4090 401 110 -521 1035 39 -1539 835 1327 -1693 -750 1574 -555 -511 654 -600 21 1438 -749
4107 -749 -1548 1515 657 -1650 161 1193 -509 328 281 -1089 391 1472 -1320 -1243 1424 388 -1451
4124 -1451 470 359 -631 678 -178 -1413 795 1144 -1576 -379 1394 -410 -658 450 -265 -427 1051
4141 1051 -451 -1065 1374 519 -1772 230 896 -744 173 314 -712 286 1036 -1006 -729 1489 -106
4158 -106 -1161 782 546 -381 277 -128 -997 922 928 -1327 -140 1598 -365 -808 639 -240 -292 823
4176 823 -261 -1050 1208 540 -1285 360 919 -415 -331 198 -557 487 759 -723 -413 1333 277
4193 277 -1100 488 365 -549 349 14 -562 583 398 -920 -291 929 -604 -403 389 -150 -154 599 -157
4212 -157 -361 767 57 -1212 351 413 -456 -355 442 -175 270 611 -571 -81 612 -45 -633 450 152
4231 152 -577 288 256 -511 494 258 -699 84 554 -449 -286 312 127 -47 408 -379 -569 356 84 -462
4251 -462 247 297 -239 118 342 -186 -25 283 -162 79 366 -191 -531 92 -20 -343 49 239 -282 222
4271 222 86 -284 72 540 -82 -193 296 -121 -227 187 -58 -202 209 144 -283 294 210 -369 -47 356 -99
4292 -99 217 314 108 -317 288 95 -195 260 123 -132 228 174 -170 154 286 -25 108 436 -65 -198 203
4313 203 -70 -196 2 186 -120 238 173 -228 259 266 -187 -28 -99 62 76 358 150 -167 228 -9 -34 190
4335 190 -48 -230 -36 68 -287 79 -12 -84 -11 -17 -64 -108 119 -72 -190 39 218 -194 239 144 -210 15 94
4358 94 -91 -116 158 -243 12 94 62 59 139 -78 -176 309 -69 -337 99 217 -386 309 59 -210 -250 194 -3
4381 -3 -274 -5 -110 -7 226 33 -164 -43 129 48 117 -19 -41 176 -104 -84 109 174 -251 -61 236 100
4403 100 -56 135 92 -105 292 45 -212 75 63 -155 224 285 -262 -112 151 -135 -121 230 108 -274 85
4424 85 139 -442 150 -42 -196 126 211 -421 64 425 -268 -444 488 -34 -408 286 -7 -207 269 218 -560
4445 -560 165 201 -633 -125 114 -103 209 77 -357 -150 407 -135 -443 233 117 -603 314 376 -311 133 -96
4466 -96 -688 -19 433 -525 -386 620 -31 -161 131 -106 -98 327 -185 -634 652 157 -518 -29 297 -415
4486 -415 85 370 -346 -256 785 -382 -720 419 122 -541 199 269 -311 304 93 -810 377 939 -506
4505 -506 -593 593 15 -595 99 30 -505 305 -53 -742 617 789 -947 118 723 -427 -369 283 -273
4524 -273 8 866 -661 -758 855 199 -650 40 615 -320 294 260 -721 333 766 -873 -642 856 104
4543 104 -547 230 81 -473 481 -154 -1051 443 444 -1190 -386 789 -290 -258 246 -276 -167 759 -377
4562 -377 -907 1037 211 -996 382 462 -378 341 167 -874 420 773 -857 -248 1026 47 -537 476
4580 476 -201 -374 400 -134 -567 354 625 -837 -143 1036 -484 -347 506 -480 -148 709 -379 -669 1029
4599 1029 6 -973 159 756 -546 182 -116 -552 352 636 -1098 -165 1146 -78 -820 596 106
4616 106 -327 242 -196 -514 668 440 -1315 -130 745 -516 -228 677 -281 -156 690 -419 -546 823
4634 823 -74 -1145 275 585 -463 94 177 -361 280 480 -607 -65 858 33 -677 682 278 -437 333
4653 333 -198 -562 502 105 -1011 154 645 -318 -517 340 -137 -54 622 -479 -522 836 147 -800 384
4672 384 646 -318 -175 196 -494 311 293 -772 164 660 -152 -431 288 167 -282 499 94 -448 461 299
4692 299 -825 295 368 -539 -539 461 -176 56 104 -455 -10 520 -137 -550 414 166 -490 -83 236 -232
4712 -232 185 415 -498 -75 450 -114 -410 504 235 -373 174 45 -96 180 120 -412 251 231 -370 -352 458
4733 458 59 221 -67 -297 -194 278 -122 -363 413 418 -193 -86 156 -98 164 112 -335 -136 321 -384 -230
4754 -230 316 -120 -530 259 -106 -85 173 143 -147 140 209 -434 -304 104 -11 -376 98 85 -265 202 -128
4775 -128 -96 161 46 -253 -287 387 -63 82 262 75 152 120 -231 -249 393 168 -377 -41 44 -158 133 146
4797 146 -330 116 252 -199 -74 284 -131 -32 298 -87 16 169 -124 -121 -24 -49 -77 73 50 -181 -53 -50 -191
4820 -191 -54 125 130 -111 213 -94 -95 68 17 88 -86 -64 -26 186 35 -280 142 105 48 -131 63 -26 20 115
4844 115 -287 -51 -147 284 117 -73 143 -168 34 200 -49 95 227 -62 -32 109 -115 -176 153 145 -233 27
4866 27 34 -281 -57 -60 -329 -43 91 -212 -258 237 -159 123 -16 -87 -5 -16 16 -90 -24 -132 49 -52 24 -12
4890 -12 -102 181 108 -21 316 -134 85 143 36 -422 -11 280 -315 -3 266 12 -172 120 -245 -145 -12
4911 -12 -232 -192 442 -46 -209 126 -27 -115 -28 -48 -202 51 -1 -205 -82 433 72 -344 320 -206 30 242
4933 242 24 -347 221 17 -272 -5 55 1 -17 226 -123 38 496 -167 -254 85 -185 -350 236 227 -108 97
4955 97 54 -305 179 72 -138 -268 92 -220 -85 177 -75 -234 158 -22 -200 196 183 -341 -5 26 -58 -28
4977 -28 240 28 147 192 -231 -251 308 134 -113 135 136 -281 -61 -53 -280 38 393 -395 -265 648 -222 -164 186
5000 186 -35 -129 207 -335 -163 141 232 -378 -61 225 -247 -206 189 -206 -134 320 -376 -284 560 209 -460 313
5022 313 319 -145 112 -112 -353 460 337 -863 -202 329 -26 -222 185 233 -208 337 -117 -277 238 113 -733
5043 -733 -176 351 -27 43 354 -350 140 303 -582 -421 455 37 -569 143 329 -125 100 159 -135 571 96
5064 96 -547 -163 698 17 -470 286 29 -94 466 -70 -349 474 218 -516 252 659 -270 -152 364 -381
5084 -381 -16 137 -498 -189 451 -147 -461 583 423 -270 -135 161 -424 529 246 -574 -46 541 -239 -421
5104 -421 284 33 65 152 -85 -475 243 255 -906 151 329 -356 -406 81 -63 -97 215 -229 -104 389 -106
5125 -106 -716 327 194 -347 108 156 -104 317 271 -424 -112 657 -517 -200 465 253 -444 -29 -119 -368
5145 -368 314 111 -365 219 513 -324 -105 270 -80 0 146 -425 -16 447 -216 -586 282 177 -214 -12
5165 -12 -2 -95 165 -9 -419 136 463 -353 -340 303 -19 -155 356 -5 -295 467 101 -638 41 349 -450
5186 -450 -151 335 -120 -15 -10 -114 118 395 7 -244 281 246 -339 24 293 -364 -52 366 -217 -176 567
5207 567 -173 -230 491 139 -277 99 22 -57 184 -93 -469 151 246 -295 93 143 -123 -156 -47 -50 -12 427 -463
5230 -463 -355 267 280 -448 -16 121 -112 66 176 -56 8 475 -393 14 225 18 -266 -73 -209 -29 -20
5251 -20 53 -261 208 392 -215 54 296 -144 -167 154 -116 -109 -193 114 -328 135 -69 -261 58 132 -168 -166 110
5274 110 -152 220 240 -96 76 24 -48 50 -76 72 -113 -201 -24 -113 95 43 -44 -142 -80 -131 -156 166 194 83
5298 83 112 -59 -126 124 163 -318 -90 134 -79 104 147 37 0 38 -126 150 -31 189 118 84 -122 -217 -23
5321 -23 -169 63 189 66 -81 84 102 37 258 4 -125 -7 211 -9 -167 174 235 -174 -70 -35 -224 -216
5343 -216 76 246 134 57 50 104 203 -132 42 -73 52 42 84 24 -34 144 192 58 91 124 -96 -199 180 72
5367 72 23 50 -94 -151 72 277 -43 -42 -6 -278 -190 -19 -83 -42 173 -10 -260 -33 -34 168 143 -170 -257 -81 -199
5392 -199 -121 -125 -125 -139 72 56 252 269 -37 -152 -209 168 -149 -284 121 124 -233 -83 232 -129 24 137 32 -123
5416 -123 33 -24 -8 37 -255 -31 -126 67 120 84 171 -272 -28 -79 -285 -19 175 -231 83 319 -47 7 123
5439 123 -105 -208 -9 152 -153 -40 57 -52 3 2 -341 -3 203 67 -51 17 -55 -80 97 -22 -223 -37
5461 -37 82 -185 145 321 -7 57 172 -138 83 185 -250 73 90 -130 -194 188 -78 -5 139 259 -169 180
5483 180 138 -250 41 158 118 -193 274 -140 -46 37 -145 -318 391 -11 -191 -188 146 -189 144 233 -198 347
5505 347 232 -26 -201 319 227 -361 132 14 -36 51 -56 -243 167 -259 -231 82 214 -160 -215 80 -49 -45
5527 -45 168 -251 -170 435 -59 -287 37 429 -48 51 -21 -121 -88 268 -250 -400 402 -140 -280 166 409 -105
5549 -105 230 53 -111 166 333 -385 270 351 -84 -264 220 -134 -256 206 -174 -230 209 -63 -166 200 201
5570 201 122 -36 177 -258 134 330 -4 -77 307 20 -218 453 246 -323 181 143 -221 193 259 -372 194
5591 194 392 -186 -266 188 -5 78 375 -43 -227 199 19 -197 281 49 -62 -79 242 -132 -16 261 -85
5612 -85 -233 444 -75 -300 267 265 -250 140 -71 -126 314 120 -290 332 34 -35 -115 219 -200 -333 57 -73
5634 -73 -170 149 -166 -359 386 272 -475 -112 171 -50 162 209 -176 -42 418 -256 -152 113 116 -441 -198 118
5656 118 -304 59 -23 -368 9 336 -85 -51 106 127 -128 45 -67 -2 216 -133 -172 129 247 -352 -142 303
5678 303 -50 -53 20 51 159 418 -250 -118 393 99 -307 180 176 -15 -25 -52 -172 -41 389 -166 -179 387 -13
5701 -13 -10 215 23 -240 83 -117 -216 240 122 -266 -206 126 -72 97 127 -357 -14 102 -38 -289 354 237
5723 237 -369 52 175 3 230 161 -341 169 203 -182 -6 336 89 -178 -46 -107 -316 163 -174 -215 181
5744 181 168 -196 -179 175 -383 -113 303 -92 -1 121 -98 13 86 -8 -273 36 9 53 122 159 -486 -168 -1
5767 -1 -257 191 261 -268 -138 383 -108 180 239 -69 57 190 93 70 176 155 93 -91 323 -91 -153 -24 -14
5790 -14 -38 483 -175 -229 -19 321 -29 -60 177 23 -123 -106 -117 81 79 -122 133 -80 89 -105 -89 -82 -66 92
5814 92 130 -318 195 7 -229 -339 146 16 -110 -221 -55 -91 87 -86 -173 174 -51 -111 353 45 25 -196
5836 -196 -20 154 -56 181 56 36 4 221 77 15 194 -377 -99 129 -111 145 -54 78 15 -276 -85
5857 -85 -131 -99 80 -180 -121 -88 -64 -39 -67 -90 82 -181 -170 144 21 189 16 151 -99 37 -127 -326 -293 60
5881 60 -5 50 -42 -16 54 -96 127 93 221 389 -96 65 54 80 -138 -71 8 -23 -120 87 -16 111 -61 -81 35
5906 35 167 210 159 183 -97 -32 -19 -39 -208 0 84 -51 85 107 -141 235 24 -102 -98 -158 -98 18 125 -105
5930 -105 43 0 0 -224 -88 -81 85 88 6 -272 -36 130 -36 14 38 34 -49 272 177 -146 168 178 -395 243 126
5955 126 -141 -131 33 -255 15 0 -13 -250 266 -129 -67 267 10 -413 238 0 -45 106 -35 -318 -273 58
5977 58 -200 -73 114 60 -69 -54 -359 -100 178 -51 -110 -111 223 136 -20 203 -122 -71 31 -452 -98 46 -41
6000 -41 -76 0 269 -86 -28 -182 -212 30 87 -524 46 332 -169 -92 168 84 47 33 -33 75 301 -56 -116 201
6024 201 48 19 -5 169 -83 -124 85 -152 -80 213 -79 -356 12 213 16 56 260 -230 171 203 -371 162
6046 162 136 -157 84 156 64 -157 257 -102 -228 111 -64 -108 143 130 -192 211 172 -223 -132 128 36 30 321
6069 321 -190 -124 126 138 -251 167 -128 -176 150 60 -342 185 239 -249 -21 250 -78 -300 282 81 -72 266
6091 266 -183 -401 402 256 -164 14 220 -110 31 146 -83 192 310 -5 -186 354 108 -273 -21 -64
6111 -64 130 71 -37 -329 -52 -10 -303 -125 328 -42 -94 25 -215 165 185 -5 -133 114 102 -1 76 212
6133 212 -204 201 288 -294 191 192 -206 -85 314 41 -320 45 -104 -88 183 374 -389 90 293 -376 53
6154 53 113 20 -312 89 -169 -3 75 11 10 41 108 -251 -105 -165 -42 124 25 -148 17 -79 -330 17 144 130
6178 130 -179 -19 96 0 -80 272 -130 156 122 -347 80 274 -17 41 0 -202 -134 29 127 -147 221 -62
6200 -62 -33 -25 170 179 91 169 200 4 132 -132 -72 101 89 -76 -178 43 -42 77 -125 -113 105 252 -189 94
6224 94 4 91 -163 198 147 48 117 -222 -62 8 22 -92 231 209 24 -62 219 111 -97 214 -268 -34 180
6247 180 -194 -312 -98 212 -342 205 278 -13 79 180 -380 185 77 40 66 -29 76 -97 25 149 30 200
6269 200 -120 -174 -257 -183 -28 -104 -290 -59 26 297 11 65 188 136 -93 219 -285 170 178 -180 130 170 -175
6292 -175 -131 99 -100 47 168 -32 -235 -90 -93 10 178 -227 54 -6 275 81 -48 -175 -116 -314 -57 -59
6314 -59 -34 20 132 73 -20 115 -27 -12 -35 -49 -159 33 -23 -148 -321 136 -95 -169 210 -165 -148 -9 -204 -21
6338 -21 -2 -78 75 45 44 10 146 -129 -264 -7 46 56 246 127 -109 -15 -67 -251 -134 63 334 77 198 248
6362 248 63 64 -151 -58 -157 -57 54 269 189 -53 -289 177 71 114 52 88 -202 -103 6 -78 -48 -16 -220 -26
6386 -26 100 -211 127 94 24 -56 239 -148 -390 54 -115 -124 -196 -30 -27 -233 -33 -25 81 93 -103 -23 -84 12 71
6411 71 51 -137 -351 116 -79 17 221 -11 143 88 60 136 -12 79 152 -15 -210 -59 0 56 191 68 33 239
6435 239 -38 -115 167 -82 67 -48 90 -201 122 3 -231 200 -58 -32 66 16 -95 -53 -143 -3 35 -39 338
6458 338 -220 -169 4 118 172 -126 3 139 224 30 -51 118 28 184 -114 -54 54 42 26 -337 41 281 97
6481 97 -167 186 104 18 -139 -105 -86 -55 -7 30 46 11 -65 -133 -172 107 -69 -8 -230 -124 66 -101 203 -42 18
6506 18 -92 -43 46 -5 179 115 -58 -14 -175 -275 -91 163 -42 40 56 165 147 45 186 -123 209 -116 -3
6529 -3 1 -198 129 169 -137 -199 9 -133 -183 -55 216 -75 -31 50 -62 50 329 12 -343 279 155 -53 38
6552 38 102 7 18 -189 -161 160 197 47 -238 173 177 38 -7 -39 51 -35 -42 -457 -65 -156 -278 -113 125 -98 147
6577 147 -114 -174 14 235 -115 -238 83 -83 -97 -124 208 -132 -51 12 -231 31 97 -76 263 15 -139 -135 59
6600 59 131 -23 116 115 -31 -121 51 -29 -244 108 137 78 138 -211 -181 166 -182 -95 38 -123 -131 110 63 -135 59
6625 59 124 103 12 94 -266 -72 72 43 -162 24 -75 97 143 -228 107 125 242 -310 270 19 -49 -99 118 -24
6649 -24 -161 -27 -56 -186 150 31 -17 40 160 33 126 -35 -119 203 146 -69 51 157 -57 121 -50 208
6671 208 -230 -47 10 53 310 191 -156 137 12 -206 -209 -60 58 -95 -57 -219 73 -77 -97 -4 -59 448 -144
6694 -144 33 17 -257 -226 119 41 -3 174 -65 -121 116 331 -74 68 72 -156 -4 25 -36 45 57 161 -331 -59
6718 -59 -195 -58 26 44 -33 -47 85 -146 117 39 3 46 70 86 56 12 -311 -231 -74 -130 -89 -52 -76 -58 -44 -87 -146
6745 -146 4 190 -67 57 -234 -44 -134 -133 237 -9 -21 14 -131 167 154 -123 68 96 -7 -258 -263 -199 89
6768 89 57 143 272 111 -133 31 -90 80 40 -228 47 97 -92 193 -69 -16 -26 -25 -315 186 -137 10 -36
6791 -36 -291 -23 92 29 87 25 -138 89 -165 13 -110 -86 61 39 -26 -35 -42 17 161 -20 -34 -129 66 92 27
6816 27 -85 -259 -43 210 170 -204 -175 102 -74 194 75 -139 -37 109 -161 -53 169 -185 -75 341 -39
6837 -39 134 -144 -63 -159 52 110 -5 -28 154 90 -180 -70 -35 231 3 -49 -76 48 91 -131 -68 53 -145 -59
6861 -59 136 21 23 -58 -161 2 169 -67 -54 -17 -34 -237 -6 159 21 -188 112 323 -285 -40 123 54 -49
6884 -49 -94 -138 -85 9 -112 -173 26 103 22 -204 -60 165 -185 -159 188 -187 175 44 -125 4 -112 178 -116
6907 -116 137 140 -175 -127 -8 -246 -35 -105 108 -220 71 -60 -25 -42 -184 -35 37 174 168 -42 156 -125 -199
6930 -199 61 -193 379 75 -2 73 149 196 -90 99 -25 122 113 276 184 268 -50 83 -80 94 121 65 122 -39
6954 -39 23 165 -69 145 -96 68 -83 -90 149 238 -176 104 75 -40 277 -103 -31 93 143 -102 -314 142 31
6977 31 -396 5 140 51 195 55 -159 -40 -165 -108 -8 -78 -118 -119 17 99 -84 122 -36 76 213 -175 197
7000 197 50 106 -40 95 239 150 121 -260 139 -39 -92 -46 98 -35 152 182 246 23 -66 264 251 -152 14
7023 14 -27 -30 113 140 119 -67 119 196 143 107 -305 89 142 -40 84 47 -18 -190 -78 21 -78 55 141 -70 21
7048 21 268 -118 -209 38 -192 101 -104 -91 -41 -12 -119 -29 -72 -10 -147 21 128 -265 -50 186 168 -70 158
7071 158 79 150 245 16 -12 230 -13 -67 183 -123 -163 64 -32 -270 -156 -54 -65 -195 282 5 -79 -303 77
7094 77 50 -42 -67 -190 22 93 -190 304 -17 -58 -111 109 27 -57 55 -169 111 11 199 47 124 -2 -142
7117 -142 121 10 -202 151 154 -55 175 137 180 13 105 27 85 16 2 13 -174 -24 59 166 17 16 15 -78 93
7142 93 69 10 -110 -39 -199 3 168 -171 -26 42 -249 339 -338 238 158 60 -26 221 -27 -21 -119 -7 32 66
7166 66 220 -101 48 -302 -193 -145 18 15 -148 117 -40 114 140 95 101 230 4 -40 208 21 -142 87 180
7189 180 136 52 304 118 -133 -73 119 -74 50 128 -191 54 -23 33 69 26 -146 -166 23 251 4 46 -159
7212 -159 -126 20 -170 -269 40 58 -28 103 139 -44 -119 -4 -341 -43 117 108 -197 74 -88 191 70 -83 -13
7235 -13 -2 -34 -176 -14 109 0 26 -19 13 -14 135 -28 153 -12 217 199 74 -73 -48 43 223 -73 -222
7258 -222 58 -4 177 -147 -67 116 96 -152 -268 -70 -125 -24 87 24 54 -3 82 -82 -41 250 177 48 108 -179
7282 -179 30 -99 17 168 -198 119 -116 -176 147 290 157 136 -12 48 134 172 178 57 161 156 148 2 26 -8
7306 -8 -66 -85 -78 -96 88 -258 47 -271 56 -107 112 86 291 162 -200 -96 123 -44 66 130 154 48 6 26
7330 26 142 -135 168 -56 -158 54 -69 88 68 47 -30 -93 47 141 169 -219 197 10 -74 -129 -205 -15 22 -100
7354 -100 -161 34 73 -43 -108 158 -139 -230 134 -18 -264 -238 -22 -19 -53 -6 81 -197 253 294 7 82 -100 169
7378 169 -141 -7 8 -70 -152 0 63 -52 131 169 187 -117 212 -42 -155 1 65 -145 247 42 -107 -20 7
7401 7 -85 94 -133 -56 -113 -130 -20 -147 -264 -10 154 -89 -45 45 -54 -204 -40 -31 3 107 -26 -53 -79 55 198
7426 198 -2 35 135 112 -118 196 -66 -163 -207 192 6 -153 134 -134 -8 -148 -221 -41 -57 -90 100 -135
7448 -135 206 50 169 238 -81 -29 69 67 81 133 -75 75 -147 54 174 -144 -89 35 60 33 63 -15 -92 166
7472 166 -155 -96 96 13 -82 -322 120 122 44 -76 -182 -82 36 -177 -82 31 -186 -132 -103 58 329 -80 94
7495 94 -125 -94 86 -81 -33 147 207 -138 220 124 20 -7 -98 182 127 22 84 270 -66 -284 -293 80 204 32
7519 32 298 24 -31 24 99 -86 -93 -39 -61 65 11 -113 -88 172 -11 -183 -124 114 -65 108 54 -75 51 105
7543 105 -80 -37 -86 -170 83 46 216 46 -66 -328 222 273 -154 -223 121 11 147 -35 35 9 114 219 207
7566 207 -59 19 -73 -19 155 -105 137 224 29 -32 -94 -102 28 32 40 30 17 -143 41 294 -13 31 -109 8 17 -74
7592 -74 -171 -93 -180 145 -235 -125 -20 53 -58 120 54 -267 -228 -74 -131 167 -134 43 -27 94 -233 74 233
7615 233 75 149 -36 92 -3 -1 60 -14 65 1 38 15 -137 -139 -109 25 -15 -171 -64 80 -270 -133 -31 -169 147
7640 147 123 -66 -134 63 -208 111 96 12 63 -22 83 280 207 -17 -112 -97 158 -165 -151 -253 9 51 159 120
7664 120 172 -72 12 -82 47 -83 -46 -193 57 -63 -51 59 -163 41 -147 -36 -19 190 11 -180 113 109 -39
7687 -39 -91 -237 -36 70 236 -9 41 134 -76 154 -133 -90 -215 78 5 158 2 -80 64 107 -191 -39 39
7710 39 109 -80 -140 36 5 154 -98 -164 180 177 -31 -38 -180 -28 11 76 -97 -34 95 -8 -155 -23 8 -86 -170
7735 -170 202 36 72 81 -131 68 119 -57 -212 -71 258 -9 -175 -207 -160 -89 -129 166 230 -143 47 -28 -309
7758 -309 -84 7 55 67 -79 195 119 -113 -13 -113 -62 -41 103 97 -129 122 -8 -314 132 19 38 -81 234
7781 234 -151 -170 -163 -2 -34 172 9 -57 158 80 -10 -94 38 -8 183 -44 -61 15 -201 -22 -29 54 147 226 83
7806 83 -38 152 69 199 -8 335 183 -7 50 -56 211 -41 50 -162 162 60 -158 59 -21 -110 25 -12
7828 -12 -244 95 -56 -4 -28 204 -118 -102 -50 169 -135 36 130 -8 233 10 272 13 241 -41 -15 119
7850 119 22 98 94 -288 197 25 293 -193 52 174 -81 61 67 -80 -192 26 -184 -104 74 321 124 -18
7872 -18 152 -107 153 111 197 -118 -124 -31 -76 68 -86 30 187 -66 -65 -317 157 73 133 -117 6 46 -55 106
7896 106 -147 -8 121 144 -141 -117 -222 123 -182 -200 77 251 78 20 -85 -93 185 -134 -143 -35 45 -42 3 130
7920 130 256 -252 -29 -77 -197 -184 172 -187 96 67 -128 100 -24 -174 -186 -79 -38 -167 -36 -235 102 -115
7942 -115 137 -61 -109 58 29 192 -135 -93 -182 118 15 -27 69 -71 -178 134 -9 58 198 49 34 20 -8
7965 -8 -55 -47 -111 15 94 -17 16 -219 -19 -163 -158 -36 126 -10 -301 -8 3 -86 251 -230 -81 -52 -70 -134 34
7990 34 -17 3 -23 67 -10 91 89 -28 -80 -114 280 -150 -21 191 13 -265 -157 -53 -85 -243 -176 -137 -63 -38 203
8015 203 -40 -7 -57 -179 -173 -192 -118 111 263 34 10 -252 0 123 -130 -83 52 -106 16 104 -51 -218 51
8038 51 -75 -57 137 -60 -204 154 237 -43 169 43 -219 -171 85 -44 294 -66 -212 -123 209 111 103 221 -46
8061 -46 150 161 -275 -31 -189 108 -129 185 215 72 260 -48 84 16 80 45 -53 6 166 -187 173 100 -96
8084 -96 -33 59 -142 259 178 56 58 -71 -47 110 39 -28 174 -120 -91 -64 4 -20 -150 17 -87 -96 109 85 90 228
8110 228 4 -41 -80 6 64 -164 125 -155 21 13 28 11 -212 -301 -58 -20 190 28 -192 108 257 -69 114
8133 114 -129 -253 -11 92 -58 67 -116 -22 44 -117 -93 -86 228 -362 -118 -31 -21 173 -150 -62 -21 83 -127
8156 -127 24 44 -92 -156 127 -38 68 -70 -64 85 111 49 -7 -112 247 -145 253 123 13 37 162 94 145
8179 145 -229 -109 -53 23 -60 155 -105 -80 90 99 -61 101
8191A01
##END NTUPLES=NMR FID
##END=
