##TITLE=1H_UK_26_2_7
 CD2CL2
 8 sc, 
 11.04.2022
##JCAMPDX= 6.0         $$ Bruker NMR JCAMP-DX V2.0
##DATA TYPE= NMR FID
##DATA CLASS= NTUPLES
##ORIGIN= UXNMR, Bruker Analytische Messtechnik GmbH
##OWNER= root
$$ XWIN-NMR		Version 3.5
$$ Mon Apr 11 10:30:04 2022 Russian Standard Time (UT+4h)  she@DPX200
##.OBSERVE FREQUENCY= 200.13135
##.OBSERVE NUCLEUS= ^1H
##.DELAY= (6, 6)
##.ACQUISITION MODE= SIMULTANEOUS
##.ACQUISITION SCHEME= undefined
##.AVERAGES= 8
##.DIGITISER RES= 18
##SPECTROMETER/DATA SYSTEM= spect
##.PULSE SEQUENCE= zg30
##.SOLVENT NAME= CD2Cl2
##.SHIFT REFERENCE= (INTERNAL, CD2Cl2, 0, 15.7039)
##AUDIT TRAIL= $$ (NUMBER, WHEN, WHO, WHERE, WHAT)
$$ ##TITLE= Audit trail, XWIN-NMR		Version 3.5
$$ ##JCAMPDX= 5.01
$$ ##ORIGIN= Bruker BioSpin GmbH
$$ ##OWNER= she
$$ F:/spectra/data/she/nmr/H-F/1/audita.txt
$$ ##AUDIT TRAIL=  $$ (NUMBER, WHEN, WHO, WHERE, WHAT)
(   1,<2022-04-11 10:28:56.68 +0400>,<she>,<DPX200>,
      <created by zg, POWCHK disabled, PULCHK disabled
       configuration hash MD5:
       00 E9 B6 7A A2 85 ED C7 34 08 36 98 17 FE 4E 26
       data hash MD5: 16K
       13 65 91 F7 C6 85 6F 6B 76 61 6D F9 A3 D0 35 D0>)
$$ ##END=
$$ 
$$ hash MD5
$$ CF B3 C6 7E 48 64 BF 41 7D 83 0A 31 41 E6 E9 E3
##$RELAX= 
##$RELAX= 
##$RELAX= 
##$RELAX= 
##$RELAX= 
##$RELAX= 
$$ Bruker specific parameters
$$ --------------------------
##$DU= <F:/spectra>
##$EXPNO= 1
##$NAME= <H-F>
##$PROCNO= 1
##$TYPE= <nmr>
##$USER= <she>
##$AMP= (0..31)
100 100 100 100 100 100 100 100 100 100 100 100 100 100 100 100 100 100 
100 100 100 100 100 100 100 100 100 100 100 100 100 100 
##$AQSEQ= 0
##$AQ_mod= 1
##$AUNM= <au_zg>
##$AUTOPOS= <>
##$BF1= 200.13
##$BF2= 200.13
##$BF3= 200.13
##$BF4= 200.13
##$BF5= 200.13
##$BF6= 200.13
##$BF7= 200.13
##$BF8= 200.13
##$BYTORDA= 1
##$CFDGTYP= 0
##$CFRGTYP= 5
##$CHEMSTR= <none>
##$CNST= (0..31)
1 1 145 1 1 1 1 1 1 1 1 1 1 1 1 1 1 1 1 1 1 1 1 1 1 1 1 1 1 1 1 1 
##$CPDPRG= <>
##$CPDPRG1= <>
##$CPDPRG2= <>
##$CPDPRG3= <>
##$CPDPRG4= <mlev>
##$CPDPRG5= <mlev>
##$CPDPRG6= <mlev>
##$CPDPRG7= <mlev>
##$CPDPRG8= <mlev>
##$CPDPRGB= <>
##$CPDPRGT= <>
##$D= (0..31)
0 1.2 0 0 0 0 0 0 0 0.06 0 0.03 0 0 0 0 0.0002 0 0 0 0 0 0 0 0 0 0 0 0 
0 0 0 
##$DATE= 1649658536
##$DBL= (0..7)
120 120 120 120 120 120 120 120 
##$DBP= (0..7)
150 150 150 150 150 150 150 150 
##$DBP07= 0
##$DBPNAM0= <>
##$DBPNAM1= <>
##$DBPNAM2= <>
##$DBPNAM3= <>
##$DBPNAM4= <>
##$DBPNAM5= <>
##$DBPNAM6= <>
##$DBPNAM7= <>
##$DBPOAL= (0..7)
0.5 0.5 0.5 0.5 0.5 0.5 0.5 0.5 
##$DBPOFFS= (0..7)
0 0 0 0 0 0 0 0 
##$DE= 6
##$DECBNUC= <off>
##$DECIM= 32
##$DECNUC= <off>
##$DECSTAT= 4
##$DIGMOD= 1
##$DIGTYP= 9
##$DL= (0..7)
0 120 120 120 120 120 120 120 
##$DP= (0..7)
150 150 150 150 150 150 150 150 
##$DP07= 0
##$DPNAME0= <>
##$DPNAME1= <>
##$DPNAME2= <>
##$DPNAME3= <>
##$DPNAME4= <>
##$DPNAME5= <>
##$DPNAME6= <>
##$DPNAME7= <>
##$DPOAL= (0..7)
0.5 0.5 0.5 0.5 0.5 0.5 0.5 0.5 
##$DPOFFS= (0..7)
0 0 0 0 0 0 0 0 
##$DQDMODE= 0
##$DR= 18
##$DS= 0
##$DSLIST= <SSSSSSSSSSSSSSS>
$$ [...]
##$SUBNAM2= <"">
##$SUBNAM3= <"">
##$SUBNAM4= <"">
##$SUBNAM5= <"">
##$SUBNAM6= <"">
##$SUBNAM7= <"">
##$SUBNAM8= <"">
##$SUBNAM9= <"">
##$SW= 18.05172834244
##$SWIBOX= (0..15)
0 0 2 0 0 0 0 0 0 0 0 0 0 0 0 0 
##$SW_h= 3612.71676300578
##$TD= 16384
##$TD0= 1
##$TE= 0
##$TE2= 300
##$TE3= 300
##$TEG= 300
##$TL= (0..7)
0 120 120 120 120 120 120 120 
##$TP= (0..7)
150 150 150 150 150 150 150 150 
##$TP07= 0
##$TPNAME0= <>
##$TPNAME1= <>
##$TPNAME2= <>
##$TPNAME3= <>
##$TPNAME4= <>
##$TPNAME5= <>
##$TPNAME6= <>
##$TPNAME7= <>
##$TPOAL= (0..7)
0.5 0.5 0.5 0.5 0.5 0.5 0.5 0.5 
##$TPOFFS= (0..7)
0 0 0 0 0 0 0 0 
##$TUNHIN= 0
##$TUNHOUT= 0
##$TUNXOUT= 0
##$USERA1= <user>
##$USERA2= <user>
##$USERA3= <user>
##$USERA4= <user>
##$USERA5= <user>
##$V9= 5
##$VALIST= <valist>
##$VCLIST= <CCCCCCCCCCCCCCC>
##$VD= 0
##$VDLIST= <DDDDDDDDDDDDDDD>
##$VPLIST= <PPPPPPPPPPPPPPP>
##$VTLIST= <TTTTTTTTTTTTTTT>
##$WBST= 1024
##$WBSW= 4
##$XGAIN= (0..3)
0 0 0 0 
##$XL= 0
##$YL= 0
##$YMAX_a= 390250
##$YMIN_a= -460331
##$ZGOPTNS= <>
##$ZL1= 120
##$ZL2= 120
##$ZL3= 120
##$ZL4= 120
##$ABSF1= 10
##$ABSF2= 0
##$ABSG= 5
##$ABSL= 3
##$ALPHA= 0
##$AQORDER= 0
##$ASSFAC= 0
##$ASSFACI= 0
##$ASSFACX= 0
##$ASSWID= 0
##$AUNMP= <proc_1d>
##$AZFE= 0.1
##$AZFW= 0.1
##$BCFW= 1
##$BC_mod= 2
##$BYTORDP= 1
##$COROFFS= 0
##$CY= 11.3945322036743
##$DATMOD= 1
##$DC= 2
##$DFILT= <>
##$DTYPP= 0
##$F1P= 2.36226072786647
##$F2P= -0.459571619588291
##$FCOR= 0.5
##$FTSIZE= 0
##$FT_mod= 4
##$GAMMA= 1
##$GB= 0.15
##$INTBC= 1
##$INTSCL= 1
##$ISEN= 128
##$LB= 0.24
##$LEV0= 0
##$LPBIN= 0
##$MAXI= 10000
##$MC2= 0
##$MEAN= 0
##$ME_mod= 0
##$MI= 1.114404
##$NCOEF= 0
##$NC_proc= 0
##$NLEV= 6
##$NOISF1= 3.799351
##$NOISF2= 2.8
##$NSP= 1
##$NTH_PI= 0
##$NZP= 0
##$OFFSET= 15.70392
##$PC= 1
##$PHC0= -18391.93
##$PHC1= 17.20078
##$PH_mod= 1
##$PKNL= yes
##$PPARMOD= 0
##$PSCAL= 0
##$PSIGN= 0
##$REVERSE= no
##$SF= 200.130013532006
##$SI= 16384
##$SIGF1= 3
##$SIGF2= 2
##$SINO= 400
##$SIOLD= 16384
##$SREGLST= <1H.CDCl3>
##$SSB= 0
##$STSI= 0
##$STSR= 0
##$SW_p= 3612.71676300578
##$SYMM= 0
##$S_DEV= 0
##$TDeff= 0
##$TDoff= 0
##$TI= <>
##$TILT= no
##$TM1= 0
##$TM2= 0
##$TOPLEV= 0
##$USERP1= <user>
##$USERP2= <user>
##$USERP3= <user>
##$USERP4= <user>
##$USERP5= <user>
##$WDW= 1
##$XDIM= 8192
##$YMAX_p= 0
##$YMIN_p= 0
$$ End of Bruker specific parameters
$$ ---------------------------------
##NTUPLES= NMR FID
##VAR_NAME=  TIME,          FID/REAL,        FID/IMAG
##SYMBOL=    X,             R,               I
##VAR_TYPE=  INDEPENDENT,   DEPENDENT,       DEPENDENT
##VAR_FORM=  AFFN,          ASDF,            ASDF
##VAR_DIM=   8192,          8192,            8192
##UNITS=     SECONDS,       ARBITRARY UNITS, ARBITRARY UNITS
##FACTOR=    0.0002768,     1,               1
##FIRST=     0,             0,               0
##LAST=      2.2672688,     0,               0
##MIN=       0,             -460331,         0
##MAX=       2.2672688,     390250,          0
$$ Real data points
##PAGE= N=1
##DATA TABLE= (X++(R..R)), XYDATA
0@%%%%%%%%pJ5j6J6j7K5l3M1n6P2q8J04j20J44j73K03k39K80l26L76m34N00n74
$$ 0 0 0 0 0 0 0 0 0 -7 8 -8 8 -9 16 -17 24 -32 40 -48 56 -64 80 -93 110 -129 151 -175 201 -233 267 -307
31c07O54p42Q44r55J076j211J358j521J699j893K105k335K589k868L172l501L862
$$ -307 347 -395 449 -506 570 -641 717 -804 895 -998 1107 -1228 1361 -1507 1665 -1836 2026
48B026m259M693n171N696o276O920p637Q444r358J0401j1603J3007j4675J6694
$$ 2026 -2233 2460 -2711 2985 -3291 3629 -4008 4436 -4922 5479 -6124 6883 -7792 8902
62H902j9190K2374k6600L2511m1418N6511q8645K75210l07829k56242O65313k35422
$$ 8902 -10288 12086 -14514 17997 -23421 33090 -55555 219655 -88174 -344416 320897 85475
74H5475k63516K87913j08566k24395M53041j03244m67199L86589L20081n45376
$$ 85475 -178041 109872 1306 -223089 229952 126708 -340491 46098 366179 -179197
84a79197m9181M03753j29407j47980J33713j63386L7974L24094k15453k89909
$$ -179197 -228378 175375 45968 -102012 31701 -131685 -93711 230383 14930 -274979
94b74979L37407J29630k77618J6697J00279o1604R4394n0156j94076K25309J74923
$$ -274979 62428 192058 -85560 -68863 31416 -30188 64206 14050 -180026 45283 220206
105B20206l29595m3766K94818o3322j13940P1558j25207L2340K63724k13666k49903
$$ 220206 -109389 -153155 141663 78341 -35599 35959 -89248 -56908 206816 -6850 -256753
116b56753L52261R8772l50278R2996K07874j82941K1928J10176k25300P8499K85637
$$ -256753 95508 194280 -155998 -63002 144872 -38069 -16141 94035 -131265 -52766 232871
127B32871k91220k00355L89631L0619l07952J25925J05130j53671J26846M6444
$$ 232871 -58349 -258704 130927 161546 -146406 -20481 84649 -69022 57824 104268
137A04268k62599J28059K35512k82151j00595L05268n8868j92547J37333M744
$$ 104268 -158331 -30272 205240 -76911 -177506 127762 68894 -123653 13680 18424
147A8424q5142J61969n5017k22092J97128J54565k58669k0982K02459q5729n5813
$$ 18424 -66718 95251 40234 -181858 15270 169835 -88834 -109816 92643 6914 -48899
158d8899J08073q6645j9680J68760j09426j48560K01934N5036k06325L7373J12629
$$ -48899 59174 -27471 -47151 121609 12183 -136377 65557 120593 -85732 -48359 64270
169F4270p4057J9733L4127j16069N5775J32639j35203p7582J48407j0518j00681
$$ 64270 -9787 9946 44073 -71996 -16221 116418 -18785 -96367 52040 41522 -59159
180e9159N3923P851l2861O8128l8136q3901J15056M8250j35494J4499Q7864n4709
$$ -59159 -5236 2615 -30246 37882 -254 -84155 30901 79151 -56343 -41844 46020 -8689
192h689j271L7816p7717K7921J03093r9625n6793J41821j7493j13940P9116L3766
$$ -8689 -9960 27856 -49861 -21940 81153 -18472 -75265 66556 49063 -64877 14239 48005
204D8005q7775N3175K8219j09954N6349J01867j24756l8239J40172l6899r0142
$$ 48005 -39770 13405 41624 -68330 -11981 89886 -34870 -73109 67063 30164 -59978
215e9978Q4535N196q0897O7128K3015r9922M7457P8496r5428k2100J01908k9043
$$ -59978 24557 29753 -51144 15984 38999 -60923 -13466 65030 -30398 -52498 49410 20367
227B0367n9358N4888M22m4369M2341N666n7795L1154M0530m7253r131M2915j0664
$$ 20367 -38991 15897 16319 -28050 14291 19957 -37838 -6684 33846 -13407 -22538 20377 9713
240I713j8146J4170m823l792J1339j4091q898J8230n95r675O949j717L096J3622
$$ 9713 -8433 5737 914 -2878 8461 -5630 -14528 3702 3107 -6568 381 -1336 1760 15382
254A5382j5713j0936K4454m371k5578J7217R678k3217J0303J5822k2465O230K5292
$$ 15382 -331 -11267 13187 8816 -16762 455 10133 -13084 -2781 13041 -9424 -3194 22098
267B2098k5033j2297L1257j0040k6699K3025O624k7456J5085J6731k4136M536
$$ 22098 -2935 -15232 16025 5985 -20714 2311 8935 -18521 -3436 13295 -10841 -6305
279f305K5611k0358j1383K6336p696k2845J9071O425k2855R304J6878j7989j52
$$ -6305 19306 -1052 -12435 13901 6205 -16640 2431 8856 -13999 -4695 12183 -5806 -5958
292e958K1286j1538j3511J8246L3k0066R016J1435j6920j221J8052p196r794J6092
$$ -5958 15328 3790 -9721 8525 8558 -11508 -2492 8943 -7977 -9198 8854 1658 -8136 7956
306G956J927j7208O460J0953j5867m694J6174o467j2763J4808O290j5309O543
$$ 7956 9883 -7325 -865 10088 -5779 -10473 5701 -766 -13529 1279 7569 -7740 -1197
319a197J4248j4094o605J6667n337j5760J2556O537j6602M129J7387j0843p976
$$ -1197 13051 -1043 -7648 9019 3682 -12078 478 7015 -9587 -5458 11929 1086 -6890
332f890J7645j355j7205R635R486j8535j517J7516j0909j1607J9524K842j8585
$$ -6890 10755 9400 -7805 1830 11316 -7219 -8736 8780 -2129 -13736 5788 8630 -9955
345i955J0354J3954j9546l352J9037j1484j4398J8792O10j9672J3857J3416j8804
$$ -9955 399 14353 -5193 -8545 10492 -992 -15390 3402 4012 -15660 -1803 11613 -7191
358g191J895J8914j2692j0029J6597k907j4169J0829K961j1565Q561P934j0931
$$ -7191 -5296 13618 926 -9103 7494 4587 -9582 1247 4208 -7357 1204 9138 -1793
371a793J359R630n908l607K234l386J976R89r339M858Q837r519p99J1451p886
$$ -1793 -434 9196 3288 -319 1915 -1471 505 1494 -7845 -2987 5850 -3669 -4468 6983 -903
386i03j754J1490j4096p183K3685p525k5197K2584J2814k5926R777J8065k3523
$$ -903 -2657 8833 -5263 -12446 11239 3714 -21483 1101 13915 -12011 -2234 15831 -7692
399g692N403K2702l0325o549M0404k1717l3413L9176Q538l5119K0612J2196l1679
$$ -7692 -2289 20413 -9912 -16461 23943 2226 -31187 7989 16527 -18592 2020 14216 -17463
412a7463K4382K0408n0471Q038M9972m0009k6556M9808r253l0666L5803o875l2608
$$ -17463 6919 27327 -23144 -15106 34866 -5143 -31699 18109 8856 -21810 13993 7118 -25490
425b5490M7826M510o6488L2674N0784n7564j3891M9259k4869j1713M2044l4173
$$ -25490 22336 26846 -39642 -6968 43816 -13748 -27639 21620 -3249 -14962 27082 -7091
437g091k3420O6743j6344o6932N1126L4747o1916M041L3302k9956J7076K5454
$$ -7091 -30511 36232 19888 -47044 4082 38829 -23087 -19046 14256 -15700 1376 26830
449B6830n9304Q229P4081m4131n0275N8762O569l9279K6913r722k5898N8950o591
$$ 26830 -32474 -24245 49836 5705 -44570 14192 20761 -18518 8395 -1327 -27225 31725 25134
462B5134p7956N5749N9528q0564j3165O0182l2150l679M0724o6981r751J07034
$$ 25134 -52822 2927 62455 -18109 -31274 28908 -3242 -6921 33803 -33178 -42929 64105
474F4105m7302r4391R6165L9089r8587K7814M7473o5122L2577M6061j05157J5472
$$ 64105 16803 -77588 18577 57666 -40921 -13107 34366 -30756 1821 47882 -57275 -41803
486d1803J28724q3044r2211J17246K2687q9536M2636J4250o2284O8916K5262j20561
$$ -41803 86921 3877 -88334 28912 51599 -37937 4699 18949 -43335 25581 50843 -69718
498f9718M1507J13858r5436n8914J02874l862n0654L8101l0941k3318R6332l0669
$$ -69718 -28211 85647 -9789 -68703 34171 30309 -20345 17756 -13185 -36503 59829 29160
510B9160j13828Q0186P5297r2654j0940N3709l2083K1090K6918q9217K4845J12546
$$ 29160 -84668 -4482 70815 -21839 -32779 20930 -11153 9937 36855 -52362 -27517 85029
522H5029q9873q1847J17849J7429q4357L8433J606m4424R1091k565j39970P4648
$$ 85029 -4844 -86691 31158 48587 -35770 2663 4269 -40155 50936 48371 -91599 -16951
534a6951J19278j28750m8154J21088l1204n1573O8149m6503l7345J26881l8720
$$ -16951 102327 -26423 -74577 46511 15307 -36266 31883 -14620 -51965 74916 36196
545C6196j44804J13710R6690j40008j7754R4127m5467Q23N3957r2669j603J38699
$$ 36196 -108608 5102 101792 -38216 -55970 38157 -7310 -6487 47470 -45199 -46802 91897
557I1897p3061j16093J22880M6474j13320K0311M0704m5435N2833J2755j18634
$$ 91897 18836 -97257 25623 72097 -41223 -20912 19792 -25643 27190 39945 -78689
568g8689N5365J25186j10786p2291J14999j672o0155M4339k8761l1689J01887
$$ -78689 -23324 101862 -8924 -81215 33784 32112 -28043 16296 -12465 -44154 57733
579E7733k9043j22612R9308Q6013j26792j6765R1092l6907p360L9484q1263P822
$$ 57733 28690 -93922 5386 91399 -35393 -52158 38934 2027 -5333 34151 -47112 -39290
591c9290J25654p4372j05359J17916M1482j04095K4325L8302m8507M5471J4156
$$ -39290 86364 11992 -93367 24549 66031 -38064 -13739 24563 -23944 21527 35683
602C5683j05634N2118J09536j08574o1982J16896j716o4312M1483j9900l0651
$$ 35683 -69951 -17833 91703 -16871 -78853 38043 36327 -27985 13498 -6402 -37053
613c7053R0417k4420j14144Q5996P8639j15278j2768R0416l8632j8361M7319o2100
$$ -37053 53364 28944 -85200 796 79435 -35843 -48611 41805 3173 -15188 32131 -29969
625b9969m019J07460o2022r9670J07562M5111j04439J8697N0652n0131K7023L3449
$$ -29969 -33988 73472 11450 -88220 19342 64453 -39986 -21289 29363 -20768 6255 39704
637C9704q5865K1264R7789p8664o4491J00496Q015p2297L2976J0221l3004N3155
$$ 39704 -46161 -24897 72892 -5772 -70263 30233 38248 -34049 -1073 9148 -23856 29299
649B9299j919q3204N0326O8027p9374k5140O7545j7302k3117K9953k9817n057
$$ 29299 27380 -55824 -5498 62529 -16845 -41985 25560 8258 -14859 15094 -14723 -19780
661a9780O3382l7676n9694P0173K6127o9665J1329L1967k9466K0088J4539n7811
$$ -19780 43602 5926 -53768 16405 42532 -27133 -15804 16163 -13303 6785 21324 -36487
673c6487K4175O4108o0180l4891P1507p517m8806L5285M17l2109M4735j030o4064
$$ -36487 -12312 51796 -8384 -43275 28232 20715 -28091 7194 7611 -24498 20237 19207 -44857
686d4857M4255N0012o8309j1854O1009k4941k4560L7249k2543k0556N2151j4961
$$ -44857 -602 49410 -18899 -30753 30256 5315 -19245 18004 -4539 -25095 27056 12095
698A2095n2682M8053K8009n6890N967L8183k7459k873K3721l0158j977M3310k6033
$$ 12095 -40587 7466 35475 -21415 -15448 22735 -4724 -7597 16124 -14034 -16011 27299 1266
711A266l1466M1259P917l4018J3689J2063j9382J2885O537k7473J2357K4307k6961
$$ 1266 -30200 11059 18976 -15042 -1353 10710 -8672 4213 10750 -16723 -4366 19941 -7020
724g020r166K7499o195j2224J2602o387n880J8537q883j9161K0689O823k1808
$$ -7020 -16186 11313 5118 -7106 5496 -891 -6771 11766 2883 -16278 4411 11234 -10574
737a0574P025J1828j2872M654Q346j6561N020J8035j9078r064K2548n293j5531
$$ -10574 -3549 8279 -4593 61 8407 -8154 -3134 14901 -4177 -13241 9307 4014 -11517
750a1517J5389M44j3689J4177M147j9747J0007J4640k0135l149J9763j0057j0192
$$ -11517 3872 4316 -9373 4804 8951 -10796 -789 13851 -6284 -9433 10330 273 -9919
763i919J5551k372j2353J3852L128j6520P874J1062j4250k562J3087o283p770
$$ -9919 5632 3260 -9093 4759 7887 -8633 -759 10303 -3947 -6509 6578 295 -7475
776g475J0181k10p895O598M017q382J384P024n489l991N836K89m842J633L123
$$ -7475 2706 2496 -5399 1199 5216 -3166 -1782 5242 -247 -4238 1598 1887 -2955 -1322 1801
791A801k276q45K994o7k703J339K156l507j460L835p37l888L272K696m437R48
$$ 1801 -475 -1320 1674 1607 -1096 243 2399 -1108 -2568 1267 530 -3358 -86 2610 -1827 -879
807h79M586l307k760M962r40n023K983K684n008M78M967l009j942N255p06m928
$$ -879 3707 400 -2360 2602 1662 -3361 -378 2306 -2702 -2224 2743 -266 -2208 3047 2341 -2587
823b587L142K012n126M91M342l711j554M783r88l105L417J727m440J131K741l829
$$ -2587 555 2567 -2559 -2068 2274 -1437 -2991 1792 804 -2301 1116 2843 -1597 -466 2275 -1554
839a554o29L433j769k244L639j17k511K343J921l643J017K303k613m51J764j200
$$ -1554 -2183 1250 -519 -2763 876 759 -1752 591 2512 -1131 -114 2189 -424 -875 889 -311
855c11n28J513q74o50K198q44r76J125n46m7L97j834N9K746j711j722L297l88
$$ -311 -839 674 -200 -850 1348 504 -472 653 107 60 457 -1377 -1318 1428 -283 -2005 1292 904
873I04k208L430r59m702N139J511q488L825O733p965j443R254n467l519J0003
$$ 904 -1304 2126 1167 -3535 1604 3115 -5373 -1548 5185 -2780 -4223 5031 -436 -3955 6048
888F048n203q866J3458P70j6639R472J0527j5400O90J4216j1512l178J5940j0783
$$ 6048 845 -8021 5437 6207 -10432 -960 9567 -5833 -5143 9073 -2439 -5617 10323 -460
902d60j0494K0857k406k2011J4421J1796j9210K973J3072j4140J956J5953j7024
$$ -460 -10954 9903 7497 -14514 -93 11703 -7507 -4534 8538 -5602 -3646 12307 -4717
915d717o335K3641p809j9011J6831N534j5363Q027L071j3055J3911O808k4114
$$ -4717 -11052 12589 4780 -14231 2600 8134 -7229 798 3869 -9186 4725 11533 -12581
928a2581O082K1423j6923q007J5822p032k940J4540j5533p605K9038q337k8228
$$ -12581 -6499 14924 -1999 -10006 5816 -1216 -4156 10384 -5149 -12754 16284 7947 -20281
941b0281K3249J3308k6098O586J1538j9711J3447J6753l5506J538M2168k3164
$$ -20281 2968 16276 -9822 -3236 8302 -11409 2038 18791 -16715 -15177 26991 3827
953C827k8998L5501K408k7240K0182J242k6947K9273J2486m7963J3728M5445l4992
$$ 3827 -25171 10330 12738 -14502 5680 6922 -20025 9248 21734 -26229 -12501 32944 -2048
966b048k2106L7244p674j6533K5463j7271k1593M4545j087n1672K8134L4543l9298
$$ -2048 -24154 13090 5416 -11117 14346 -2925 -24518 20027 18940 -32732 -4598 29945 -9353
979i353m730K7041j9254M647K2356l8088m374N4566k3035m5443M1012J6387l4010
$$ -9353 -14083 12958 -6296 -1649 20707 -17381 -21755 32811 9776 -35667 5345 21732 -12278
992a2278J3557M801k5201L1724J1574n5938J7516N3848m2532k7958M4706m497
$$ -12278 1279 6080 -19121 12603 24177 -31761 -14245 39603 -2929 -30887 13819 9322
1004I322j9604K4738k1418j8904N5007p693o4016L7300M3311m9561o968L3637
$$ 9322 -10282 14456 -6962 -25866 29141 21448 -42568 -5268 38043 -11518 -18486 15151
1016A5151k2615N499K6798m6119l943O7039l0914n7071N2945K3410m6831J3147
$$ 15151 -7464 -1965 24833 -21286 -25229 41810 10896 -46175 6770 30180 -16651 -3504
1028c504J1597k9146L5073J5795o7355J8508O7999m9880l8767N6832k116l0783
$$ -3504 8093 -21053 14020 29815 -37540 -19032 48967 -913 -39680 17152 15036 -15747
1040a5747K8119j5800k4488N9014n806p4677M2001N6526o0429j6779M5385j9479
$$ -15747 12372 -3428 -27916 31098 25292 -49385 -7384 49142 -11287 -28066 17319 -2160
1052b160l703L0303m3574r553P0715k7192o4448N4874L1901n3698N317K1774k5572
$$ -2160 -5863 24440 -19134 -28687 42028 14836 -49612 5262 37163 -16535 -11218 10556 -15016
1065a5016K5668J5413o1775J5862O7991m5622m3808N4145N583l1834K1356j0810
$$ -15016 10652 26065 -35710 -19848 48143 2521 -41287 12858 18441 -13393 7963 -2847
1077b847k0757N0572n868o6612M0208N1714n7715j6569M4625j5916m722K4953
$$ -2847 -23604 26968 21100 -45512 -5304 46410 -11305 -27874 16751 835 -3887 21066
1089B1066m1024n715O7767k9912o1617N7055K8941n6166R056K5072k9013K1918
$$ 21066 -19958 -25673 42094 12182 -49435 7620 36561 -19605 -10549 14523 -14490 7428
1101G428J8706n9744J4405O8329m8381m5777O0245P716m0577K2703j774k6139
$$ 7428 26134 -33610 -19205 49124 743 -45034 15211 22927 -17650 5053 3279 -22860
1113b2860M3472L298o3910L0455N3352n2608k1727M7684j0283j6502K3465k4229
$$ -22860 20612 23910 -40000 -9545 43807 -8801 -30528 17156 6873 -9629 13836 -10393
1125a0393j1106N2538j6745n4871M1916L2098m6571n54K5544j8959J0035J5381
$$ -10393 -21499 31039 14294 -40577 1339 33437 -13134 -13688 11856 -7103 2932 18313
1137A8313m0671P827M9923l4360l5334M5767P711l3078J4944J606j7818L1388
$$ 18313 -22358 -14531 35392 1032 -34302 11465 19176 -13902 1042 2648 -15170 16218
1149A6218k20m7295K5992L9756m3578j3829L8544j1766j3266K1590j9440j0010
$$ 16218 15998 -31297 -5305 34451 -9127 -22956 15588 3822 -9444 12146 -7294 -17304
1161a7304M2178j5655m2715L8291K2940m2200L534K4449k0586N937J7881l2689
$$ -17304 24874 9219 -33496 4795 27735 -14465 -10931 13518 -7068 -1131 16750 -15939
1173a5939J963M1974k5741l0338L8480O502l1571J4277Q601j9981J7826Q099l4235
$$ -15939 -13976 27998 2257 -28081 10399 16901 -14670 -393 8208 -11773 6053 14152 -20083
1186b0083J3011L2281k9245j5587L0820m486j6432J5349n189j1661K2612l164
$$ -20083 -7072 25209 -4036 -19623 11197 6711 -9721 5628 439 -11222 11390 8226
1198H226k7039J8857J7689k5280j440J7473r711j032J0248j5417J28K2009j3396
$$ 8226 -18813 44 17733 -7547 -8987 8486 -1225 -2257 7991 -7426 -7298 14711 1315
1211A315j6324K0986L105j7236Q313L854j0758J0724L203j8847R746J6104j9050
$$ 1315 -15009 5977 9082 -8154 159 4013 -6745 3979 7182 -11665 -1919 14185 -4865
1224d865m978J8388o452q885J2169n385q144J5736k875j6715J3298R555j7901
$$ -4865 -9843 8545 2093 -6792 5377 -8 -8152 7584 4709 -12006 1292 10847 -7054
1237g054K115J2723r987j957J0696q813l994J4276n639j1907J2415L963j2629
$$ -7054 -4939 7784 -2203 -4160 6536 -2277 -6271 8005 2366 -9541 2874 6837 -5792
1250e792M431O236q052K014O099q352k96R726o098n616Q613n9o416M287J352m276
$$ -5792 -1361 4875 -3177 -1163 4936 -3416 -3712 6014 -84 -5700 2913 2854 -3562 725 2077 -2199
1266b199L030J361n110K232L847m409p64L822j511j471K302j109j000K395j261
$$ -2199 831 2192 -2918 -686 3161 -1248 -2012 1810 299 -1172 1130 21 -979 1416 155
1281A55j927K731l58k177J565P16j790J769L30k204J212J679k674K85J990j790
$$ 155 -1772 959 601 -1576 -11 705 -1085 684 1014 -1190 22 1701 -973 -688 1302 -488
1297d88o33K432j201j563K460j04k151J728J084l063J332J984k691j43K485j435
$$ -488 -1121 1311 110 -1453 1007 903 -1248 480 1564 -1499 -167 1817 -874 -1017 1468 33
1313C3j739K844qk840K211Q12k894P08K317k094p93K896j024k116K019J026k480
$$ 33 -1706 1138 1130 -1710 501 1313 -1581 -873 1444 -650 -1443 1453 429 -1687 332 1358 -1122
1330a122O44J847j803m99K053p13j945J982K83j642M76J854j376r96J564nj270
$$ -1122 -478 1369 -434 -933 1120 407 -1538 444 727 -915 -439 1415 39 -957 607 602 -668
1347f68K77J126j097o50J355L99j996J118J749k041j015K538k64k689K603Q51
$$ -668 -391 735 -362 -1012 343 742 -1254 -136 1613 -428 -1443 1095 831 -1858 745 1596
1363A596l677J427L110l575r79N013k118m098M586J005n224K655K997n377J433
$$ 1596 -2081 -654 2456 -1119 -2098 2915 797 -3301 1285 2290 -2934 -279 2718 -2659 -1226
1378a226M964n533j423O992k487n708N944R75n879L678K282o107L222M679o948
$$ -1226 3738 -1795 -3218 3774 1287 -4421 1523 2498 -3381 297 2579 -3528 -306 4373 -2575
1393b575Q3P155m337l728N685j379l500N062k100m903P064Q97q531M114N835o508
$$ -2575 -2492 4663 326 -3402 2283 904 -2596 2466 366 -4537 2527 3424 -5107 -993 4842 -1666
1409a666L71M008n461K102N883q643j889J1405m660q354R214J004p137O296k99
$$ -1666 -1295 2713 -2748 -646 5237 -3406 -5295 6110 1450 -6904 2310 3314 -3823 2473 2174
1424B174q780R619M188j5288L746J4041j0907n339J1446m943l971J1014p740q707
$$ 2174 -6606 3013 7201 -8087 -4341 9700 -1207 -6546 4900 -43 -4014 7000 -740 -9447
1438i447J7323n70j9716J0914J2316j5790R52R984j0887L226J2888j7275n082
$$ -9447 7876 7306 -12410 -1496 10820 -4970 -4018 5966 -4921 -1695 11193 -6082 -11164
1451a1164K4024p955j9394J6903N944j5306Q005L912j4743J3016J0302k5368K700
$$ -11164 12860 4905 -14489 2414 8358 -6948 1057 4969 -9774 3242 13544 -11824 -9124
1464i124K5483j5122j4738J8715j602r688J3048p057j3064K2677K556k8175J1369
$$ -9124 16359 1237 -13501 5214 3612 -6076 6972 -85 -13149 9528 12084 -16091 -4722
1477d722K0979j9700n159J4639r331J324J3898j9664n642L0558r153k6787K0000
$$ -4722 16257 -3443 -8602 6037 -3294 -1970 11928 -7736 -13378 17180 8027 -18760 1240
1490A240J0875j8413O047L932j5041J6834R776l1371N581L2759k1087j8770K4470
$$ 1240 12115 -6298 -251 3681 -11360 5474 15250 -16121 -10540 22219 1132 -17638 6832
1503F832j766j1861J5749j1273j5265L1922J108l9099J8190K8513k8194o871K1587
$$ 6832 5066 -6795 8954 -2319 -17584 14338 15446 -23653 -5463 23050 -5144 -12015 9572
1516I572j3021q5J8943k4816r031M0119j0313l7755K6534J9547k7622M124J0275
$$ 9572 -3449 -3534 15409 -9407 -18438 21681 11368 -26387 147 19694 -7928 -3804 6471
1529F471j7488J5306J4216l6223K102M1335k1478k7642K8858N796j8743J2670
$$ 6471 -11017 4289 18505 -17718 -15616 25719 4241 -23401 5457 11253 -7490 5180
1541E180n164j6082K9712L114m1709J6287L4188k8039j3657K3851p822k580J6613
$$ 5180 16 -16066 13646 16760 -24949 -8662 25526 -2513 -16170 7681 -141 -2721 13892
1554A3892k3329p875L9554j1199l8505K7304K0753k8654K657J1304j5866J5688
$$ 13892 -9437 -17312 22242 11043 -27462 -158 20595 -8059 -5402 5902 -9964 5724
1566E724J2425l7263M732M2257k4169k8801L1570N061k0468J4034m772j6631L0728
$$ 5724 18149 -19114 -14382 27875 3706 -25095 6475 11536 -8932 5102 330 -16301 14427
1579A4427K594m3054J8333L6228l1921j5499K8141p560o616J7684k0687j0194
$$ 14427 17021 -26033 -7700 28528 -3393 -18892 9249 1689 -4927 12757 -7930 -18124
1591a8124M0001r027m0721K7166K3917l1371p87J6730j4602Q233J4336l1801J332
$$ -18124 21877 12850 -27871 -705 23212 -8159 -8946 7784 -6818 1415 15751 -16050 -14718
1604a4718M0409k0263l0949L0322R558k2762R371J123j5022K2732N175l6383J3072
$$ -14718 25691 5428 -25521 4801 14359 -8403 968 2091 -12931 9801 14976 -21407 -8335
1617h335L3191k6832j5810K5835l957q896J3566j4669q269L1770p885l3507K2964
$$ -8335 24856 -1976 -17786 8049 4092 -4804 8762 -5907 -14176 17594 9709 -23798 -834
1630h34K0736k6641j280J5500j2247N949J1342k5622J644L2836j8074k5048K7135
$$ -834 19902 -6739 -8019 7481 -4766 1183 12525 -13097 -11453 21383 3309 -21739 5396
1643E396P525k1156Q801K814j3669J7872N029l0276J0479K8245k3201j4123K4237
$$ 5396 12921 -8235 566 3380 -10289 7583 12612 -17664 -7185 21060 -2141 -16264 7973
1656G973k936j1631J3480q241j0255K4350l645k7836J7308J8667k3084k948J5940
$$ 7973 5037 -6594 6886 -1355 -11610 12740 9095 -18741 -1433 17234 -5850 -8798 7142
1669G142r267K25J1517j6506k401K4224j1284j9877J9498P285j7666N369N680
$$ 7142 -2125 -1900 9617 -6889 -9290 14934 3650 -16227 3271 10556 -7110 -1741 3939
1682C939j0298J0073N028j9625O036J9381j5437j0755J7228j784r143R061m364
$$ 3939 -6359 3714 8742 -10883 -4847 14534 -903 -11658 5570 3786 -5357 3704 -660
1695f60o708J4912j643j7753J2047J1602j6240j435J1398o840j014P860j0134
$$ -660 -7368 7544 5901 -11852 195 11797 -4443 -5878 5520 -1320 -2334 5526 -4608
1708d608j524J5482p027j2670J3548L754j2510M564M427p857N464M686j2540L269
$$ -4608 -6132 9350 2323 -10347 3201 6955 -5555 -991 3436 -4421 1043 5729 -6811 -3542
1722c542J2823j0248o274J2015j673p686O833j160o144Q295O38j0834O193P927
$$ -3542 9281 -967 -7241 4774 3101 -4585 2248 1088 -5056 3239 3877 -6957 -764 7163
1736G163r950p85P967m302k595N952m544k743P621k060p276O601L094p107J680
$$ 7163 -2787 -3572 4395 93 -2502 3450 -1094 -3837 3784 1724 -5552 1049 4143 -2964 -1284
1751a284M179m208P54L147m698L52N029l443l238N149j42l441K576L14k492K538
$$ -1284 2895 -1313 -559 2588 -2110 -1758 3271 -172 -3410 1739 1597 -1844 732 1046 -1446 1092
1767A092M98l768K111K228l638j21L283k091m52K344j883r35L307j667k699L566
$$ 1092 1590 -2178 -67 2161 -1477 -1598 1685 -406 -858 1486 -397 -1332 1975 308 -2391 1175
1783A175K92l370J743J977l048P04K502k928K0K873j920j699K756m27k520J883
$$ 1175 1467 -1903 -160 1817 -1231 -527 1975 -953 -933 1940 20 -1679 1077 650 -1870 13
1799A3J358k445P32J597j688j42J667j286p16J615j43j600P04R10j046Q2J044
$$ 13 1371 -1074 -342 1255 -433 -575 1092 -194 -910 705 562 -1038 -334 576 -470 -388 656
1816F56n82k44Q28n64l55L32K51o90N8K77K41k15J39J47j88LP3K55o77k63P89
$$ 656 74 -170 658 94 -261 71 322 -368 -310 -33 208 -7 132 279 91 94 167 422 -255 -518 271
1837B71n65o6M01P4n10O75O22j357J03J043q81m89J283n34j040J145J88j306J186
$$ 271 -294 -360 41 115 -395 280 902 -455 -352 691 -190 -679 604 70 -970 175 363 -943 243
1856B43Q28j755L90J423j417p17J599p17r80K032m65j827J947M96k195J139J263
$$ 243 1071 -684 -294 1129 -288 -1005 594 -123 -1103 929 464 -1363 584 1080 -1115 24 1287
1873A287j869m6J592j692l45K225j447j439L371o22k371K106N53k124J107O45
$$ 1287 -582 -628 964 -728 -1073 1152 -295 -1734 1637 1015 -1356 750 1303 -821 286 931
1889I31k596J637J851l435M77L319k084j714K952j586q90K789j713k710M460J21
$$ 931 -1665 -28 1823 -1612 -1135 2184 100 -1614 1338 -248 -1138 1651 -62 -2772 1688 1809
1905A809n028K700L224m190J068K543m037J429M016n594j381P404k836n581N958
$$ 1809 -3219 -519 2705 -1485 -417 2126 -1911 -482 3534 -2060 -3441 3963 1127 -4454 1504
1920A504J100n321L775J058o067M650M288r284P30R194n806m544P435j527m283
$$ 1504 2604 -2717 1058 2116 -3951 699 4987 -4297 -3567 5627 -179 -4723 2712 1185 -3098
1935c098O529k181o822Q754K136j1578L776Q645p500j822O268m812k4P194p267
$$ -3098 3431 1250 -5572 3182 5318 -6260 -2484 6161 -1339 -3161 3107 -1705 -1729 5465 -1802
1950a802m338J1960j755j1281P272M803p600K610K293p115O336N565j2887R00
$$ -1802 -6140 5820 4065 -7216 56 4859 -2741 -131 2162 -4953 1383 6948 -5939 -5039
1964e039J3440p340p746R183j067m673P306m217p457J2891J800j6576O745J2063
$$ -5039 8401 1061 -6685 2498 1431 -3242 4064 -153 -7610 5281 7081 -9495 -2750 9313
1978I313j1140k896Q715o390L23R932j1731n270J8627l470j7250J1272P789j1933
$$ 9313 -1827 -4723 3992 -2398 -2075 7857 -3874 -9144 9483 6013 -11237 35 7824 -4109
1992d109L378M148j0305Q126R074j8560k26K0823r410j3807J3690J665r016Q512
$$ -4109 -731 3417 -6888 1238 10312 -8248 -8474 12349 2939 -10868 2822 4487 -4529 3983
2006C983l034j0730J5571M557k2337O454J8302j3663o782J2092m915k108J0833
$$ 3983 949 -9781 5790 10347 -11990 -5536 12766 -897 -7679 4413 -502 -2610 8223
2019H223j2245p047K1714k889k1752J2417J2070j3678P81N827r490P862R139k0072
$$ 8223 -4022 -11069 10645 7756 -13996 -1579 10491 -3187 -2406 3421 -6069 1793 10932 -9140
2033i140m75K3407j0163j6488J5043L788r993P467l141j0554J7612L524k4361
$$ -9140 -9615 13792 3629 -12859 2184 5972 -4021 3446 305 -10249 7363 10887 -13474
2046a3474P389K0596j5145q553J3814m911k376J1352j3069p528K4253l628k4996
$$ -13474 -6085 14511 -634 -9187 4627 -284 -2660 8692 -4377 -11905 12348 8720 -16276
2059a6276J4722J4248j6875j75Q643j0144P093J0778k1355j029K5973j0996j9972
$$ -16276 -1554 12694 -4181 -4356 4287 -5857 1236 12014 -9341 -10370 15603 4607 -15365
2072a5365J7684O058j3606O840R3j1318J5712N534k5237O741K2649j5312j1861
$$ -15365 2319 8377 -5229 1611 1704 -9614 6098 11632 -13605 -6864 15785 473 -11388
2085a1388J5635k177n218R951j0105p454K1455j833k3970J2586J5657j6245k344
$$ -11388 4247 2070 -3148 6803 -3302 -10756 10699 8866 -15104 -2518 13139 -3106 -5450
2098e450R463p650M348R037j7991j430K3503r099j9045J5777O922j2793N041J005
$$ -5450 4013 -3637 711 9748 -8243 -9673 13830 4731 -14314 1463 8385 -4408 633 1638
2112A638r474J3084M457k1577N565K0703j4404j0962J5614j910n932Q818p755
$$ 1638 -7836 5248 9705 -11872 -6307 14396 -8 -10970 4644 2734 -3198 5620 -2135
2125b135p434J9225j904k1665J1910J4550j6162k332J0845p313J764Q939j4674
$$ -2135 -9569 9656 7752 -13913 -2003 12547 -3615 -5947 4898 -2415 -651 8288 -6386
2138f386k298K0755p937j7240J4531O940j2865L833L545q757Q778N615j7682L569
$$ -6386 -8684 12071 4134 -13106 1425 8365 -4500 -667 2878 -5879 2899 8514 -9168 -5599
2152e599J7800j1827j0362J3579J61p751P296l606o833J3282M61j6723P808J2380
$$ -5599 12201 374 -9988 3591 3752 -3999 3297 -309 -7142 6140 6601 -10122 -2314 10066
2166A0066j2428k960R165m881m34O709r092j896J4004n224j2426J0425N422j0077
$$ 10066 -2362 -5322 3843 -1038 -1472 5237 -3855 -5751 8253 3029 -9397 1028 6450 -3627
2180c627K374L568o051N556L833j2010K815J2218r079o942J0533p94n659N624
$$ -3627 -1253 2315 -3736 1820 5653 -6357 -3542 8676 -403 -7345 3188 2394 -3265 2359
2194B359k191n565R847j09j1743O185Q742j0133j510Q030m220j833O014n643k921
$$ 2359 168 -5397 4450 4341 -7402 -1217 7525 -2608 -4118 3912 -308 -2141 3873 -1770 -4691
2209d691J0101k813r305P605M408q659J895M420n008J655M032o637k34Q279m470
$$ -4691 5410 2597 -6708 897 5305 -3354 -1459 2961 -2047 -392 3640 -2997 -3231 5048 578
2224E78n711O783Q33m907K774P61l559L612J534o155K439N072m889k100M889j569
$$ 578 -5133 1650 2483 -2424 350 1111 -2448 1164 2698 -3457 -1018 4054 -835 -2935 1954 385
2240C85j498K683k170j308M375j758l923L736J730m193J318K004k420P45K034
$$ 385 -1113 1570 -600 -1908 2467 709 -3214 522 2252 -1941 -623 1381 -1039 -294 1740
2255A740l434M28L721k804j978L714l47k827K317N22k722K368Q80l484J418K805
$$ 1740 -1694 -1266 2455 -349 -2327 1387 1040 -1787 530 1052 -1670 698 1578 -1906 -488 2317
2271B317k789j120L347j630j416K253n30j668K479m27k480J840J456k519K12J839
$$ 2317 -472 -1592 1755 125 -1291 962 432 -1236 1243 816 -1664 176 1632 -887 -675 1164
2287A164j415l21J403r92r87K193p11j291R84Q21j519M69R61p82k67P38o56l03
$$ 1164 -251 -572 831 -161 -1148 1045 334 -957 27 848 -671 -202 759 -23 -290 448 -208 -511
2305e11J045l96n39O34j26n09M67K38l12J66k03k02K92Q9m72L75J63n25M87J55
$$ -511 534 138 -401 233 107 -402 65 303 -9 157 -46 -248 44 133 -339 36 199 -326 161 316
2325C16o45N30J58p04K06O10m52l17O66j52q31J045P7j044L36P67q40J76R04j091
$$ 316 -329 201 359 -345 -139 471 19 -298 368 216 -615 430 507 -537 -201 566 -274 -98 806 -285
2345b85m70J339k20j068Q08O92j480O89R15j263l4J145r32n23J240l67j111J325
$$ -285 -755 584 364 -704 104 796 -684 5 920 -343 -377 768 -164 -687 553 186 -925 400
2363D00l14o23Q20K76j044N19O69r45j40R07q44L9Q49q15m1P84m20q71J495m49
$$ 400 86 -537 283 559 -485 34 703 -242 -382 525 -319 -280 569 -246 -287 497 77 -794 701 252
2383B52r56R36j05p82J030q0j126J358Q36k147R3K062j830q38K386j151r02J852
$$ 252 -704 232 127 -655 375 295 -831 527 1363 -784 -691 1371 -459 -1297 1089 -62 -964 888
2401H88n53j912K672N03l621J593K417l113L49K574k673k79L154k360j979M602
$$ 888 335 -1577 1095 1598 -2023 -430 1987 -1126 -777 1797 -876 -1155 1999 -361 -2340 2262
2417B262r87m015K971J769l499J576J398l613J866L113m669m85N189j971l538
$$ 2262 1275 -2740 231 2000 -1499 77 1475 -2138 -272 2841 -1828 -2313 2876 905 -2633
2432b633L827L8k892L364j058l853M363J910o081J531M601l629p96K925k393k00
$$ -2633 1194 1232 -1660 1704 646 -3207 1156 3066 -3015 -1484 3117 -512 -1308 1617 -776 -976
2448i76M204l928l197O979o54o585M201L011m494J237K076m545L010L784o955
$$ -976 3228 -700 -3897 3082 2428 -4157 44 3055 -1439 -202 1874 -2671 339 4123 -2832
2463b832p12Q118l694n179N645r1l532M687j625n461P160K195j0019K670Q138
$$ -2832 -3544 4574 880 -4299 1346 1255 -2277 2410 785 -4676 2484 4679 -5340 -2670 5468
2478E468o400k011N493l518q40O510n852m904J0525l9j0599N216N794o947R98
$$ 5468 -932 -2943 2550 -968 -1808 4702 -1150 -6054 4471 4432 -6167 -951 4843 -2104 -1106
2493a106L952o188L274O366r531k190J1899l875q753P157J821n271M085m02o792
$$ -1106 2846 -3342 -68 6298 -3233 -5423 6476 2601 -6152 1005 2826 -2445 1640 1238 -5554
2508e554Q042M127j2262J854J0657o518n055O844k248j626O345o003n084J2108
$$ -5554 2488 6615 -5647 -3793 6864 346 -4709 2135 -113 -1739 4606 -1397 -6481 5627
2522E627l54j2665O150P429q090L33L788n834L686O652j1250j840J4151m702j0304
$$ 5627 5273 -7392 -1242 6187 -1903 -1570 2218 -3616 70 6722 -4528 -6368 7783 3081 -7223
2537g223Q310L011p085N006j113p641R737M473j4711K563J3315p920o518Q543
$$ -7223 1087 4098 -2987 2019 906 -6735 3002 7475 -7236 -4673 8642 722 -5796 2747
2551B747k561k666P435o302o534J3759L86j5142O538J0016r246j293N807n722
$$ 2747 186 -2480 4955 -1347 -7881 5878 6264 -8878 -2340 7676 -1570 -2863 2944 -2778
2565b778K300P345j1160l115J5354l941j2656Q898M906p846L339J115p033P854
$$ -2778 -478 6867 -4293 -7408 7946 4005 -8651 247 5153 -2693 646 1761 -5272 2582
2579B582M824j4292J217J4294p271q120Q915o62l567O070m859n913J2527N65j4757
$$ 2582 7406 -6886 -5669 8625 1354 -6766 2149 1487 -2080 3990 -869 -6782 5745 6310 -8447
2594h447O011J0075r010k032N984m869K213O345j0135k376J3882l861j2218Q837
$$ -8447 -2436 7639 -1371 -3403 2581 -2288 -75 6270 -3865 -6241 7641 3780 -8438 399
2608C99M853p901K529J869o711O964M927j3210J560J3360p531p932Q983j56n097
$$ 399 5252 -2649 -120 1749 -4962 2002 6929 -6281 -4721 8639 1108 -6824 2159 2003 -3094
2623c094O322l431o108J1124R93j3380N248J0094q942l033P078m075l84O704p454
$$ -3094 3228 -203 -6311 4813 5806 -7574 -2326 7768 -1174 -4207 2871 -1204 -1588 5116 -2338
2638b338l808J2275k526j1101P472N612p702J213K707n505M656M164r953L87J1323
$$ -2338 -6146 6129 3603 -7498 -26 5586 -2116 -903 1804 -3701 955 5119 -4834 -4447 6876
2653F876n738o928P574P97m507L607j626m661P871R00j0118L863Q353p276k220
$$ 6876 1138 -5790 1784 2581 -1926 1681 55 -4606 3265 4165 -5953 -2090 6263 -1013 -3233
2668c233N890l242m84M431n371k335R584k833q465O209M282o564J222K982m410
$$ -3233 2657 -585 -1069 3362 -2009 -4344 5240 2407 -6058 151 4433 -2131 -909 2073 -2337
2683b337K965L389p474L40Q499m757n513O530P78m862L523M2m276M955J713p682
$$ -2337 628 4017 -3457 -3117 5382 625 -4888 1642 2420 -2442 1081 1123 -3153 1802 3515 -4167
2699d167K607O114n452k436N119j393k001L875k725k292N868j073o172L945L504
$$ -4167 -1560 4554 -898 -3334 1785 392 -1609 2266 -459 -2751 3117 2044 -4128 -183 3321
2714C321n040N46K820k608P42K719m134j91N186k588l804M174M21l240J909L25
$$ 3321 -1719 -1173 1647 -961 -219 2500 -1634 -1825 3361 773 -3031 1143 1564 -1676 233 558
2730E58k640K968R21m014J340L794l276j444L282j302j259K239j634j149L258
$$ 558 -2082 886 1807 -2207 -867 2927 -349 -1793 1489 187 -1072 1167 -467 -1616 1642
2745A642o97l192K666J698l498O14J668j710L87J821k369m75L158j563k109K648
$$ 1642 945 -2247 419 2117 -1381 -767 901 -809 -422 1399 -970 -1445 1713 150 -1959 689
2761F89O76k639J436P26k343J450J460k930O89K433j638j375K269m05j395J280
$$ 689 1365 -1274 162 888 -1455 -5 1455 -1475 -786 1647 9 -1366 903 498 -897 383
2777C83k14j142J114M49j749R06J229j226k65J372o34m58P20m79m59P94j23j221
$$ 383 169 -973 141 590 -1159 -253 976 -250 -515 857 223 -235 485 6 -453 341 218 -1003
2795a003Q88N32q87P23L28o60J61K75p59K26N39p08J07M66k02n36R53n5q34J085
$$ -1003 -115 417 -470 253 581 -79 82 357 -402 -176 363 -345 -238 228 26 -510 443 388 -446 639
2815F39m05n20M07J47q68JJ054o45K26M11m68J5N54j81p36O45J5q70M01M50m52
$$ 639 234 -286 121 268 -600 -599 455 -190 36 447 -21 -6 548 367 -369 276 291 -579 -178 272 -180
2836a80Q1O22n36k50Q34k45q38P37l23l47N54l0m85J07Q13p06J76O35o43m0L78
$$ -180 -99 523 -13 -263 571 326 -512 225 -98 -445 109 79 -406 -299 514 -192 -16 619 -24 -64 314
2857C14k08l94M83m25m26N10N81n16K98Q3n93M97j32m67J3O97q98K25N80n03K55
$$ 314 106 -288 195 -230 -656 -146 435 -81 217 300 -293 204 72 -395 -382 315 -583 -358 222 -281 -26
2878b6O01m77l50Q56m81j137J112M24j278Q01M96j081O72J074j394l52J640j054
$$ -26 575 98 -252 604 123 -1014 98 522 -756 45 541 -540 132 1206 -188 -540 1100 46
2896D6j155J534k81j123J312J77j673J808O58k233N04J740j212j010J590q13q52
$$ 46 -1109 425 144 -979 333 510 -1163 645 1303 -930 -426 1314 102 -908 682 -131 -983
2913i83J647m01j839K410N58k492J153J375k126L12J219j980P16J704j863q95
$$ -983 664 263 -1576 834 1392 -1100 53 1428 -698 -386 833 -1147 -431 1273 -590 -1485
2929a485K791n37k086J776L68j536J795o15k087J914J387l550O99K947j923p50
$$ -1485 1306 769 -1317 459 827 -709 1086 471 -1616 298 1685 -1865 -1166 1781 -142 -892
2945h92K322j732m44K523k131k170L938J72m135K387K070k759R36J683l080J066
$$ -892 1430 -302 -746 1777 -354 -2524 1414 1586 -2549 -162 1908 -851 85 1768 -1312 -246
2961b46L111m102j670N671j842l931L546P58k796K619Q7m003L606K418n741L21
$$ -246 2865 -1237 -2907 2764 922 -3009 537 1295 -1501 1118 1205 -2798 808 3226 -2515 -2194
2977b194N231l078k432L713j419j097L776k095l930N848O53o385K244L815m038
$$ -2194 3037 -41 -2473 1240 -179 -1276 2500 405 -3525 2323 2976 -3409 -1165 2650 -1388
2992a388J71K879l371J028M342n219j845O919j634n116L565J494l523K648J07
$$ -1388 -1217 1662 -1709 -681 3661 -1558 -3403 3516 1882 -3234 331 1825 -1698 950 1057
3007A057m339M333L093p183N49O686l711l207L984j235j630M253l020m127P419
$$ 1057 -3282 1051 4144 -3039 -2490 4196 485 -2722 1262 27 -1603 2650 -370 -4497 2922
3022B922P95p671K850N118m764m37K927l912J273N005o094k587Q761j706o761
$$ 2922 3717 -3954 -1104 4014 -750 -1187 1740 -2172 -899 4106 -1988 -4575 4186 2480 -4281
3037d281M683K455m320K205N28n109M497L884q276J29Q508l904m576N239r14k204
$$ -4281 402 2857 -1463 742 1270 -3839 658 4542 -3734 -3605 4903 999 -3577 1662 748 -1456
3053a456M474l025m544P238J615r330K816O735m786j720L768l321Q11M768o100
$$ -1456 3018 -7 -4551 2687 4302 -5028 -2212 4523 -263 -1983 1785 -1536 -725 4043 -2057
3068b057k726Q845j359p787M767L123m154J765Q89m922M785L737q617J23Q413
$$ -2057 -4783 4062 2703 -5084 -317 2806 -1348 417 1306 -3616 1169 4906 -3711 -3588 4825
3083D825m066n116N480pk895M165k088m648O957J775r351K987O850n798j500M125
$$ 4825 759 -4357 1123 1116 -1779 2386 298 -4350 2607 4382 -4969 -1982 4868 -930 -2430 1695
3099A695k914L96M847n503k917Q955j277q140M371M040n365J357K107m993L966
$$ 1695 -1219 -823 4024 -1479 -4396 4559 3282 -4858 -487 3553 -1812 -455 1652 -3341 625
3114F25L971p682m04Q462l502n885N007Q18l264L621j582m320O517J813q319J864
$$ 625 4596 -3086 -3490 4972 1470 -4415 592 1410 -1854 1767 185 -4135 2382 4195 -4124 -2260
3130b260O956m628k614M355k305n15L861m434k471P476r15o679L750M038m572
$$ -2260 4696 68 -2546 1809 -496 -1011 2850 -1584 -4055 3421 2506 -4173 -423 3615 -957
3145i57K19K137l658K318L382n989o32P193k902m944M783Q84l102K442o80l648
$$ -957 -738 1399 -2259 59 3441 -2548 -3180 4013 1111 -3833 950 1834 -1268 1174 494 -3154
3161c154M769J225o344J684N671m118k082M187j929r44L592l012k574N528n42
$$ -3154 1615 2840 -3504 -1820 3851 -267 -2349 1838 -91 -1035 2557 -455 -3029 2499 1957
3176A957n649L155L162m075N90K299k660J240K981m446j207N339j628m440L857
$$ 1957 -3692 -537 2625 -1450 -860 1439 -1221 19 3000 -1446 -2653 2686 1058 -3382 475
3191D75R68l080K216K31k861K928J764n001J161L971k963k104L247p66j354K579
$$ 475 1443 -1637 579 810 -2051 877 2641 -2360 -1199 2772 -191 -2295 952 186 -1168 1411
3207A411j394j584L246P8m251K202K198k767k62K028j681M56K063k479o08L440
$$ 1411 17 -1567 1679 1757 -2494 -292 1906 -861 -1123 905 -776 -320 1743 -736 -1344 2096
3223B096j216k630K150N23k099J317N20k271J880J013k996R45K819k121j218K108
$$ 2096 880 -1750 400 923 -1176 141 661 -1610 270 1283 -1713 -768 2051 -70 -1288 820
3239H20n73j112J359p84j211K191P5k182J394J883k442lJ587j076m76J296j430
$$ 820 247 -865 494 -290 -1501 690 765 -1417 -23 1860 -582 -585 1002 -74 -550 746 -684
3256f84k57K020p70j535J422P58j477N23M60q19K45R08j691K28J298p19p24J202
$$ -684 -941 1079 309 -1226 196 954 -523 0 460 -359 -114 794 -897 -669 629 -90 -814 388
3274C88J0p13O98l27p13R42j16j187P55O73q21j16J289m97l61N53l33m03Q98p13
$$ 388 398 -315 383 56 -657 285 169 -1018 -263 410 -411 -527 762 265 -96 457 124 -279 619 -94
3294i4o41O61M14r52O89M00o44O6O91q55K16O33n37n29P70J0q13O03R3n96N93
$$ -94 -735 -74 340 -612 77 477 -167 -101 590 -265 -49 584 47 -482 288 298 -515 88 181 -415 178
3315A78L88q43L53M02o27l68N47l56mP78l79l66M24J70l06R0K98n21p6M71n69
$$ 178 566 -277 76 478 -149 -517 30 -326 -330 448 69 -297 127 297 -9 81 379 -142 -218 253 -316
3336c16J06K25N7j53M81kk87M8j17r2k1J89n55J53L63k80K59P5l44J96K63l22
$$ -316 -210 15 72 -81 400 398 111 159 42 -50 -71 118 -437 -284 79 -201 58 133 -211 -15 248 -74
3358g4k79M89k96j72M31j53o2K98K26m05K62M09r41J56N31p42l18P93j13m36O95
$$ -74 -353 136 -160 -332 99 -54 -116 182 408 3 265 674 -267 -111 420 -322 -640 153 40 -396 299
3379B99j83p98R37M09j289M67O06r48J45N30m87J25P30l24n02Q51l11o75N74J08
$$ 299 116 -682 255 664 -625 -158 448 -500 -355 175 -312 -187 543 219 -283 568 257 -418 156 264
3399B64o91N01J21q63N99P22r52j35J260p46l57O51m58m45Q67p93p45J510M54
$$ 264 -427 74 195 -668 -69 653 -299 -434 826 80 -277 374 -84 -529 338 -455 -1200 310 764
3418G64j489N44J072j289M37M24j054O41Q44j658l45K282p33j406J417K87j211
$$ 764 -725 -181 891 -398 39 463 -591 50 894 -764 -1109 1173 440 -966 451 738 -473
3435d73J146qj814J051J110j846k28K136j036p37J429n25p46J878j245j628K241
$$ -473 673 665 -1149 -98 1012 -834 -1062 1074 38 -699 730 205 -541 1337 92 -1536 705
3452G05L75k587Q90J795j477j29J437j671J66K333k242j325K681n8k778J785R88
$$ 705 1080 -1507 -617 1178 -299 -428 1009 -662 -496 1837 -405 -1730 951 893 -1885 -100 888
3469H88j770J057R19k459J560J934l102m48K941j120j858J891l02j079K084r18
$$ 888 -882 175 1094 -1365 195 2129 -973 -1421 1520 400 -1458 433 131 -948 1136 218
3485B18k232L097R38l624Q62K514k280o0J440j806K27K877k861j540L996m12l188
$$ 218 -2014 1083 2021 -1603 -741 1773 -507 -567 873 -933 -706 2171 -690 -2230 1766 1354 -1834
3502a834J937J440k893J852J14k697K031K610m230l01M507j734k636K693o91j223
$$ -1834 103 1543 -1350 502 616 -2081 -50 2560 -1670 -1971 2536 802 -1834 859 168 -1055
3518a055K552j275l119L954J645m831J010L492k544p57K092k095o0L556l220k709
$$ -1055 1497 222 -2897 1057 2702 -2129 -1119 2373 -171 -928 1164 -931 -991 2565 -655 -3364
3534c364N238K81m661K028K117k544J166R79l086J766K822m181j179M898j053
$$ -3364 1874 2155 -2506 -478 1639 -905 261 1240 -1846 -80 2742 -1439 -2618 2280 1227
3549A227l472K784K01j861K736j236l277M048J640n427J021M147k763j015K396
$$ 1227 -2245 539 740 -1121 1615 379 -2898 1150 2790 -2637 -1616 2531 -232 -1247 1149
3564A149j932L36L138l451k269N043q4m846K145K324k481Q59J082l236K336L130
$$ 1149 -783 -447 2691 -760 -3029 2014 1930 -2916 -771 1553 -928 -69 1013 -2223 113 3243
3580C243m922j029N386j587l990L158O14k386K841j152k714L870J730n368N59
$$ 3243 -1679 -2708 2678 1091 -2899 259 873 -1513 1328 176 -2538 1332 3062 -2306 -1747
3595a747M244k355j668K562j454o69L268k504k622M998N34n057J509K983k537
$$ -1747 2497 142 -1526 1036 -418 -1087 2181 -323 -2945 2053 2587 -2470 -961 2022 -515
3610e15m6J531k791J616L135m272j240N122j180l732K694P51k079J541j91k841
$$ -515 -561 970 -1821 -205 2930 -1342 -2582 2540 1360 -2372 322 1073 -1006 535 344 -2497
3626b497L239J670m366L01M261k021j965K261j118m11K266k070k137M104N70m589
$$ -2497 742 2412 -1954 -1653 2608 587 -1378 883 -235 -646 1620 -450 -2587 1517 2087 -2502
3642b502J710K892k458k0J561k421R16K819l633j227M667j140l663K906O20j830
$$ -2502 -792 2100 -358 -378 1183 -1238 -322 2497 -1136 -2363 2304 1164 -2499 407 1027 -803
3658h03J439J14k427K064J994m133j44M003j929j791K372l6j668K345j283k196
$$ -803 636 750 -1677 387 2381 -1752 -1896 2107 178 -1613 759 723 -945 1400 117 -2079
3674b079L068R11m068J169K916k298o23J736j130nK336k608j037L227m30k938
$$ -2079 989 1900 -2168 -999 1917 -381 -1004 732 -398 -403 1933 -675 -1712 1515 1085 -1853
3690a853J680J202j978J020M49j770J548J436k910J46K680j123j961J940L1j177
$$ -1853 -173 1029 -949 71 520 -1250 298 1734 -1176 -1030 1650 527 -1434 506 537 -640
3706f40J216k73j532J782R65k832J030J719j694n54J210p73j52J539j468p18K288
$$ -640 576 303 -1229 553 1518 -1314 -284 1435 -259 -813 397 -376 -528 1011 -457 -1175 1113
3723A113l22k160J407J116j729L72R40j398P34R04j714q7K043r62j144J551p2
$$ 1113 791 -1369 38 1154 -575 -203 737 -661 73 977 -737 -824 1219 257 -887 664 592
3740E92j213R70M9j373J337K01j586P81J172r82m59J169n89m25R07q98l83J227
$$ 592 -621 349 398 -975 362 563 -1023 -242 930 -52 -511 658 69 -356 551 -347 -730 497
3758D97j93j167R05O49q65N0N03o16J80M97o65m40J471p52r19J055J03p37O52
$$ 497 304 -863 42 691 -174 -124 379 -237 -57 440 -225 -665 806 54 -865 190 293 -444 208
3777B08Q2o42M47J79q32L00N72n79p8M29k09m7P13l31l05O85k80q30K65M99o83
$$ 208 290 -352 95 274 -558 -258 314 -265 -343 86 -123 -170 543 212 -93 592 312 -518 -253 246 -437
3798d37J06O31k25O1J54l77m9O11l38m23L91J38o64L24J25k8m9L82l52k06N56
$$ -437 -331 300 75 136 290 -87 -136 475 137 -286 105 243 -421 -97 28 0 -49 333 -19 -225 331
3819C31l80l32N05j0n47M97j0j41L18o1p9j24M33l57j0k4N9m89L71k62K73K44
$$ 331 -49 -381 124 114 -433 64 54 -87 231 170 91 -33 400 43 33 9 68 -421 -50 -312 -39 205
3841B05j73j49M9K42l88J52Mj66Q9O7N4q2L17l42j98Q85m46l37L47n8n00M40n0
$$ 205 32 -117 -68 174 -214 -62 -58 -224 -135 -68 -14 -96 221 -121 -319 566 120 -217 130 72 -428 12 -38
3864c8q1J55j7j73J18L15l66k07M35P0o10L97k79j11O84j69m55M43K13n65L3M75
$$ -38 -119 36 19 -154 -36 279 -87 -294 141 211 -399 -2 -281 -392 292 123 -332 111 324 -241 -208 267
3886B67q10K82K44o2j22P14l21l16N07m2m84M27J49q08K21M89p53L46O22o35k55
$$ 267 -543 -261 -17 -79 -201 513 192 -124 383 341 -143 284 433 -375 -154 335 -418 -72 550 -85 -340
3907c40M46J18m06M35j44n04P72l18o74P57J57p37K99O06m86N3L86p34j65J244
$$ -340 106 224 -182 253 109 -395 377 59 -615 142 299 -438 -139 467 -19 34 420 -314 -479 765
3927G65j071n44J344k98p97O22L48q37M08N09q96K56J018j176n18J463l82q70
$$ 765 -306 -850 494 196 -601 21 369 -468 -60 449 -447 -191 827 -349 -867 596 214 -656
3945f56Q56Q3p62R87Q4j259R37N40j140k28J153o63l36J035q33j72J083n42j126
$$ -656 200 283 -479 508 592 -667 270 810 -330 -558 595 -68 -404 631 -202 -374 709 167 -959
3964i59J792m8j448L70Q10j012L64P05j381N94J820j911n11J767o33j031Q39N1
$$ -959 833 785 -663 -293 517 -495 -131 574 -807 -213 1607 -304 -815 952 319 -712 127 178
3982A78p40J244j27j824J576R19k027K16J635j087m18R78r18l57J712q05j485
$$ 178 -562 682 555 -1269 307 1226 -801 -585 1050 -37 -455 523 -395 -752 960 155 -1330
3999a330J999N12k212P23J149j308M43N76j519L79K280k362j054K861k37j885
$$ -1330 669 1181 -1031 -308 841 -467 -24 552 -967 -588 1692 -670 -1724 1137 900 -985
4015i85J431K2q06R67R7k149J629J303k549m4J968p44q01J098j011j50J918j227
$$ -985 446 468 -338 629 726 -1423 206 1509 -1040 -1084 884 140 -661 437 -574 -724 1194 -33
4033c3j806K597Q34k929Q54J398j179L88O11j541O09J968k380r58K713j77k261
$$ -33 -1839 758 1592 -1337 -483 915 -264 124 735 -806 -197 1771 -609 -1567 1146 969 -1292
4050a292J499J26j013J516j92k423K005J794k981m41K850j254j220J417o12m76
$$ -1292 207 333 -680 836 644 -1779 226 2020 -961 -1402 1448 194 -1026 391 -221 -697
4066f97K170j188k265K899J024l540P38K036j685J37J375k110M95K410k015j621
$$ -697 1473 285 -1980 919 1943 -1597 -859 1177 -508 -371 1004 -1106 -611 1799 -216 -1837
4082a837L258l87k479J363P51j223P48M53k166J794J748k972n60K866j022j342
$$ -1837 1421 1034 -1445 -82 669 -554 194 647 -1519 275 2023 -949 -1509 1357 335 -1007
4098a007J514l87j024K030q92k140K642J039l222Q20J988j460j63R02j233J88
$$ -1007 507 120 -904 1126 234 -1906 736 1775 -1447 -627 1361 -99 -262 640 -593 -405
4114d05K090k203j227K769j16k357J378P69j333R52L16k280J714J740k896q2K446
$$ -405 1685 -518 -1745 1024 908 -1449 -71 698 -635 317 633 -1647 67 1807 -1089 -1171 1275
4131A275r94j369J496j04j080J872q75j813K188Q92k857L79K720j963n23J265
$$ 1275 281 -1088 408 304 -776 1096 221 -1592 596 1488 -1369 -990 1730 -233 -756 509
4147E09r59j68K068j798j137K340L86k434P10J205j248O31M73j593J152J216j891
$$ 509 -450 -618 1450 -348 -1485 855 1241 -1193 -483 722 -526 105 578 -1015 137 1353 -538
4164e38q21K372n58j210J089J62r76J076k88j572J692Q70k316K84J853j242n49
$$ -538 -1359 1013 455 -755 334 496 -480 596 308 -1264 428 1298 -1018 -734 1119 -123 -672
4181f72J055q49R8J332r98j268K023N03k343J174P53j299N13L55j017O21J295
$$ -672 383 -466 -368 964 -34 -1302 721 1224 -1119 55 808 -491 22 377 -640 -19 1276
4198A276j790l39K046o02j660J365J5q84J014l22j031J007R05j625p2J621j070
$$ 1276 -514 -853 1193 591 -1069 296 311 -573 441 119 -912 95 1000 -625 -697 924 -146
4215a46n72J031l49l16R90n22j144J419L42j662Q09R11j035r4P34q25J75R40r71
$$ -146 -718 313 -36 -352 638 116 -1028 391 733 -929 -120 791 -244 -338 396 -429 -254 686 -285
4234b85l85J039j74r13O74K92l79M45m1p12P25J89j114J90J093n78l03Q14m21
$$ -285 -670 369 195 -718 -44 248 -131 314 273 -439 286 475 -639 -449 644 66 -237 577 156
4253A56n03O44l49n33Q42J72q53J94O90n49j45L59m55M01K96n14m10P66o4o17
$$ 156 -347 297 -52 -585 257 429 -424 -230 460 -89 -234 125 -330 71 367 -147 -557 209 145 -472
4273d72P76q5n44K45K72m79L42L40m93n0N68k51n80O46o2k66J98O5k42K26L41
$$ -472 304 219 -325 -80 192 -287 55 395 -98 -148 420 169 -411 235 173 -93 105 170 -72 154 495
4294D95r47J30P44n96K20L4r2l47Q02n01o4M11k27j36K10k0l51J63L23j46j11
$$ 495 -452 -322 422 -174 46 80 -12 -359 443 -58 -122 289 62 -74 136 116 -235 -72 251 105 -6
4315fL26l67J38o1M4l02J59M4J57l28M63m72J40J57k76M09m5l8k79L04j06k77
$$ -6 320 -47 91 30 74 -228 -69 -25 132 -196 267 -205 -65 92 -184 225 180 142 -137 167 61 -216
4337b16L33n0k42J49J0K0j14L24l42r6L50p7j28K15k12J35J01j10k33M23o9k91
$$ -216 117 67 -175 -26 -16 4 -110 214 -128 -224 126 49 -79 136 -76 59 160 50 -183 240 171 -120
4359a20L13J42n36L6N15m85p7L15j74K49K09l51L1J42j00j53L03k15N2P3p8r9
$$ -120 193 335 -201 -165 350 -135 -212 103 -71 178 387 36 67 209 109 -44 259 44 96 169 91 -8
4381hoK60k95K10J66l2k43J24k47m8K72k2m17N39l07k74N2N19l42K97J70p23L93
$$ -8 -14 246 -49 161 327 295 52 176 -71 -119 153 131 -286 253 -54 -328 -276 243 -99 198 368 -355 38
4404C8J71k42l26N21k16j75L65j48j41K82j93k69M91L44o79j90M62l23O6N54m22
$$ 38 209 -33 -359 162 -54 -229 136 -12 -153 129 -64 -333 158 502 -177 -367 95 -228 -162 392 -30
4425c0j49N49l12k41M27L25q96M20J35k92J36J56m48L1M62l44k40P50j58p49P46
$$ -30 -179 370 58 -183 244 569 -327 93 228 -64 72 228 -220 -189 273 -71 -311 439 281 -468 278
4446B78j58l30K67Ln38K26R52r44r6Q23n89k32O61m70j04R83p38o95Q25L79j092
$$ 278 120 -210 57 60 -478 -252 700 -244 -340 483 -106 -338 323 -147 -251 732 -6 -701 124 503 -589
4467e89L51P25p95J02J58m54J82R03l95q98J262j26j008N01L91q12N20P57j389
$$ -589 -238 487 -308 -206 -48 -502 -320 583 188 -710 552 426 -582 -81 310 -502 18 775 -614
4486f14O21O97j071k26J077l17n91Q55m41m66R69m22j067J280N56j301J05N55
$$ -614 7 704 -367 -593 484 167 -424 431 -10 -476 493 71 -996 284 840 -461 -356 199
4504A99m69J94M97p55L1J258r78r98J475j28q70N47L00n30N33J61j109M93R34
$$ 199 -270 -76 421 -334 -303 955 -23 -1021 454 326 -544 3 303 -227 306 467 -642 -149 785
4523G85j020m81J306k81r38R17l19n17J281l52j634J493P47j529K93Q30p36k31
$$ 785 -235 -716 590 309 -629 288 -31 -548 733 381 -1253 240 987 -542 -249 581 -155 -386
4541c86P82r89M07J183j170j121J756L47j481P83M86j255Q34L29j232N43J135
$$ -386 396 -593 -186 997 -173 -1294 462 809 -672 111 597 -658 176 505 -727 -184 951
4558I51j319n71J857l05j451J202m41o38J185j95j489J374R28j696o9J553j091
$$ 951 -368 -939 918 613 -838 364 -77 -715 470 275 -1214 160 1088 -608 -677 876 -215
4575b15L9P19r93k8J484j141j002J410L52j352K83R27o70K40L20j004M56J470
$$ -215 -176 543 -450 -478 1006 -135 -1137 273 625 -727 -444 483 -187 53 373 -631 -175 1295
4593A295j642o18J607n9j255R53k15m17Q79l33j242J263J057j818MJ208n99l71
$$ 1295 -347 -965 642 583 -672 281 66 -351 528 195 -1047 216 1273 -545 -541 667 68 -303
4611c03O84q40J20J308j047r80J680J68j876R47R48j120L59K38j251O64J392j342
$$ -303 381 -459 -339 969 -78 -1058 622 790 -1086 -139 809 -311 48 286 -965 -301 1091 -251
4629b51n69J436l05r59O61K69p14J018j47j375R78J000j548k97J693p79o45N73
$$ -251 -820 616 311 -648 13 282 -432 586 439 -936 42 1042 -506 -803 890 111 -534 39
4647C9l29k36J130o01r22J308N51j605M73O12o17K25M89p74m5J330j315o05J525
$$ 39 -290 -526 604 3 -919 389 940 -665 -192 420 -197 28 517 -257 -302 1028 -287 -892 633
4666F33l12r40P86m7m93N68j29q00P93O38j131j26J245o57m55R11n47k52J029
$$ 633 321 -619 167 120 -373 195 66 -734 59 697 -434 -560 685 28 -427 484 -63 -315 714
4685G14p74m94R42K7o89O3Q11n44r4M19o73j02R95p94l97J261l08p88J91L71m61
$$ 714 -60 -554 388 415 -274 -211 600 56 -38 381 -292 -394 601 -193 -590 671 363 -425 -234 137 -324
4706c24M71J64j125N75O28n44j16P31j79n86M33k71r0N63k63l78O30J56p72J14
$$ -324 147 311 -814 -239 389 -155 -271 460 281 -305 128 -143 -233 330 67 -311 319 475 -297 -183
4726a83N62l83l16P81n01M3M65l73m85O85L5m13J69J28o7j41J59m85K80N18o48
$$ -183 379 -4 -320 461 -40 3 468 95 -390 295 330 -83 86 214 147 6 165 -320 -40 478 -170
4747a70n0L75j11j75K00j36q3J48Q3n92N05M46p69J56P56m82l82L17j55j08O39
$$ -170 -220 155 44 -131 69 -67 -150 -2 81 -511 -6 440 -329 -173 583 101 -281 36 -119 -227 412
4768D12m32l26P71j8n07L4L78p79P18O3m09J08K48l05j22M49j87k91J82K92l78
$$ 412 -20 -346 425 407 -100 -66 312 -467 251 314 -95 13 261 -44 -166 283 96 -195 -13 279 -99
4789i9R1Qjn3K01j89k34M98m36K78Ll5J49k27J54q7L20l88K00j06j74OK53Jj32
$$ -99 -8 0 -1 -54 147 -42 -276 222 -214 64 67 32 181 -46 108 21 341 -47 153 47 -127 -121 132 133 1
4814AR3J36l74J25L53m45r6M63k32j22j6L68m19j8K15j04m9L14k28k20O1J86n7
$$ 1 94 230 -144 -19 334 -111 -207 256 24 -98 -114 254 -165 -183 32 -72 -121 193 -35 -255 -194 -8 -65
4837f5K48K1j30J8j08R0q4K16l36K1L4N8J30j97J21l6K27k16j18J78J80j94j86
$$ -65 183 204 74 92 -16 74 -10 206 -130 -109 -75 -17 113 -84 37 1 228 12 -106 72 252 58 -128
4860a28K62k81K4L60k03j35L69k61j67L38k61N2L01k25j29K84N7k51k36K83k03
$$ -128 134 -147 -123 237 34 -101 268 7 -160 178 -83 -31 270 45 -84 200 257 6 -230 53 -150
4881a50M6L58k88L5J11k95J56L5J5p1J51k05K08JL1l38L6K52k01o1K41o5j11K01
$$ -150 -104 254 -34 1 112 -183 -27 8 23 -48 103 -102 106 107 138 -200 -164 88 -113 -174 67 2 -109 92
4905I2l6j43J94O6m97L81m5j43K34J28m23K83J42k45k67L58j74L3n8mo9J85J08
$$ 92 56 -87 107 173 -324 57 12 -131 103 231 -192 91 233 -12 -279 79 -95 -62 -120 -124 -193 -8 100
4928A00j02j76L49m4l18M95n59P9L07p1k67P62r14L28j21J23j60J79J82k06M65
$$ 100 -2 -178 171 127 -191 304 -255 -176 131 60 -207 555 -359 -31 -152 -29 -189 -10 172 -34 431
4949D31k64j96j21N05l79k61N61m35Q4K00n6m37P66k69o90N96kj85q5M41l32l5
$$ 431 167 -29 -150 355 -24 -285 276 -159 -75 125 69 -368 398 129 -561 35 33 -152 -237 204 -128 -163
4971a63L46j18k39N88l87o25L92P52r39K37K89m23M64J95p22M34M85q46j34P55
$$ -163 183 65 -174 414 27 -598 -206 546 -393 -156 133 -290 174 369 -353 81 566 -280 -414 341
4991C41k24l46K36l4J4L11K0o33J22P08o42k65N53l23R6N22o58k74J208o29m79
$$ 341 117 -229 7 -27 -13 298 318 -315 -193 515 -127 -392 161 -162 -66 456 -202 -476 732 103 -376
5012c76P63j3p46L00L09n68L89K16o60M0Q50l48o72Q48k75n75N65K01l24L73j20
$$ -376 387 374 -372 -72 237 -331 58 274 -386 -346 504 156 -516 332 57 -518 47 248 -76 297 177
5033A77p63O33N41j025PR23l52l39N14l26p09J170m27n25O84M38j134M18M88n53
$$ 177 -586 47 588 -437 -430 493 141 -198 316 -10 -719 451 24 -501 183 621 -513 -95 393 -160
5053a60L83J79r66L38Q26j077j88R98N6o15M43j12l14L54P2q89N58O82p01l30
$$ -160 223 402 -564 -226 600 -477 -665 333 389 -226 217 105 -209 145 217 -672 -114 568 -133 -463
5073d63R27n21k41O85n72j22Q06l19q69Q60K11o95K20N81o19R2M19q75LJ171r67
$$ -463 464 -57 -298 387 -185 -307 499 180 -689 171 382 -313 -93 488 -131 -39 380 -495 -492 679 -288
5094b88k14P54p6o20O45p7n56M99J83p75L73Q62r34l25J075k74l74L73j60o72
$$ -288 -502 252 176 -444 201 124 -432 67 250 -525 -152 710 -224 -549 526 252 -122 251 91 -581
5114e81Q19k86o41Q90L33p09j35P96p00L00m1l36O9J048p17o18J088l05m14L16
$$ -581 238 -48 -689 201 534 -175 -310 486 -214 86 45 -291 -222 826 109 -509 579 274 -140 176
5134A76j87k00L63L10j040L95P45p96k95R51k50n48L29l0j9M71l39p66P60O20
$$ 176 -11 -211 152 462 -578 -183 562 -234 -529 422 172 -376 -47 -77 -96 375 36 -730 30 650
5154F50j012J45L91k5m90L50l50J23P38n27o82R88O4q20M84K34m63M69o3n18K81
$$ 650 -362 -217 174 149 -341 9 -341 -218 520 -7 -689 299 363 -457 27 261 -202 267 204 -314 -33
5175c3M89k96o44P53Mo38L55k19K5N08j33q09O07M78q26J69N13m38k73O69l81
$$ -33 456 160 -484 269 273 -365 -10 -229 -204 304 171 -638 -31 447 -379 -210 303 -135 -408 261 -120
5196a20j09O83l48n20N83k66p4K82n3j13k20N84m54J87K35m67l12P73k35j99K04
$$ -120 -229 454 106 -414 169 -97 -171 111 58 -55 -275 309 -145 42 277 -190 -502 271 36 -163 41
5217D1J15l61M21n0m37N25o2m08J93N75q93K39L60k99k82O39n63k10O02R6o38
$$ 41 156 -205 216 166 -271 254 192 -216 -23 552 -341 -102 258 -41 -323 316 -247 -457 145 241 -397
5238c97L88J86j49K37j45j22k62N54m23o4M42j21j64J56M1l74L89J61k58N1K77
$$ -397 -9 177 28 265 120 -2 -264 290 -133 -197 245 124 -40 116 157 -217 172 333 75 126 403
5259D03m77q5O09l84K4j67R6k43L57O6m85M89M7n87K77J79l76L24M0j63K3J65
$$ 403 -74 -159 450 66 90 -77 19 -224 133 199 -286 203 250 -337 -60 119 -257 67 107 -56 -33 132
5281A32j71j92N42m37L5J71j33j77K4J16k71M86J14k21k32L49L8k94M41j73j71
$$ 132 -39 -231 311 -126 -91 80 -53 -230 -206 -90 -361 125 239 18 -214 135 173 -121 320 147 -24
5302b4J84j33j88J03n3L7J82j38J10K7k7k85K45k4j74J90J67M6l05J34J10k97
$$ -24 160 27 -161 -58 -111 -74 108 -30 80 107 80 -205 40 16 -158 32 199 245 -60 74 184 -113
5324a13J44L16k82n2L61j85j41L2j84J5K0mk74M26r2J65k04m7QL16k2j51j42J11
$$ -113 31 347 65 13 374 189 48 80 -104 -89 -69 -73 -347 79 -13 152 -52 -99 -91 225 203 52 -90 21
5348B1j20J32J75k35P3j5R8j06KK4j01O5J05p0n8J79m78K16K92k47J69k39J16
$$ 21 -99 33 208 -27 46 31 129 23 25 49 -52 13 118 48 -10 169 -309 -93 199 -48 121 -118 -2
5371bl11N60l72J69J54j93j69J81J23k62J50l2j66J29M27n03J46K17l2j20j44
$$ -2 -313 247 -125 44 198 5 -164 17 140 -122 28 -4 -170 -41 386 -117 29 246 214 94 -50
5392e0K33l82J94j18J50j94M05k66l36N25k60L2J76j07j92L98j82o0Q5k0o1J31
$$ -50 183 -199 -5 -123 27 -167 238 -28 -364 161 -99 -67 109 2 -190 208 26 -34 51 31 -30 101
5414A01j44pj4L63k42l01K66n3NJ39r1j63J48K0j48O5K17n7j95K33k11K92j54
$$ 101 -43 -50 -64 299 57 -244 22 -31 -26 113 22 -141 7 27 -121 -56 161 104 -91 142 -69 223 69
5437F9L12l16j09J14m56L03Q5j40R0M4m73N27J91l56J06M13m00j01l2J16l01K87
$$ 69 381 65 -44 70 -386 -83 2 -138 -48 -4 -477 50 241 -115 -9 404 4 -97 -129 -13 -314 -27
5459b7m3q2J56O0m88J84M74l4m83K70N9l9M4J64m84N23j19k35J43J95m12K73M
$$ -27 -70 -152 4 64 -424 -240 234 200 -283 -13 46 7 51 215 -269 254 135 -100 43 238 -174 99 103
5482A03l64M15n0j76j15N65l31k83K73N9m4Lj12j41K73m9j56J0N46o64J01L84
$$ 103 -261 154 104 -72 -187 378 47 -236 37 96 52 55 -57 -198 75 26 -130 -120 426 -238 -137 247
5504B47j69J5qJ18l80K73J21m38M75j3m25J85L95l02j25J14k34K00K74k19n49
$$ 247 78 93 85 203 -177 96 217 -221 254 241 -184 1 396 94 -31 83 -151 49 323 104 -445
5525d45O71K4o10M28jm08M18j11n56P71K36m41k4K03n8k60L01k10l5M28j90m21
$$ -445 226 250 -360 68 67 -341 77 -34 -590 181 417 -24 -48 155 97 -163 138 -72 -107 321 131 -290
5547b90K22M21l55L3K37n06J52N04o12k8O61m42n18P40L0m81NK70l13M46j56p0
$$ -290 -68 353 -2 31 268 -238 -86 418 -194 -222 439 -3 -521 219 249 -232 -227 43 -270 176 20 -50
5569e0l22Q81p12j48M73N2l75M07j42k79O12j43p08O91J13o96K83K80k59J68p
$$ -50 -372 509 -203 -351 122 174 -201 206 64 -215 397 254 -454 237 350 -346 -63 217 -42 126 119
5590A19j68k88O37m84l67P99j62j67J21j03n7K07K22o31M1Q25o86o8O63l62m09
$$ 119 -49 -337 300 -184 -551 248 86 -81 40 -63 -120 87 309 -322 -281 544 -142 -210 453 91 -318
5611c18L80j16j93N83l35k77K75L58n95r0N76k18j68M38n95k4O44m10l11N80Q7
$$ -318 62 -54 -247 336 1 -276 -1 357 -238 -328 248 30 -138 300 -295 -319 325 -85 -396 184 271
5632B71m52J51J04l24N58j51l42P3L82l86j88Q23m77j40N3J00k37O90l24m19J86
$$ 271 -181 -30 74 -250 308 157 -185 -112 270 -116 -304 519 42 -98 -45 55 -182 508 184 -235 -49
5653d9L16m89p8O27m24m4J26n7j37M80l27m76O10K92q37J75M88k21J37ml86J87
$$ -49 267 -222 -300 327 -97 -141 -15 -72 -209 271 -56 -532 78 370 -467 -292 196 -25 112 108 -278 -91
5675i1L96j64m34M37j26l36L05M4q7J6J06n22O06K76o09Q4L37j87k22L05q1j59
$$ -91 305 141 -293 144 18 -318 -13 31 -56 -40 66 -456 150 426 -183 -99 238 51 -171 134 53 -106
5697a06L46k22o03Q30j25j77k3J66k15J58P6l48J78K86m62n1M65k28q9M9J93l25
$$ -106 240 18 -585 245 120 -57 -80 86 -129 29 105 -243 -65 221 -241 -292 173 -55 -144 -95 98 -227
5719b27M91j39o42L70L91k73o2J62k7o1L7o8k65L95j21j26L97O4n51P8K89k98
$$ -227 264 125 -517 -147 244 -29 -91 71 44 -17 20 -48 -313 82 -39 -165 232 296 -255 -177 112 -186
5741a86j07M10l94K09L79k21k38M19qk43r8J73m5j37K69l49R2K86l5m01K54q7
$$ -186 -293 117 -277 -68 311 90 -148 271 263 20 -78 95 50 -87 182 -167 -75 211 176 -225 29 -58
5763e8k01J58J98j91M69j10l84k6L84m83P6J27l31K71K11j2k46K25j16N2O8j27
$$ -58 -259 -101 97 -94 375 265 -119 -145 239 -244 -168 -41 -372 -101 110 98 -148 77 -39 13 81 -46
5785d6j24J91J57l66L85O2k44K16Nl17j68L10p2l2L1J46l68K60j76J46N9J23l93
$$ -46 -170 21 178 -188 197 259 15 231 236 -81 -249 61 -11 -43 -12 134 -234 26 -150 -4 55 178 -215
5808b15O5L67j89qJ44k15l5Q0K68k28j63J86j23j8k6K48j66K33l47L22k00q9J71
$$ -215 -150 217 28 20 164 -51 -86 -6 262 34 -129 57 -66 -84 -110 138 -28 205 -142 180 -20 -109 62
5831F2k43L26m0q5J84o0Q8j14k89j21J36J47n3k8K36l12J20M8jP4m8p2l1J20P
$$ 62 -181 145 105 20 204 144 232 118 -171 -292 -156 -9 -62 -90 146 -166 -46 2 1 75 27 -45 -76 44 51
5856E1k19J85j85K52P9k57j53Q5K11o5PO7M3PQ7j66J36q9R4J16k06l52M46k30
$$ 51 -168 17 -168 84 163 -94 -247 -162 49 -16 -9 58 101 108 195 29 165 76 170 286 80 -272 174 -56
5880e6o4Q1L9J6j02J87L6k21Q6K80j94k75K53J46m74J86Q2O8jo1k87L45m8j71
$$ -56 -120 -39 0 16 -86 101 137 -84 2 282 88 -187 66 212 -262 -76 6 74 73 12 -275 70 22 -149
5904a49K41k73J48J9n3qq5J12L17j74J07l17R8J48j43j9L13k38q5M1j1K4j81K40
$$ -149 92 -181 -33 -14 -67 -75 -160 -48 269 95 202 -115 -17 131 -12 -31 282 44 -41 0 -11 13 -168 72
5928G2k59J40K58l50N2K0nJ08J82j82j24J93R4j82j33K39j46J51k20j39Q6k2p5
$$ 72 -187 -47 211 -139 -87 -67 -72 36 218 36 -88 105 199 17 -116 123 -23 128 -92 -231 -145 -167 -242
5951b42R9J06J31Q6q4k79n2M71n5l57L45k71M8j48K20N4k87L31k33o4J53K31Q
$$ -242 -143 -37 94 180 96 -183 -235 236 181 -176 169 -102 -54 -202 18 72 -215 116 -117 -181 -28 203 211
5974B11j10j49p3J44ON2l28L55k19l8L27m20K20L24l21p7K33j48r3K8K41k08p7
$$ 211 101 -48 -121 23 29 81 -247 108 -111 -149 178 -242 -22 302 -19 -96 137 -11 -104 -76 165 -43 -120
5997a20K75l97Q3K67k07K42j05r6N6Q2j14P3J7J10n51P0N20k40j65L10m29K46
$$ -120 155 -242 -159 108 -99 143 38 -58 -2 80 -34 39 56 166 -385 -315 205 -35 -200 110 -319 -73
6019g3K51k99PK63P3m04K55n3l4R9k2m14N49J8k74J85O0k13j39M14m67K27L71
$$ -73 178 -121 -114 149 222 -182 73 20 -14 85 63 -351 198 216 -58 127 187 -26 -165 249 -218 9 380
6042C80n22j46N27m4m63O6N59n04O2L71l34L04l09q4K28K76m42k81N54q9j70N6
$$ 380 -142 -288 239 195 -268 -202 357 -147 -85 286 -48 256 -53 -137 91 367 -75 -356 198 109 -61 -5
6064eO3k85L84j3l89K36M06n90L16r7r6q9M72j47m55O48l94k12L36K79l52j36
$$ -5 58 -227 157 144 -245 -9 397 -193 123 26 -70 -159 313 166 -289 359 -35 -247 89 368 16 -120
6086a20J26j29j09K80j58j81L26J90l00Q4J1j64J5K80l06L83%m39K31K67l09j21
$$ -120 6 -123 -232 48 -110 -291 35 225 -75 9 20 -144 -129 151 -155 228 228 -211 20 287 -22 -143
6108a43L61k31l6P3J33m72M88j97q8l2M12m05o4K64q0j27K19j40o9M37k32k54
$$ -143 218 -13 -49 24 157 -315 173 -24 -112 -144 268 -137 -201 63 -17 -144 75 -65 -134 303 71 -183
6130a83K18j17m9j83L71j24R2J18l98K45O90n64l39M32R7n09L54j36m90P27j22
$$ -183 35 -82 -131 -314 57 -67 25 143 -255 -10 680 116 -223 209 306 -203 151 15 -475 252 130
6151A30l51J09K96k82J66J82m37L0L62k76j19L37j57m28N33J57k93J03J71o17
$$ 130 -221 -112 184 -98 68 250 -187 -157 205 -71 -190 147 -10 -438 95 252 -41 62 233 -384
6171c84N2L66l52L05K87l98q7K01K54k71J49k10O3J10j27j47L27L6m28Q6J18L2
$$ -384 -332 34 -318 -13 274 -124 -211 -10 244 -27 122 -88 -25 85 -42 -189 138 174 -254 -168 -50 -18
6193a8K9J23j87j2R2m7l40J98M14k36k6k8K06p8m1q8J23j2l2k50L24J35m65J83
$$ -18 11 134 -53 -65 27 -20 -360 -162 252 16 -10 -38 168 90 49 -39 84 72 40 -210 114 249 -216 -33
6217c3j90K69OO6n10N61m4k62jK79j33l70K16J14L16j42k14j2L63l15j76J40P4
$$ -33 -223 46 52 118 -392 169 125 -137 -138 141 8 -362 -146 -32 284 142 -72 -84 279 -36 -212 -72 2
6240Bm0J00k6k82K60J53m06N2J84j7j62M02k79K2K37q9m08N66r7l24L0k2J71o3
$$ 2 -38 62 36 -246 14 167 -239 -187 -3 -20 -182 220 -59 -37 200 111 -297 269 172 -152 -122 -144 27 -36
6264c6J07q9O9KL9k00L06r6L0q4l47J20K54j93J1jK9R6j45K79j05Mj47j07K48
$$ -36 71 -18 51 53 92 -108 198 102 132 48 -299 -179 75 -118 -107 -108 -79 17 -128 151 46 50 -97 -204 44
6289D4J7j49n3J16r8J03j93M69J60m22J41o2k5k3J03r7rK01m24QK40n3k1q9Q0
$$ 44 61 -88 -141 -25 -123 -20 -213 256 416 -6 135 73 48 25 128 31 22 223 -201 -193 47 -6 -27 -116 -36
6314c6P5j11o9lJ75l4j54K44K0m0j69j4k36J37J97j12J43J65r2k27L93q0k12K30
$$ -36 39 -72 -141 -144 31 -3 -157 87 107 67 -102 -116 -352 -215 -18 -130 13 178 86 -141 252 172 -40 190
6338A90l66J63j06J79k34L86k43M1j40J19K27l34K88j08k78K81n2k21M8K59J88
$$ 190 -176 -13 -119 60 -174 212 -31 10 -130 -11 216 -118 170 62 -216 65 13 -208 -160 99 287
6359B87m08pQ6L9j93L25K3j67J78l82J62M03m37J71k34J73r3K17J51j63j20q3
$$ 287 -121 -128 -42 -3 -196 129 152 -15 163 -219 -57 346 -91 80 -154 19 -74 143 294 131 11 -72
6381g2L8N8l1n6L24k64j8J31K55k22j81K54j17J11k57M2K3rj83J45M7J43k26m8
$$ -72 -34 24 -7 -63 261 -3 -21 110 365 143 -38 216 99 210 -47 -5 18 9 -174 -29 18 161 -65 -113
6405a13J26k33P8m4k5L60j03k09Q6P9J36j9J53k82l3M4j6L7j06J25j65J12r7O8
$$ -113 13 -220 -142 -186 -211 149 46 -163 -77 2 138 119 272 -10 -43 1 -15 22 -84 41 -124 -12 -109 -41
6429d1M2j1J73l89K87J58j61nk5r2j38L29l42J4L95j54K50j80j01J54k43j72N
$$ -41 1 -10 163 -226 61 219 58 53 28 -64 -202 127 -215 -201 194 40 290 110 9 163 -80 -252 -247
6452b47M32j35l40K82M4j06j62N01k59N0n6j04ML99l48N8K97k79m9Jq9k33K68
$$ -247 185 50 -290 -8 36 -70 -232 269 10 60 4 -100 -96 303 -45 13 310 31 -18 -17 -106 -339 -71
6475g1l1k4P3L30n95K43J20L1k02N16l33j76K65j01l46K06K98m07k8L86j71J95
$$ -71 -102 -126 -53 277 -318 -75 45 76 -126 390 57 -119 146 45 -301 -95 203 -204 -232 154 -17 178
6497A78r7j34N7N5L7j70J62L7k12K93j87j26L19n78J72J62L3O2j32P6j08j69L25
$$ 178 81 -53 4 59 96 -74 88 125 -87 206 19 -107 212 -366 -194 -32 1 63 -69 7 -101 -270 55
6520E5q1J3M31l84k42M2K19j32J38l4j69J24J36j67j45L94j91j86M23k71R6k1
$$ 55 -26 -13 418 34 -208 -166 53 -79 59 25 -144 -20 116 -51 -196 198 7 -179 244 -27 69 48
6542D8j02k25M92l90R0j08M10l70O4N4j33J53L9q4PL57l31k92M02k3k69K75j6
$$ 48 -54 -279 213 -177 -87 -195 215 -155 -91 -37 -170 -17 22 -62 -55 302 -29 -321 81 58 -211 64 48
6565D8j80j73N03o07L47J25j27q8J30O2k31J06K6k81M41r6l23P9L30j74k5K63
$$ 48 -132 -305 198 -409 -62 63 -64 -152 -22 40 -191 -85 -59 -340 101 5 -318 -239 91 -83 -108 155
6587A55P5k89j5J75l5j01J45j29qK44l41J51q7k06L09Q2l01J20N0j43k6M29m4
$$ 155 230 -59 -74 101 66 -35 110 -19 -27 217 -124 27 -60 -266 43 125 -176 -56 -6 -149 -175 254 210
6610B10m93N39j78p2J79J3m23M46j75k39L7L74M8m06K59l0K1Q9k1l49K3K35j86
$$ 210 -283 256 78 6 185 198 -225 221 46 -193 -156 218 266 -140 119 89 110 199 178 -171 -148 87 -99
6633i9J27j16P3J84j49l41j53P94l73j8L5Q6n5J42l0m56M53M3m65M15P7m62J14
$$ -99 28 -88 -15 169 20 -321 -474 320 -53 -71 -36 50 -5 137 107 -349 104 147 -318 97 174 -288 -174
6656a74K37q8n3oj14J48K99m5l21K79n4q4k56L26k36KK09l01K27J46L6j36J5J3
$$ -174 63 -25 -78 -84 -198 -50 249 204 -117 162 108 24 -232 94 -142 -140 69 -232 -5 141 177 41 56 69
6680F9K19k38R4k71o0K07l92R4M53l37j21K85j1J7J62l4m03L91j67j13J45K27
$$ 69 288 50 144 -127 -187 20 -372 -278 175 -162 -283 2 -9 8 170 136 -267 124 -43 -156 -11 216
6702B16l69j7J31j02P2P3J1j38K15n1o5N5J40l52K0J62l0R7n1j7L24j8l36QJ02
$$ 216 -153 -170 -39 -141 -69 4 15 -123 92 41 -24 31 171 -181 -161 1 -29 68 17 0 324 306 -30 -22 80
6727H0j51J03N0r1j53K94Qk62L9L0L01K6j73q7N5J9j19MJ00k96j81M63K29l83
$$ 80 -71 32 82 -9 -162 132 140 -122 -83 -53 248 274 101 14 69 88 -31 -27 73 -223 -404 59 288 -95
6751i5L37k27o4Q8o1j25J32K34m02J68K09r4j53MJ08m3N7j98o9J28L04j2k54p8
$$ -95 242 15 -49 39 -22 -147 -15 219 -183 -15 194 100 -53 -49 59 16 73 -125 -194 -66 238 226 -28 -106
6775a06K7r2L02k87K26K20k16l21L19k7p3j74L57l32J81J57j41j73j1J90k3Q2
$$ -106 -79 -171 131 -156 70 290 74 -247 72 45 -28 -202 155 -177 4 161 20 -153 -164 26 3 85
6797H5O3l20J17K69l26K41j33j17R2l9M2q9q5L26k41J86N6l23L63R9j84Pj28l29
$$ 85 148 -172 -55 214 -112 129 -4 -121 -29 -68 -26 -115 -200 126 -115 71 127 -196 167 266 82 89 -39 -368
6821c68L69K55l21k2J9P7L0Q2j76KK51p5J0r7P9p5j14l6n1K01k0N4j1q2j24J47
$$ -368 1 256 -65 -87 -68 9 39 121 -55 -53 198 123 133 36 115 40 -74 -110 -161 40 20 74 63 -19 -143 4
6847DO2j60p6K45j77j08J13M2J62k18l2K00N0k86J94k38j00J87R9J69l8k40j3
$$ 4 66 -94 -170 75 -102 -210 -97 -55 107 -111 -143 57 107 -179 15 -223 -323 -136 -37 132 94 -146 -159
6870a59M03k24j52M33j51k23J76R6l76K28J00j00O8O5m36p5M00o7J22o7j45P7
$$ -159 244 20 -132 301 150 -73 103 199 -177 51 151 51 119 184 -252 -327 73 6 128 61 -84 -7
6892gK3j82J18K65j72L0J46l36K56J50k22k74J35K03j06o7m6j24K35j60Q7j21
$$ -7 16 -166 -48 217 45 75 221 -115 141 291 69 -205 -70 133 27 -40 -86 -210 25 -135 -48 -169
6914a69J25q4P4J79J63l91K20j06j58J09j9j50L5M27o27M41J33k26n2L0j50K08
$$ -169 -44 -128 -54 125 288 -103 117 11 -147 -38 -57 -207 -172 255 -372 69 202 -24 -76 -46 -196 12
6936A2o5J34j63K97J2l86O6L19j37k18M1K17l29J62j61L70r6j38J4K19j39k34
$$ 12 -53 81 -82 215 227 -159 -93 226 89 -129 -88 129 -200 -38 -199 171 75 -63 -49 170 31 -203
6958b03L29j90j60M48k21j91J94M6k45L18j6p7Q7k6J3k63K38j55J7j0K87l34J6
$$ -203 126 -64 -224 224 3 -188 6 52 -193 125 109 32 119 93 106 -157 81 -74 -57 -67 220 -114 -98
6981i8M0K19m9J35k62j90M22l65J21O2%j12p2P8L38j43j73L89k55L4K41o00J30
$$ -98 -58 161 112 247 -15 -205 217 -148 -27 35 35 -77 -149 -71 267 124 -49 340 85 119 360 -240 -110
7004a10J62O4j93qJ76J0Q6k62M6K66j15j21J66k42M1J88k82J36l1p3lK23J0m01
$$ -110 52 116 -77 -85 91 101 187 -75 -29 237 122 1 167 -75 -34 154 -128 8 -23 -96 -99 124 134 -267
7028b67L62n05J79R1J27j07L2J93j77p5J57r1j35n3M18l81L21p5qo1L15k23l42
$$ -267 95 -410 -231 -140 -13 -120 -88 105 -72 -147 10 -81 -216 -269 149 -232 89 14 6 -55 260 37 -305
7051c05K07o8K30k59J21j21K40JJ34j08J97m24J90J84j58R0p2k80j43N06q9j38
$$ -305 -98 -166 64 -195 -74 -195 45 46 180 72 269 -155 35 219 61 151 79 -201 -344 162 73 -65
7073f5J88j22K44l32mK17q5N0k07J64m3k83J55K66J2j07J76j34k78L64N2m04J83
$$ -65 123 1 245 -87 -91 126 41 91 -116 48 5 -278 -123 143 155 48 224 90 -188 176 228 -176 7
7096GK93l27j92K47QJ33J1j07k0%j18J05J52nj32l29J33mL77j51j99O1J50p0J0
$$ 7 300 -27 -219 28 36 169 180 73 53 53 -65 40 192 187 55 -274 -141 -145 232 81 -118 -57 93 23 33
7121C3p4r4p5K89l69P5K12J50p4k2Rj52J80J2j58p3J41j20O7Q2K36l69o0L44N6
$$ 33 -41 -135 -210 79 -290 -215 -3 147 73 51 60 -92 88 100 -58 -131 10 -110 -43 39 275 -94 -154 190 246
7146B46k81QQ9j60L34k19N5Q6l52RM55j27n4j00j49N1J78O0m0QP3l60R1O5k9r
$$ 246 -35 -27 62 -98 236 17 72 158 -194 -185 270 143 89 -11 -160 -109 69 129 89 97 170 -190 -99 -34 -63 -72
7172g2r2J13J21J08q8j28J88k23K9J42l7k49R5J49j97q0K50j23K10q1P2l75J86
$$ -72 -164 -51 70 178 90 -38 150 -73 -44 98 61 -188 -93 56 -141 -221 29 -94 116 35 107 -268 -82
7195h2K08j56J92j48k67N94l49j84N0L33j87J93m35M15k01K07k4k28L0O1J8j61
$$ -82 126 -30 162 14 -253 341 -8 -192 -142 191 4 197 -238 177 -24 183 159 -69 -39 22 40 -121
7217a21n3N7L28j70q7J14J10l46p2L73k97J64J94j22Q7j71N8nJ44k54J5p3K41
$$ -121 -174 -117 211 41 -46 68 178 -168 -240 133 -164 0 194 72 159 -12 46 41 185 -69 -54 -127 114
7240A14j20m3K54m24J55n7J56j67L09m2k43L04k97P6n1j6k32O20k32j62l4j3J37
$$ 114 -6 -49 205 -219 -64 -121 35 -132 177 135 -108 196 -101 -25 -76 -92 -324 296 64 -98 -132 -145 -8
7263hO3J40k60K26j92j7l35K39L31Pj51J01r8K0k42J53K7Q6Q0j97rK17l86K13
$$ -8 55 195 -65 161 -31 -48 -383 -144 187 194 43 144 46 66 -176 -23 4 90 170 -27 -36 181 -205 8
7287Hj8J51q4K32m09k6K2J68Q5l51J20O7K06k5o0K2O1l63J81M2J9k31Q7K23k79
$$ 8 -10 141 57 289 -120 -146 -124 44 129 -222 -102 -35 171 146 86 108 169 -194 -13 29 48 -183 -96 127 -152
7312a52P2J09Q0k01M00k77j00L80m11J27%n3p2K36m6L56l29q1J92k13P2j58j9
$$ -152 -80 29 109 -92 308 31 -69 311 -100 27 27 -26 -98 138 92 448 119 38 230 17 89 -69 -88
7335h8k7K9K5J80j28r0K81j70O9J29j41Qoj54j20L53J59l18j9k84J49R3J10k49
$$ -88 -115 -86 -61 119 -9 -99 182 12 81 210 69 77 71 -83 -203 150 309 -9 -28 -312 -163 -70 40 -209
7359b09N64j8n26R3K46k63J95j05K59l05J45j19O6j35mj6L07J4k8p2k03J36Q3
$$ -209 355 337 -189 -96 150 -113 82 -23 236 -69 76 -43 23 -112 -116 -132 175 189 161 89 -114 22 105
7382A05k09K45m9N5j84j14J99R6j32j94M30k99l1K21l9l73K65j8J79O2mj66L0
$$ 105 -104 141 92 147 -37 -151 48 144 12 -182 248 -51 -82 139 100 -273 -8 -26 153 215 211 45 75
7405G5Rn6j32L46m28L8K55O5j82q3L0j5n4J41j90J13J02j73j4j2M08j20l7j36
$$ 75 84 28 -104 242 -186 -148 107 172 -10 -93 -63 -78 -132 9 -181 -68 34 -139 -153 -165 243 123 86 -50
7429e0K00m38K01J02l0L4j67K99k10j37J38K52L1l45K39l6m18K65J73o9j77l3
$$ -50 150 -288 -87 15 -15 19 -148 151 -59 -196 -58 194 225 -120 119 83 -335 -70 103 34 -143 -176
7451a76M7L74k14l79K58N3J5K52l12l0K77j07j11J90j30J6J6j41P3n1O0m3J12
$$ -176 -129 245 31 -348 -90 -37 -22 230 -82 -112 165 58 -53 137 7 23 39 -102 -29 -80 -20 -63 49
7474D9m8j65k1M10p0p6j1j90J41P7j95P7O4L6r0q5K00j11J37j81J35n0o2J00L9
$$ 49 1 -164 -185 225 155 79 68 -122 19 96 -99 -22 42 78 -12 -97 103 -8 129 -52 83 33 -29 71 110
7499A10j62l2K73m19J29K04j91J70Mk3j27J85j31oJ33Ok07K13J3n6j60j28K09
$$ 110 -52 -84 189 -230 -101 103 -88 82 86 63 -64 121 -10 -16 117 123 -84 129 142 86 -74 -202 7
7522GP1J96l61J79R5k7n1jj58J0K37Ok85J67j4q8K86j52q1J3Q4l2r5m4K7J05P6
$$ 7 78 274 -87 92 187 160 109 108 -50 -40 197 203 -82 85 71 -17 269 117 36 49 133 101 6 -38 -11 94 170
7549A70m6k07K80k7P1k68o9j5K15j38l36N95k30J28o8N2j09M8ro8K9j25J59j72
$$ 170 124 -83 197 170 241 -27 -96 -111 104 -34 -370 225 -5 123 55 107 -2 46 37 -31 -2 -127 32 -140
7573a40J12q8J16Q0j11o1J69M0j57j47K67k31k8J79J06k95p5Q5J62j49L17l26
$$ -140 -28 -116 0 80 -31 -92 77 117 -40 -187 80 -151 -179 0 106 -189 -264 -179 -17 -166 151 -175
7595a75M3J60j08J82l06M2J91j01j22J05J92j15M9M8J18l26J88o8OJ78L7l09J64
$$ -175 -132 28 -80 102 -204 -162 29 -72 -194 -89 103 -12 37 85 203 -123 65 -3 3 181 218 -91 73
7618G3k9l2J2KL29m06M9l2m2J67K5m9m0k11K08k2R5J5m7k19K7J18j8P3j21J94
$$ 73 44 12 24 26 355 -51 -2 -34 -76 91 116 67 27 -184 24 2 97 112 65 -154 -127 -9 -27 46 -75 119
7644A19j82J0O4K4j76K60r%j40J13k31L65l46p6Q0R8K0j6J64K51n98L17l6q0k40
$$ 119 -63 -53 11 35 -141 119 110 110 -30 83 -148 217 -129 -205 -125 -27 -7 -23 141 392 -206 111 75 -5 -245
7669b45K63k17Q1r8L96l46K46N5l35K33m0o6KK14j53L5j10o3K57J18m14L36Jj57
$$ -245 18 -199 -118 -216 180 -166 80 135 -200 33 -7 -73 -71 143 -10 25 -85 -148 109 227 -187 149 150 -7
7693gk9j49K39J00k23qk0L37m52qM7J22J15p9k16J57mK63j95j67L56j16j95J54
$$ -7 -36 -185 54 154 -69 -77 -97 240 -212 -220 -173 -51 64 -15 -231 -74 -78 185 -10 -177 179 63 -132 22
7717B2J07j32l0L18l20N7k2n5K63j77O4j31o7J23r5M8J9n4j42L78k18K3j01Q2
$$ 22 129 -3 -33 285 -35 22 0 -55 208 31 95 -36 -103 20 -75 -27 -8 -62 -204 174 -44 -21 -122 -40
7741d0J71j09N4L1R9k91p2J47m2M0M2J17k64k27O16k62o9K05k82J48n8j77L47
$$ -40 131 22 76 107 206 -85 -157 -10 -52 -12 30 147 -117 -344 272 10 -59 146 -136 12 -46 -223 124
7764A24q7l2J01J1j11j72R4J23q0K37k53n5m8K94j28J11l0l25L7P6l9N9O7J77
$$ 124 37 5 106 117 6 -166 -72 51 -29 208 -45 -100 -148 146 18 129 99 -226 -189 -113 -152 -93 -26 151
7788A51k46J04j91J68j10J57j04M4p1P7J03J27k56J48r8J00J21j22K09l23q4L11
$$ 151 -95 9 -182 -14 -124 33 -71 -27 -98 -21 82 209 -47 101 3 103 224 102 311 -12 -96 215
7810B15k99M0K84l57p1K31J5k86K45K6o5O1m0j03L27k00Q0n8K46l84J36j18m8
$$ 215 -84 -44 240 -117 -188 43 58 -228 17 43 -22 39 -1 -104 223 23 103 45 291 -93 43 -75 -123
7833a23L5K64j92k9j40K45l02M30j23P9k68M1q6K38k50J62k7J33Lr2P3q0j22K73
$$ -123 -88 176 -16 -45 -185 60 -242 188 65 144 -124 -83 -169 69 -181 -19 -46 87 90 -2 71 -9 -131 142
7857A42r5k09J31R5k52K62k7n6o2m5K10q0o6J5K79l76J94k6j17M3k80K51R0J22
$$ 142 47 -162 -31 64 -188 74 47 -9 -71 -116 94 14 -52 -37 242 -134 60 34 -83 -40 -320 -69 21 143
7881A43q9m0N3j52J87j2k22J92j93J84kj7J53n5K6k19L09l32N1O9l8k24Q5l1K28
$$ 143 54 14 67 -85 102 90 -132 60 -133 51 49 32 185 130 156 -63 246 -86 -35 34 -4 -228 -143 -174 54
7906E4j24K14p5j67J74J70k22R9m6o2J26P2k13n7j8j68L23K51k38j93M38l23J32
$$ 54 -70 144 69 -98 76 246 24 123 77 15 141 213 0 -57 -75 -243 80 331 93 -100 338 15 147
7929A47j89J57m6j63O5q5N9K2J17q0k04K82p3L52l02j20L17m07J13J40k20J17
$$ 147 -42 115 69 -94 -29 -114 -55 -33 84 4 -200 82 9 361 59 -61 256 -151 -38 102 -118 -1
7951aq0j2K00n1j16J21j39J83j84J08l20L05P3k13J18O1L2n0K2l21K38j38K52
$$ -1 -81 -93 107 56 -60 61 -78 105 -79 29 -291 14 87 -126 -8 53 85 35 57 -264 -26 -164 88
7974H8r4l6Q9mJ62k46L8J02O4J0r8jj72P4j3k12L15k1K99m63o0J59p1J99N6j92
$$ 88 -6 -42 47 43 205 -41 -3 99 163 173 75 74 -98 -24 -37 -249 66 45 344 -119 -179 -20 -91 108 164 -28
8000b8J84k92K40J48o6k30J37j01k2J1m5J64J87l67J64j8n9k04L02j74j11L09
$$ -28 156 -136 104 252 186 -44 93 -8 -30 -19 -64 100 287 -80 84 66 7 -197 105 -69 -180 129
8022A29j02q0M5n5J61k6n0Om0O2K41k68N5J87j20l20K32J3j37K56q4j7k75Q3P5
$$ 129 27 -53 -8 -63 98 72 22 28 -12 50 291 23 78 265 145 -175 57 70 -67 189 105 88 -187 -104 -29
8047b9J51j48O3rl2k20K05P1J83o08M21K9r7J17o7l9k34K25Q6j44o6K09k8Q6k95
$$ -29 122 -26 37 28 -4 -224 -19 52 235 -373 48 77 -20 97 30 -9 -243 -18 68 -76 -142 67 39 125 -170
8072a70K02j29j00K1J28K18k11J41l53L26j25j12J68j14K11l97K27J21o2J53m8
$$ -170 32 -97 -197 -176 -48 170 -41 100 -253 73 -52 -164 4 -110 101 -296 -69 52 -10 143 95
8093I5k17o4J65K18k36m5P7J34q4KJ54k57J80o7P2j1j66k4J09p6J5k56M93k45
$$ 95 -122 -186 -21 197 -39 -84 -7 127 43 45 199 -58 122 55 127 116 -50 -74 35 -41 -26 -282 211 -34
8117c4M9OJ13r1j86K99j51K44k26j08P7J51j90N0K64j36j46N9m1n7J79l21J79
$$ -34 15 21 134 43 -143 156 5 249 23 -85 -8 143 -47 3 267 131 -15 44 3 -54 125 -196 -17
8140a7j11L40k5m16R4N4L32j33q8j49K64l6k17J01K40j75j16K33l61L07J3k20
$$ -17 -128 212 187 -229 -135 -81 251 118 30 -119 145 109 -108 -7 233 58 -58 175 -186 121 134 -86
8162h6P5q3r8J01J88J2k01J06r1j15L86j99J31k03J20j13J44k21K06j11J80p1
$$ -86 -11 -94 -192 -91 97 109 -92 14 -77 -192 194 -5 126 -77 43 -70 74 -147 59 -52 128 57
8184E7j34J47K6j15Q0j0j38
$$ 57 -77 70 96 -19 61 51 -87
8191h7
$$ Imaginary data points
##PAGE= N=2
##DATA TABLE= (X++(I..I)), XYDATA
0@%%%%%%%%%%%qJ6j6J6j6K1k9L2l5M3n6O4p2Q8j04J19j35J55j76J99k28K60k93
$$ 0 0 0 0 0 0 0 0 0 0 0 0 -8 8 -8 8 -8 13 -16 16 -19 24 -32 32 -40 48 -56 63 -72 83 -93 106 -122 138 -155
34a55L29l70M12m58N13n72O34p04P80q62R50j049J158j274J404j546J704j879
$$ -155 174 -196 216 -242 271 -301 333 -371 409 -453 497 -552 606 -668 736 -810 894 -985
52i85K071k285K530k807L123l492L921m435N065n848O853q195J0077j2893J7530
$$ -985 1086 -1199 1331 -1476 1647 -1845 2076 -2359 2706 -3142 3711 -4484 5593 -7300 10230
67A0230k6392M8728j96520k96377O98805k8861m61051K86572R4463k88572L18038
$$ 10230 -16162 32566 -163954 -460331 238474 209613 -251438 35134 129597 -158975 159063
78A59063O7614m93449K44987M12035n04639j86484M97748n8725k91903J58782
$$ 159063 226677 -266772 -21785 390250 -114389 -300873 196875 138150 -153753 5029
88E029j5589n6719K67595j30094l35136K89688K11842l31012n1380J97510o0219
$$ 5029 -10560 -67279 200316 70222 -264914 24774 236616 -94396 -145776 51734 -8485
99h485L271K2064j56005J42419K05547k89503j13733L32285j8876k19438Q3315
$$ -8485 -5214 16850 -139155 3264 208811 -80692 -194425 137860 118984 -100454 -17139
110a7139q993l3346K11224j20699k76772K97902J89340l69460J821K94355j57529
$$ -17139 -26132 -59478 151746 31047 -245725 52177 241517 -127943 -126122 168233 10704
121A0704r7527J66468j35927k7076K73724j92873k59752L61447J21788l69816
$$ 10704 -86823 79645 -56282 -83358 190366 -2507 -262259 99188 220976 -148840
131a48840N7439K16208j58052J7026J16219k11021L8757K68463k15215j76033
$$ -148840 -91401 124807 -33245 -16219 100000 -111021 -72264 196199 -19016 -195049
141a95049L13881J7647k63938J11444R8845j29210Q5367J9285k10671J30009J99615
$$ -195049 118832 136479 -127459 -16015 82830 -46380 38987 58272 -152399 -22390 177225
152A77225k42923r0546K46251l8655j34069J11383k0629p4461J39875m3852j70455
$$ 177225 -65698 -156244 90007 51352 -82717 28666 8037 -66424 73451 29599 -140856
163a40856J64981J07143k16754k897J71254o2165m4320O4496p5756Q293J35018
$$ -140856 24125 131268 -85486 -88383 82871 20706 -23614 40882 -34874 -26581 108437
174A08437j00960j12648J49853L0558j33504L9225N5543n0908L5428Q45q5639
$$ 108437 7477 -105171 44682 75240 -58264 -19039 36504 -14404 21024 21869 -63770
185f3770P8582P0800j34432j8147J18199m1775m7772N3840m1836p360J00317o5120
$$ -63770 14812 85612 -48820 -66967 51232 9457 -38315 15525 -26311 -33671 66646 1526
197A526q6871J27726K1327j35739N4127P8495r2396J1288O5675q7098J4623J15831
$$ 1526 -85345 42381 63708 -72031 -17904 60591 -31805 -20517 45158 -41940 -27317 88514
209H8514r5230p5068J39806r53j22543O5748M8491r1310L3861N6375q9131J3628
$$ 88514 -6716 -81784 58022 57069 -65474 274 48765 -42545 -8684 47691 -41440 -27812
221b7812R6180p5718n2800J04552o537q5403M6102K9151n4915K3486K6681n3161
$$ -27812 68368 -7350 -60150 44402 37865 -47538 -1436 27715 -27200 -3714 22967 -30194
233c0194J5539N3162m1324k4875M8138l512l1589J4810M685j1296R126o522j0818
$$ -30194 -14655 38507 -2817 -27692 20446 16934 -14655 155 4840 -6456 2670 -3852 -14670
246a4670J9126M917j4849N107L918l824R050r027j4803K0623L211k6445J1752
$$ -14670 4456 9373 -5476 -369 3549 -275 8775 -252 -15055 5568 8779 -17666 -5914
259e914K0475k1084J270K1695j8056n284K5825j7051k0611K9134N77l1656J8316
$$ -5914 14561 -6523 -5253 16442 -1614 -6898 18927 1876 -18735 10399 10976 -20680 -2364
272b364J8006k6198N358K3567k1417p211K6937j4215k0348K4214J163k6299J4794
$$ -2364 15642 -10556 -5198 18369 -3048 -10259 16678 2463 -17885 6329 7492 -18807 -4013
285d013J6276k1503L050K1192j4667r289K0475n834j8688J4926O404k0712M962
$$ -4013 12263 -9240 -6190 15002 335 -8954 11521 5687 -13001 1925 8329 -12383 -7421
298g421J7489j2798n687J8824l390j4325J2466O161j8170J750J3821j2492q474
$$ -7421 10068 -2730 -8417 10407 7017 -7308 5158 11319 -6851 -5101 8720 -3772 -12246
311a2246J7122k9j4439J1471J0218j6513L0J5693j1355j1695J4533P6j6701J0060
$$ -12246 4876 4847 -9592 1879 12097 -4416 -4386 11307 -48 -11743 2790 2866 -13835 -3775
325c775J2548j4734q23J8032p416j2892J5086L268j8400N085J3373j4956m789
$$ -3775 8773 -5961 -6784 11248 3832 -9060 6026 9294 -9106 -4021 9352 -5604 -10393
338a0393J9648m142j5118J5955P931j9978L594J6940j6698r992J9689m649j7310
$$ -10393 9255 5113 -10005 5950 13881 -6097 -2503 14437 -2261 -12253 7436 2787 -14523
351a4523J6534Q446k0206P345J7006j7531o122J9484q698j6639J5281L254j5842
$$ -14523 2011 10457 -9749 -2404 14602 -2929 -9051 10433 1735 -14904 377 3631 -12211
364a2211Q407R782j1517M029J0779r958k702J0952m780p282M312p48rL235n081
$$ -12211 -3804 5978 -5539 -1510 9269 -689 -3391 7561 2781 -4501 -189 -937 -946 2289 -2792
379b792J792J0390p277n399J1496l948q365R304o935j1577J9814O07k5755J6163
$$ -2792 -1000 9390 2113 -3286 8210 4262 -4103 5201 -1734 -13311 6503 7110 -18645 -2482
393b482K0631k5469j419K4530j7963p817K4798j9201j6461L7766p144l9233L3159
$$ -2482 18149 -7320 -8739 15791 -2172 -9989 14809 -4392 -20853 16913 9769 -29464 3695
406C695K2320m0497P321K5905k8881N487K8562m0957p490N3901k4877l9987M8672
$$ 3695 26015 -14482 -7161 18744 -10137 -4650 23912 -17045 -24535 29366 4489 -35498 13174
419A3174Q883m3520K5576J3521l8018K8482K0113o1887J3997O2647m7704l3914
$$ 13174 22057 -21463 4113 17634 -20384 8098 28211 -33676 -19679 42968 -4736 -38650
431c8650N8831o832l2824L8089j1261l6854N4063M412p2299L5124N3928o1154
$$ -38650 20181 13349 -19475 18614 7353 -29501 24562 28974 -43325 -8201 45727 -15427
443a5427j4610N2210k0356r254L1696m0727j1210P0603k8405o6951N4841K8188
$$ -15427 -30037 22173 1817 -7437 24259 -16468 -27678 42925 14520 -52431 2410 30598
455C0598n3155J3637J7251l0821L6868J3961p2411L2130P3680p2245l8474P6243
$$ 30598 -22557 -8920 8331 -22490 14378 28339 -44072 -11942 61738 -10507 -48981 27262
467B7262j2221l5179M2478l2280l0210R2546j7027j07484P4968P0474j04561n445
$$ 27262 15041 -20138 22340 -9940 -40150 52396 35369 -72115 2853 73327 -31234 -36679
479c6679P8577n2968r208O2474p2275j8935J24470n0718j17407J07055N9128j11406
$$ -36679 41898 -11070 -20278 42196 -30079 -49014 75456 24738 -92669 14386 73514 -37892
491c7892J3017N5360n9760K8704N0561j00786O947J25153p2441q9898J06992K5808
$$ -37892 -24875 30485 -29275 -571 49990 -50796 -43849 81304 8863 -81035 25957 51765
503E1765q2866K6366J0685l7145O8055l63j12288N8352J00797r2653m3205P9581
$$ 51765 -31101 -4735 5950 -31195 36860 36497 -75791 -17439 83358 -9295 -52500 27081
515B7081j5806j8695L5681n9866n612J07573n8821j03227J11156N1348j08837
$$ 27081 11275 -7420 28261 -31605 -37217 70356 11535 -91692 19464 70812 -38025
526c8025J5362M7801m8674M6965K6602j23672L7783J37660j07095q7750J33423
$$ -38025 -22663 25138 -23536 23429 50031 -73641 -35858 101802 -5293 -93043 40380
537D0380O102r2951N7564L414o0625R1981J862j45272P9954J27138j35331n7865
$$ 40380 46482 -46469 11095 14509 -46116 45865 47727 -97545 -17591 109547 -25784 -83649
549h3649J25372j9093m9446N8175m9728l3295J23536l6026j35385J03860Q4276
$$ -83649 41723 22630 -26816 31359 -18369 -51664 71872 35846 -99539 4321 88597
560H8597j26666r389Q3615m0063O642L6097r2074J9963J30394q8075j04697J20073
$$ 88597 -38069 -47458 36157 -3906 2736 38833 -53241 -33278 97116 9041 -95656 24417
572B4417L4313r4490K9292J7219m5784P0336N539j20097O6836J10288j20843n2851
$$ 24417 58730 -35760 -6468 10751 -35033 35303 40842 -79255 -12419 97869 -22974 -75825
584g5825J16372j4960n2999M5065l9418k0834J11679m1124j22710J02258P6674
$$ -75825 40547 25587 -27412 17653 -21765 -42599 69080 27956 -94754 7504 84178
595H4178j18367o103P6143m3864L914L7981q0898J6999J15343q4365r0027J20568
$$ 84178 -34189 -40292 35851 -8013 -4099 33882 -47016 -30017 85326 961 -89066 31502
607C1502K9565r7501K6786K3522m3043N9158P043j09930N6948J02743j06632m6874
$$ 31502 61067 -36434 -9648 13874 -29169 29989 37032 -72898 -15950 86793 -19839 -66713
619f6713J10116j7526n7956M9347k4245l0666R0613k8185j10731Q9986P5943j12222
$$ -66713 43403 25877 -32079 17268 -6977 -37643 52970 24785 -85946 4040 79983 -32239
631c2239j1407Q3107m0180j2446M7511o1340r290R8144n2637q5851R5793L6862
$$ -32239 -43646 39461 -719 -13165 34346 -26994 -36284 61860 9223 -76628 19165 56027
643E6027r1829J6388M4314l8207K3774J8725p4145K6601Q0863o9334m8334P8920
$$ 56027 -35802 -19414 24900 -13307 10467 29192 -44953 -18352 62511 -6823 -55157 23763
655B3763J476m7916K9002m190k1271N0638j6140o6541N6811M4823p4840o512N4614
$$ 23763 25239 -22677 6325 2135 -19136 31502 15362 -51179 5632 50455 -24385 -30897 23717
668B3717k3999n933K6076m1846L137O5851m4505n2910P0074J3316o4546K4505
$$ 23717 -282 -6215 19861 -21985 -18848 47003 2498 -50412 19662 32978 -31568 -7063
680g063K6450l7730K4119J8475n8219K3248O0986n9857l2737O8753q233m5286
$$ -7063 19387 -18343 5776 24251 -33968 -10720 50266 -9591 -42328 26425 18192 -27094
692b7094L4491M63l1986M0540M303n6429L4002M2599n5826j1104N0266j9618k1749
$$ -27094 7397 7860 -24126 16414 20717 -35712 -1710 40889 -14937 -26041 24225 4607 -17142
705a7142K9029j5812j4399M0133j2928l9196L6245K0100m0134M011K4286j9200
$$ -17142 11887 -3925 -18324 21809 8881 -30315 5930 26030 -14104 -10093 14193 -5007
717e007Q82J4578k1867K950K7901k1290j6962K9512O81k1190J0982K550j1065
$$ -5007 -4125 10453 -11414 -8464 19437 -1853 -18815 10697 11378 -9812 1170 3720 -7345
730g345J3715j378k0163J5548J3673k1965O32J7902j1156l582J2080j2211k404
$$ -7345 6370 4992 -15171 377 14050 -7915 -7283 10619 -537 -4119 7961 -4250 -6654
743f654J8649j2880j4299K2000J744k0243J1928Q815j5774P244R733j8647K773
$$ -6654 11995 -885 -15184 6816 8560 -11683 245 9060 -6714 530 10263 -8384 -5611
756e611J8429j6157r497K1287l826j5504J3948M420j5068Q877Q131j6250K511
$$ -5611 12818 -3339 -12836 8451 4625 -10879 3069 7489 -7579 1298 9429 -6821 -4310
769d310J4663j2356p167J4536k113j0562Q770M055r505L756O102q225j088P675
$$ -4310 10353 -2003 -9170 5366 3253 -7309 1461 5516 -3989 -233 5869 -2356 -3444 4231
783D231m465m747N720J727m821R62L913j647j874K467Q5l096R58K327k962k044
$$ 4231 -234 -4981 739 2466 -2355 -1393 2520 873 -1001 1466 1551 -1545 -587 1740 -1222 -3266
799c266L984N86l854K259L526l798q90M398k161m122M259Q31n372K343M126m184
$$ -3266 718 1304 -2550 -291 3235 -563 -1453 2945 784 -3338 921 1752 -3620 -1277 2849 -1335
815a335r48N518k004l686M518M91n136J964L233m545m78M682k187k730M500M54
$$ -1335 -2283 3235 1231 -2455 2063 2554 -2582 -618 2615 -1930 -2408 2274 87 -2643 1857 2311
831B311m261K366K553m381j88L557k620j962L826n07l080L253J194l402J002K351
$$ 2311 -1950 416 2969 -1412 -1600 1957 -663 -2625 1201 694 -2386 867 2061 -1341 -339 2012
847B012l381l46K726j926j350K636l86q43K221l83r99J352j57j993P11L34q38
$$ 2012 -1369 -1715 1011 -915 -2265 371 -15 -858 1363 980 -19 1333 1176 -817 -106 228 -610
864f10M09o39o31L171q42k575K892P35l287K139Q92m557K681L668p284Q63Q589
$$ -610 -201 -840 -1471 1700 858 -1717 1175 1910 -1377 762 1654 -2903 -222 3446 -3838 -2975 5614
881E614o327m566R606k014p395Q466q89j0302R817N150j6226M667J5040j3306
$$ 5614 -713 -5279 4327 2313 -5082 3384 2495 -7807 2010 7160 -9066 -4399 10641 -2665
895b665n570J6146o275r797J4648l449j4507J6345M946k2560Q848J8245j8080
$$ -2665 -8235 7911 1636 -8161 6487 3038 -11469 4876 9822 -12738 -3890 14355 -3725
908c725m651J7760r808o296J6530j0064j2729K1888q21k2684J3538J3465j7961
$$ -3725 -8376 9384 -424 -6720 9810 -254 -12983 8905 8084 -14600 -1062 12403 -5558
921e558J584J0813j1792N494J0902k0252o95K3945j2496j5713J7792N83j0916
$$ -5558 -3974 6839 -4953 541 11443 -8809 -9504 14441 1945 -13768 4024 4607 -6309
934f309J2336o042j2667K3881K90l0882J6955K1919k7171l183K1242j4986L23
$$ -6309 6027 -15 -12682 11199 11489 -19393 -2438 19481 -7690 -10873 10369 -4617 -4294
947d294K0669k5447r138M1347j2585l7983L1328J6181l3864R990J6329k6198J4460
$$ -4294 16375 -9072 -18210 23137 10552 -27431 3897 20078 -13786 -3796 12533 -13665 795
960G95K2241m1473J43M9688k5911l5728L9341O366k9375J8862M75k6764L3128
$$ 795 23036 -18437 -18294 31394 5483 -30245 9096 15462 -13913 4949 5424 -21340 11788
973A1788J1816n1279J5116M6055l6713k0034L6214r185j2953K3619k2387j5285
$$ 11788 23604 -27675 -12559 33496 -3217 -23251 12963 3778 -9175 14444 -7943 -23228
985b3228M9437r619n2855L4288L2513m0814n37K1688k1955J3321K1023m6089J890
$$ -23228 26209 16590 -36265 -1977 30536 -10278 -10815 10873 -11082 2239 23262 -22827 -20937
998b0937N8516l1883m3250M7478J1281l4856J6930l7k5074M0158P332o3231K3500
$$ -20937 37579 5696 -37554 9924 21205 -13651 3279 3242 -21832 18326 25658 -37573 -14073
1011a4073N6836m7079k5232M4871r654j5961K7985k6648j8565O0117j3451o5638
$$ -14073 42763 -4316 -29548 15323 5669 -10292 17693 -8955 -27520 32597 19146 -46492
1023d6492M4681M2168n3803m088L1893k4418J1996K5909n4193n62P1967l5981
$$ -46492 -1811 40357 -13446 -17534 14359 -10059 1937 27846 -26347 -26909 45058 9077
1035I077n6215N7609J8110m7412J8130Q882l0331L9439J2030p1382K4726O9565
$$ 9077 -47138 10471 28581 -18831 -701 8181 -22150 17289 29319 -42063 -17337 52228
1047E2228n4931l7660N6761l174k7037K8677k0971k2817O0773q241p1918M3334
$$ 52228 -2703 -40363 16398 13224 -13813 14864 -6107 -28924 31849 23608 -48310 -4976
1059d976N0794n8947j2049M0771j8706J595K4433m6453j628O9031l2216n8516
$$ -4976 45818 -13129 -25178 15593 -3113 -1518 22915 -23538 -25166 43865 11649 -46867
1071d6867N3315K4588m6285J0680J1721k5099L2763R837o2544K3779O2801n2526
$$ -46867 6448 31036 -15249 -4569 7152 -17947 14816 24653 -37891 -14112 48689 -3837
1083c837l5200N5398j815k7065K4299j9033j8506N8313j1822o9106M5915M7873
$$ -3837 -39037 16361 14546 -12519 11780 -7253 -25759 32554 20732 -48374 -2459 45414
1095D5414o0597q996M3374k2730j558K7695m3703l541O8130l2578o0473N8043
$$ 45414 -15183 -24179 19195 -3535 -5093 22602 -21101 -24642 43488 10910 -49563 8480
1107H480K6990n4000R844K1043k8051K3828J7393n7504J3710O2620m4337l9275
$$ 8480 35470 -18530 -8686 12357 -15694 8134 25527 -31977 -18267 44353 16 -39259
1119c9259N4214M455l4737K0069m304k0235M1178k148n7063L1361M5272m7357
$$ -39259 14955 19410 -15327 4742 438 -19797 21381 19233 -37830 -6469 38803 -8554
1131h554j5674L8474j1777q282K0161k6726n574M8367k2048m5081M2915K1858
$$ -8554 -24228 14246 2469 -5813 14348 -12378 -17952 30415 8367 -36714 6201 28059
1143B8059m2624N358J8747j9427J6229J1315m2322J2813M6971l7276k8319M4185
$$ 28059 -14565 -9207 9540 -9887 6342 17657 -24665 -11852 35119 -2157 -30476 13709
1155A3709Q4k8027J9558l377j8393L3375k386m5449K8253L4796m2980r129L5859
$$ 13709 13793 -14234 5324 1947 -16446 16929 14543 -30906 -2653 32143 -10837 -19966 15893
1168A5893j4432j0002K1707k0467r701M0104j4325l8321L4283J9198l7961N089
$$ 15893 1461 -8541 13166 -7301 -17002 23102 8777 -29544 4739 23937 -14024 -8935
1180h935K1823j9324M978J5762k7920J798L5706k2138k5433L2117M969k4801J1346
$$ -8935 12888 -6436 -1458 14304 -13616 -11818 23888 1750 -23683 8434 13403 -11398 -52
1193e2N694j5303J5517M995k7018J1894K3327k3560r629K3111n280r930J1444
$$ -52 5642 -9661 5856 10851 -16167 -4273 19054 -4506 -14135 8976 3696 -6234 5210
1206E210p889n680K0050p042k0618J8481J0003k0327L353J1280j0927L888Q136
$$ 5210 -2679 -8359 11691 4649 -15969 2512 12515 -7812 -4459 6821 -4106 -218 7918
1219G918j6025L053J8947j4977j1477K0160j504j4407J0564J466j1238J1405L255
$$ 7918 -8107 -5054 13893 -1084 -12561 7599 6095 -8312 2252 3718 -7520 3885 7140
1232G140j7589Q285J4232j6533m112J6511o897p875J1381l557q076J2623p23j3818
$$ 7140 -10449 -2164 12068 -4465 -8577 7934 1037 -6838 4543 986 -7090 5533 4810 -9008
1246i008R487Q089j3168K46J0193o859k494Q136n647l588R225k863p970P871K810
$$ -9008 479 8568 -4600 -4354 5839 -1020 -3514 4622 -1025 -4613 4612 1749 -6221 1650 4460
1261D460p814K308L949m618R40L252m486M98M804l627k363M524o75k532J990J42
$$ 4460 -3354 -1046 2903 -1715 -775 2477 -2009 -1511 3293 -334 -2697 1827 1152 -1380 610 752
1277G52j953K137l64k566K418R51k529P35J321j750P38J233k427N84K200j936
$$ 752 -1201 936 572 -1994 424 1375 -1154 -419 902 -848 -110 1123 -1304 -720 1480 -456
1293d56j020K845j254j616K292j00k162K183N13k930J433J758k614r2L006k140
$$ -456 -1476 1369 115 -1501 791 691 -1471 712 1225 -1705 -272 1486 -1128 -1220 1786 -354
1309c54q61K685o96k406K260Q61k771J015J855k757K3K499j197j838K620K37k649
$$ -354 -1215 1470 774 -1632 628 1489 -1282 -267 1588 -1169 -1146 1353 156 -1682 938 1175 -1474
1326a474J591J392k168j55K309j690j310K240M0k087J525J210k150O5J893j135
$$ -1474 117 1509 -659 -814 1495 -195 -1505 735 775 -1312 213 1423 -727 -662 1231 96
1342I6r89J124N66j706L12J322n48p03R92L37j372J25J862j473j304J966N40k814
$$ 96 -893 231 797 -909 -597 725 177 -526 466 803 -569 -444 1418 -55 -1359 607 1147 -1667
1360a667J248K158k817Q8L398k550k217M421n13m790L161K849m950R02M493m396
$$ -1667 -419 1739 -1078 -990 2408 -142 -2359 2062 1549 -3241 -80 2769 -2181 -1279 3214 -1182
1376a182j264N948l381l743O868p19o802M685L274o637J779M361n245N04N846
$$ -1182 -2446 3502 121 -3622 3246 2527 -4275 410 3684 -2953 -1174 3187 -2058 -1554 4292
1391D292n620k268P529k596n635N493J160n597M044Q10n421N206L087q514K035
$$ 4292 -1328 -3596 3933 1337 -4298 1195 2355 -3242 802 1612 -3809 1397 4484 -4030 -1995
1406a995P505n656l155O012l567j016O152n805l736J0288j548j0649P476N340
$$ -1995 5510 -146 -3301 2711 -856 -1872 4280 -1525 -5261 5027 3479 -7170 306 5646
1420E646r148K814M127q262M911P174j3197m11J5579p596j0392J2407Q2q993Q912
$$ 5646 -3502 -688 3439 -4823 88 7262 -5935 -6346 9233 1637 -8755 3652 3734 -5259 3653
1435C653j671j0988J3312M530j9339O173J6726j4549n612J4150p003l792J3116
$$ 3653 1982 -9006 4306 8836 -10503 -4330 12396 -2153 -7765 6385 -618 -4410 8706
1448H706j0744r732K1608j383k3194J3492J3040j7401J825J0767j2894M656J3643
$$ 8706 -2038 -11770 9838 8455 -14739 -1247 11793 -5608 -3783 6984 -5910 -1254 12389
1461A2389k0241m107K6865r811k1269J8527O669j5473Q553J758j4830J5714R245
$$ 12389 -7852 -11959 14906 5095 -16174 2353 9022 -6451 2102 3860 -10970 4744 13989
1474A3989k7468M711K5930j6888j3646J8781k848p183J2834j0909j1033K6653
$$ 13989 -13479 -8768 17162 274 -13372 5409 2561 -4622 8212 -2697 -13730 12923
1486A2923j290l0634J5588J9625k0872j995J2706j2350O325J4293k5408k476L4346
$$ 12923 11633 -19001 -3413 16212 -4660 -6655 6051 -6299 26 14319 -11089 -13565 20781
1499B0781j4755k6932K4410Q745k0345J0420Q98j7419K2446R509l7561Q830L5873
$$ 20781 6026 -20906 3504 12249 -8096 2324 3222 -14197 8249 17758 -19803 -10973 24900
1512B4900k4749j8703K6872m015j2004J7917j2960j5682L4899p32m1473K0530
$$ 24900 151 -18552 8320 4305 -7699 10218 -2742 -18424 16475 15743 -25730 -5200
1524e200K9535k9226p297K0943j2863J802J8199k6890p282M1099j2161l6877K7771
$$ -5200 24335 -4891 -12188 8755 -4108 -2306 15893 -10997 -18279 22820 10659 -26218 1553
1537A553J6624k5951N021P366j6313J8518J0795l7974O667M0470k3828k4930K8331
$$ 1553 18177 -7774 -2753 4613 -11700 6818 17613 -20361 -13694 26776 2948 -21982 6349
1550F349J945j4564J4086j0592j4439L3502q54m2025K0531L1516l0210q958K1990
$$ 6349 8294 -6270 7816 -2776 -17215 16287 15433 -26592 -6061 25455 -4755 -13713 8277
1563H277j0934J755J6585k8246m982M2181j5186l7524L0134J7268k8456O015R116
$$ 8277 -2657 -902 15683 -12563 -17545 24636 9450 -28074 2060 19328 -9128 -3113 6003
1576F003j7480J8526J1323l9464P886M1852k6909k6750L2409L158j8754J4586
$$ 6003 -11477 7049 18372 -21092 -13206 28646 1737 -25013 7396 10554 -8200 6386
1588F386p128j5805L1893J152m2560J9157L3687l1147j2595K6046q595m756J6839
$$ 6386 -742 -16547 15346 16498 -26062 -6905 26782 -4365 -16960 9086 491 -4265 12574
1601A2574k1218q037L8692j1082l7917K7166K0539k8425J002J2859j4252J1475
$$ 12574 -8644 -16681 22011 10929 -26988 178 20717 -7708 -6706 6153 -8099 3376
1613C376J1983l1475L674L7125k1727k5274K8568N254j9402J0520k648j2672K4804
$$ 3376 15359 -16116 -12442 24683 2956 -22318 6250 11504 -7898 2622 -26 -12698 12106
1626A2106J044l5067J6404K8758k6874j0901K2601o939n194J3582j6617o118L1318
$$ 12106 13150 -21917 -5513 23245 -3629 -14530 8071 1132 -4062 9520 -7097 -13215 18103
$$ [...]
8191A61
##END NTUPLES=NMR FID
##END=
