##TITLE=1H_UK_26_2_6
 CD2Cl2
 8 sc, 
 8.04.2022
##JCAMPDX= 6.0         $$ Bruker NMR JCAMP-DX V2.0
##DATA TYPE= NMR FID
##DATA CLASS= NTUPLES
##ORIGIN= UXNMR, Bruker Analytische Messtechnik GmbH
##OWNER= root
$$ XWIN-NMR		Version 3.5
$$ Fri Apr  8 10:46:29 2022 Russian Standard Time (UT+4h)  she@DPX200
##.OBSERVE FREQUENCY= 200.13135
##.OBSERVE NUCLEUS= ^1H
##.DELAY= (6, 6)
##.ACQUISITION MODE= SIMULTANEOUS
##.ACQUISITION SCHEME= undefined
##.AVERAGES= 8
##.DIGITISER RES= 18
##SPECTROMETER/DATA SYSTEM= spect
##.PULSE SEQUENCE= zg30
##.SOLVENT NAME= CD2Cl2
##.SHIFT REFERENCE= (INTERNAL, CD2Cl2, 0, 15.7039)
##AUDIT TRAIL= $$ (NUMBER, WHEN, WHO, WHERE, WHAT)
$$ ##TITLE= Audit trail, XWIN-NMR		Version 3.5
$$ ##JCAMPDX= 5.01
$$ ##ORIGIN= Bruker BioSpin GmbH
$$ ##OWNER= she
$$ F:/spectra/data/she/nmr/H-F/1/audita.txt
$$ ##AUDIT TRAIL=  $$ (NUMBER, WHEN, WHO, WHERE, WHAT)
(   1,<2022-04-08 10:45:35.31 +0400>,<she>,<DPX200>,
      <created by zg, POWCHK disabled, PULCHK disabled
       configuration hash MD5:
       00 E9 B6 7A A2 85 ED C7 34 08 36 98 17 FE 4E 26
       data hash MD5: 16K
       7B 91 5D 69 03 72 6F AE 0C D9 4A E5 D0 5D 2D 83>)
$$ ##END=
$$ 
$$ hash MD5
$$ 61 7A 80 B8 53 B5 E6 C2 01 41 8D 34 73 D5 9A D1
##$RELAX= 
##$RELAX= 
##$RELAX= 
##$RELAX= 
##$RELAX= 
##$RELAX= 
$$ Bruker specific parameters
$$ --------------------------
##$DU= <F:/spectra>
##$EXPNO= 1
##$NAME= <H-F>
##$PROCNO= 1
##$TYPE= <nmr>
##$USER= <she>
##$AMP= (0..31)
100 100 100 100 100 100 100 100 100 100 100 100 100 100 100 100 100 100 
100 100 100 100 100 100 100 100 100 100 100 100 100 100 
##$AQSEQ= 0
##$AQ_mod= 1
##$AUNM= <au_zg>
##$AUTOPOS= <>
##$BF1= 200.13
##$BF2= 200.13
##$BF3= 200.13
##$BF4= 200.13
##$BF5= 200.13
##$BF6= 200.13
##$BF7= 200.13
##$BF8= 200.13
##$BYTORDA= 1
##$CFDGTYP= 0
##$CFRGTYP= 5
##$CHEMSTR= <none>
##$CNST= (0..31)
1 1 145 1 1 1 1 1 1 1 1 1 1 1 1 1 1 1 1 1 1 1 1 1 1 1 1 1 1 1 1 1 
##$CPDPRG= <>
##$CPDPRG1= <>
##$CPDPRG2= <>
##$CPDPRG3= <>
##$CPDPRG4= <mlev>
##$CPDPRG5= <mlev>
##$CPDPRG6= <mlev>
##$CPDPRG7= <mlev>
##$CPDPRG8= <mlev>
##$CPDPRGB= <>
##$CPDPRGT= <>
##$D= (0..31)
0 1.2 0 0 0 0 0 0 0 0.06 0 0.03 0 0 0 0 0.0002 0 0 0 0 0 0 0 0 0 0 0 0 
0 0 0 
##$DATE= 1649400334
##$DBL= (0..7)
120 120 120 120 120 120 120 120 
##$DBP= (0..7)
150 150 150 150 150 150 150 150 
##$DBP07= 0
##$DBPNAM0= <>
##$DBPNAM1= <>
##$DBPNAM2= <>
##$DBPNAM3= <>
##$DBPNAM4= <>
##$DBPNAM5= <>
##$DBPNAM6= <>
##$DBPNAM7= <>
##$DBPOAL= (0..7)
0.5 0.5 0.5 0.5 0.5 0.5 0.5 0.5 
##$DBPOFFS= (0..7)
0 0 0 0 0 0 0 0 
##$DE= 6
##$DECBNUC= <off>
##$DECIM= 32
##$DECNUC= <off>
##$DECSTAT= 4
##$DIGMOD= 1
##$DIGTYP= 9
##$DL= (0..7)
0 120 120 120 120 120 120 120 
##$DP= (0..7)
150 150 150 150 150 150 150 150 
##$DP07= 0
##$DPNAME0= <>
##$DPNAME1= <>
##$DPNAME2= <>
##$DPNAME3= <>
##$DPNAME4= <>
##$DPNAME5= <>
##$DPNAME6= <>
##$DPNAME7= <>
##$DPOAL= (0..7)
0.5 0.5 0.5 0.5 0.5 0.5 0.5 0.5 
##$DPOFFS= (0..7)
0 0 0 0 0 0 0 0 
##$DQDMODE= 0
##$DR= 18
##$DS= 0
##$DSLIST= <SSSSSSSSSSSSSSS>
$$ [...]
##$SUBNAM2= <"">
##$SUBNAM3= <"">
##$SUBNAM4= <"">
##$SUBNAM5= <"">
##$SUBNAM6= <"">
##$SUBNAM7= <"">
##$SUBNAM8= <"">
##$SUBNAM9= <"">
##$SW= 18.05172834244
##$SWIBOX= (0..15)
0 0 2 0 0 0 0 0 0 0 0 0 0 0 0 0 
##$SW_h= 3612.71676300578
##$TD= 16384
##$TD0= 1
##$TE= 0
##$TE2= 300
##$TE3= 300
##$TEG= 300
##$TL= (0..7)
0 120 120 120 120 120 120 120 
##$TP= (0..7)
150 150 150 150 150 150 150 150 
##$TP07= 0
##$TPNAME0= <>
##$TPNAME1= <>
##$TPNAME2= <>
##$TPNAME3= <>
##$TPNAME4= <>
##$TPNAME5= <>
##$TPNAME6= <>
##$TPNAME7= <>
##$TPOAL= (0..7)
0.5 0.5 0.5 0.5 0.5 0.5 0.5 0.5 
##$TPOFFS= (0..7)
0 0 0 0 0 0 0 0 
##$TUNHIN= 0
##$TUNHOUT= 0
##$TUNXOUT= 0
##$USERA1= <user>
##$USERA2= <user>
##$USERA3= <user>
##$USERA4= <user>
##$USERA5= <user>
##$V9= 5
##$VALIST= <valist>
##$VCLIST= <CCCCCCCCCCCCCCC>
##$VD= 0
##$VDLIST= <DDDDDDDDDDDDDDD>
##$VPLIST= <PPPPPPPPPPPPPPP>
##$VTLIST= <TTTTTTTTTTTTTTT>
##$WBST= 1024
##$WBSW= 4
##$XGAIN= (0..3)
0 0 0 0 
##$XL= 0
##$YL= 0
##$YMAX_a= 516937
##$YMIN_a= -549185
##$ZGOPTNS= <>
##$ZL1= 120
##$ZL2= 120
##$ZL3= 120
##$ZL4= 120
##$ABSF1= 10
##$ABSF2= 0
##$ABSG= 5
##$ABSL= 3
##$ALPHA= 0
##$AQORDER= 0
##$ASSFAC= 0
##$ASSFACI= 0
##$ASSFACX= 0
##$ASSWID= 0
##$AUNMP= <proc_1d>
##$AZFE= 0.1
##$AZFW= 0.1
##$BCFW= 1
##$BC_mod= 2
##$BYTORDP= 1
##$COROFFS= 0
##$CY= 11.3945322036743
##$DATMOD= 1
##$DC= 2
##$DFILT= <>
##$DTYPP= 0
##$F1P= 2.36226072786647
##$F2P= -0.459571619588291
##$FCOR= 0.5
##$FTSIZE= 0
##$FT_mod= 4
##$GAMMA= 1
##$GB= 0.15
##$INTBC= 1
##$INTSCL= 1
##$ISEN= 128
##$LB= 0.24
##$LEV0= 0
##$LPBIN= 0
##$MAXI= 10000
##$MC2= 0
##$MEAN= 0
##$ME_mod= 0
##$MI= 1.114404
##$NCOEF= 0
##$NC_proc= 0
##$NLEV= 6
##$NOISF1= 3.799351
##$NOISF2= 2.8
##$NSP= 1
##$NTH_PI= 0
##$NZP= 0
##$OFFSET= 15.70392
##$PC= 1
##$PHC0= -18404.04
##$PHC1= 27.60078
##$PH_mod= 1
##$PKNL= yes
##$PPARMOD= 0
##$PSCAL= 0
##$PSIGN= 0
##$REVERSE= no
##$SF= 200.130013532006
##$SI= 16384
##$SIGF1= 3
##$SIGF2= 2
##$SINO= 400
##$SIOLD= 16384
##$SREGLST= <1H.CDCl3>
##$SSB= 0
##$STSI= 0
##$STSR= 0
##$SW_p= 3612.71676300578
##$SYMM= 0
##$S_DEV= 0
##$TDeff= 0
##$TDoff= 0
##$TI= <>
##$TILT= no
##$TM1= 0
##$TM2= 0
##$TOPLEV= 0
##$USERP1= <user>
##$USERP2= <user>
##$USERP3= <user>
##$USERP4= <user>
##$USERP5= <user>
##$WDW= 1
##$XDIM= 8192
##$YMAX_p= 0
##$YMIN_p= 0
$$ End of Bruker specific parameters
$$ ---------------------------------
##NTUPLES= NMR FID
##VAR_NAME=  TIME,          FID/REAL,        FID/IMAG
##SYMBOL=    X,             R,               I
##VAR_TYPE=  INDEPENDENT,   DEPENDENT,       DEPENDENT
##VAR_FORM=  AFFN,          ASDF,            ASDF
##VAR_DIM=   8192,          8192,            8192
##UNITS=     SECONDS,       ARBITRARY UNITS, ARBITRARY UNITS
##FACTOR=    0.0002768,     1,               1
##FIRST=     0,             0,               0
##LAST=      2.2672688,     0,               0
##MIN=       0,             -549185,         0
##MAX=       2.2672688,     516937,          0
$$ Real data points
##PAGE= N=1
##DATA TABLE= (X++(R..R)), XYDATA
0 0 0 0 0 0 0 0 0 4 -8 8 -8 8 -16 16 -24 25 -32 42 -56 64 -78 94 -112 129 -153 179 -209 241 -279 321 -367
31 -367 415 -473 537 -608 683 -770 860 -964 1076 -1197 1331 -1476 1636 -1809 2000 -2207
47 -2207 2433 -2682 2954 -3255 3585 -3952 4358 -4814 5328 -5911 6578 -7351 8260 -9346
61 -9346 10671 -12330 14471 -17359 21482 -27880 39210 -65212 251269 -161120 -408226 435777
73 435777 110471 -194583 157000 -17815 -234599 346094 102688 -482923 97028 456944
83 456944 -268043 -259706 234447 20870 -93214 92402 -192145 -112045 335866 -25236 -391399
94 -391399 131161 253351 -169447 -89831 63615 -51689 102918 50190 -264342 34754
104 34754 320073 -133728 -229544 181767 103969 -73468 41909 -85534 -66593 250096 -10733
115 -10733 -324465 125065 260597 -193809 -105485 158238 -33782 5417 106798 -186350
125 -186350 -55198 303236 -79375 -310363 176417 179042 -191301 -7708 94453 -94781
135 -94781 97594 118148 -236012 -11189 294983 -116601 -232924 177657 77017 -151413
145 -151413 49434 9326 -114870 143728 67004 -252150 27964 235281 -134026 -150473
155 -150473 139549 9514 -72570 79343 -48566 -76637 173023 25845 -197913 70857
165 70857 162608 -107248 -61957 82289 -21379 8599 60615 -94035 -21516 154964 -28561
176 -28561 -131191 72096 61931 -69829 -3194 -4154 -42417 66424 11142 -120570 34326
187 34326 109591 -72923 -53804 65585 -15622 -18262 42949 -63967 -34108 112799 -19223
198 -19223 -112396 79541 75525 -82667 7918 58352 -52412 16586 60231 -87111 -24291
209 -24291 115196 -36507 -94771 81072 42162 -73942 26249 34639 -59404 26053 47553
220 47553 -80790 -15373 85380 -36057 -62834 58133 18930 -43108 25518 11124 -38287
231 -38287 27714 21633 -55037 -194 45852 -25211 -25284 29107 2680 -8253 16552 -9654 -11261
244 -11261 23917 -5304 -28854 11030 9891 -16284 3016 6612 -5740 16266 9469 -18648 8349
257 8349 19913 -17443 -9161 15289 -8970 -8502 14974 -5202 -7566 22567 2795 -18798 13127
270 13127 10363 -21231 -1880 10061 -17249 -5984 13728 -10282 -7601 19992 504 -13704
282 -13704 13431 7131 -16480 1461 8566 -13631 -4369 11941 -5614 -5742 15036 3764 -9077
295 -9077 8666 8534 -10874 -2192 8293 -7017 -8153 8261 1828 -7077 7115 9100 -6428 -1260
309 -1260 9029 -4898 -10396 3920 -517 -12958 -137 7572 -6071 -2291 12205 495 -8149
322 -8149 6884 4170 -11557 -1622 7344 -8494 -6685 11152 3454 -6773 9421 11426 -6757
335 -6757 409 11930 -5916 -10589 8257 257 -14621 4179 11322 -9446 -1982 15843 -3201
348 -3201 -10395 10608 928 -17245 2501 6204 -16904 -3495 14027 -7766 -8591 15074 2231
361 2231 -11843 7609 5602 -11568 1678 6422 -9693 -210 12175 -2159 -2584 10616 4062
374 4062 -1514 3090 -1784 -137 3315 -7315 -6030 6781 -1085 -4640 6611 -1674 -3484 12333
388 12333 -4363 -17695 12598 7962 -25366 -1483 17519 -13268 -3640 18912 -12231 -5254 30452
401 30452 -10902 -28880 29003 11541 -39082 5737 22668 -23716 2513 23113 -26084 470
413 470 43194 -23722 -31599 43889 7056 -43296 15596 16051 -27921 17334 16649 -40581 15600
426 15600 47873 -40134 -26089 50257 -3848 -35860 22056 -1522 -21888 35513 -1314 -49050
438 -49050 36245 41964 -52329 -12536 44727 -16415 -17620 17536 -27546 -4599 48817 -29718
450 -29718 -47525 55667 23773 -53911 7348 25545 -21328 15996 4797 -51227 29306 57960
462 57960 -58548 -29264 72513 -432 -39666 28211 -6650 -18466 52598 -21186 -74390 62090
474 62090 51968 -86312 -9110 70922 -26661 -16704 35170 -44002 -5252 79580 -50874 -81733
486 -81733 87926 38151 -94201 10020 53875 -36018 13840 24507 -69696 22032 88885
497 88885 -76344 -68570 97741 18309 -76539 23760 20761 -25465 48368 -3737 -83380 57457
509 57457 78136 -94036 -39528 86877 -6890 -39146 26494 -25220 -1036 78050 -45182
520 -45182 -83841 89870 50196 -99133 -4422 57611 -27290 9248 15811 -68955 33713 93991
532 93991 -84815 -69075 107610 15101 -85960 22290 15137 -30763 53004 -10393 -95486
543 -95486 69741 89390 -108097 -40485 104450 -11332 -51396 32738 -26216 -11169 85633
554 85633 -42374 -96995 99207 68332 -110255 -9390 78745 -27525 -7286 24026 -65088
565 -65088 17943 97763 -75830 -83029 109825 34652 -94197 14702 35086 -31244 35626
576 35626 -386 -89380 50560 90295 -97079 -52824 102252 2890 -57436 27798 -10303
587 -10303 -15096 68675 -32458 -90512 80024 65143 -99004 -16476 74693 -17652 -10754 22625
599 22625 -49472 14730 82156 -66013 -74031 93899 29766 -84195 12583 34625 -25282 31908
611 31908 3666 -74802 45357 79531 -87556 -48180 90866 -1479 -57303 28681 -4114
622 -4114 -19419 61370 -18473 -81488 66225 62650 -90335 -20262 71912 -21190 -23796 29097
634 29097 -34755 -3239 71681 -38682 -68767 73184 35966 -75248 2416 39848 -24621
645 -24621 10374 14142 -50689 22063 64290 -53399 -41502 67255 7996 -47134 15905 3746
657 3746 -16560 35383 -10078 -53631 43362 44073 -59545 -13252 50347 -13916 -16999 18691 -25584
670 -25584 -3364 47545 -29538 -46114 53906 22951 -52704 8649 29747 -23050 8042 14116
682 14116 -40002 10674 46712 -39674 -31232 51812 4279 -36958 19701 8839 -20983 23556
694 23556 3373 -41128 21364 34598 -40424 -13861 39353 -7913 -18287 19095 -7617 -11089
706 -11089 27504 -9282 -32399 25379 18014 -32664 -369 22508 -11435 -1058 12307 -15734
718 -15734 809 23486 -15969 -18991 22540 3873 -20039 6794 6982 -8947 9400 3369 -16028
731 -16028 9337 14310 -17560 -5797 15571 -5665 -7649 8538 -4725 -3425 13700 -4699 -12091
744 -12091 14259 5202 -16168 3641 7887 -10676 1569 7372 -11031 869 14463 -8714 -8047
757 -8047 15244 -391 -12544 7482 3856 -11166 4422 6062 -10941 1538 11968 -7597 -5471
770 -5471 11210 -677 -9085 5254 2558 -8031 1985 4569 -6374 -404 7550 -2400 -3787 5423
784 5423 1587 -4837 658 2638 -3013 -1722 2184 -694 -1915 1841 2006 -1834 -390 2659 -811
799 -811 -3300 862 1100 -3581 -802 3054 -1129 -1547 4117 1160 -2634 2174 2650 -3615 -869 3451
815 3451 -2511 -2997 3634 784 -3118 2612 3306 -2887 223 3709 -2250 -2697 2697 -368 -4368 1648
831 1648 1991 -3263 427 3799 -1687 -1842 3046 -633 -3283 1684 655 -3642 698 2607 -2372 -304
847 -304 3563 -336 -1123 2683 169 -1936 1489 367 -2201 741 1394 -1342 330 1873 -113 -208
863 -208 49 -391 313 -412 -2046 157 493 -1134 801 1235 -1223 1952 2463 -3602 -569 4807 -3222
880 -3222 -4434 4560 -364 -4897 4382 882 -6257 5553 5115 -9680 414 10403 -6993 -6266 9216
895 9216 -2474 -7426 9133 -330 -10305 10385 6994 -15257 2588 14112 -10374 -6360 11611
908 11611 -4688 -6311 11820 -4116 -11201 15007 4694 -17411 5613 12921 -11287 -2815 8422
921 8422 -8071 51 11438 -11645 -7195 18245 -2186 -15743 8724 5815 -9234 4468 -253
934 -253 -11105 11634 7418 -20556 2336 20021 -10569 -8623 12093 -4255 -2928 13107 -12463
947 -12463 -11898 24722 849 -26932 12547 17474 -17179 605 11108 -14714 6393 17954 -25539
960 -25539 -9481 33979 -7509 -28600 19605 10559 -18059 10053 3434 -21035 18825 16823 -36101
973 -36101 -1603 37241 -15868 -22457 21773 253 -11239 17995 -10349 -21168 32289 8839
985 8839 -41762 9176 32133 -21533 -10524 16726 -11375 2921 21302 -26533 -14219 42079
997 42079 -3429 -39180 18725 20003 -20006 4548 4648 -19271 20593 18352 -40095 -2673 43914
1010 43914 -15448 -29250 21456 3537 -11136 16373 -12847 -21122 37402 8715 -47816 11218
1022 11218 37566 -24223 -13485 18208 -12743 3418 23620 -32034 -16127 50536 -4166 -47474
1034 -47474 23625 25765 -25808 4041 8468 -23771 21707 23728 -47298 -5417 54667 -16790
1046 -16790 -38121 28198 9112 -18577 16848 -8231 -26521 37446 14835 -53686 6794 47041
1058 47041 -23601 -22132 22760 -6074 -2952 22357 -26367 -19291 47210 1371 -48752 17602
1070 17602 30913 -22475 -3428 9367 -17198 16574 20516 -41487 -6997 49233 -13076 -37522
1082 -37522 23870 11592 -16108 12981 -7417 -22364 34704 12848 -49805 7105 43893 -23636
1094 -23636 -21129 22895 -5867 -3939 22574 -24167 -19302 45973 1673 -48619 18498 31259
1106 31259 -25946 -4307 14019 -17876 11334 22773 -36325 -10478 47291 -9594 -38345 22516
1118 22516 14763 -19407 9135 235 -20736 24562 15539 -40620 1322 39628 -16866 -22545 20057
1131 20057 -333 -8015 16272 -13824 -16790 32934 4799 -37836 11452 26873 -19245 -6672
1143 -6672 12396 -11359 5460 16778 -25217 -9020 34897 -5946 -29394 17172 12471 -15436
1155 -15436 6090 1533 -15867 17580 11700 -30737 1068 29879 -14317 -16984 17404 -1066
1167 -1066 -7615 13864 -9094 -14414 24471 4119 -29257 9132 20885 -16719 -5010 12856
1179 12856 -9718 725 15051 -16515 -9336 25150 -2600 -22739 12688 10869 -14281 3152
1191 3152 5427 -12243 7488 11117 -18559 -2861 20808 -6852 -13939 11762 2550 -7828 7028
1204 7028 -1479 -9596 11833 4756 -16211 3398 12847 -8381 -4388 7589 -3707 -764 7236
1217 7236 -7699 -4645 12677 -1650 -11376 7428 4933 -7777 2641 2789 -7060 4553 5573
1230 5573 -10605 -581 11173 -5468 -6627 7700 -170 -5595 5956 -622 -6749 6637 3666
1243 3666 -9809 1734 7979 -6118 -2829 6403 -2507 -2859 5503 -2140 -4701 5963 913 -7230
1257 -7230 2665 4538 -4814 -596 3778 -2434 -508 3540 -2604 -2115 4155 -578 -3462 2247 1320
1272 1320 -2483 672 1180 -1470 751 1478 -1853 -57 1692 -1245 -1078 874 -456 -610 801 -718
1288 -718 -439 1405 18 -959 797 583 -1041 334 -4 -780 541 337 -995 392 1301 -838 -144
1305 -144 1466 -599 -873 1187 39 -1208 1007 542 -1459 532 1094 -1386 -261 1579 -698 -1288
1321 -1288 1066 -79 -1840 564 1081 -1463 -143 1550 -422 -810 1388 305 -1278 798 795 -1199
1337 -1199 62 1264 -759 -544 1294 466 -811 710 723 -939 -237 469 -407 -804 125 428 -386 -289
1355 -289 862 36 -591 476 463 -844 -64 1064 -826 -1204 1663 550 -1845 1160 2017 -1797 -234
1372 -234 2423 -1632 -1383 2964 -1051 -2977 2775 1522 -3742 1184 2907 -3147 79 3138 -3044
1387 -3044 -1691 4089 -1688 -3748 3914 1316 -4034 2017 2644 -2893 1766 2385 -4247 281 4469
1402 4469 -3272 -2909 4766 -364 -3229 2903 -148 -2543 3818 12 -5259 3207 3581 -5716 -470
1417 -470 4469 -2832 -519 3143 -3813 -460 6571 -3647 -5698 6852 1516 -6553 2627 2477 -4420
1432 -4420 3602 2443 -7608 3234 8319 -7916 -4316 9407 -1981 -5698 5492 -1428 -4660
1445 -4660 8354 -816 -10847 7829 8088 -11729 -1011 9681 -5356 -2587 6839 -6830 -2668
1458 -2668 12402 -5160 -11317 12150 5432 -12833 2648 6796 -7202 2627 5208 -11364 2080
1471 2080 13672 -10361 -9530 13908 1624 -10512 5251 1167 -6031 8210 154 -14220 7921
1484 7921 12211 -14053 -4498 13037 -3165 -4344 6218 -6355 -2265 13662 -6933 -14307 14309
1497 14309 7213 -15234 1834 8821 -6918 3569 4822 -13906 3798 16909 -14084 -11606 18290
1510 18290 1045 -13432 7233 1562 -7696 11670 298 -18629 11001 16116 -19032 -6862
1522 -6862 17927 -4052 -7945 8965 -6041 -4079 17179 -6158 -19114 16678 11606 -20329 -814
1535 -814 13214 -7467 322 6873 -13148 1890 19518 -12931 -15244 19609 4806 -16491 4825
1548 4825 4905 -7425 9164 1304 -17853 9876 17352 -18418 -8437 18392 -2470 -9447 7581
1561 7581 -5163 -3972 16264 -6272 -18740 17100 12244 -20141 -1056 13522 -7217 -254 6010
1574 6010 -13414 2088 19279 -13639 -15370 20370 4976 -17387 5160 5671 -8114 8445 1739
1587 1739 -18037 9056 18271 -18564 -9674 19798 -1208 -11180 8260 -2579 -5736 14444 -4120
1600 -4120 -18874 14523 13553 -19629 -2526 15262 -5957 -3085 7342 -9780 -474 17364 -9812
1613 -9812 -15848 17086 6796 -16619 2858 7775 -7172 5248 3010 -14379 5675 15543 -14435
1626 -14435 -9468 16680 110 -10453 6017 -878 -4676 11535 -2676 -14570 11341 10767 -16161
1639 -16161 -2390 12307 -4912 -3077 6172 -7510 -492 13985 -8121 -12443 14308 5080 -14282
1652 -14282 2739 6714 -7148 3441 4337 -11276 3826 13596 -11110 -7960 14140 80 -10029
1665 -10029 5470 478 -5956 7563 172 -12163 7430 9808 -11973 -3024 10687 -3435 -4467
1678 -4467 5464 -3953 -2740 9205 -3960 -9231 9085 4866 -10012 1293 6006 -4962 846
1691 846 2959 -6771 1210 8353 -6663 -5359 8963 345 -6357 3853 1386 -3874 4288 189
1705 189 -7147 4053 5551 -7508 -1433 6847 -2390 -2954 4002 -2274 -2055 5760 -2075 -6123 5541
1720 5541 2872 -6511 1237 4540 -3650 344 3215 -3908 -225 5273 -3872 -3872 5530 158 -4736 2660
1736 2660 1345 -3371 2110 1545 -4249 1409 3654 -4051 -1791 4213 -1282 -2685 2321 161 -1866
1751 -1866 2325 247 -2855 1987 1845 -2899 -246 2254 -1482 -502 1205 -920 -105 1832 -848 -1253
1767 -1253 1890 -6 -1663 396 492 -1164 528 18 -1576 697 1082 -1543 339 1490 -889 -446
1783 -446 1059 -693 -791 1018 -161 -1364 1365 779 -1484 550 1198 -1029 -523 1355 -1128 -620 1403
1800 1403 -486 -1008 1280 672 -984 606 919 -759 -478 870 -419 -829 668 -41 -576 416 598
1817 598 -280 189 742 -319 -684 151 -11 -285 -11 121 -377 -162 420 422 -348 110 2 -245 68 -16 44
1838 44 -480 242 268 -342 112 478 -120 -214 535 112 -683 273 321 -722 -123 539 -668 -320 959 15
1858 15 -626 617 229 -981 223 604 -1055 -295 1276 -725 -592 1514 -82 -883 808 -66 -1431
1875 -1431 552 634 -1740 88 1474 -1127 -588 1308 -236 -437 1169 -108 -1270 1295 360 -1603
1891 -1603 748 952 -1026 109 971 -747 325 1311 -1548 -226 1728 -981 -1476 1361 -159 -1258
1907 -1258 1165 -137 -1401 2016 476 -2587 980 2077 -2574 -350 1769 -1680 -373 2579 -2059
1922 -2059 -1511 4092 -617 -3779 2671 1831 -3580 802 1704 -3364 1086 3021 -4180 -985 5226 -1973
1938 -1973 -3764 4009 794 -3579 2183 441 -3793 3146 2529 -5395 152 5649 -3225 -2669 4223
1953 4223 -1242 -1962 3320 -1997 -3307 5129 663 -6092 2703 4074 -4087 -379 2554 -2844 965
1968 965 3397 -4966 -1429 6472 -2185 -5451 4521 1598 -3650 2448 206 -4090 4529 2264 -7612
1983 -7612 1259 7124 -4737 -3486 5082 -1201 -1916 4473 -3149 -4109 7688 448 -8990 3589 6055
1998 6055 -6134 -820 4244 -4131 1134 5455 -6507 -2480 9681 -2389 -8696 6065 3482 -5932
2012 -5932 2392 1916 -5260 4701 4125 -9486 455 10094 -5040 -6069 6438 -40 -3810 4398 -2272
2027 -2272 -4989 8035 1265 -10507 3573 7947 -6304 -2455 4832 -3132 204 4923 -6451 -2819
2041 -2819 9983 -1918 -9109 5877 4513 -5906 1378 1622 -5060 4715 3799 -9544 573 10396
2055 10396 -5417 -6502 6869 42 -4073 4537 -2980 -5062 8638 1441 -11344 4146 8847
2068 8847 -7450 -2504 6298 -3233 -264 5812 -6860 -3659 11074 -1710 -10739 6432 5559 -7079
2082 -7079 1091 3225 -5155 3513 4703 -9451 -811 10964 -4559 -7876 6724 1738 -4815 3664
2096 3664 -570 -4894 6840 2652 -10283 2290 8767 -6099 -3858 5645 -1632 -1173 4576 -4995
2110 -4995 -3168 9063 -745 -9398 4937 5385 -5606 44 2914 -3682 2872 4037 -7964 -452
2124 -452 9271 -4074 -6735 6169 1205 -4470 3170 -701 -4729 6252 2382 -9024 2409 7816
2138 7816 -5917 -3201 5602 -1780 -1964 4734 -3606 -3900 7847 -127 -8167 4284 5409 -5567
2152 -5567 -197 3700 -3717 898 4273 -5777 -1582 7844 -2159 -6142 4716 2064 -4282 1831
2166 1831 993 -3656 3229 2316 -6438 839 6073 -3292 -3178 4176 -408 -2145 2888 -1829 -2639 4727
2182 4727 42 -5398 2595 3769 -3981 -303 2717 -2230 589 2798 -3716 -828 5063 -1813 -3873
2197 -3873 3604 1287 -3098 1780 596 -2887 2322 1840 -4434 651 4508 -2908 -2207 3561 -668
2212 -668 -1938 2301 -721 -2600 3326 742 -4214 1824 2994 -2884 -667 2539 -1423 -862 2537
2227 2537 -1718 -1626 3051 -313 -3049 1810 1519 -2167 476 1142 -1387 462 1571 -1734 -26 2297
2243 2297 -1060 -1387 1575 88 -932 799 -168 -810 994 222 -1808 828 1483 -1318 -157 1119
2259 1119 -833 -116 1102 -757 -413 1292 -320 -961 1368 236 -1329 497 615 -937 494 797
2275 797 -1088 149 1175 -1158 -731 1129 -16 -977 795 -50 -908 420 430 -953 393 719 -619
2292 -619 -574 736 32 -552 828 17 -528 555 170 -573 -85 576 -470 -586 551 -275 -342 421 85
2311 85 -403 301 495 -396 189 348 28 -177 -20 108 -167 58 294 -47 135 -23 -60 -75 12 117 -108
2332 -108 -303 253 90 -83 -90 529 -156 -245 477 -126 -378 301 324 -398 -177 545 -376 -151 552 -113 -309
2353 -309 412 231 -628 333 507 -489 66 455 -452 -171 616 -204 -626 476 202 -707 353 557 -723
2372 -723 -124 516 -531 -98 410 -189 -256 679 14 -472 395 201 -654 442 70 -322 236 310 -527 100
2392 100 338 -472 103 246 -411 33 435 -893 -216 1182 -249 -650 904 227 -714 657 309 -1090
2410 -1090 964 1121 -1428 -118 1513 -872 -447 1333 -486 -872 1593 -404 -1767 1524 775 -1978
2426 -1978 489 1758 -1416 59 1495 -1067 -165 1924 -1021 -1652 2192 88 -2333 1214 867 -1308
2442 -1308 825 740 -1824 688 1932 -1892 -858 2386 -473 -1586 1521 -339 -1252 1581 -174 -1881
2458 -1881 2002 1365 -2994 172 2336 -1648 -472 1473 -1710 79 2516 -2133 -1877 3070 207
2473 207 -2737 1548 739 -2069 1041 819 -3091 1379 2794 -3440 -1047 3838 -1291 -2329 2404 -392
2489 -392 -1612 2872 -544 -3765 3094 2342 -4512 194 3566 -2198 -845 2363 -2022 -808 3541
2504 3541 -2315 -3458 4186 812 -4202 1273 2356 -2269 777 1430 -3151 1147 3600 -3554 -2083
2519 -2083 4605 -467 -3215 2178 323 -1682 2335 -235 -3859 2777 2678 -4620 -404 3895 -1961
2534 -1961 -1158 2273 -1572 -324 3856 -2689 -3743 4734 905 -4769 1460 2558 -2588 938 1706
2549 1706 -3733 1635 4126 -4374 -2250 5576 -538 -3810 2509 481 -2367 2820 -143 -4356 3148
2564 3148 3377 -5223 -821 4930 -1953 -2265 2555 -1536 -1256 4046 -2094 -4036 4738 1892 -5107 899
2580 899 3218 -2548 -102 1791 -3512 703 3981 -3729 -2628 5216 -62 -4264 2026 1085 -2225
2595 -2225 2166 106 -3878 3092 2934 -4667 -752 4710 -1667 -1884 2453 -1436 -1169 3308 -1840 -3659
2611 -3659 4224 1680 -5062 818 3209 -2388 103 1850 -2690 556 3972 -3488 -2882 4937 204
2626 204 -4030 2346 1230 -2100 2003 1042 -3547 1888 3100 -4319 -1316 4536 -1565 -2588 2429
2641 2429 -732 -1384 2819 -865 -3515 3167 1786 -4359 1 3321 -2195 -745 1812 -1696 -31
2656 -31 3103 -2346 -2258 3717 312 -3617 1335 1228 -1668 1065 468 -2210 1544 2211 -2984 -797 3394
2673 3394 -1287 -1846 1532 -421 -1162 1968 -453 -2491 2536 1519 -3169 525 2427 -1551 -463
2688 -463 1477 -1648 -269 2544 -1618 -1516 3059 164 -2732 1182 1202 -1652 469 740 -1948 660
2704 660 1893 -2024 -887 2567 -240 -1543 1595 183 -1064 1227 20 -1834 1298 1063 -2151
2719 -2151 -62 1918 -878 -719 1197 -643 -242 1316 -710 -1233 1470 286 -1511 658 1097 -620
2735 -620 7 641 -928 231 1036 -1180 -768 1066 -313 -974 909 204 -578 830 -64 -771 740
2752 740 631 -1195 -61 838 -780 -359 770 -497 -316 877 -164 -739 784 68 -1140 406 601
2769 601 -750 28 930 -412 -25 1024 -527 -429 671 -2 -719 505 248 -550 -72 215 -136 55
2787 55 636 -388 -49 484 -201 -328 -42 -181 -550 90 118 -154 343 82 -457 205 235 -286 -230 -44 58
2808 58 -144 42 -133 -248 379 195 -15 391 -30 -47 162 -146 -277 12 -147 -328 211 134 5 -7 473
2829 473 -245 -159 248 -295 -276 75 133 -243 89 281 -412 80 510 -60 -178 359 -118 -657 225 -154 -441
2850 -441 262 372 -189 -159 462 -214 -174 485 -7 -462 62 47 -439 17 165 -14 368 427 -48 169 -41
2871 -41 -5 -85 326 -209 142 152 -221 -15 -6 -20 -153 60 -137 -289 132 -75 -522 192 164 -335 100 586 -250
2894 -250 -15 440 -368 140 342 -505 -585 652 88 -433 425 374 -376 243 412 -741 -313 928 -725
2913 -725 -393 639 -204 -515 784 25 -488 779 416 -944 285 693 -975 -409 669 -328 -310 679
2931 679 -301 -268 831 -416 -988 665 269 -691 272 285 -879 250 501 -975 175 1331 -945 -620
2949 -620 1383 -128 -722 851 -312 -792 1089 259 -1327 899 1337 -1076 -100 1190 -814 -147 836
2966 836 -984 -706 1630 -383 -1781 1397 975 -1351 234 833 -1060 212 897 -1842 -138 1982
2982 1982 -1236 -1473 2059 296 -1094 1141 32 -1282 1135 488 -2282 439 1912 -1682 -660
2997 -660 1665 -489 -790 1277 -782 -1063 2068 -506 -2232 1532 1099 -1736 233 1256 -879 452
3013 452 1210 -1924 -99 2213 -1336 -1956 1585 220 -1489 960 278 -1068 1551 658 -2274 900
3029 900 2148 -2135 -915 2012 -717 -756 1384 -1036 -966 2415 46 -2491 1748 1443 -2505 -136
3045 -136 1583 -1518 339 1410 -2007 -95 3012 -1065 -2263 2393 458 -1863 1032 446 -1776
3060 -1776 1110 678 -2363 710 2602 -1748 -1191 2288 -123 -1170 1172 -616 -1039 2012 -93 -2609
3076 -2609 1582 2169 -2172 -332 1742 -1073 142 1292 -1921 -355 2880 -1066 -2413 2188 851
3091 851 -1889 881 378 -1321 1392 746 -2456 583 2352 -1769 -1635 2372 83 -1344 1486 -531
3107 -531 -1099 2041 -35 -2916 1595 1758 -2129 -315 1688 -881 -107 1556 -1588 -741 2523 -912
3123 -912 -2464 1831 1114 -1824 452 921 -1050 877 1052 -2101 326 2217 -1688 -1385 1821 -112
3139 -112 -1376 1159 -211 -943 1483 141 -2332 1170 1667 -1750 -319 1427 -686 -480 948 -1028
3155 -1028 -361 2047 -621 -1883 1445 632 -1534 278 694 -1253 655 666 -1596 249 1818 -1122
3171 -1122 -1041 1537 80 -989 926 -142 -1209 1002 561 -1559 674 1696 -1274 -228 1494 -606
3187 -606 -467 849 -688 -643 1469 -177 -1407 1119 1005 -1397 -58 764 -856 21 555 -943 -331
3204 -331 1271 -755 -994 1421 286 -895 840 305 -592 712 19 -1292 493 815 -1294 -169
3220 -169 965 -327 -240 673 -254 -348 986 -170 -916 531 248 -888 23 565 -444 -133 384 -619
3238 -619 74 850 -559 -595 885 -62 -307 408 206 -386 550 101 -663 252 745 -347 -368 421 -264 -473
3258 -473 237 -219 -302 405 417 -561 559 544 -628 -30 186 -268 -271 273 66 -52 338 -110 -355 487 185
3279 185 -585 -36 369 -212 25 337 -435 111 230 -332 -121 240 -182 -112 30 124 -403 112 -46 -344 66
3300 66 -67 -210 -20 -95 -263 52 -11 -193 -162 441 -218 -278 206 233 -58 153 258 -358 39 128 -214 -86
3322 -86 -89 -12 -72 136 -130 -167 163 53 -159 118 -30 -56 46 89 -340 -336 82 83 -329 194 160 32 58 24 -55
3347 -55 -56 0 0 -149 200 94 155 261 -116 35 247 23 7 -28 -180 -72 56 -108 101 248 270 -103 11
3370 11 54 -149 191 -143 -508 -365 471 34 -100 144 -114 59 484 -55 -32 353 27 -466 -238 266 -127
3391 -127 -55 204 -217 35 320 -185 -80 260 332 -647 152 95 -465 143 458 -458 -32 429 -58 -6 376
3412 376 -350 -515 202 -20 4 196 21 -326 211 319 -414 225 451 -187 -339 414 -114 -226 254 -250
3432 -250 -74 380 154 -580 620 515 -640 -53 416 -593 208 412 -816 -162 901 -171 -627 660
3450 660 -56 -526 390 -29 -580 494 406 -977 -3 829 -642 -419 520 -515 -303 377 -430 -705 841
3469 841 177 -881 302 574 -400 33 401 -433 179 579 -1074 -433 696 15 -695 445 302 -507
3487 -507 559 320 -330 388 553 -1040 -133 1154 -558 -547 626 -289 -252 688 -332 -572 956 78
3505 78 -1123 528 564 -785 14 586 -480 15 820 -610 -469 1253 -235 -1084 777 436 -762 576
3523 576 271 -847 666 827 -1305 -157 1248 -596 -866 848 -381 -845 692 -392 -852 1130
3539 1130 526 -1566 607 1094 -894 -154 614 -542 -100 1086 -843 -621 1280 -238 -1158 776 810
3556 810 -982 94 394 -863 587 701 -1756 -115 1369 -554 -741 814 -58 -564 679 -228 -698
3573 -698 1026 411 -1405 454 1413 -696 -348 723 -504 -117 744 -918 -494 1482 -126 -1302 783
3590 783 638 -606 185 351 -787 493 899 -1006 -408 1317 -506 -842 870 -119 -562 888 -7
3607 -7 -824 929 404 -1245 132 1241 -887 -394 619 -337 -240 865 -808 -678 1217 196 -1277
3624 -1277 308 564 -908 193 477 -733 365 800 -780 -233 1184 -285 -727 814 -103 -789 412
3641 412 -194 -651 812 243 -1119 412 1179 -593 -347 360 -489 -203 710 -497 -612 1026 75 -968
3659 -968 673 691 -653 -48 321 -559 -145 381 -1182 -370 1097 -194 -936 606 245 -440 413 229
3677 229 -424 435 558 -881 67 988 -487 -399 779 -203 -280 512 -62 -383 835 -45 -724 408 642
3696 642 -309 65 408 -433 130 563 -578 -211 612 -97 -693 384 233 -644 92 95 -296 340 340 -526 23
3717 23 592 -70 -386 645 -471 -209 242 -374 -397 462 312 -627 261 352 -500 -37 195 -234 169 222 -392
3738 -392 -388 345 -141 -333 208 21 -412 227 216 -321 242 462 -250 -3 555 -269 -351 547 37 -238 131
3759 131 -47 -83 287 196 -97 38 383 -135 -104 114 -553 -126 177 -189 -203 295 14 -111 231 174 -404 54
3781 54 -137 -162 25 170 -247 114 244 -57 -184 156 -64 -420 267 -127 126 63 -28 -147 -185 130 -260 25
3803 25 82 -53 93 88 247 -100 10 0 177 61 181 -141 124 -68 -50 -294 -95 62 -128 -41 58 -152 -101
3826 -101 84 37 42 93 -169 5 74 68 206 14 -180 -42 9 -124 -72 -156 -44 -94 -50 -35 -41 -229 -177 285 96
3851 96 58 -95 -115 242 55 77 51 -104 -439 -26 -64 -160 -333 -126 -313 130 171 -62 -25 -78 -12 -139 127 -13
3875 -13 -91 -8 -62 12 103 198 -99 5 -10 102 74 224 167 -8 370 -73 -161 163 -222 -133 195 184 -70 87
3899 87 152 -239 217 16 -251 123 214 -209 68 25 -118 49 251 -79 -151 244 92 -84 241 -15 -359 71
3921 71 153 -408 -166 323 -210 -257 94 -194 8 142 141 -328 366 56 -497 185 -160 -269 -134 221 -270 -72
3943 -72 444 -481 -159 203 -145 -181 225 206 -258 150 154 -267 43 223 -568 -338 154 -260 -141 254 -118 -98
3965 -98 434 -13 -455 325 307 -357 32 306 -149 -158 -12 74 -195 388 -134 -209 534 -157 -403 210 135 -206
3987 -206 324 94 -488 389 229 -536 -151 528 -312 -459 390 -93 -271 489 -261 -519 431 315 -218 291
4007 291 244 -359 6 170 -494 -29 454 -224 -477 545 -116 -520 126 258 24 -56 181 -515 412 519
4027 519 -531 -43 861 -176 -459 315 52 -56 613 -74 -630 203 653 -815 118 467 -387 61 282
4046 282 -432 -12 621 -490 -343 636 337 -656 175 457 -259 102 172 -536 267 623 -713 -426 908
4065 908 -169 -557 682 -82 -65 620 -129 -792 503 320 -934 241 767 -540 -236 226 -389 31
4083 31 591 -330 -690 556 53 -575 255 299 -304 239 200 -324 351 477 -725 -402 952 -49 -500 205
4103 205 -5 -228 499 -223 -710 611 126 -747 55 464 -374 -6 190 -280 -136 662 -313 -584 620
4122 620 105 -656 108 207 -283 -23 328 -571 257 460 -785 -219 638 176 -416 329 87 -370 469 10
4142 10 -434 456 185 -580 -216 634 -325 -70 331 -287 -75 473 -80 -319 574 277 -595 45 438 -263
4162 -263 108 258 -401 248 414 -596 -318 631 64 -490 211 98 -193 -15 194 -325 185 499 -466 55
4182 55 133 -290 -233 208 31 -34 309 -194 -376 434 42 -574 44 236 -296 -136 119 -607 118 349 -421
4203 -421 -321 334 -194 -453 283 308 -231 2 41 -262 123 377 -310 -135 266 -228 -206 158 -214 -215 285 -31
4225 -31 -459 396 -35 -272 62 456 -207 -116 199 -18 -76 249 -156 -77 60 -144 -442 361 212 -132 -136 -53
4247 -53 -329 -11 107 -345 -254 26 -128 -163 32 -284 17 129 67 -94 192 -32 -219 53 61 -60 -35 182
4269 182 -28 -22 349 -147 -351 84 92 -61 -312 -82 -411 24 40 -151 123 -48 -53 -8 23 10 85 188 35 -256
4293 -256 -148 100 9 73 288 -233 -112 136 -172 -131 -16 37 139 110 5 -115 23 160 211 185 195 -77 -47
4316 -47 -44 203 91 -35 -123 134 29 -7 -16 -106 65 -88 33 53 -118 69 243 -32 -197 130 62 -139 65
4339 65 -42 -34 257 -108 -85 169 50 -124 43 5 -136 94 -78 -135 -23 79 -154 -208 -90 201 -77 -108 126
4362 126 -156 -155 372 149 134 -105 -147 -234 371 -64 -140 -97 -345 -346 69 -70 -54 99 144 -107 2 91 -25 114
4386 114 -60 -80 93 -93 73 250 -15 42 -94 -73 133 -73 119 147 58 50 126 99 190 -40 -129 0 195 -157
4410 -157 18 -21 98 -413 35 65 -4 112 -16 -227 30 3 -215 -192 231 -97 -129 206 -216 -303 28 239
4432 239 -85 4 -135 -214 106 130 -197 -46 10 -135 -100 -25 -152 -135 125 129 -60 139 144 -24 286 -156 -213 25
4456 25 129 -204 6 230 -237 -101 9 -32 36 188 -67 -119 -133 301 -288 -35 469 49 -108 67 -292 114
4478 114 251 -351 -247 261 -55 -210 159 48 -140 199 45 -474 202 375 -281 -184 308 -146 28 188
4498 188 -66 -303 110 -47 -231 282 201 -145 -90 54 -148 -88 75 -473 -202 436 -148 -225 153 204 -157 268
4520 268 210 -521 121 28 -637 45 508 -378 -382 264 -198 -232 -46 9 -198 150 -239 -375 304 294 -449 271
4542 271 469 -301 23 187 -537 332 218 -280 -358 460 126 -284 -254 -128 -268 -74 146 -415 212 446 -98
4563 -98 -73 454 48 -105 179 -204 -209 399 12 -373 220 70 -257 221 162 -94 199 367 -279 -90 373 19
4585 19 -295 568 24 -437 198 64 22 37 -127 -537 393 339 -450 -199 392 147 -474 24 -138 -157 470 -147
4607 -147 -471 111 186 -701 -54 251 -275 -337 258 -215 -197 206 1 -274 202 -34 -242 -74 211 -230 44
4628 44 168 -289 -8 352 -90 -28 265 -170 -109 86 -147 -235 526 -32 -743 -4 508 -273 -73 221 -317
4649 -317 -29 -100 -18 183 354 -57 -375 307 271 -368 29 231 45 184 282 -69 265 516 -309 -131 439
4670 439 -34 -329 252 -37 -142 98 6 -354 281 192 -477 120 555 -88 -156 156 39 -162 192 -177 -39
4691 -39 268 123 -143 113 50 12 37 28 -250 -18 322 -231 -303 387 -5 -126 113 79 -117 -12 114 10 -49
4714 -49 167 -93 -69 284 -218 -156 63 57 -31 247 -53 -239 174 64 -211 49 284 -107 -109 53 -235 -128 326
4737 326 -197 -213 97 31 -121 253 -129 8 -51 80 -168 27 339 -77 134 -124 -247 -208 86 -89 -178 220
4759 220 -128 -185 292 150 -146 22 343 -48 -112 121 105 -200 95 -87 -160 188 -73 33 -83 178 -84
4780 -84 -39 22 -80 -119 103 -81 101 386 -204 48 34 -67 -90 15 -133 -24 24 -111 -96 183 -180 -251 -26
4803 -26 -50 -28 -363 -18 97 54 188 194 -181 139 52 -130 -16 83 -263 6 139 -85 -139 119 22 43 207 124
4827 124 133 165 4 -194 -5 29 -191 -65 137 -57 -129 7 100 -283 -18 -116 -84 26 54 -58 -39 -39 -283 153
4851 153 -41 -157 45 325 140 -216 -84 0 -94 59 102 87 125 288 135 23 130 -35 -66 -106 112 -79
4873 -79 -15 116 -137 -52 126 197 54 198 -214 68 -100 -207 87 -111 -136 -42 92 34 77 52 -53 0 59 133
4897 133 22 181 140 20 300 -158 428 31 -116 -62 -89 -3 -4 -147 -54 -25 -292 -125 23 -101 38 107 45
4920 45 -165 -65 104 -83 -28 153 -3 -110 94 -232 357 -78 -253 140 11 -334 -156 113 -220 -34 167
4941 167 -291 -120 555 -9 -177 209 -290 -135 8 -6 -163 50 -63 -104 77 15 -189 -131 145 -301 148
4962 148 182 -144 -297 -48 -85 -164 107 187 -192 25 107 -42 -217 52 -211 -114 110 -61 -333 111 -71 -5
4984 -5 41 177 -196 103 299 -313 47 22 -287 -347 94 -437 -12 224 -8 -146 342 9 -378 -48 266 -360
5006 -360 -124 194 -331 205 450 -163 -21 474 -4 -414 114 223 -273 -133 146 -317 117 168 -458 342
5026 342 280 -230 -25 31 -51 -132 39 -67 -248 373 127 -351 56 357 -159 157 111 -85 72 187 -224 -176
5048 -176 322 -169 -508 154 8 -293 -12 -34 -336 78 -22 -381 115 170 -203 -35 282 -41 -319 225 -253
5069 -253 -122 494 89 -487 136 340 -178 -87 108 -189 162 225 -204 -150 271 -113 -428 347 316 -290 226
5090 226 136 4 -63 127 -496 175 365 -138 -200 258 205 -325 212 117 -254 474 179 -374 26 447 -111 18
5112 18 203 -231 -3 168 109 -208 318 -166 -346 25 312 -231 -53 -13 -352 149 410 -384 -122 293 -91
5133 -91 13 332 117 -197 231 -107 -250 169 366 -312 183 51 -189 70 217 -120 -112 -43 -193 -199 508 10
5155 10 -350 -127 350 -348 37 138 -231 89 269 -484 -278 456 -112 -327 110 -32 -359 -34 50 -191 109
5176 109 24 -214 16 120 -454 38 39 85 143 75 -244 -319 333 -264 -489 -218 417 -183 -152 78 -242 103 227
5199 227 -357 -8 240 -126 -280 1 -108 -36 198 85 179 419 66 31 110 240 -56 -185 438 -101 0
5220 0 110 -16 -215 102 173 -383 -84 -23 -109 150 105 -74 -100 30 -368 -183 37 -174 -115 71 108 -327 -48
5243 -48 -91 -114 -112 250 40 -123 502 126 -113 21 -103 -235 -104 -159 -117 179 -110 -262 -58 266 109 -77
5265 -77 -1 -219 -67 274 49 -119 81 -179 -129 90 179 -12 -121 204 118 118 -43 -342 -148 79 -137 82
5287 82 47 -67 -98 98 87 141 278 -350 -110 -25 -42 47 -11 18 79 -102 114 -164 -138 140 -236 -79 17 85 2
5312 2 -10 3 62 42 93 61 -109 387 -72 -70 84 -198 -57 9 39 -98 -74 79 -43 88 47 -125 -108 206 -155
5337 -155 70 278 32 -144 12 -210 -93 119 -41 1 57 -146 -43 65 16 92 -172 123 -15 34 -85 68
5359 68 -55 -228 -29 -45 125 -11 102 221 35 -156 -116 12 -212 -89 89 -208 -74 139 195 -182 -169 232
5381 232 26 31 28 140 113 369 -32 267 3 75 -62 89 122 -95 2 -70 -285 -64 44 -55 -95 -46 70 27
5405 27 140 -2 -61 39 -88 77 80 30 -198 -18 135 -61 209 100 -204 -36 82 72 26 123 -12 278 -91
5428 -91 -96 -84 209 165 16 -32 -19 104 -173 74 -131 6 316 -30 -95 272 -70 -184 254 188 -122 -67 373
5451 373 -241 64 215 -34 -118 279 26 -87 92 -228 102 239 104 -151 234 446 -230 165 26 102 -61
5472 -61 -20 -12 3 198 -17 -16 224 -16 -131 89 30 -39 202 189 -205 -21 158 124 20 164 -130 -225 -44 42
5496 42 147 170 218 -252 65 7 -296 -31 221 125 -141 139 -26 101 176 -116 56 69 -92 -360 -140 -81 -290
5519 -290 331 138 -226 -95 220 -453 -113 113 -74 88 73 133 -313 6 -57 -101 -81 23 -265 27 44 -104
5541 -104 34 53 -15 62 107 27 -275 516 -226 -155 -52 168 -88 9 -91 -102 11 362 -291 173 258 -226 -470
5564 -470 36 117 -60 88 -230 -59 -38 414 -222 -201 67 -171 -351 31 -136 -74 211 17 -311 469 195
5585 195 -247 134 83 -171 69 -1 -211 -71 88 -229 -124 1 -33 -194 -144 198 55 -36 330 -187 229 320
5607 320 -281 -47 311 -144 39 162 22 -38 -16 19 -143 -127 321 -473 -95 154 125 275 119 42 -17 281
5629 281 21 -50 303 29 -171 -27 107 -17 214 -148 -198 41 29 -190 -313 105 65 -121 90 81 42 360
5651 360 -55 -219 316 162 -294 -154 243 47 -55 139 -156 -74 307 -324 -77 149 208 -77 162 -18 50
5672 50 -259 9 -187 111 145 -163 108 185 31 -457 -93 118 -289 265 -20 -420 17 210 -183 -177 -112 -112 -160
5695 -160 251 -275 186 2 -194 55 -25 33 -300 29 214 -213 -8 115 -185 69 16 -161 -139 98 91 -161
5717 -161 13 -52 57 -76 -169 59 -68 15 -81 7 253 -306 -203 -163 -132 -95 308 183 -139 -23 -209 -179 145
5740 145 235 -3 6 17 -275 166 -49 113 -196 106 26 69 -16 -140 -259 -187 296 -165 -71 121 -154 -181 178
5763 178 225 -3 14 -228 -172 56 -228 -154 10 -235 -192 -275 -14 -162 -42 -91 -116 -161 204 -143 -6 120 -50
5786 -50 -205 151 50 -8 75 -121 -196 -197 147 -190 81 41 -119 -130 -123 83 -5 22 192 -88 -4 -228 -52 -172
5810 -172 -21 -129 204 97 17 -176 199 8 -113 -18 242 74 -154 -26 -67 96 -38 -47 -1 81 30 -178 -84
5833 -84 -317 -267 -182 -58 52 -11 -178 -230 -31 30 2 46 32 120 -105 -48 -77 -8 72 176 -232 -125 -15 -92 21
5858 21 -159 -116 26 -8 -61 -28 228 32 -26 114 -69 -167 37 135 -174 181 221 -239 26 143 -9 -81 -110 -135
5882 -135 65 76 106 21 290 88 -220 -171 36 219 52 229 0 -172 260 95 -273 103 -123 -135 57 137
5904 137 50 255 164 -124 208 -45 -185 -61 -54 93 -171 24 42 76 -102 -101 -196 -18 187 -4 36 42 -64 -327
5928 -327 -8 -104 -136 178 85 151 34 -239 -62 100 -22 -3 53 142 -23 -31 114 -258 -17 32 29 43 67 -227 -2
5953 -2 -140 -59 85 201 220 -31 -74 138 170 -160 -74 -234 -109 -95 -126 -221 197 267 -21 151 172 -157 215 108
5977 108 123 -30 -113 65 -80 132 -3 74 271 -381 114 -18 -91 -137 94 -48 21 -28 -57 -101 108 186 -194
6000 -194 29 -74 -87 68 -110 -188 -70 186 129 217 144 82 -159 187 94 -236 -54 9 48 -9 154 -184 -97 -136
6024 -136 -230 -361 -96 33 -202 -23 -17 -153 236 106 -198 -229 189 -3 -15 143 -244 -84 -37 175 -72 231
6046 231 86 -183 65 252 -28 -37 233 35 97 66 -209 -3 211 57 -51 174 112 -103 54 128 -303 113
6068 113 83 -174 -39 176 63 -143 88 -55 -183 111 -20 -54 145 151 -114 -28 140 -395 341 -34 -93 9
6090 9 293 145 -86 39 -108 36 182 -66 142 84 -161 -163 107 22 -69 155 -13 -92 -36 -47 -203 -179 136 -61
6114 -61 -135 222 -191 -206 -17 135 -116 146 122 -207 170 -35 -50 -168 67 23 -182 51 168 88 253 315 -168
6137 -168 -195 13 -137 -57 95 -44 -189 47 -76 109 129 92 -39 117 66 -77 142 126 -30 -33 292 -29 -187
6160 -187 -137 103 -81 158 -68 -448 24 297 -136 -157 -77 75 -102 -69 -160 -172 100 -58 -86 201 -9 58 20
6183 20 -19 -34 295 -29 3 177 -5 22 -201 -79 -85 -9 53 -267 -279 -23 -106 24 48 71 -43 -138 29 156 121
6208 121 -122 21 68 206 -97 -120 -66 119 -21 153 -38 123 74 175 -104 174 36 -2 102 -66 101 -156
6230 -156 -215 -109 -48 59 -17 -68 -53 -92 104 15 -259 -236 100 -124 -42 46 31 -126 -267 -56 159 -215 33 186
6254 186 -4 -188 -48 -123 -86 15 -92 113 -2 196 47 -16 -20 -150 276 -199 -40 -195 37 -45 -21 -30 40
6277 40 -37 164 -369 -107 139 203 60 -144 12 117 -176 223 -55 -50 -85 -29 150 -306 -123 27 87 -22 53
6300 53 113 -28 159 120 -57 -414 46 77 -206 252 10 103 78 -103 -253 110 -275 -130 -224 196 107 -109 -9
6323 -9 345 -240 108 192 -19 -15 -79 -34 -67 -477 -89 -7 84 89 -57 81 170 -17 -40 270 -143 48 48 -77 85
6348 85 3 -77 46 -190 -35 78 116 -24 181 -19 7 -46 168 -6 -289 -109 -124 54 40 -132 297 -267 102
6371 102 32 -253 48 53 134 57 34 138 183 102 78 -181 259 -49 -21 -132 85 8 324 -164 -246 108 51 -174
6395 -174 -92 -1 -124 -77 174 11 26 46 -5 -87 109 -118 -135 -42 -66 -110 -80 73 -85 -183 26 -229 94 194
6419 194 134 -141 52 161 -223 -74 297 54 -181 51 110 -57 -165 98 -131 195 173 -27 50 41 -23 -128
6441 -128 271 26 -41 -52 86 174 5 -34 -134 166 48 57 -110 80 -120 -104 91 -18 152 182 -184 102 20
6464 20 4 -229 196 80 -56 -29 -63 132 15 -39 208 40 -106 8 -15 -10 66 -81 218 -191 103 138 -211
6487 -211 -63 95 54 -19 -125 -136 189 18 55 -93 106 -68 -202 -55 18 149 -231 -26 -194 -231 160 24
6509 24 -38 -103 -59 -185 67 88 86 -92 101 159 123 136 174 343 -66 166 -227 79 241 -161 -94 27 -365 218
6533 218 52 -82 155 146 223 -29 270 -64 -177 54 177 -267 -146 184 -148 -70 -296 -102 -5 108 127 -224
6555 -224 79 29 -84 175 94 -15 24 97 -186 26 195 -138 34 183 -213 -240 -34 -24 -283 -113 -132 -106 -71
6578 -71 -19 -19 -67 57 177 -40 -247 -90 200 -28 -183 -165 196 -177 -83 63 -127 -6 -50 190 -102 39 15
6601 15 -106 -92 -119 -37 102 98 -177 83 -64 48 -55 -100 23 -145 207 115 -51 -12 227 78 145 4 -105
6624 -105 -194 164 43 44 138 -57 -155 -156 -238 -123 -5 -112 17 -180 25 -65 -64 284 84 -59 76 27 -38 278
6648 278 -18 -76 -91 10 -253 -173 235 -40 -109 -165 49 110 185 -261 39 -19 481 73 51 100 -21 87 -48
6671 -48 -254 69 -14 84 70 6 -128 -110 -22 -2 395 -93 200 -51 -81 131 114 -104 114 -25 151 202 63 -37
6695 -37 134 -42 -153 57 -99 -226 -396 121 90 -45 128 -21 -147 -9 105 -90 286 132 -23 -54 3
6716 3 -115 117 81 -111 20 124 51 -41 -95 125 15 225 -156 84 71 80 -56 -13 112 -95 -106 18 21 -98
6740 -98 -29 -40 114 56 53 207 164 -4 100 91 208 188 12 -2 -120 -206 -223 -120 113 -23 259 -75 168 -110
6764 -110 99 198 -80 48 155 -43 62 -63 191 -168 -71 -194 129 310 6 -84 -296 272 33 -31 29 201
6786 201 -128 -146 34 17 -315 14 -76 -82 -76 154 -141 -113 130 50 32 -64 37 207 18 -171 -365 25 82 -8
6810 -8 -161 127 66 -1 81 -49 38 -38 -71 -171 20 53 113 -178 5 -73 357 -141 -5 9 189 59 65 -224 58
6835 58 49 129 -140 31 194 -31 220 -164 198 36 12 189 -146 -126 210 -121 96 -60 -185 -252 203 -102
6857 -102 -141 42 209 -101 -36 77 48 209 98 34 -97 -51 -55 13 77 -115 27 -198 72 -53 212 4 -193
6880 -193 -10 21 -25 -119 -5 16 69 242 18 52 149 -63 120 171 -16 -117 -51 -22 -168 180 -122 -230 47
6903 47 -23 26 -252 -5 2 -40 180 105 -36 35 -80 -207 227 41 -72 -43 29 -67 -3 101 -153 -89 100 -109
6927 -109 -194 -6 -234 -68 187 91 -4 -83 -210 -43 38 -227 197 -96 56 38 -68 200 32 -118 -117 50 -105
6950 -105 -76 -131 -15 -268 -134 -129 9 3 64 12 139 -6 117 -58 -54 -170 15 -123 47 71 -16 -25 -194 -28 -59
6975 -59 19 -33 -157 -2 -19 -27 -38 82 -196 -287 364 -321 -59 -1 215 105 194 -44 62 45 68 122 246 136
6999 136 77 -9 36 75 -94 -65 48 -301 -149 -67 -49 -1 161 45 -51 123 33 39 325 -185 -147 47 63 201 329
7024 329 21 -251 -66 103 34 -176 -107 -43 -9 -183 147 -251 63 190 -307 -30 151 -195 -96 60 -6 27
7046 27 112 81 -57 -86 -114 149 2 -84 158 102 -5 -337 37 -37 -149 -295 172 -170 -66 -129 -121 30 246 126
7070 126 -72 265 -207 -191 -154 137 -165 -37 40 133 130 21 15 20 108 97 11 -125 328 124 10 -114 -101 146 115
7095 115 -252 -39 -96 -102 -19 78 94 14 -83 -33 5 156 64 -25 -158 40 -112 170 95 29 126 -54 96 -83 73
7120 73 172 -57 63 -62 19 -64 -112 155 -45 172 245 -114 46 163 116 29 -204 10 -43 -45 54 86 -61 -53 107
7145 107 49 297 -168 -18 -197 -68 -7 -144 20 -17 3 -45 70 67 -30 -85 60 -71 46 42 122 0 62 6 12
7170 12 -79 -128 66 -496 -17 18 -121 -195 67 73 -203 -5 -206 -307 -1 -152 72 -15 17 -5 142 96 2 39
7194 39 -98 -17 -68 -57 270 91 103 -25 -79 -18 5 149 -14 -45 -88 -169 -196 181 -64 -194 164 98 -78 -98 -132
7219 -132 29 99 111 -60 -76 162 78 -263 -51 79 58 -137 153 -232 -64 -130 40 -34 -52 70 144 128 -129
7242 -129 -115 118 -161 14 220 -22 51 19 125 21 -117 215 -103 288 -48 -127 -89 41 143 -66 -237 85
7264 85 -139 53 91 124 46 -14 10 -86 53 86 104 -6 163 -171 132 36 -114 107 49 -214 19 130 113 269
7288 269 64 -284 -56 -129 -31 -167 -108 -96 -132 0 95 -30 -148 -22 228 12 260 0 23 190 -76 -36 -118
7311 -118 165 92 110 28 -52 151 132 52 24 -97 -309 31 28 -282 -49 99 -33 -196 52 -82 49 -204 11
7334 11 -25 83 -110 60 275 175 -111 24 98 16 -4 -45 -148 -15 119 -135 24 161 113 -107 -48 -147 -15
7357 -15 -27 34 -50 90 48 -7 -8 119 -49 -110 51 -32 -151 130 69 103 106 259 -22 -37 136 173 355 289 64 46
7383 46 -2 155 26 140 63 116 113 83 -32 86 -150 6 -97 -185 260 74 122 25 192 62 55 39 -347 135
7407 135 -81 -84 -88 -164 -119 262 10 -90 -91 -199 -34 37 109 113 -81 -112 -65 70 211 -71 -128 17 103 -181 169
7432 169 -2 -99 -20 -28 19 96 -110 159 -112 -98 -80 -175 25 12 47 56 -2 63 -249 -44 7 -212 -86 53 -132
7457 -132 -78 -60 -111 -62 -49 -67 -67 -94 245 -118 44 -138 82 -136 37 -86 128 84 129 62 -116 99 21 23 -221
7482 -221 154 142 -31 101 -89 -111 107 -37 107 -60 -91 14 -144 133 -217 -17 -61 88 -58 -71 -108 51
7504 51 191 -136 -78 75 -62 193 -30 -82 -57 44 -118 -139 -54 -88 -53 -222 -37 111 19 106 -159 -41 113
7527 113 -28 -18 -78 -153 -40 -151 116 -28 -67 94 -2 41 138 148 -35 -1 263 -77 139 307 27 -253 -143
7550 -143 -59 80 49 -57 188 39 -237 1 60 78 82 70 30 -15 -24 202 3 48 -110 2 -7 96 42 -63 160
7575 160 189 109 11 -16 -79 -64 -211 -133 26 -123 116 20 209 55 18 40 93 10 184 97 -339 -65 -71 -70 219 130
7601 130 -191 -90 -28 -41 -111 85 -24 8 160 169 122 -180 81 42 -204 33 -9 -215 93 -152 -98 -162 85 19
7625 19 -178 162 -146 -243 212 60 179 -113 20 -236 -162 104 -73 99 -227 173 114 -214 190 186 -275 -16
7647 -16 16 -142 -220 111 94 -55 -17 26 113 23 -39 40 -20 -26 -125 133 -30 -300 -296 -170 -34 -182 -73 -51 -326 86
7673 86 29 -37 -185 76 167 -28 -83 -177 35 -233 80 -46 3 -6 -76 -310 -39 117 -267 -44 187 -154 -16
7696 -16 -129 -63 203 -53 -6 13 114 -12 -47 0 -223 37 -179 83 164 43 -29 38 125 -181 -148 188 -45 -41
7720 -41 -208 215 -21 166 23 105 121 49 151 -254 45 -15 115 -15 -35 -67 -143 178 -6 -36 114 -208 -61
7743 -61 -10 56 -69 -202 116 -66 -247 -125 -48 35 26 17 -36 8 99 -178 -17 183 198 200 -42 -75 122 38 60 148
7769 148 59 45 -88 180 -18 -140 -1 284 -78 -205 192 68 116 243 226 12 142 -112 -189 37 -75 -318
7791 -318 123 -5 -109 -78 -57 -7 75 -13 113 55 -52 -120 -63 148 27 -205 -43 -186 113 248 108 -121 275
7814 275 64 -220 32 -39 87 -92 -133 83 110 86 -49 61 -42 175 72 229 144 -82 -34 200 90 -121
7836 -121 93 -25 -70 21 -29 -156 168 -45 -117 78 -62 9 71 8 44 -183 148 -40 -286 30 124 -39 -57
7859 -57 43 -194 93 -9 -233 -37 22 146 44 169 -15 87 1 -151 -332 16 135 -89 -1 -101 153
7880 153 -30 -43 175 206 472 -208 115 182 -326 23 35 -83 27 -224 96 23 -69 45 209 -192 -25 126
7902 126 -8 -94 -256 -54 44 -40 83 8 4 135 -90 169 -89 -190 318 192 -11 -106 146 -41 62 -27 14
7925 14 103 83 182 204 -105 252 76 142 61 -56 -2 99 132 -123 -164 -67 55 -39 -97 129 -54 23 1 -37 226
7950 226 19 -192 -31 128 -77 -179 -119 74 302 186 28 -78 43 185 95 -166 -12 112 -10 -189 94
7971 94 -197 140 304 -224 41 12 97 -57 -80 139 95 -99 54 115 192 -16 -181 -120 24 -33 -108 119 -244
7994 -244 -109 123 84 -54 -118 100 171 95 193 137 178 31 186 103 -77 -57 262 -201 -173 20 -59 -61 -74 137 194
8019 194 -74 -91 -192 -233 67 -159 -165 -51 143 -175 -113 53 122 48 -90 -23 80 -1 14 -213 -103 -214 21
8042 21 -15 -73 -85 180 157 85 -34 88 173 -33 88 -44 -117 67 265 -220 -18 -3 53 -107 94 -24 28 -275
8066 -275 -100 128 110 310 -52 121 256 -130 -41 -74 -136 -138 -407 -42 83 -152 -56 15 189 83 -136 131 14
8089 14 -45 -134 -10 -143 -53 -150 63 107 203 -81 299 68 -209 -42 33 -199 -5 16 -90 200 -53 -141 -243
8112 -243 -29 99 182 141 -175 -178 69 95 2 190 -205 -49 -111 51 -71 12 64 -53 -138 -7 -57 87 -95 26
8136 26 -196 -114 -30 -69 -46 197 -44 -139 -77 0 -38 -76 -69 -40 -5 -1 106 239 -149 78 0 -198 212 -25 -38 -204
8162 -204 -155 -57 151 -156 5 -56 -29 154 12 17 82 65 -84 -16 245 -275 -46 -188 79 23 143 -147 -126 -42
8186 -42 130 93 -76 -257 0
8191@
$$ Imaginary data points
##PAGE= N=2
##DATA TABLE= (X++(I..I)), XYDATA
0 0 0 0 0 0 0 0 0 0 0 0 8 -8 8 -8 8 -16 16 -24 24 -29 32 -40 48 -56 67 -77 89 -104 118 -134 154 -175 199
33 199 -224 251 -282 317 -353 394 -441 488 -540 598 -661 730 -805 885 -977 1074 -1185 1307
51 1307 -1438 1587 -1753 1943 -2155 2401 -2687 3023 -3429 3925 -4549 5356 -6444 7998 -10372
66 -10372 14399 -22453 44373 -217456 -549185 354942 259835 -309119 57096 137444 -192517
77 -192517 231904 220490 -403554 17003 516937 -184872 -355332 283649 145515 -176113
87 -176113 59232 -44760 -111608 286283 58484 -382918 83912 330437 -174296 -184087 117457
98 117457 -9602 -1565 48705 -206970 -27378 301930 -92044 -289980 170775 169829 -142735
109 -142735 -22300 -297 -68969 173523 36642 -304476 68668 310510 -166765 -184704
119 -184704 195672 32342 -84015 87112 -95855 -93489 257081 -10990 -326875 134177
129 134177 255268 -199213 -93645 153861 -57015 -2768 121917 -173259 -71066 283976
139 283976 -50656 -271409 167179 169896 -168645 1607 95731 -91132 71080 101786 -212051
150 -212051 -28318 250090 -95986 -210339 141604 73396 -120669 39637 10171 -93572
160 -93572 112064 52908 -201179 19204 184907 -101583 -117837 103920 18262 -36140 56434
171 56434 -46640 -40728 139092 3524 -145217 60467 103645 -75857 -28313 39574 -22817
182 -22817 40321 36344 -97041 10805 121698 -58995 -88062 72084 11775 -53463 28406
193 28406 -28395 -48795 90918 8212 -121812 50065 97278 -88777 -35101 75332 -36263
204 -36263 -25075 61960 -53634 -44372 110930 -1501 -107270 66202 74181 -81207 -5047
215 -5047 58714 -48409 -5913 57480 -56989 -32766 90542 -8917 -75761 52808 42945 -54315
227 -54315 5332 27770 -38197 6321 29930 -46661 -12311 54641 -12403 -35256 31711 14423
239 14423 -19331 9537 -1105 -17006 15841 631 -30948 7543 20108 -14936 -2241 12592
251 12592 -5823 4512 8705 -19518 -2510 18747 -15679 -16781 17644 1195 -10872 15142
263 15142 3963 -10083 17363 8040 -21001 6018 14990 -18981 -6469 17212 -7634 -7140 18082
276 18082 -1764 -11284 16245 3595 -19294 4991 8128 -18757 -5027 11957 -8613 -6357 14767
289 14767 35 -8558 11651 5060 -13101 1785 7199 -12146 -7258 8988 -2343 -7068 9632
302 9632 7262 -5521 5080 10539 -5348 -4675 7432 -3278 -11384 4178 5301 -8170 938 11567
316 11567 -2474 -4787 9923 1534 -11241 1036 3537 -12605 -5808 8152 -4399 -8119 9417
329 9417 4946 -8877 3921 10235 -7948 -6243 9181 -3432 -11598 8066 7181 -9917 3966
342 3966 15769 -4996 -4906 14839 226 -13747 6905 5550 -15202 970 13212 -9409 -4277
355 -4277 16991 -1684 -12251 11381 4295 -17250 -354 5394 -13585 -4447 7805 -7158 -3602
368 -3602 12098 -711 -6430 8355 3883 -5939 -418 -868 -2255 3913 -2201 -3711 9919 4984
382 4984 -3880 6889 4290 -4349 7286 -456 -17406 6820 12977 -21158 -6073 22343 -6653
395 -6653 -11583 18077 -3844 -13363 22265 -3280 -32878 19635 20787 -36517 -2865 33030 -15863
408 -15863 -10657 26500 -15016 -13683 36186 -13865 -41570 34421 19731 -46720 5951 32685
420 32685 -23096 2051 26761 -29841 -1293 47491 -30222 -40749 46769 9970 -46692 15246
432 15246 19041 -23936 21574 14306 -43435 20872 49765 -46754 -28738 51749 -3293 -33172
444 -33172 20577 -4782 -12882 41697 -11275 -51299 44919 36858 -60538 -10506 39563 -20436
456 -20436 -8022 13828 -38346 9632 58302 -45475 -45852 70489 14871 -59613 17791 18488
468 18488 -27049 32819 2736 -66730 44373 69312 -76648 -30131 85579 -10483 -47096
479 -47096 35153 -15095 -25027 66001 -21975 -85794 73416 63866 -95877 -12302 79143 -27851
491 -27851 -22091 33665 -46962 -5971 83154 -52059 -84433 91455 44437 -92561 6340 51848
503 51848 -30310 14624 13987 -72079 29556 85610 -80250 -61778 96719 15593 -65875 23130
515 23130 8719 -17465 56144 -20409 -87174 69985 70657 -101025 -27054 83716 -15271 -24493
527 -24493 28445 -40588 7538 88912 -59907 -86298 101874 43382 -103032 6448 53698
538 53698 -32312 20495 14732 -80064 39493 97714 -95251 -69839 111229 11025 -84506
549 -84506 25864 12192 -28353 60012 -13267 -97244 73867 87644 -111020 -39478 100109
560 100109 -13367 -45061 32110 -30265 -5201 89345 -45349 -93916 99689 62397 -107952
571 -107952 -7133 68554 -29209 138 19680 -68109 23567 96088 -77151 -74619 106226
582 106226 26826 -85558 16381 23747 -28294 41404 -7439 -86653 57114 82315 -94540
593 -94540 -41080 93111 -3595 -44965 25566 -21412 -7554 70771 -40984 -83785 84196
604 84196 54678 -94422 -5810 63909 -23309 -809 18944 -57491 19310 82427 -69415 -67542
616 -67542 94460 23697 -78107 19762 28469 -28657 35457 3013 -77214 42811 76147 -83347
628 -83347 -42967 86562 -2298 -49652 30775 -5422 -19321 57614 -17464 -75839 57869 53472
640 53472 -80301 -17160 60311 -17891 -15531 23319 -32745 2703 61855 -39179 -55917 64311
652 64311 24849 -61080 6251 26827 -19350 18340 6711 -46972 28202 52827 -54127 -29545
664 -29545 58642 -2244 -36259 19102 -4982 -13943 39176 -12596 -49797 44133 36561 -57218
676 -57218 -6891 43249 -19568 -11705 20939 -26453 -3453 46865 -25823 -40977 48914 18283
688 18283 -47547 9205 24044 -23801 7455 13760 -35102 9078 40882 -32136 -24491 43497
700 43497 2965 -30290 15691 5346 -17713 18869 1138 -32671 17920 26759 -30838 -8662
712 -8662 29896 -6650 -12027 13746 -8173 -7330 20538 -9095 -23252 20329 11938 -22613 2900
725 2900 14757 -8797 1435 7069 -13915 2690 15878 -14664 -11227 17585 -190 -11966 8316
738 8316 1543 -6407 10483 -60 -13969 9912 8528 -16356 -946 12592 -7921 -3331 10423
751 10423 -6156 -3651 13618 -4924 -12126 12339 3531 -15534 3681 8455 -10241 746 9675
764 9675 -7861 -2201 12431 -4690 -9192 9876 2234 -11058 2804 5590 -7270 78 6863
777 6863 -4239 -1994 7438 -731 -5950 4124 2595 -5663 -697 3286 -1972 -2099 3348 968 -1508
792 -1508 1798 2425 -1524 -1162 1888 -871 -3514 273 1989 -2507 -929 3480 -203 -2363 2613 1715
808 1715 -3756 296 2637 -3341 -2194 3656 -515 -3326 3204 2325 -3247 1403 3577 -2745 -1514
823 -1514 3243 -1285 -3519 2498 1388 -3330 1696 3584 -1938 -656 3772 -928 -3017 2230 237
838 237 -3984 720 2389 -3116 -40 3435 -1216 -1639 2956 -182 -2922 1240 410 -2961 254 1311
854 1311 -1799 393 2326 -407 -256 2203 131 -1208 357 -481 -518 -127 -1254 355 1234 -479 196
871 196 1514 -905 559 2252 -3132 -2035 4257 -1286 -4826 3925 2448 -4876 2849 3471 -5529 2406
887 2406 6080 -8484 -2997 10559 -4322 -9048 8819 2184 -8935 6251 4076 -10436 5559
900 5559 9275 -13934 -2816 14953 -7252 -11089 11833 706 -9824 9378 1602 -12481 10432
913 10432 8892 -17179 526 16136 -9386 -7994 11361 -3127 -4447 11106 -5371 -9814 16406
926 16406 3034 -18371 5920 10919 -10662 -783 4964 -9080 5710 10465 -17023 -3061 21267
939 21267 -7336 -15356 12312 1662 -8721 9736 -4497 -14006 19808 7545 -27302 6517
951 6517 23956 -16026 -8657 15466 -8361 -2774 18087 -16430 -14889 31377 1028 -33138 14949
964 14949 20741 -20794 140 12138 -17218 7463 20793 -28936 -9764 38676 -7535 -31603
976 -31603 20808 11694 -18618 10481 1108 -21770 22083 16469 -39264 291 38946 -17005 -22074
989 -22074 21476 -1477 -8595 18368 -15262 -19985 35622 5683 -43061 12168 30957 -21730
1001 -21730 -7243 14479 -12979 8034 21331 -31445 -11633 44325 -6937 -38230 20833 16686
1013 16686 -18654 8034 399 -20900 26567 16864 -44843 935 45139 -19296 -26962 23366
1025 23366 -580 -9075 20307 -18224 -22423 43359 6262 -52113 14958 37911 -27454 -10631
1037 -10631 19201 -15756 6307 26368 -35941 -15737 53979 -6154 -48929 25078 24437 -26297
1049 -26297 5244 6836 -24160 23587 22920 -47955 -4320 53235 -16447 -36023 26011 7149
1061 7149 -14873 16026 -11840 -23425 38397 11554 -50758 9132 42200 -22122 -17085 18685
1073 18685 -8626 2724 21537 -30036 -15692 47651 -2933 -45735 20129 25221 -22280 1801
1085 1801 5621 -20013 21540 19410 -44280 -3134 49337 -16724 -33890 25933 6857 -15192
1097 -15192 16629 -10053 -23563 36544 11606 -49846 9327 42351 -24165 -17895 22165 -8156
1109 -8156 -2212 22731 -24546 -18446 43846 325 -45281 17605 27382 -23321 -2070 11453 -16991
1122 -16991 12372 20341 -34406 -8090 42422 -10208 -32875 20309 10859 -15883 10147 -2269
1134 -2269 -18696 24622 12266 -37362 3555 34422 -16806 -17098 17732 -3381 -4337 15999 -15912
1147 -15912 -14171 31659 1492 -33912 12706 21575 -18055 -2581 10025 -12393 8220 15484
1159 15484 -25419 -5997 32125 -8444 -24871 17338 7648 -14089 8663 -596 -16070 18011
1171 18011 10311 -28524 2826 26497 -14105 -13125 16304 -3125 -6864 13980 -8763 -13586 22116
1184 22116 3826 -25499 8581 18072 -14608 -3589 11035 -8811 499 12683 -13769 -8108
1196 -8108 20555 -2296 -18495 9924 8250 -10416 2676 3590 -9047 7364 7616 -14885 -683
1209 -683 15479 -6337 -8999 9020 -271 -4644 6310 -3471 -6370 10897 1688 -12674 5184
1222 5184 8594 -8087 -871 5716 -5594 899 7037 -8059 -3596 11706 -2908 -9371 7262
1235 7262 3025 -7484 3520 2636 -6997 3964 5533 -8783 -729 9470 -4298 -5645 6761
1248 6761 134 -4974 4474 221 -5614 4501 3152 -7223 937 5933 -4080 -2466 4546 -1090
1262 -1090 -2381 3375 -1212 -3220 3497 744 -4250 1491 2375 -2448 265 2082 -1382 -75 1942
1277 1942 -1472 -551 2033 -425 -1442 1316 399 -1060 481 159 -840 701 49 -1162 421 269
1293 269 -961 -14 250 -716 84 839 -874 -117 1003 -996 -506 1165 -349 -1394 993 427 -1323
1310 -1323 761 1176 -1025 220 1722 -671 -816 1689 -118 -1372 988 541 -1543 19 1172 -1097
1326 -1097 -821 1358 -384 -1150 959 448 -1331 223 1055 -1034 -585 1318 -368 -828 1043 243 -1031
1343 -1031 444 965 -735 -583 1072 -46 -501 423 365 -57 -377 498 -22 -855 -121 479 -1039 -307
1361 -307 1056 -338 -1231 1391 1051 -1856 400 2053 -1449 -1165 2066 -806 -1738 2634 369 -3240
1377 -3240 2140 2462 -3537 -142 3478 -1974 -1652 3212 -1415 -2373 3523 -221 -4467 2985 2538 -4374
1393 -4374 251 3443 -2948 -526 3282 -2816 -1148 4697 -1996 -4036 4630 1292 -4238 2178 1816
1408 1816 -2838 2196 1346 -4842 1620 4861 -4863 -2041 5484 -1393 -2660 3492 -1711 -2126 5365
1423 5365 -1682 -6861 5339 3557 -7852 724 4947 -4148 562 4185 -5914 139 8542 -5720
1437 -5720 -6494 9176 1074 -7938 4369 2003 -5694 5458 2389 -10156 4537 10004 -10269 -4845
1451 -4845 11093 -2719 -6785 6970 -2009 -5164 10191 -1278 -12723 9372 9181 -13358 -1516
1464 -1516 10599 -5541 -2381 7209 -7267 -1920 13706 -6222 -12048 12872 5712 -13163 2112
1477 2112 6273 -6593 3683 3822 -12038 3923 14050 -11734 -8878 14443 154 -9688 5581
1490 5581 -1179 -5260 10571 -1933 -15133 11196 11639 -16076 -2397 12791 -5017 -2760 6922
1503 6922 -9384 -922 16320 -9486 -15188 17499 6387 -16935 3755 7915 -8361 5286 4775
1516 4775 -16306 5216 18532 -16273 -12139 19785 1167 -13814 7617 1191 -7732 12509 -254
1529 -254 -19599 11571 16302 -19601 -6243 17663 -3978 -6931 8391 -7091 -3085 17473 -7849
1542 -7849 -18515 17282 10336 -19437 258 11352 -7228 2381 5512 -14444 4338 18880 -15079
1555 -15079 -13777 19686 2734 -15033 5858 2153 -6871 11600 -273 -18563 12055 16555 -19556
1568 -19556 -6868 18063 -3813 -7385 7754 -6997 -2604 17621 -7654 -18627 18109 10465
1580 10465 -20031 201 12265 -7588 1006 5923 -14182 3385 19195 -14281 -14594 20334 4189
1593 4189 -16645 5592 4277 -8112 9240 1681 -18014 9388 17288 -18024 -8504 18815 -2052
1606 -2052 -9611 7884 -3942 -5030 14607 -4669 -17887 14551 11855 -17822 -1352 13067 -5982
1619 -5982 -1217 6015 -10597 716 15780 -10695 -13245 16390 4799 -14437 4163 5594 -6126
1632 -6126 6473 1538 -14082 7085 13676 -14623 -6765 15083 -1780 -8212 6610 -2289 -3961
1645 -3961 11388 -3575 -14146 11457 9046 -15358 -1071 11234 -5826 -1700 6407 -7807 -379
1658 -379 13284 -7769 -11261 13367 4083 -12775 3370 5738 -6529 3993 3534 -10553 3952
1671 3952 11657 -10271 -6759 11980 -516 -8119 4996 289 -4671 7421 -565 -9869 6867
1684 6867 7706 -10348 -2005 8398 -3876 -2829 4466 -4311 -1262 8096 -4099 -7422 8391 2991
1698 2991 -8346 1871 3827 -4202 1699 2165 -6429 1855 7199 -6251 -3626 7729 -596 -5106
1712 -5106 3664 96 -3703 4295 -43 -6341 4043 4632 -6764 -652 5866 -2767 -1857 3885 -2649
1727 -2649 -1845 5034 -2024 -4831 5048 2083 -5167 1630 3745 -3255 549 2856 -3526 23 4062
1742 4062 -2937 -3067 4520 379 -3391 2210 1518 -2677 1570 1133 -2985 867 2664 -2714 -1505 2655
1758 2655 -604 -1470 1585 -85 -990 1847 -253 -1737 1400 536 -1693 165 990 -826 204 772
1774 772 -1210 390 1394 -1081 -513 1287 -405 -1337 1141 -159 -1200 1050 399 -1364 937 921
1790 921 -1415 30 1301 -1162 -826 1028 -437 -1019 1145 330 -1099 1051 874 -1123 -261 993
1806 993 -864 -666 864 -203 -885 563 301 -835 324 677 -340 -461 425 -107 -816 323 108
1823 108 -327 4 489 -51 -70 431 132 -231 303 349 -239 -464 424 -14 -346 545 247 -172 -140 475 -6
1844 -6 -371 412 5 -843 25 700 -453 -8 1024 -97 -513 996 335 -801 337 477 -810 -176
1862 -176 938 -695 -367 1218 -519 -964 864 501 -1301 345 644 -1261 107 1198 -1156 -275
1878 -275 1584 -682 -1008 1184 96 -943 871 48 -1140 748 674 -1566 207 1629 -875 -280
1894 -280 1192 -639 -442 1184 -950 -848 1678 -383 -1960 1217 707 -1316 620 426 -1398 1103
1910 1103 913 -2494 392 2509 -1882 -1431 2392 -842 -1200 2388 -757 -2164 3324 425 -4356 1594
1926 1594 2855 -3309 -683 3172 -2349 -642 3537 -2532 -2378 5187 -534 -5215 3077 2376 -3899
1941 -3899 599 2267 -3478 1231 3413 -4563 -1260 5980 -1865 -4402 4178 968 -3494 2209 115
1956 115 -3695 3860 2312 -5747 854 5465 -3615 -2598 3760 -1599 -1459 3477 -3187 -2695 6326 -276
1972 -276 -6277 3731 3668 -4554 489 2192 -3923 2121 3718 -6453 -584 7711 -3228 -5508 5408
1987 5408 1208 -4036 3273 -476 -4682 5903 2563 -8997 1716 7870 -5658 -3363 5792 -1837
2001 -1837 -2006 4993 -3813 -4189 8571 268 -9879 4005 6299 -6520 -405 4165 -4533 1362
2015 1362 5330 -7229 -2176 10250 -2782 -8359 6088 3513 -5550 2600 828 -5109 5618 3463
2029 3463 -9799 991 9528 -5291 -5301 6325 -549 -2547 4527 -3613 -4166 8798 479 -10495
2043 -10495 3979 6870 -6332 -1458 4008 -3700 1762 4928 -7351 -1959 10884 -3082 -8901
2056 -8901 6808 3298 -5836 2623 742 -5422 5955 3700 -10790 1408 10717 -6356 -6043 7054
2070 7054 -740 -3800 5074 -3342 -5162 9572 1074 -11450 4385 8711 -7281 -2532 5894 -3564
2084 -3564 38 5788 -6849 -2996 10847 -1791 -10091 6227 5129 -6532 1153 2457 -4798 4281
2098 4281 4191 -9329 -240 10117 -4379 -6703 6243 856 -3751 3575 -1564 -4794 7428 1557
2112 1557 -9779 3149 7708 -5941 -2539 4867 -2321 75 4582 -5707 -2657 9413 -1910
2125 -1910 -8322 5499 4210 -6093 1092 2763 -4408 3451 3775 -8086 -199 9084 -4325 -5972
2139 -5972 6184 592 -4046 3638 -768 -4648 6171 1947 -8674 2499 7054 -5506 -2970 5041
2153 5041 -1865 -1571 4613 -3395 -3356 7120 -317 -7327 3977 4492 -5206 -237 2617 -3078 1506
2168 1506 3484 -5247 -966 6650 -2305 -5110 4116 1516 -3453 1746 277 -2991 3762 1560 -5598
2183 -5598 1258 4955 -3599 -2018 3836 -1058 -1130 2788 -2230 -2011 4575 -597 -4747 3012 2687 -3644
2199 -3644 246 2147 -2366 1142 2559 -3908 -653 4749 -1700 -3384 3488 393 -3083 1909 704
2214 704 -2745 2397 1901 -3928 795 3725 -2669 -2011 2937 -559 -1616 1926 -650 -2115 2430 778
2230 778 -3365 964 2098 -2234 -708 2040 -1155 -226 1688 -1400 -678 2151 -374 -1894 1309 921
2246 921 -1346 422 720 -1139 616 542 -1499 208 1429 -1205 -733 1294 -375 -766 920 -535
2262 -535 -776 1378 -215 -1509 1053 554 -1186 288 784 -832 23 898 -776 -458 1439 -616 -932
2279 -932 1104 383 -1066 740 613 -1126 317 949 -914 95 1083 -325 -821 890 184 -902 453
2296 453 407 -823 556 460 -825 64 803 -269 -465 631 -17 -528 388 223 -365 71 577 -282 -133
2315 -133 451 222 -68 85 151 -444 -23 289 -115 -267 132 17 -209 -111 -161 -74 -267 -68 3 -161 13 119
2337 119 -168 -267 268 -113 -407 217 394 -323 -158 383 -158 -204 684 -123 -418 106 229 -733 11 574 -325
2358 -325 -438 595 -162 -327 668 264 -756 283 484 -774 -49 682 -458 -266 717 -311 -287 615
2376 615 -238 -452 718 -80 -511 428 124 -429 430 199 -448 265 334 -835 -9 240 -262 -98 360 -289
2396 -289 -385 789 -337 -625 924 -46 -956 440 409 -844 337 380 -1312 332 1272 -1108 -463 1789
2414 1789 -485 -1309 1211 -71 -1088 1005 137 -1585 904 1278 -2047 86 1894 -982 -927 1696
2430 1696 -378 -791 1739 -537 -2012 1875 917 -2405 428 1784 -1501 -78 1462 -1530 -223
2445 -223 2180 -1458 -1618 2400 172 -2466 1212 829 -1368 1084 645 -2133 1204 1951 -2515 -716
2461 -716 2766 -1177 -1421 1604 -642 -837 2296 -942 -2161 2671 1000 -3324 506 2098 -2028 264
2477 264 1550 -2305 225 3207 -2481 -2149 3876 -57 -3390 1925 901 -2264 1573 676 -3243 1987
2493 1987 3388 -3801 -1183 4329 -1269 -2429 2523 -600 -1689 3104 -803 -3679 3273 2472 -4548
2508 -4548 134 3540 -2202 -827 2181 -2163 -369 3599 -2456 -3148 4529 755 -4123 1488 1729
2523 1729 -2295 981 822 -3703 2068 3517 -4047 -1553 4575 -1033 -2738 2454 -593 -1608 3240
2538 3240 -1025 -3895 3960 2433 -5142 487 3873 -2529 -958 2295 -2451 -60 3988 -2851 -3691
2553 -3691 5203 839 -5055 1929 2484 -2811 1367 1470 -3937 2007 4097 -4673 -2040 5243 -643
2568 -643 -3843 2636 317 -2052 2948 -174 -4345 3636 3201 -5558 -271 4460 -1963 -1875 2386 -1712
2584 -1712 -573 4055 -2298 -3497 4891 1521 -5002 1437 2701 -2493 618 1322 -3259 1448 3639
2599 3639 -3639 -2056 4946 -501 -3628 2260 297 -1785 2244 -199 -3663 3000 3007 -4480 -181 4169
2615 4169 -1887 -1805 2290 -1549 -1015 3233 -2321 -3515 4366 1557 -5039 1188 2862 -2650 289 1671
2631 1671 -3084 720 3596 -3220 -1947 4806 -59 -3504 2170 1043 -2071 1948 424 -3320 2058
2646 2058 2736 -4065 -779 4115 -1199 -1718 2383 -428 -1119 2503 -1220 -2908 3034 1133 -3889 759
2662 759 2499 -1846 59 1452 -1750 333 2663 -2399 -1825 3295 -211 -2773 1312 754 -1470 1370
2678 1370 373 -2242 1494 2093 -3138 -659 2992 -1154 -1642 1599 -785 -1086 2176 -451 -2139 2124
2694 2124 1309 -2684 345 1926 -1694 -413 1402 -1197 -350 2254 -1200 -1391 2572 254 -2331 1181
2710 1181 926 -1567 425 809 -1503 460 1622 -1856 -514 2065 -563 -1525 1157 -66 -1194 976
2726 976 43 -1425 1181 953 -1746 322 1282 -972 -218 774 -488 -157 972 -783 -886 1129 141
2743 141 -1218 726 787 -738 505 334 -667 281 827 -1024 -337 1410 -495 -732 948 43 -539
2760 -539 779 -159 -820 889 281 -1128 78 729 -532 -48 636 -227 -132 765 -204 -691 479 123
2778 123 -849 28 471 -641 -52 526 -90 -41 565 -259 -232 382 46 -467 177 76 -318 38 328 18
2798 18 220 369 -256 -133 145 -40 -263 87 -34 -102 306 516 -96 71 295 -83 38 -31 -397 11 8 -327
2820 -327 247 247 3 224 542 119 -183 373 -145 -402 239 -43 -268 126 200 -228 73 284 -83 -228 323
2841 323 -259 -417 -33 -4 -549 27 267 -232 69 327 -119 -45 387 -363 -318 187 -104 -542 230 14 145
2862 145 109 -26 -297 -25 300 -311 -87 227 131 -149 51 48 221 376 -262 25 154 17 -252 225 -89
2883 -89 -359 127 -28 -455 259 381 -193 75 693 -217 -476 127 -615 -224 556 -448 -796 485 350 -621
2903 -621 42 760 -365 27 463 -795 -467 680 -300 -606 989 92 -719 692 314 -613 238 351
2921 351 -1158 -121 740 -834 -473 980 -154 -708 635 -112 -445 683 196 -1240 504 651 -1365
2938 -1365 -282 948 -398 23 933 -412 -232 1298 -484 -1082 863 219 -1071 256 310 -750 905
2955 905 663 -986 469 1470 -1194 -777 1413 -424 -788 843 -352 -821 1335 127 -1925 1025
2971 1025 1231 -1690 -272 1346 -986 -219 1090 -1044 -643 1855 -332 -1751 1733 693 -1943 363
2987 363 680 -1186 563 1130 -1855 35 2423 -1307 -983 1826 266 -1137 844 -218 -1212 1512
3003 1512 74 -2174 820 1950 -1580 -473 1588 -588 -248 1238 -1341 -1015 2222 -584 -2302
3018 -2302 1747 1174 -1884 343 1147 -972 805 800 -2088 170 2504 -1549 -1965 1994 286 -1567
3034 -1567 1015 226 -1381 1758 387 -2917 662 2275 -2048 -874 2043 -792 -851 1762 -1082 -1026
3050 -1026 2586 -432 -2716 1622 1470 -2232 13 1451 -1538 397 1726 -2163 8 2846 -1421
3065 -1421 -1858 2150 292 -1844 940 344 -1261 1709 847 -2753 774 2277 -1878 -1117 1894 -565
3081 -565 -1140 1299 -1116 -910 2485 -221 -2498 1558 1664 -2250 51 1605 -1447 -107 1314 -2042
3097 -2042 -177 2725 -1215 -1903 2285 705 -1970 740 425 -1480 1161 635 -2811 778 2323 -1911
3113 -1911 -778 2176 -301 -1076 1509 -847 -1074 1919 -99 -2699 1555 1820 -2187 -253 1734 -1030
3129 -1030 139 1471 -1385 -406 2097 -1100 -2123 1707 677 -1501 684 885 -951 1045 988 -2004
3145 -2004 213 2080 -1600 -1114 1598 -401 -915 1140 -397 -938 1658 73 -2005 1166 1165 -1818
3161 -1818 -226 1322 -1195 -82 1097 -1374 -220 1889 -437 -1955 1496 428 -1657 484 472
3176 472 -1241 619 464 -1697 376 1776 -1279 -1150 1487 -287 -944 671 -419 -977 1323 373
3192 373 -1325 788 1398 -1241 -460 848 -479 -526 751 -689 -805 1332 -313 -1093 1050 647 -1137
3209 -1137 391 550 -829 225 393 -1007 -55 885 -749 -418 1064 13 -515 558 188 -578 600
3226 600 244 -960 333 675 -871 -78 776 -239 -199 448 -620 -225 787 -266 -705 524 277 -657
3244 -657 320 338 -244 47 513 -383 -165 441 -545 -369 589 -139 -534 306 283 -449 467 157 -588 193 297
3265 297 -523 -373 390 -294 -473 291 128 120 513 69 -477 80 244 -341 -85 241 -235 -9 435 -264 -31
3286 -31 608 78 -33 67 -58 -516 107 14 -278 -216 -135 -53 257 220 -146 -58 -32 -182 -386 220 -273 -233 247
3309 247 6 -93 238 187 -7 262 303 -460 20 68 -246 -268 21 -75 -178 437 345 1 16 265 -166 -238 107
3332 107 -103 -108 268 -387 -232 190 153 -42 54 154 -39 -98 -40 -53 -172 -8 -78 -57 -99 71 88 133 27 80
3356 80 17 4 -232 65 -119 19 138 128 -241 5 331 -22 378 34 -246 -166 72 -327 -92 262 96 -396
3378 -396 269 -90 -135 173 186 -54 223 41 -141 -28 241 -126 62 61 123 -117 148 -106 -287 276 -6 -187
3400 -187 170 220 -400 83 406 -152 -52 302 -90 -356 329 -192 -350 176 127 -283 171 128 -187 386 258
3421 258 -602 185 389 -321 -348 274 -40 -281 321 21 -335 696 92 -665 89 397 -590 13 458 -416
3441 -416 54 528 -354 -214 501 60 -876 257 197 -388 331 350 -431 296 567 -815 -136 781 -278 -769
3461 -769 414 -164 -518 491 -294 -631 428 315 -901 274 1040 -612 -289 695 -396 -321 537 -416
3479 -416 -741 686 71 -921 449 455 -579 -15 582 -685 -11 504 -916 -210 1002 -192 -599 778
3497 778 314 -478 772 61 -686 471 514 -1085 -129 1279 -520 -536 762 -338 -227 1117 -505 -688
3515 -688 1082 149 -1291 555 880 -827 -106 576 -735 314 908 -972 -616 1115 -283 -1096 890
3532 890 326 -951 695 144 -872 696 735 -1322 104 1214 -697 -763 784 -213 -615 903 -505
3549 -505 -952 1154 390 -1366 397 1151 -861 226 538 -874 30 832 -858 -516 1342 -99 -1202
3566 -1202 793 355 -914 400 -30 -894 729 1001 -1443 -51 1530 -701 -689 805 -164 -430 867
3583 867 -616 -659 1105 513 -1213 581 1149 -879 36 775 -515 290 1047 -888 -679 1453 90
3600 90 -1312 884 560 -776 323 691 -785 340 546 -1339 -348 1386 -466 -777 936 -188 -539
3617 -539 704 -130 -966 987 280 -1324 138 966 -898 -501 623 -512 52 601 -672 -543 1376
3634 1376 -179 -908 472 392 -668 453 455 -718 636 670 -1342 -253 985 -497 -901 636 55
3651 55 -656 501 -64 -729 792 408 -1153 64 824 -732 -323 685 -223 -113 524 -573 -331 980
3669 980 19 -809 422 501 -957 -71 129 -657 320 770 -727 -183 1014 -332 -470 270 418 -333 247
3688 247 -193 -477 511 122 -703 114 566 -433 -116 396 -211 -225 398 -259 -322 777 -68 -904 313 126
3708 126 -742 71 122 -656 94 203 -610 -178 433 -58 -506 538 95 -117 513 80 -177 355 458 -440
3728 -440 52 683 -320 -324 510 -111 -101 450 162 -283 391 43 -617 353 427 -443 -103 475 -304 29 -57
3749 -57 -234 -163 252 -27 -499 109 15 -329 32 -72 33 -93 236 -345 -123 398 -216 -268 29 -81 -175 155
3771 155 -15 -15 272 -80 -455 -52 -96 -267 -97 154 -13 -11 0 35 -25 170 98 -251 366 175 -25 473 -100
3794 -100 -135 -250 11 -258 113 266 -33 85 124 110 -164 8 -42 -22 183 -20 -31 83 19 -293 113 88 -18
3817 -18 -132 -17 -53 -291 153 -85 -62 143 -138 77 194 282 81 223 30 -105 -230 52 9 127 53 63
3839 63 63 -4 142 -45 -76 92 -181 124 -239 -227 -74 -30 5 82 184 -225 -31 -9 115 -54 -61 -33 -125 37 236
3864 236 -327 92 -70 32 162 94 -215 -70 180 -62 41 144 14 29 -81 76 -29 20 -105 43 -134
3885 -134 108 -201 -238 21 35 151 29 234 -91 232 40 -42 -2 84 -443 -98 44 -15 -80 87 -181 -99 350
3908 350 12 -51 336 205 -376 52 178 -272 120 232 -312 -37 61 -387 8 53 -37 -335 299 78 -443
3929 -443 225 11 -40 380 398 -202 -107 323 -356 -223 292 46 -94 248 75 -375 304 -26 -195 103 63
3950 63 -247 -96 211 -273 -191 163 -315 -258 463 19 -412 -68 13 -448 68 -82 -304 139 321 -195 28
3971 28 504 -254 -99 506 -48 -249 420 -167 -286 310 -18 -571 30 202 -46 343 82 -318 80 359
3991 359 -567 -307 398 268 -364 157 428 -85 213 119 -575 -30 489 -391 -13 746 -341 -429 618 -35
4011 -35 -286 374 -101 -410 334 324 -510 258 651 -408 300 288 -449 83 663 -281 -192 647 -92 -469 177
4032 177 388 -241 208 91 -687 487 591 -649 -40 590 -326 -489 130 -219 -356 545 -386 -525 596
4051 596 301 -568 97 421 -361 -81 218 -307 43 667 -483 -482 776 -100 -706 161 361 -353 95 332
4071 332 -424 311 962 -714 -246 669 -185 -446 523 -49 -299 358 -180 -650 571 230 -746 101 675
4090 675 -245 -305 314 -291 37 491 -572 -626 499 40 -575 313 149 -333 273 32 -383 260 747 -454
4110 -454 -228 732 -169 -626 377 -182 -166 488 -119 -526 531 376 -682 88 522 -226 -137 661 -194 -197
4130 -197 301 -210 -187 447 29 -552 611 331 -661 31 144 -639 313 342 -543 -526 537 -249 -396 378
4150 378 189 -189 244 218 -445 489 470 -522 16 502 -355 -84 359 -318 25 328 -222 -240 560 -17 -356
4171 -356 182 129 -443 130 94 -205 100 298 -400 -195 456 -36 -360 119 72 -207 161 113 -425 308 51
4192 51 -566 -7 434 -150 -24 202 -187 -356 181 -55 -408 233 -134 -420 360 416 -295 27 164 -441 -97
4213 -97 287 -298 -154 438 119 -168 137 81 -246 285 190 -399 282 331 -238 -108 584 -241 -113 377 -52
4234 -52 -59 -49 49 -169 222 42 -78 -89 377 -264 72 255 14 264 231 -235 41 173 73 -34 328 182
4256 182 -165 118 -155 -283 106 47 -204 145 235 -52 -59 51 -173 -184 128 -91 128 65 -100 -271 -10 235
4278 235 -95 29 288 -87 -86 119 23 -297 203 -14 -303 238 -5 -6 154 -35 -108 -46 23 135 -236 124 119
4301 119 231 -8 13 -136 -58 16 -140 72 -124 -195 36 -49 119 25 -199 154 -68 311 -191 69 129 -135
4323 -135 159 26 22 -102 41 53 18 153 -8 -167 135 106 -256 50 200 181 -8 153 -35 -67 209 -80
4345 -80 -116 159 42 -315 42 185 49 -76 5 36 -17 17 276 1 -175 -110 -63 -29 162 92 -241 48 4 -27
4369 -27 154 -162 53 72 -82 -231 133 -16 -215 210 236 93 286 -201 25 25 289 -197 -71 214 102 367
4391 367 67 -39 -39 16 -49 -120 160 348 -192 33 186 -155 -221 0 -192 42 113 9 -39 42 244 -208 84
4414 84 39 -254 119 -75 -175 123 186 -123 17 195 157 -226 149 -108 -43 88 64 -182 -211 71 -107 17
4436 17 197 17 8 69 1 -128 39 -243 -326 116 -59 -90 -175 135 150 221 225 -109 62 264 -321 -179 16 -17
4460 -17 39 330 -93 72 107 -159 -153 327 108 -217 -132 223 -236 44 173 -327 -86 217 146 -406 198 304
4482 304 -284 72 86 -129 42 170 -56 313 263 -197 -21 421 -35 -380 84 99 -264 134 244 8 137
4503 137 344 -405 -19 488 60 -309 255 -138 -365 113 -113 -352 257 211 -216 101 -8 -153 -145 116 -226
4524 -226 -61 517 -128 -341 243 187 -187 151 28 -115 39 98 -303 324 382 -579 -55 540 90 -34 -45
4545 -45 -247 6 416 123 -361 427 252 -608 216 158 -456 47 121 -362 -105 405 -398 -113 510 123 -391
4566 -391 400 166 -333 329 -283 -299 111 544 -586 -285 391 -33 -14 243 -39 -439 343 0 -319 192
4586 192 -110 -521 -116 190 72 158 189 -172 -83 210 -18 -240 442 171 -284 76 171 -71 128 249 -368
4607 -368 266 304 -170 -219 510 0 -151 271 -315 -66 393 265 -396 546 458 -464 -8 355 -186 -75 65
4628 65 -157 -126 158 -401 -146 582 291 -508 70 124 -414 173 -73 -425 153 347 -473 -206 414 -248 -210
4649 -210 150 -8 -168 389 -14 -460 134 -28 -324 220 137 -89 -253 179 -300 104 254 -202 -328 460
4669 460 -24 -268 230 -4 -144 184 253 -347 17 390 -175 -187 486 -241 -194 -64 111 -175 240 200 -299
4690 -299 185 111 -363 48 263 -106 -37 181 -91 51 362 -28 -284 152 258 -127 210 41 -133 60 94
4711 94 -96 -7 299 -350 -152 234 91 -50 192 47 -159 17 70 -136 365 -15 -237 251 146 8 12 311
4733 311 -17 47 228 9 17 227 -53 -183 173 212 -175 -115 27 -20 84 -116 -197 -284 153 -164 -55 38 169
4756 169 -65 68 -13 -179 -161 27 -220 -198 105 -25 -178 231 16 -207 161 -83 -124 56 59 -256 76 -6
4778 -6 122 -112 66 40 -7 49 -200 -186 94 23 190 39 4 -23 -17 153 -134 86 -77 -280 -66 183 -174 -3
4802 -3 69 -167 6 49 74 -189 -29 -15 -92 81 5 -215 0 157 170 -1 44 -102 -58 -99 -98 -181 -74 -30 195
4827 195 -153 128 -287 26 93 -80 -60 47 11 -107 133 116 -468 32 -102 -13 150 132 16 -107 62 -52
4849 -52 -49 36 -85 -118 -48 -79 -196 226 -10 -316 -15 -92 -61 -145 6 7 99 -27 123 -101 -43 240 19 122 76
4874 76 -111 7 -79 -24 259 -56 -15 80 68 12 -106 9 -34 54 14 183 -57 197 -148 -154 -45 -93 -78 69 -50
4899 -50 -24 -111 -71 11 -89 240 4 -193 64 -56 -241 18 111 -37 84 20 -111 104 136 -166 -129 112 -351
4922 -351 -138 268 -24 -247 27 117 -74 135 164 -201 128 -91 -64 -173 79 -240 129 58 -127 -62 88 -98
4944 -98 -165 349 -75 -277 -144 2 -197 263 97 -145 -97 95 -3 -275 273 51 -178 183 -187 -240 189 68
4966 68 -60 -74 135 -109 -348 201 -89 -98 206 -126 -125 -21 213 -469 151 207 -207 31 172 38 -121 -50 -193
4989 -193 -312 482 -89 -170 -51 -94 -165 115 -60 -229 120 8 -249 147 143 -316 -141 147 -199 -79 166 -89
5011 -89 -144 -5 -116 -439 86 221 -129 191 62 -258 74 234 -490 41 558 -121 -276 100 169 -268 67
5032 67 -14 -221 125 215 -49 -20 337 -137 -147 216 -176 110 267 -139 -108 429 171 -580 67 279 -382 4
5054 4 104 -33 -25 294 -270 -172 369 81 -407 23 -15 -281 65 109 -84 210 120 -507 35 57 -197 -49 156
5077 156 -57 -62 204 -243 -143 465 216 -497 308 248 -254 -51 426 -159 104 258 -234 -193 288 -22 -576
5098 -576 440 -43 -143 193 254 -174 24 284 -481 132 246 -292 -419 230 -16 -122 190 -355 -283 250
5118 250 -124 -258 72 256 -235 -168 61 -129 99 335 -229 -14 334 -74 -323 294 353 -259 221 257 -125
5139 -125 106 106 -44 178 410 -171 -110 192 2 -371 186 -82 -263 255 200 -275 54 159 -335 36 143
5160 143 -148 228 333 -292 -24 159 52 -332 58 -133 -295 -83 116 -243 79 171 -157 -164 466 -280 -354
5181 -354 42 -98 -9 87 20 -292 266 200 -358 363 54 -145 34 -9 -86 -141 -93 -203 -136 410 -12 -74 -1 152
5205 152 -152 -54 67 61 -37 87 -249 -241 290 -283 -139 -27 47 -168 10 -78 -86 432 226 -303 91 248 -87
5228 -87 -45 49 -86 -313 76 -273 -151 141 -41 -391 96 123 -194 -48 190 -196 -24 38 -59 -73 298 -177
5250 -177 -117 -21 2 -139 148 43 -147 99 -24 -85 131 194 -290 14 115 -148 -161 273 20 -130 42 70
5272 70 -14 -35 -46 -85 337 -26 -131 -227 130 -187 -165 148 59 -202 204 186 -35 30 156 34 76 -126 39 -57
5296 -57 -187 -133 -204 273 213 105 247 -75 25 296 -31 -180 56 268 -101 -47 -204 1 -34 223 180 -280
5318 -280 -90 336 -24 -89 70 -201 -36 127 89 -123 49 -82 -223 93 1 -186 -185 85 -109 -154 -156 23 359
5341 359 203 -296 113 237 -267 -64 104 24 70 -95 13 157 -91 -163 81 -32 -17 42 -192 74 188 74
5363 74 -66 -79 20 94 -31 35 -4 102 -39 122 18 42 -109 256 -232 -60 173 -103 110 -25 -221 -193 117
5386 117 -2 -163 -71 -55 -92 -213 5 -172 400 78 -38 -251 246 80 74 115 23 -39 -2 -76 -137 28 -156 -377
5410 -377 54 154 -178 172 -122 -138 -77 25 -89 168 227 -107 109 -163 192 9 149 -274 -162 77 -93
5431 -93 -84 42 235 -117 -113 38 62 47 113 56 -234 -141 231 -83 -11 121 -70 -6 95 -114 169 75 -44 -2 185
5456 185 -144 -142 -116 -108 -177 247 -105 -235 102 -256 -325 -193 150 -53 -88 151 -217 -232 -44 -170 -209 78 -188
5479 -188 -330 -5 84 28 -150 -7 -190 46 131 -11 -193 -101 230 -101 -16 139 -319 28 -18 -336 17 133
5501 133 -219 -25 33 -118 -143 -70 -46 -182 3 225 -256 280 -61 51 149 261 -212 -322 47 -164 132 155
5523 155 187 -131 99 57 -32 -35 -4 -379 199 -73 -272 194 240 -190 -247 224 -104 -100 78 -112 -33 49 46 -278 19
5548 19 275 -118 176 84 69 -93 185 82 4 232 -67 -169 181 145 -237 128 -130 -280 -58 73 -348 -178
5570 -178 241 -223 -30 269 -93 55 215 234 60 328 14 -490 189 -4 105 -134 -6 -165 25 341
5590 341 -192 -236 367 -8 -138 32 25 -65 96 215 -44 69 31 -251 -12 196 -163 -67 309 -220 -132 148
5612 148 70 -94 11 -220 -361 149 167 -312 -59 192 114 -47 86 -8 -223 -54 43 23 113 219 -13 90
5634 90 125 -163 312 98 -219 67 95 -288 -56 150 -110 -251 135 12 -228 4 38 -312 215 59 8 -85
5656 -85 210 66 -141 225 -158 -244 131 106 -412 100 72 -281 -6 87 22 -81 130 -241 -4 19 17 -173 201
5679 201 11 -217 30 102 -73 -37 -20 38 -9 171 88 79 74 136 16 -116 -123 -262 -120 -6 78 217 124 84 -280
5704 -280 111 -30 -107 -171 44 -71 -131 45 -453 -40 -165 -99 27 73 -186 80 157 -11 114 19 -163 -184 148
5727 148 -205 -174 210 376 -17 174 89 -173 181 94 -100 215 110 -148 -108 318 -53 178 267 -91 -376 -5
5749 -5 -62 -427 210 226 -106 -80 321 -197 -9 171 27 13 -68 134 55 215 -89 -186 54 -283 -124 241 53
5772 53 -61 -161 25 -260 77 20 38 -74 -51 287 -265 194 214 -226 6 51 -155 56 243 -202 -94 4
5794 4 24 35 73 153 -105 -125 -181 38 71 79 27 -13 314 244 -143 205 137 82 285 -29 -70 93 -61 121 -170 -45
5820 -45 -125 27 102 -220 139 35 155 -117 32 -233 18 313 47 -245 97 -35 93 255 174 70 -217
5841 -217 265 -213 28 331 131 -189 270 124 -130 24 59 -11 131 48 -211 -87 -51 -32 -271 74 -109 105
5863 105 121 47 -6 -63 166 20 -57 238 74 43 172 178 165 -106 5 -113 80 23 102 3 -12 -28 -148 24 -160
5888 -160 6 155 -41 56 -82 -33 -67 -112 -81 -36 97 -23 10 -57 -168 -191 253 104 -76 50 295 -81 -30
5911 -30 188 -208 -114 147 58 32 222 182 -90 13 18 -216 76 105 193 -213 102 37 -184 196 -127 39 -165
5934 -165 -154 -189 88 -32 -328 -15 59 -153 -2 -43 24 -83 -159 -151 -32 -12 -153 -35 -90 -30 -464 209 134 -3
5958 -3 35 29 -130 -16 284 -303 -168 -2 -56 -148 160 67 108 -155 -66 113 238 160 -76 -3 -66 -216 -119 35 119
5983 119 -234 11 -18 -179 59 -143 -26 -96 148 -102 -61 59 -50 105 -40 -344 62 251 -20 -177 43
6004 43 -75 -177 206 84 133 213 80 -424 77 127 -137 -406 29 96 -252 286 -136 -143 253 53 -72 196
6026 196 5 17 -7 153 51 -32 63 160 -150 290 -99 -137 304 155 -64 24 28 -79 105 64 94 63 428 26
6050 26 -285 -103 41 -196 72 -188 -145 51 -131 127 157 46 -193 39 161 56 194 116 -103 -77 354 -255
6072 -255 -9 -42 -72 -168 38 36 -36 381 59 -413 -122 149 62 -93 -142 -148 14 124 -42 162 167 97 -354 62
6096 62 287 -91 -47 -30 -65 -127 184 -93 -74 130 68 -124 106 77 -47 187 81 -298 102 176 -234 278 194
6119 194 -100 306 302 4 153 144 -85 -95 160 -228 -69 55 200 -233 90 -138 3 185 303 -60 -99 284
6141 284 -207 -52 298 -48 -314 87 96 -3 182 72 120 168 337 1 -170 212 -18 -44 -96 -45 6 -37 -5 -48
6165 -48 135 326 147 -152 89 -195 -265 22 27 28 99 225 91 -141 15 -217 -128 -64 -157 -177 9 -121 136 90
6189 90 -10 -248 120 79 -99 373 112 192 109 47 -207 41 214 117 -124 66 44 -68 -136 -212 -65 156 114
6212 114 -108 14 154 -2 -81 -85 20 61 -70 -136 44 48 -59 -213 126 -12 -167 -25 -33 5 51 129 -76 114
6236 114 269 -130 117 233 13 -130 220 -14 -17 135 180 124 12 -64 -214 29 24 64 -63 113 78 76 155 115
6260 115 16 -6 217 7 -152 107 43 -92 9 -121 159 -152 286 46 3 -45 -26 150 -62 -468 -41 213
6282 213 -128 122 28 -4 -32 117 -114 -35 -154 -66 103 -14 -39 0 88 -49 -21 207 95 -96 -115 -103 -108 -71 -98
6307 -98 117 21 -142 -185 198 -77 -63 -281 9 -137 116 -24 91 22 155 12 95 -203 -47 147 95 -192
6329 -192 -102 -168 -45 177 -83 284 -21 -35 25 -46 -71 250 -215 -106 113 57 61 -73 263 -62 103 -19 -140
6352 -140 165 -67 -127 -53 -141 -14 -121 -111 44 -194 135 46 -66 132 122 -84 -52 35 29 147 241 272 126 126 -43
6377 -43 -36 -180 23 35 -55 14 -15 -158 -46 -21 -37 42 -130 108 109 26 2 -153 -169 -73 -230 -126 366 -79 29
6402 29 8 -38 250 127 15 77 166 99 29 -22 189 -88 -163 -63 -149 -35 -72 -142 -127 181 -158 -98 41 -124 -374
6427 -374 111 114 -6 206 43 76 -69 110 -100 -129 205 -12 -193 120 217 194 -84 -45 -99 -178 95 -1 46 -42
6451 -42 -19 98 190 -10 -48 141 86 241 6 -78 -171 0 22 -190 183 -133 -121 -131 -3 -231 -2 -124 -271
6474 -271 108 142 27 205 157 -27 -211 -45 -115 -256 -18 -237 -122 25 17 -18 -131 176 -16 -94 399 225
6496 225 -105 25 -79 -300 -165 -47 -52 23 -8 -142 191 41 -190 -72 116 -51 -75 165 -55 148 8 -174
6518 -174 135 -25 -105 -110 122 75 -146 49 170 123 -395 168 124 -114 -73 20 24 260 152 -57 -103 387 -168 6
6542 6 168 90 20 -52 -28 22 67 116 24 -49 76 32 -79 -88 -240 224 260 43 96 -21 -19 -68 34 -213 119 -159
6568 -159 -60 -303 -132 141 -214 37 -129 41 266 -129 -271 -33 63 11 -36 184 -63 -64 110 99 5 30 -271
6591 -271 63 203 -90 -92 0 20 -93 -27 83 -233 -21 -94 -83 72 64 -209 -202 184 -1 133 57 -2 -128 308
6615 308 36 -163 52 -82 -164 -65 191 15 -38 -19 -34 -104 56 80 -157 -194 200 -79 151 313 -76 125 27
6638 27 32 -173 123 -31 -219 -99 -137 -12 68 250 32 -210 166 -206 -5 7 8 -167 67 84 -120 100 53
6661 53 71 130 225 125 -12 54 -20 181 71 -272 36 183 -215 -385 23 -11 43 67 23 380 -27 185 -224
6684 -224 -141 187 -167 -235 19 -62 -104 198 175 -101 238 62 -118 158 69 -26 83 41 119 -260 21 124 -74
6707 -74 -13 -167 -318 -82 -40 29 -148 128 -54 -173 9 -150 131 279 -53 32 -152 46 20 -13 133 -8
6729 -8 -136 -92 -140 54 -101 -122 -24 -64 20 6 -16 -42 -107 -66 -236 -142 93 183 -95 15 51 177 130 97 65 134 176
6756 176 93 50 210 12 -95 -17 45 139 -193 -19 57 77 -50 81 119 19 312 67 -32 111 -124 42 227
6779 227 -264 47 74 140 304 161 21 125 -77 -140 1 -158 -170 -8 -8 29 156 -117 125 49 -112 -136 54
6802 54 -183 -181 -193 -275 71 105 45 -209 -238 -74 -21 -174 52 68 46 -42 138 -52 65 56 75 -1 75 105 -321 147
6828 147 -144 -37 -64 -297 179 -87 27 1 -88 -141 -201 -89 -103 67 12 -151 1 48 111 65 124 -247 191 88
6852 88 -159 218 120 -15 -166 106 -164 -146 61 -67 -124 22 19 59 -41 260 46 -304 -359 1 137 213 -144
6875 -144 -7 121 178 -143 -321 -36 12 -87 -210 62 -275 179 -147 240 57 -182 -40 128 0 -74 152
6896 152 87 -4 89 -69 -88 -30 74 106 60 108 -24 -17 -109 -334 -52 50 6 33 -29 101 -120 -75 -48 133 122 -51
6922 -51 214 -80 134 -105 -85 -35 60 -66 -141 -85 90 126 78 -37 415 -191 78 164 -42 -149 -191 -99 -261 70
6946 70 149 -45 85 62 -47 68 -219 34 -151 7 -74 -43 -116 143 58 42 -23 -86 37 21 -22 103 137 26
6970 26 -260 -37 95 35 76 -64 -70 122 -220 -17 10 -91 54 11 -118 163 27 -186 -171 -268 59 36 17 124
6994 124 -36 16 -234 41 43 -146 74 30 2 -60 -72 -62 -57 246 50 -59 136 71 -26 234 -57 275 20 -7
7018 -7 -265 251 -149 46 44 250 -40 75 126 -191 78 -279 4 58 -42 -79 135 112 96 -262 76 -111 -149
7041 -149 179 177 -179 -48 141 149 126 20 286 -222 8 -89 -19 -58 -83 -110 182 -305 246 -211 -116 87 121 161
7065 161 -171 95 142 -29 13 107 -175 45 27 84 -120 133 26 -159 -177 159 -15 -35 -45 -232 -113 242 -59
7088 -59 -42 49 16 67 170 211 14 -172 183 -107 74 191 95 6 -254 225 -35 -25 -51 -171 -247 -154 -45 287
7112 287 23 -86 132 26 -162 106 68 43 58 -108 -62 194 90 75 62 -172 239 58 29 -44 -78 313 24
7135 24 51 -121 73 -116 -156 118 61 -222 -66 80 133 49 -30 6 -185 -106 112 100 176 105 -311 -172 254 -86
7159 -86 -182 -11 -93 -70 -116 -183 -41 123 180 41 -205 286 -123 158 -47 -192 67 -169 -103 263 162 -22 -80
7182 -80 -176 137 32 90 -8 199 121 75 -36 -310 -13 -24 75 99 -189 46 59 13 71 -53 35 105 119 -24 -131
7207 -131 127 90 -18 -57 80 93 -189 59 50 221 151 180 -136 -133 -58 -194 57 -52 37 69 -58 -23 -71 -135 -72
7232 -72 -239 36 -26 -14 31 111 -134 -133 40 -332 -205 78 -53 56 103 90 39 164 -74 -107 164 25 -93 96
7256 96 77 -182 154 66 -70 -82 -97 80 23 103 43 -44 -165 91 127 -143 -234 132 -122 -143 -18 10 75 78 -222
7281 -222 26 -103 -68 -151 74 230 40 120 -86 -132 137 -53 -128 -170 -170 -142 94 -9 -98 92 32 39 52 -315 150
7306 150 26 2 279 -153 -214 -11 52 -96 141 -104 331 -111 341 93 23 120 -69 73 -108 -256 -58 -5
7328 -5 127 81 -88 146 -117 -61 97 -198 114 -21 21 129 -17 54 -8 43 95 180 -53 -375 -64 -1 65 -227
7352 -227 75 73 5 -71 -46 45 -57 65 61 -102 -107 219 -124 -125 225 214 -223 -132 -188 1 44 280 10 -107 -194 -154
7378 -154 110 21 36 -96 59 362 271 -31 -54 -165 107 70 -197 165 44 -9 206 10 -48 24 -11 -82 -54 56
7402 56 111 -30 83 -73 -27 22 59 17 115 1 -66 -125 -338 62 99 153 236 -7 2 81 24 298 -21 261 -144
7427 -144 198 61 -289 60 67 -72 -7 -60 -8 30 40 -299 -152 129 112 -65 -58 47 132 282 37 -111 123 -16
7451 -16 22 -188 -80 20 123 114 -92 -118 -101 -17 -69 -32 -41 59 116 112 90 156 23 55 -224 136 -58 -59 -91 -99 45
7478 45 95 -288 -98 92 -167 -70 -44 29 -98 44 63 -288 -73 -10 -11 -123 -98 -39 80 71 437 217 -30 -1 21
7503 21 -31 -89 -71 -78 -180 -188 202 7 -181 21 25 -39 29 101 -15 62 42 204 70 138 13 53 162 -69 59 -116
7529 -116 134 88 188 32 53 -87 -169 6 263 -39 -86 -56 -126 86 -169 -118 -173 313 69 152 -350 69 54
7552 54 166 140 -165 -101 -155 -108 166 -130 -209 -79 -3 10 -197 11 23 147 22 75 -247 -207 -140 -27 19 -324
7576 -324 222 155 131 244 42 5 25 120 -37 -35 140 -97 -153 -40 85 24 82 225 -344 197 133 72 -48 -65
7600 -65 195 61 11 130 -21 -270 232 -33 31 -48 74 -48 -295 -72 23 46 59 -47 -190 -101 35 -95 24
7623 24 -125 -112 -148 182 -131 16 117 148 -62 47 75 73 63 -60 135 129 -158 -59 115 60 30 28 -25 7 -66 91
7649 91 0 235 -218 -136 37 -10 155 -13 41 187 95 -16 -90 126 56 -23 -6 -14 323 -6 -170 140 -72 -140
7673 -140 59 51 -117 233 -130 94 46 -62 -98 11 -130 12 -24 141 -199 -160 203 -85 -40 -174 34 54 82
7696 82 21 -306 163 83 -257 177 -184 6 -192 -165 -88 -168 -132 94 40 53 -73 -172 -152 92 22 -92 -102 193
7720 193 -120 -87 52 -53 105 -120 -28 -142 135 -199 -176 -18 -52 -32 127 180 62 -203 179 148 138 17 -191
7743 -191 -97 85 -200 -250 24 8 -115 -76 -74 -212 -171 327 -137 -26 105 29 -322 154 256 15 82 118 178 -140
7767 -140 88 -153 49 30 -38 -40 59 12 120 -59 -41 -123 -194 -135 -9 -98 -173 16 170 132 -246 81 15 5 79
7792 79 -96 -92 -4 125 41 -101 -127 -21 -9 -184 -353 215 -165 102 69 67 -115 116 157 -5 -85 42 44 216 153
7817 153 9 18 40 96 -203 -165 149 -46 -157 -28 72 -231 0 112 138 113 11 -37 -279 29 -227 105 -68
7840 -68 -96 -42 112 53 50 -65 77 -50 -362 138 -95 -226 -267 -187 110 45 48 -118 64 -195 74 113 5 151
7864 151 169 -63 -82 -132 75 168 197 134 -130 174 -168 84 86 39 -52 -96 -55 -7 -46 -44 -7 99 129 -126 -211 95
7890 95 109 -15 -44 -138 -6 -164 25 87 5 0 83 21 145 118 55 418 165 15 81 102 -104 36 90 -7 32 184
7916 184 112 -25 159 -80 -65 -316 -82 -54 139 -21 253 239 -7 -59 -22 -113 -50 142 385 -27 -188 65 -196
7939 -196 -39 187 -128 42 64 -57 -47 -8 22 237 117 -209 -110 -214 -2 -28 83 -76 12 -31 102 -49 89
7962 89 249 126 0 -75 95 -10 -181 311 -171 -23 188 36 -174 -38 -42 66 -215 42 119 -76 -155 132
7984 132 17 -3 -52 -305 133 -186 17 156 51 -73 115 -49 34 -43 -24 -28 -26 -9 -20 -163 -24 -15 197 34
8008 34 -234 -123 -4 112 -115 93 207 74 -8 51 -11 -15 -76 -122 118 63 -10 -349 -42 -138 63 120 27 16 -323
8033 -323 -22 -341 -129 -69 80 119 -156 60 -136 26 -31 46 65 -95 75 -38 -124 -61 4 15 60 -89 -117 37
8057 37 -200 -200 -102 16 45 68 91 118 -191 -105 -70 67 -70 -24 143 -22 317 123 -63 -212 -57 -41 28 -11 132
8082 132 116 -238 46 -170 -118 30 -43 -149 -86 6 -20 203 87 -109 -256 186 11 154 -81 -175 24 96 137
8105 137 62 62 -179 -48 -38 64 -39 8 -41 41 -33 90 -61 -129 47 32 -208 -142 26 217 120 251 -156 -22
8129 -22 -20 -7 -127 -30 57 -113 -78 -20 79 137 -20 76 48 88 -50 96 -17 -150 -74 -77 -5 265 -203 59 -26 4
8155 4 44 106 -53 -176 10 -56 -22 -122 -7 58 -101 79 -33 -69 -93 -211 -247 -213 5 164 158 -101 -5 49 19
8180 19 -67 31 77 -256 -208 -170 74 239 -96 -57 209
8191B09
##END NTUPLES=NMR FID
##END=
