##TITLE=1H_UK_26_2_5
 CD2Cl2
 8 sc, 
 7.04.2022
##JCAMPDX= 6.0         $$ Bruker NMR JCAMP-DX V2.0
##DATA TYPE= NMR FID
##DATA CLASS= NTUPLES
##ORIGIN= UXNMR, Bruker Analytische Messtechnik GmbH
##OWNER= root
$$ XWIN-NMR		Version 3.5
$$ Thu Apr  7 11:16:31 2022 Russian Standard Time (UT+4h)  she@DPX200
##.OBSERVE FREQUENCY= 200.13135
##.OBSERVE NUCLEUS= ^1H
##.DELAY= (6, 6)
##.ACQUISITION MODE= SIMULTANEOUS
##.ACQUISITION SCHEME= undefined
##.AVERAGES= 8
##.DIGITISER RES= 18
##SPECTROMETER/DATA SYSTEM= spect
##.PULSE SEQUENCE= zg30
##.SOLVENT NAME= CD2Cl2
##.SHIFT REFERENCE= (INTERNAL, CD2Cl2, 0, 15.7039)
##AUDIT TRAIL= $$ (NUMBER, WHEN, WHO, WHERE, WHAT)
$$ ##TITLE= Audit trail, XWIN-NMR		Version 3.5
$$ ##JCAMPDX= 5.01
$$ ##ORIGIN= Bruker BioSpin GmbH
$$ ##OWNER= she
$$ F:/spectra/data/she/nmr/H-F/1/audita.txt
$$ ##AUDIT TRAIL=  $$ (NUMBER, WHEN, WHO, WHERE, WHAT)
(   1,<2022-04-07 11:15:28.32 +0400>,<she>,<DPX200>,
      <created by zg, POWCHK disabled, PULCHK disabled
       configuration hash MD5:
       00 E9 B6 7A A2 85 ED C7 34 08 36 98 17 FE 4E 26
       data hash MD5: 16K
       B7 FA 9B 01 4D 8A 14 0A 9C 5F 69 30 5D 18 15 21>)
$$ ##END=
$$ 
$$ hash MD5
$$ 6F 65 28 F2 B8 BD 51 56 4D 64 6C 6B 39 52 D4 D1
##$RELAX= 
##$RELAX= 
##$RELAX= 
##$RELAX= 
##$RELAX= 
##$RELAX= 
$$ Bruker specific parameters
$$ --------------------------
##$DU= <F:/spectra>
##$EXPNO= 1
##$NAME= <H-F>
##$PROCNO= 1
##$TYPE= <nmr>
##$USER= <she>
##$AMP= (0..31)
100 100 100 100 100 100 100 100 100 100 100 100 100 100 100 100 100 100 
100 100 100 100 100 100 100 100 100 100 100 100 100 100 
##$AQSEQ= 0
##$AQ_mod= 1
##$AUNM= <au_zg>
##$AUTOPOS= <>
##$BF1= 200.13
##$BF2= 200.13
##$BF3= 200.13
##$BF4= 200.13
##$BF5= 200.13
##$BF6= 200.13
##$BF7= 200.13
##$BF8= 200.13
##$BYTORDA= 1
##$CFDGTYP= 0
##$CFRGTYP= 5
##$CHEMSTR= <none>
##$CNST= (0..31)
1 1 145 1 1 1 1 1 1 1 1 1 1 1 1 1 1 1 1 1 1 1 1 1 1 1 1 1 1 1 1 1 
##$CPDPRG= <>
##$CPDPRG1= <>
##$CPDPRG2= <>
##$CPDPRG3= <>
##$CPDPRG4= <mlev>
##$CPDPRG5= <mlev>
##$CPDPRG6= <mlev>
##$CPDPRG7= <mlev>
##$CPDPRG8= <mlev>
##$CPDPRGB= <>
##$CPDPRGT= <>
##$D= (0..31)
0 1.2 0 0 0 0 0 0 0 0.06 0 0.03 0 0 0 0 0.0002 0 0 0 0 0 0 0 0 0 0 0 0 
0 0 0 
##$DATE= 1649315727
##$DBL= (0..7)
120 120 120 120 120 120 120 120 
##$DBP= (0..7)
150 150 150 150 150 150 150 150 
##$DBP07= 0
##$DBPNAM0= <>
##$DBPNAM1= <>
##$DBPNAM2= <>
##$DBPNAM3= <>
##$DBPNAM4= <>
##$DBPNAM5= <>
##$DBPNAM6= <>
##$DBPNAM7= <>
##$DBPOAL= (0..7)
0.5 0.5 0.5 0.5 0.5 0.5 0.5 0.5 
##$DBPOFFS= (0..7)
0 0 0 0 0 0 0 0 
##$DE= 6
##$DECBNUC= <off>
##$DECIM= 32
##$DECNUC= <off>
##$DECSTAT= 4
##$DIGMOD= 1
##$DIGTYP= 9
##$DL= (0..7)
0 120 120 120 120 120 120 120 
##$DP= (0..7)
150 150 150 150 150 150 150 150 
##$DP07= 0
##$DPNAME0= <>
##$DPNAME1= <>
##$DPNAME2= <>
##$DPNAME3= <>
##$DPNAME4= <>
##$DPNAME5= <>
##$DPNAME6= <>
##$DPNAME7= <>
##$DPOAL= (0..7)
0.5 0.5 0.5 0.5 0.5 0.5 0.5 0.5 
##$DPOFFS= (0..7)
0 0 0 0 0 0 0 0 
##$DQDMODE= 0
##$DR= 18
##$DS= 0
##$DSLIST= <SSSSSSSSSSSSSSS>
$$ [...]
##$SUBNAM2= <"">
##$SUBNAM3= <"">
##$SUBNAM4= <"">
##$SUBNAM5= <"">
##$SUBNAM6= <"">
##$SUBNAM7= <"">
##$SUBNAM8= <"">
##$SUBNAM9= <"">
##$SW= 18.05172834244
##$SWIBOX= (0..15)
0 0 2 0 0 0 0 0 0 0 0 0 0 0 0 0 
##$SW_h= 3612.71676300578
##$TD= 16384
##$TD0= 1
##$TE= 0
##$TE2= 300
##$TE3= 300
##$TEG= 300
##$TL= (0..7)
0 120 120 120 120 120 120 120 
##$TP= (0..7)
150 150 150 150 150 150 150 150 
##$TP07= 0
##$TPNAME0= <>
##$TPNAME1= <>
##$TPNAME2= <>
##$TPNAME3= <>
##$TPNAME4= <>
##$TPNAME5= <>
##$TPNAME6= <>
##$TPNAME7= <>
##$TPOAL= (0..7)
0.5 0.5 0.5 0.5 0.5 0.5 0.5 0.5 
##$TPOFFS= (0..7)
0 0 0 0 0 0 0 0 
##$TUNHIN= 0
##$TUNHOUT= 0
##$TUNXOUT= 0
##$USERA1= <user>
##$USERA2= <user>
##$USERA3= <user>
##$USERA4= <user>
##$USERA5= <user>
##$V9= 5
##$VALIST= <valist>
##$VCLIST= <CCCCCCCCCCCCCCC>
##$VD= 0
##$VDLIST= <DDDDDDDDDDDDDDD>
##$VPLIST= <PPPPPPPPPPPPPPP>
##$VTLIST= <TTTTTTTTTTTTTTT>
##$WBST= 1024
##$WBSW= 4
##$XGAIN= (0..3)
0 0 0 0 
##$XL= 0
##$YL= 0
##$YMAX_a= 518317
##$YMIN_a= -549310
##$ZGOPTNS= <>
##$ZL1= 120
##$ZL2= 120
##$ZL3= 120
##$ZL4= 120
##$ABSF1= 10
##$ABSF2= 0
##$ABSG= 5
##$ABSL= 3
##$ALPHA= 0
##$AQORDER= 0
##$ASSFAC= 0
##$ASSFACI= 0
##$ASSFACX= 0
##$ASSWID= 0
##$AUNMP= <proc_1d>
##$AZFE= 0.1
##$AZFW= 0.1
##$BCFW= 1
##$BC_mod= 2
##$BYTORDP= 1
##$COROFFS= 0
##$CY= 11.3945322036743
##$DATMOD= 1
##$DC= 2
##$DFILT= <>
##$DTYPP= 0
##$F1P= 2.36226072786647
##$F2P= -0.459571619588291
##$FCOR= 0.5
##$FTSIZE= 0
##$FT_mod= 4
##$GAMMA= 1
##$GB= 0.15
##$INTBC= 1
##$INTSCL= 1
##$ISEN= 128
##$LB= 0.24
##$LEV0= 0
##$LPBIN= 0
##$MAXI= 10000
##$MC2= 0
##$MEAN= 0
##$ME_mod= 0
##$MI= 1.114404
##$NCOEF= 0
##$NC_proc= 0
##$NLEV= 6
##$NOISF1= 3.799351
##$NOISF2= 2.8
##$NSP= 1
##$NTH_PI= 0
##$NZP= 0
##$OFFSET= 15.70392
##$PC= 1
##$PHC0= -18033.63
##$PHC1= 15.80078
##$PH_mod= 1
##$PKNL= yes
##$PPARMOD= 0
##$PSCAL= 0
##$PSIGN= 0
##$REVERSE= no
##$SF= 200.130013532006
##$SI= 16384
##$SIGF1= 3
##$SIGF2= 2
##$SINO= 400
##$SIOLD= 16384
##$SREGLST= <1H.CDCl3>
##$SSB= 0
##$STSI= 0
##$STSR= 0
##$SW_p= 3612.71676300578
##$SYMM= 0
##$S_DEV= 0
##$TDeff= 0
##$TDoff= 0
##$TI= <>
##$TILT= no
##$TM1= 0
##$TM2= 0
##$TOPLEV= 0
##$USERP1= <user>
##$USERP2= <user>
##$USERP3= <user>
##$USERP4= <user>
##$USERP5= <user>
##$WDW= 1
##$XDIM= 8192
##$YMAX_p= 0
##$YMIN_p= 0
$$ End of Bruker specific parameters
$$ ---------------------------------
##NTUPLES= NMR FID
##VAR_NAME=  TIME,          FID/REAL,        FID/IMAG
##SYMBOL=    X,             R,               I
##VAR_TYPE=  INDEPENDENT,   DEPENDENT,       DEPENDENT
##VAR_FORM=  AFFN,          ASDF,            ASDF
##VAR_DIM=   8192,          8192,            8192
##UNITS=     SECONDS,       ARBITRARY UNITS, ARBITRARY UNITS
##FACTOR=    0.0002768,     1,               1
##FIRST=     0,             0,               0
##LAST=      2.2672688,     0,               0
##MIN=       0,             -549310,         0
##MAX=       2.2672688,     518317,          0
$$ Real data points
##PAGE= N=1
##DATA TABLE= (X++(R..R)), XYDATA
0@%%%%%%%JrJ6j6J6k4L2m0M9n7P3r7J20j42J70k04K41k82L30l85M48n18N97o83
$$ 0 0 0 0 0 0 0 0 1 -8 8 -8 8 -16 16 -24 25 -32 41 -56 64 -78 92 -112 129 -153 177 -208 240 -278 319 -364
31c64P80q88J008j140J285j445J622j816K027k262K517k792L094l426L789m185
$$ -364 416 -472 536 -604 681 -764 858 -958 1069 -1193 1324 -1468 1626 -1800 1989 -2196
47b196M617n088N606o177O804p496Q265r123J0089j1181J2425j3858J5532j7519
$$ -2196 2421 -2667 2939 -3238 3566 -3930 4335 -4788 5301 -5880 6545 -7313 8219 -9300
61i300J9921k2894K6682l1700L8702m9222O6979j04493L18626l97935k63181Q32991
$$ -9300 10621 -12273 14409 -17291 21411 -27811 39168 -65325 253301 -144634 -407815 425176
73D25176l08138l07138L39041j72448k15148N85084k40875o04464N75971L82484
$$ 425176 117038 -190100 148941 -23507 -238655 346429 105554 -498910 77061 459545
83D59545p26142r852M96601k10581j09742J98924l03659O3780M87708l49279m12677
$$ 459545 -266597 -276449 220152 9571 -100171 98753 -204906 -141126 346582 -2697 -415374
94d15374N28489J63395m35707O3318J62302j24740J66511k3404l54122K70616
$$ -415374 113115 276510 -159197 -95879 66423 -58317 108194 84790 -269332 1284
104A284L45065m41436j55959M19076m0450j93327J09949j27531o853L45462k26474
$$ 1284 346349 -95087 -251046 168030 127580 -65747 44202 -83329 -90182 255280 28806
115B8806l74474M23399K07419m49774L1985K74195j72474L2908J21278l10799
$$ 28806 -345668 77731 285150 -164624 -132639 141556 -30918 1990 123268 -187531
125a87531Q9433M08969l44638l03467M73128P2633l78045J43531J16861j91366
$$ -187531 -98098 310871 -33767 -337234 135894 208527 -169518 -25987 90874 -100492
135a00492J97811N8073l92635J76562L73436l77331j90137M02321m7497k38989
$$ -100492 97319 155392 -237243 -60681 312755 -64576 -254713 147608 100111 -138878
145a38878J87265l4355j48771K77532l3857l70627K40706K76970l52530p8441
$$ -138878 48387 14032 -134739 142793 108936 -261691 -20985 255985 -96545 -174986
155a74986K92449j00865q7079J64488j41333o9664K92679j01395k90007K43770
$$ -174986 117463 16598 -70481 94007 -47326 -116990 175689 74294 -215713 28057
165B8057J56607k71143P222J58514j06642K9390R0985j85925K3179K39583j47710
$$ 28057 184664 -86479 -79257 79257 -27385 2005 92990 -92935 -69756 169827 22117
176B2117j77495J96723M4630j47603N3481J4891p0073J17611Q69j75260J03817
$$ 22117 -155378 41345 85975 -61628 -8147 6744 -63329 54282 55151 -120109 -16292
187a6292J43700j59884m7592J28006m5043k5568O7344r4904j2304J65026p8705
$$ -16292 127408 -32476 -80068 47938 2895 -22673 44671 -50233 -62537 102489 23784
198B3784j40442J52831N4924j46459M5217O1801r7544N3607O3609j47150K3742
$$ 23784 -116658 36173 91097 -55362 -10145 51656 -45888 7719 71328 -75822 -52080
209e2080J64096j14735r9479J56839J180j16278P9475J7211j01047Q3711M8244
$$ -52080 112016 -2719 -102198 54641 55821 -60457 19018 36229 -64818 18893 67137
220F7137j44114L5160J31012j02400n9766J19633k0056p0723P1456r731p0591
$$ 67137 -76977 -41817 89195 -13205 -72971 46662 26606 -44117 27339 17608 -52983
231e2983P5997K0135j02101L7460P7558o9914k2129O4915k3200k2150M1630k6670
$$ -52983 23014 43149 -58952 -21492 56066 -13848 -35977 28938 5738 -16412 25218 -1452
243a452k7254N1253q768m9330L3064K3955l4763Q057J7761j8089J2873J1549l1901
$$ -1452 -28706 22547 13779 -35551 -2487 21468 -13295 -5238 12523 -5566 7307 18856 -13045
256a3045O425K7430k5373j2097K4838r021r268K0834r581j1004K6310n674k7036
$$ -13045 -6620 20810 -4563 -16660 8178 -843 -10111 10723 1142 -9862 16448 10774 -16262
269a6262J9611R599k7635O953J5272k0631M405K1437j8666m237K7453j1196j8789
$$ -16262 3349 12948 -14687 -7734 7538 -13093 -8688 12749 -5917 -10154 17299 6103 -12686
282a2686K1147O31k2953J2536R234k0415O372J7823j5984k270K1257r096j4497
$$ -12686 8461 9092 -13861 -1325 7909 -12506 -6134 11689 -4295 -6565 14692 5596 -8901
295h901J6586J572j9326P202J0768j5150r93J5815o251q012J3869J814j4852N475
$$ -8901 7685 9257 -10069 -2867 7901 -7249 -8242 7573 1322 -6690 7179 8993 -5859 -384
309c84R016j3579m634J3544m806j1146J2275O444j2228M110J2485j0643p357J2882
$$ -384 8632 -4947 -9581 3963 -843 -11989 286 6730 -5498 -1388 11097 454 -6903 5979
323E979k540j4379R133P806j3749J729J6433p121q667J4826J288j6427O186R998
$$ 5979 3439 -10940 -1807 5999 -7750 -6021 10412 3291 -5376 9450 10738 -5689 497 10495
337A0495j5832m961J6962o062j4345J6883Q234j8716N041J7826j6591r172J9973
$$ 10495 -5337 -10298 6664 602 -13743 3140 11374 -7342 -2301 15525 -1066 -10238 9735
350I735p976j9530J8739P088k5346R936K3507k1316o553K7334j0377j9345K1654
$$ 9735 1759 -17771 968 8056 -17290 -7354 16153 -5163 -11716 15618 5241 -14104 7550
363G550P10k4243J6096J2677k5394N719K4542j7207q876K1347o296j2733J3262
$$ 7550 8260 -15983 113 12790 -12604 -6885 17657 450 -8426 12921 6625 -6108 7154
376G154m916j2412J4912l43j7495J1836J0326j2298K799M386r253J0799K076k3495
$$ 7154 2238 -10174 4738 4395 -13100 -1264 9062 -3236 -437 3949 -5304 5495 7571 -15924
390a5924J0174K0529k4304n355K5171j0982o277K2941j9207j3529M1220j2392
$$ -15924 -5750 14779 -9525 -14880 10291 -691 -6968 15973 -3234 -16763 24457 12065
402A2065m5804L7149K2899m8955J0030L2926l4427Q137L7748m7617r374O8665
$$ 12065 -33739 3410 26309 -22646 -12616 20310 -14117 -5980 31768 -15849 -25223 43442
414D3442l2836n6794O1423J4392o1096K9699K3050n1218L5095L7502p8052R155
$$ 43442 10606 -46188 15235 29627 -31469 -1770 21280 -29938 5157 42659 -35393 -26238
426b6238Q5700n7890n3299P6815m393n4741M8470m628n3979O9562K0001j01250
$$ -26238 59462 1572 -51727 25088 20695 -34046 14424 9796 -44183 25379 45380 -55870
438e5870L7063Q6995p9144l4117P4658k7621k7583N7288m4201m0303J00672r958
$$ -55870 -18807 68188 -10956 -45073 29585 1964 -25619 31669 -12532 -52835 47837 37879
450C7879j07910O4769O7498q3144k775M8549m6477J9962M9789q8512o053J18716
$$ 37879 -70031 -5262 62236 -20908 -23683 24866 -21611 -1649 48140 -40372 -46425 72291
462G2291n0209q9867Q4910K5018o5421L5203m572n6939Q2670K0984j30220M2988
$$ 72291 22082 -67785 17125 42143 -23278 11925 7353 -49586 33084 54068 -76152 -33164
474c3164J17564r1157m9568Q8523k7107k4046O8298p2140n0093J43282j8732j55108
$$ -33164 84400 -6757 -56325 32198 5091 -18955 49343 -22797 -72890 70392 51660 -103448
486a03448R0629R7732j14178k769O9455o9810L0164Q1759j32842k7856J80139
$$ -103448 -12819 84913 -29265 -32034 37421 -32389 -2225 79534 -53308 -81164 98975
497I8975n8503j50827J17128O1057j05044L9855K4569r0837R0203O7797j74831
$$ 98975 40472 -110355 6773 67830 -37214 2641 27210 -63627 26576 94373 -80458
508h0458R170J82461r0336j14906J15820R719o2383P3038m3267q4260J47004K6636
$$ -80458 -71288 111173 20837 -94069 21751 31470 -30913 42125 -1142 -85402 61602 88238
520H8238j90920N6456J48234j08016n0312Q3788m5960Q718Q7735j18504n1990
$$ 88238 -102682 -46226 102008 -6008 -56320 27468 -18492 -9774 77961 -40543 -92533
531i2533J87434l0049j74937R6088Q7361j01312J9234K6948q4677Q8304P6942
$$ -92533 94901 64852 -110085 -13997 73364 -27948 -8714 18234 -66443 21861 98803
542I8803j78267l047J96892p8505j30730J10053J8680o4656P2635m3398r5276
$$ 98803 -79464 -82511 114381 35876 -94854 15199 33879 -30777 41858 -1540 -96816
553i6816J54910M4144k05132M4692J70858j05284o8982R2144m3514o462J00137
$$ -96816 58094 102238 -102894 -58202 112656 7372 -61610 30534 -12980 -19442 80695
564H0695j12142p8866J95539m89j96186Q2680J15849j06013K61M9030q9696O0085
$$ 80695 -31447 -110313 85226 84737 -111449 -28769 87080 -18933 -18672 30358 -59338 747
576G47J02865j64796m2851K04373m5023j53998J00355M7395p9328N9446j1541
$$ 747 103612 -61184 -104035 100338 55315 -98683 1672 49067 -30261 29185 17644
587A7644j07974J20408P6700j88500L242J76710p4451q9836Q7516j7717k7010
$$ 17644 -90330 30078 106778 -81722 -78480 98230 23779 -66057 21459 3742 -23268
598b3268R0826p5481r2862J57294L1343j76971M3809J20829p9990j9189M9391
$$ -23268 67558 -7923 -100785 56509 87852 -89119 -45310 75519 -4471 -23660 25731
609B5731o6193L6099R4029j26065n6712J67412j6996j38783P0731N1964o5498
$$ 25731 -40462 -4363 89666 -36399 -93111 74301 57305 -81478 -10747 41217 -24281
620b4281M3229J534r3733R0825P8392j54939j3952J52294n5127q4968P7657j1654
$$ -24281 18948 20482 -73251 17574 95966 -58973 -72925 79369 24242 -60726 16931 5277
632E277l7255Q5599m5633r7011J25661M9478j53843K1762J13900p0664k9337O1274
$$ 5277 -31978 53621 7988 -89023 36638 86116 -67727 -45965 67935 -2729 -32066 29208
644B9208n4939J886R5264q0346p3674J31146J4188j23644M3112O1158o0724J6874
$$ 29208 -25731 -23845 71419 -8927 -82601 48545 62733 -60911 -17799 43359 -17365 -491
656d91K4949p2111M1617P6841r7314l5617J11802j7967p4809M7299P659l4140
$$ -491 24458 -47653 -6036 70805 -26509 -62126 49676 31709 -43100 4199 11858 -22282
668b2282M9295j6783o8766P1500M5565r6251K780P8655l9265k5194M0456l4117
$$ -22282 27013 10230 -58536 12964 58529 -37722 -34942 43713 4448 -20746 19710 -14407
680a4407m625O3962m7920n4432Q4509J3904q1328K9934M1830m5330J3792K5018
$$ -14407 -19032 44930 -2990 -57422 27087 40991 -40337 -10403 31427 -13903 -111 24907
692B4907n5791K0125N9888o3448l2002P8523j0647n5503M0137R905l7238L5493
$$ 24907 -30884 -10759 49129 -14319 -46321 32202 21555 -33948 6189 16094 -21144 14349
704A4349N046n6113L5440M2636o2273r188N8390k3020k6803L5590j2598j9482
$$ 14349 19395 -36718 -1278 41358 -20915 -30103 28287 5267 -21536 14054 1456 -18026
716a8026M0448j2246m2858L9748K1648m9418O004L4251k4212l947K2793k2075
$$ -18026 22422 10176 -32682 7066 28714 -20704 -14700 19551 -4661 -8608 14185 -7890
728g890l174L3672k0830k5435L3726M569l0272J2708J2063j7322R537Q526k1284
$$ -7890 -11064 22608 1778 -23657 10069 14638 -15634 -2926 9137 -8185 1352 9878 -11406
741a1406Q575J9917k0957p948K1530p106j1318J2552m326p370J5238m054j4421
$$ -11406 -2831 17086 -3871 -11819 9711 2605 -8713 3839 -487 -7857 7381 3327 -11094
754a1094J5601N689j7715N574R884j3177K410R892j3540R37J6379j2317q396J8241
$$ -11094 4507 10196 -7519 -1945 7939 -5238 -2828 7064 -6476 -5539 10840 -1477 -9873 8368
768H368k663j4609J1990L491j4488P861P585j5289K654J4804j2149n933J6050
$$ 8368 5705 -8904 3086 6577 -7911 -50 7535 -7754 -5100 9704 -2445 -8378 7672
781G672l452j1977J1148K910j2800N299P741j0872o13J0690n472o302R157J025
$$ 7672 4220 -7757 3391 6301 -6499 -1200 6541 -4331 -4944 5746 274 -6028 3129 4154
795D154q131L661M911p086j009O508k931m449N650J705n735K007N178m325k059
$$ 4154 -3977 -316 4595 -2491 -3500 3008 77 -4372 1278 2983 -2752 -745 4433 108 -1951
810a951N143j081n780L342K694m917L90N261k716k735N059L0n024K440L133n047
$$ -1951 3192 2111 -3669 -327 2367 -2550 -2160 3101 385 -2350 2709 2739 -2285 155 3288 -1759
826a759j296N284k501l791M989J439m847K316L667m139j397N113k702m318M897
$$ -1759 -3055 2229 -272 -4063 926 2365 -2482 -166 3501 -638 -2035 3078 376 -3942 955
841I55Q69n846K843N008n337o60O599l601l803O029r55o532N103L241p860K107
$$ 955 1824 -4022 -1179 3829 -1508 -2168 4431 830 -2973 3056 2101 -4431 672 3913 -3947 -1840
857a840O144n813j020P077m413l527P333k533p082O781K417q013L243N260o063
$$ -1840 4304 -1509 -2529 4548 135 -3392 3941 1408 -5674 1107 3524 -4489 -1246 4014 -2049
872b049J056N208n805m36P133o023m129Q181j738n601M870L96l788N782j267o953
$$ -2049 -993 4215 -1590 -2026 5107 -916 -5045 3136 1398 -4203 667 1063 -2725 3057 1790 -5163
888e163P612L245j0523K801O368p419K312M918j0163L907J2311j3094n900J8002
$$ -5163 2449 5694 -4829 -2028 4340 -3079 -767 4151 -6012 -2105 10206 -2888 -8788 9214
902I214m301j4311J2980R45j3396J3461K906k1918J4249J8329k6800l427K7757
$$ 9214 4913 -9398 3582 4527 -8869 4592 7498 -14420 -171 18158 -8642 -12069 15688
915A5688j3533j5005K1734p208j5976K5688l248l0700K5495J9091l6440K389L0206
$$ 15688 2155 -12850 8884 1676 -14300 11388 8140 -22560 2935 22026 -14414 -12025 18181
928A8181k0324q452K3675j7786r834L3800j4722l1396L5296J3220l8333R834K2252
$$ 18181 -2143 -10595 13080 -4706 -14540 19260 4538 -26858 8438 21658 -16675 -6841 15411
941A5411k2561N943J5304k9443O403L5292l0089k2316M0663q19k9561J8787K540
$$ 15411 -7150 -1207 14097 -15346 -8943 26349 -3740 -26056 14607 13788 -15773 3014 5554
954E554j8136K5500j932l9073K7809L0173m4249o026L9123j6726j2144K3631k2137
$$ 5554 -12582 12918 10986 -28087 -278 29895 -14354 -20380 18743 2017 -10127 13504 -8633
967h633p438M4905k3149m3482M8758J9540n3372J1748K9503k8932J0623K1345
$$ -8633 -16071 28834 5685 -37797 10961 30501 -22871 -11123 18380 -10552 71 21416
979B1416m6112J0194N6881m5749l8308O2453K614m8595K6885Q306l1095L6886
$$ 21416 -24696 -14502 42379 -3370 -41678 20775 23389 -25206 1679 9985 -21110 15776
991A5776O556o2330L2952N6501o2895k3347O2610j4866l0041L3702j9026k0985
$$ 15776 22332 -39998 -7046 49455 -13440 -36787 25823 10957 -19084 14618 -4408 -25393
1003b5393N8446j5441o7748N3547M3263o7830l421M7486k7568j628K9498m5915
$$ -25393 33053 17612 -50136 3411 46674 -21156 -24577 22909 -4659 -6287 23211 -22704
1015b2704j228O9755l8626n8933O5387K2041n8738J5746K0224l1141L0215J3810
$$ -22704 -23932 45823 7197 -51736 13651 35692 -23046 -7300 12924 -18217 11998 25808
1027B5808o5970K5110O8590n9154l8516O5621k642l6707K8813j4727k2551N9829
$$ 25808 -40162 -15052 53538 -5616 -44132 21489 18847 -17860 10953 -3774 -26325 33504
1039C3504j1975p5337N1797N4454p0312j1542N2143k4798l731L1500m9627m810
$$ 33504 21529 -53808 -2011 52443 -17869 -29411 22732 -2066 -5797 25703 -23924 -28734
1051b8734P9281l8824p0213O9475L0871o6432J4295K6822l6431K9821K3207p3893
$$ -28734 50547 11723 -58490 10985 41856 -24576 -10281 16541 -19890 9931 33138 -40755
1063d0755J6585Q2186n7076n3299P1772O177m7534K9854l968l4154N6511N272
$$ -40755 -24170 58016 940 -52359 19413 25590 -21944 7910 3942 -30212 26299 31571
1075C1571q2153L6582O9613o4928k8402N7873j3959j7793L3406l5144j8686P2648
$$ 31571 -50582 -14000 55613 -9315 -37717 20156 6197 -11596 21810 -13334 -32020 40628
1087D0628j8566p5622N2876M4929o0341j440L2369k7645J6848K6083o1177M593
$$ 40628 22062 -53560 -684 44245 -16096 -17536 14833 -12812 4036 30119 -31058 -26465
1099b6465P6438m1591n6355N9655J4550m3928K1697M77l1072M7310R846p3760
$$ -26465 49973 8382 -47973 11682 26232 -17696 4001 4478 -26594 20716 30562 -43198
1111d3198K7188O5377n4152k9600N1943j1361j8836L2927k8573k3729O4994q617
$$ -43198 -16010 49367 -4785 -34385 17558 6197 -12639 20288 -8285 -32014 32980 24363
1123B4363p1043M1854M5353n3445m525L3901k6933P973L1316m9491q470O8831
$$ 24363 -46680 -4826 40527 -12918 -17443 16458 -10475 -2502 28814 -20677 -29147 39684
1135C9684k5400n6424M7404K1608m2732J5115J0810l1760L0492K0577n9059Q838
$$ 39684 14284 -42140 5264 26872 -15860 -745 10065 -21695 8797 29374 -29685 -20847
1147b0847O0057l6648l4283M3605j176k3633K5471j2457k6267M5239M838n6440
$$ -20847 39210 2562 -31721 11884 10708 -12925 12546 89 -26178 19061 23899 -32541
1159c2541K2740M1685l8091j0872K9532j6423j866K5952k9860j3682M7887j0361
$$ -32541 -9801 31884 -6207 -17079 12453 -3970 -5836 20116 -9744 -23426 24461 14100
1171A4100m2976K9183J9965k9894P013J1159k2387J7013J7907l8385J041M1639
$$ 14100 -28876 307 20272 -9622 -2609 8550 -13837 3176 21083 -17302 -16261 25378
1183B5378k1623k5416K8779L64j7642J8507o182k0719K9179O902l8419J2787L0156
$$ 25378 3755 -21661 7118 7482 -10160 8347 2165 -18554 10625 17527 -20892 -8105 22051
1196B2051k6118q588K3436j3213n085K2279j7474j5601L2982k234l2305J8507
$$ 22051 -4067 -12655 10781 -2432 -7517 14762 -2712 -18313 14669 12435 -19870 -1363
1208a363J7473k3819L082J4416j7543M098J8926k1967p517K8502p830k1731J7759
$$ -1363 16110 -7709 -4627 9789 -7754 -3656 15270 -6697 -14214 14288 6458 -15273 2486
1221B486N955j5714Q328M666j4783J0024J0269j9394O15J8371r923r372J2736
$$ 2486 8441 -7273 1055 5721 -9062 962 11231 -8163 -7548 10823 900 -8472 4264
1234D264k639n954R364m144q846J2676J634j3957O338Q012r374L30O274p210J729
$$ 4264 1625 -4329 5035 891 -7955 4721 6355 -7602 -1264 6748 -2626 -2296 3978 -3232 -1503
1249a503P792r215k955J1942m016q477Q544J165p907O081J665q218N537N438j0101
$$ -1503 6289 -2926 -5881 6061 2045 -6432 2112 3277 -4630 1451 3116 -5102 435 5873 -4228
1264d228J021R264o485m046P914k002n436O559n43o642N917K940q021K374N680
$$ -4228 -3207 6057 -428 -4474 3440 1438 -3998 2561 2018 -4624 1293 4233 -3788 -1414 4266
1279D266n314j700N316k776k930N102j226l900M070J518m706J647L136l232m16
$$ 4266 -1048 -2748 2568 -208 -3138 1964 738 -3162 908 2426 -2280 -633 2503 -729 -1145
1294a145K758j471j563K587k76k396J817J052k085p3K096j380p22J219l12o74
$$ -1145 1613 142 -1421 1166 890 -1506 311 1363 -722 -795 1301 -79 -801 418 106 -568
1310e68O45M25j145J71Q70l51o49N70N61j277N3J106m82o88P77O44j125j87J757
$$ -568 77 502 -643 -472 398 47 -602 -32 529 -748 -695 411 -71 -759 18 662 -463 -650 1107
1329A107o12j115J437p8j575Q35J176j829j91K170j537j142K599P3k968J727J880
$$ 1107 495 -620 817 739 -836 -1 1175 -654 -845 1325 -212 -1354 1245 1318 -1650 77 1957
1346A957l445L51K882k566j232L617j061l138L475R58l397J131K438l081K34K838
$$ 1957 -1488 -1137 1745 -821 -2053 1564 503 -2635 840 1798 -1599 -468 1970 -1111 -877 1961
1362A961k707r51L622j218k569K647O37k587J542L48k218J742Q50k656Q98K286
$$ 1961 -746 -1697 1925 707 -1862 785 1422 -1165 377 725 -1493 249 1099 -1557 -659 1627
1378A627k427J09J622j774O68K248l872J19M411k818k880M888q79l576M587p36
$$ 1627 -800 -691 931 -843 -175 2073 -1799 -1680 2731 -87 -2967 1921 1042 -2534 2053 1317
1394A317m921O073J540q729L158P177p583k008P871m178l426Q280m335o604J0989
$$ 1317 -3604 2469 4009 -4720 -1562 5615 -1968 -3976 3895 -283 -3709 4571 236 -6368 4621
1409D621K81j2485O862P925j1157O79Q138p765l43J0460r608n406J5628l388j3564
$$ 4621 4902 -7583 -721 7204 -3953 -3274 4864 -2901 -3244 7216 -2392 -7798 7830 4442 -9122
1424i122J0550N182j1736M772N211j0923O292R479j5824j028J7710q616j0861
$$ -9122 1428 6610 -5126 -354 4857 -6066 226 9705 -6119 -7147 10563 1947 -8914
1437h914J2941q96r062J0575k764j2426J5118N124k0312N706J6083j3271l957
$$ -8914 4027 3131 -5931 4644 1880 -10546 4572 9696 -10616 -4910 11173 -2098 -6055
1450f055J1747q460j336J4224j3023r612K2913k325k1301J2884J0055j4613M928
$$ -6055 5692 -2768 -4104 10120 -2903 -12515 10398 8073 -13228 -344 9711 -4902 26
1463B6N561j4937R748J4130k4267k492K7350j1486j7428J8131M6j1658J4810m278
$$ 26 5587 -9350 398 14528 -9739 -12231 15119 3633 -13795 4336 4382 -7276 7534 3256
1477C256j8968K2339R917l2234O226K6796j8357r455J8459j0452m490K1969j6540
$$ 3256 -15712 6627 16544 -15690 -9464 17332 -1025 -10480 7979 -2473 -6963 15006 -1534
1490a534j8473L3012K843l5441J4546K0924k1612J782J2830j9295P742K3535k8764
$$ -1534 -20007 13005 15848 -19593 -5047 15877 -5735 -3953 8877 -10418 -2676 20859 -7905
1503g905j2106L7700o570l0089J9562Q528j7306J3816J61k3804K2007J8279l6892
$$ -7905 -20011 17689 11119 -18970 592 9120 -8186 5630 5791 -18013 3994 22273 -14619
1516a4619r57L5106j5613j7611J9318n901p124K2294j5196k2312L4721P880l8904
$$ -14619 -15576 19530 3917 -13694 5624 -277 -7401 14893 -303 -22615 12106 19986 -18918
1529a8918J0298K5539j9917k186J3355j9209P221K6366l0189j5974M1909l480
$$ -18918 -8620 16919 -2998 -5184 8171 -11038 -3817 22549 -7640 -23614 18295 14815
1541A4815l4931J9123J2396j9729J3323K731k8322K2555K4501m1612n620M2362
$$ 14815 -20116 -993 11403 -8326 4997 7728 -20594 1961 26462 -15150 -20770 21592
1553B1592j4128k3923K2197l953j1950K5824j2022l0232L5418J6363m4247N137
$$ 21592 7464 -16459 5738 1785 -10165 15659 3637 -26595 8823 25186 -19061 -13924
1565a3924L3697k0224p921J7787j7699M46L0451k5683k4242M1716M957l9082J4252
$$ -13924 19773 -451 -8372 9415 -8284 -7838 22613 -3070 -27312 14404 19361 -19721 -5469
1578e469J8740j9473Q018P248k6767J5398K8456l5869j3629M0813o264k7295J8103
$$ -5469 13271 -6202 1816 9064 -17703 -2305 26151 -9718 -23347 17466 11202 -16093 2010
1591B010K331j2961K0527o136k8735K7716J9796l9418r31L2540j4613j0968J6425
$$ 2010 4341 -8620 11907 5771 -22964 4752 24548 -14870 -15801 16739 2126 -8842 7583
1604G583j3551k109K8049j9835k5380L6510P811l5652R916J8590j7839O387R264
$$ 7583 -5968 -8077 19972 137 -25243 11267 19078 -16574 -6658 11932 -5907 480 9744
1617I744k4927J1043K8358l0485j5916L6942l286k6820J6814L910j4927J8782
$$ 9744 -15183 -4140 24218 -6267 -22183 14759 11473 -15347 1467 5377 -9550 9232
1629I232q81k8772K1385K3041l4570n721L1445j1333j3961J6746q692p670K4290
$$ 9232 8351 -20421 964 24005 -10565 -16286 15159 3826 -10135 6611 -2081 -9751 14539
1642A4539j0478k5427K6692J3337l0613L151K0215j3550j017J1076j6681K003
$$ 14539 4061 -21366 5326 18663 -11950 -8799 11416 -2134 -3151 7925 -8756 -6753
1654f753K4052j8037j7475K6953L023k2126R399O630j2011J0493L042k0886J1590
$$ -6753 17299 -738 -18213 8740 11763 -10363 -964 5666 -6345 4148 7190 -13696 -2106
1667b106J8859k2419p168K2696n901j1169J1840n016p265J7566n714j9770J8148
$$ -2106 16753 -5666 -12834 9862 3961 -7208 4632 -384 -7649 9917 4203 -15567 2581
1680B581J1024k2126K004J5295j0733j312J0732j2695j019J8767j1749j4640J9338
$$ 2581 13605 -8521 -6517 8778 -1955 -3267 7465 -5230 -6249 12518 769 -13871 5467
1693E467L688j7799P184P632j1261O216O050j5051M014J5919j4173q440J6756
$$ 5467 9155 -8644 -1460 6172 -5089 1127 7177 -7874 -3860 12059 -2114 -10554 6202
1706F202k237j0716Q945K38q274J0134J089j4183Q067R991j3080k055J1382n261
$$ 6202 3965 -6751 2194 2432 -5842 4292 5381 -8802 -735 9256 -3824 -5879 5503 242
1720B42m017P674m943l565J0730l858r376Q857M025j0078K476N553n878J543M426
$$ 242 -3775 3899 -1044 -4609 6121 2263 -7113 1744 5769 -4309 -1833 3720 -2158 -615 3811
1735C811p063O84Q232o008m224P545p13n884M511M05m654N084J046p171M184M999
$$ 3811 -3252 -2568 5664 -344 -4568 2977 2264 -3620 891 1296 -3358 1726 2772 -4399 -215 4784
1751D784o739n62N699k997k319M517k937k559N839j304n363N294K237n864J292
$$ 4784 -1955 -2517 3182 185 -2134 2383 -554 -3113 2726 1422 -3941 1353 3590 -2274 -982
1766i82L618m093K65L728l671j117N051k432l819M600J259m545K017K428l743
$$ -982 2636 -1457 -1192 2536 -1135 -2252 2799 367 -3452 1148 2407 -2138 -121 2307 -1436
1781a436Q11K440k595q68L498j440k407K818L83k431J488J114j986L54J313j514
$$ -1436 -625 1815 -780 -1648 1850 410 -1997 821 1204 -1227 261 1375 -611 -257 1056 -458
1797d58m00J561o14j075J113M11n74j98L79j93n7R1n00K82K4J29Q6l13J71O58
$$ -458 -858 703 89 -986 127 538 -36 -234 145 -48 -105 -14 -514 -232 -208 -79 7 -306 -135 523
1817E23m60n00P71K46r46J57P28r38k98J458n87j105J570L9j047O32O90j575J43
$$ 523 63 -437 334 580 -366 -209 519 -419 -717 741 154 -951 619 658 -389 243 933 -642 -499
1836d99J298j006o40J925p36j162J310M79j783Q72J201j983O4J677j383o11J869
$$ -499 799 -207 -847 1078 342 -820 490 969 -814 58 1259 -724 -660 1017 -366 -977 892
1853H92q68j285J761K25j490R20M85j652N56J210j525l1J583q94k25R93p70j84
$$ 892 24 -1261 500 725 -765 155 640 -1012 -456 754 -771 -802 781 -113 -338 655 -115 -299
1871b99Q46o82n63J022q9p97M99M08q02J109k68j621J724R97k450O8K205j845
$$ -299 547 -135 -698 324 235 -562 -63 345 -457 652 384 -1237 487 1484 -966 -898 1307 -538
1889e38k85K506k690k26L852k397l200M660J90m211K508K029m496J971K877n136
$$ -538 -823 1683 -1007 -1233 2619 222 -2978 1682 1872 -2339 169 2198 -2298 -327 2550 -2586
1905b586R73N411m747k679O558q81n506M515J015n288M114J906o984L071O172
$$ -2586 -1613 3798 -949 -3628 2930 2049 -3457 1058 2073 -3215 899 2805 -4179 -1108 5064
1920E064o757k212P778k885m163N600j850m153O171l21p697N412M875p690L48
$$ 5064 -1693 -3905 3873 988 -3175 2425 575 -3578 2593 2272 -5425 -13 4862 -2828 -2480
1935b480N883m138p35M733n232j169Q120m681o263P981J818p563L889K093n243
$$ -2480 3403 -735 -1470 3263 -1969 -3138 4982 301 -5962 2019 3837 -3726 163 2256 -2987
1950b987M666K179r544M163Q750r596l278J0112l520m631O555l066m579J0487
$$ -2987 1679 3858 -5686 -1523 7227 -2369 -5647 4465 945 -3686 2869 -197 -4776 5711
1964E711k308j2026R270P341j2829P91R448p123m45P911r307j859J4483p361j2287
$$ 5711 3403 -8623 647 7988 -4841 -4050 5398 -1725 -2170 5741 -3566 -5425 9058 1697 -10590
1979a0590J3643M377j3487M539O181r547N735O204j4402K632J5959j1717r648
$$ -10590 3053 7430 -6057 -1518 4663 -4884 851 7055 -7347 -4715 11244 -473 -10121
1992a0121J5129l53j0678Q225q23q232J1472J833j6944Q470J3813j4823m376J3040
$$ -10121 5008 4655 -6023 2202 1379 -6853 4619 6452 -10492 -2022 11791 -3032 -7408 5632
2006E632m913m231Q856q326m386J6815n078j6631J3478Q627j5079K485P546q740
$$ 5632 719 -3512 5344 -2982 -7368 9447 4369 -12262 1216 9843 -5236 -2751 4795 -3945
2020c945M799P011j5806J971J8482j1953j2280J6096J589j1586Q053q97r110J3371
$$ -3945 854 7865 -7941 -5970 12512 559 -11721 4375 5964 -5622 2431 1534 -7576 5795
2034E795J969k0123Q874J6993j6222o851J5645n058n284J0990r218p211K0026
$$ 5795 7764 -12359 -3485 13508 -2714 -9565 6080 1022 -4262 6728 -2490 -9701 10325
2047A0325l799k1299J4639J2546j7589L11J0925j0031K998J0561j6405k270K2521
$$ 10325 6526 -14773 -134 12412 -5177 -4866 6059 -3972 -974 9587 -6818 -9088 13433
2060A3433j0024j7815J7359N703j4737O154L875j1457J0901O508k0618M034K0695
$$ 13433 3409 -14406 2953 8656 -6081 73 3948 -7509 3392 9900 -10718 -6684 14011
2073A4011j3890j1403J6022j377q105R435m883r078J7089N86k1177J0081J4900
$$ 14011 121 -11282 4740 3363 -4742 4693 -190 -9268 7821 8407 -12770 -2689 12211
2086A2211j5280l105J0912o957N05J0043j3667l846K0498o417j7542J3978O920
$$ 12211 -3069 -6174 4738 -2219 -1714 8329 -5338 -9184 11314 4897 -12645 1333 8253
2099H253j3071M431L659j0120R109P855j9539K201K0118j1833j1589J4884p14
$$ 8253 -4818 -387 3272 -6848 2261 10116 -9423 -7222 12896 1063 -10526 4358 3644
2112C644q664R730m006j0594J6331K705k0725P475J6272j4336m999J2614o814
$$ 3644 -5020 4710 704 -9890 6441 9146 -11579 -4104 12168 -2168 -7167 5447 -1367
2125a367k118J1583j0777p535J9224k257j8622J1141R952j3217J911O579r401
$$ -1367 -3485 8098 -2679 -10214 9010 6753 -11869 -728 9224 -3993 -2082 4497 -4904
2138d904M654R182j4661k414J8066o537j3028J1730K705r009O342K21r551R901
$$ -4904 -250 8932 -5729 -8143 9923 3386 -9642 2088 4793 -4216 2126 2347 -7204 2697
2152B697N326j5628K690J3954q969o097R230k878l156P915n686o984J2739M02
$$ 2697 8023 -7605 -4915 9039 70 -6027 3203 325 -2831 5084 -602 -7586 5153 5555
2166E555j3726O705Q234q993M9N670o411K156P381j0017k882J3260m360r565Q444
$$ 5555 -8171 -1466 6768 -2225 -2176 3494 -2917 -761 6620 -3397 -6279 6981 2621 -6944 1500
2181A500K125p165N118P71q054P448M785j2035J283J1310p465m585Q123k363m288
$$ 1500 3625 -3540 1578 2349 -5705 1743 6528 -5507 -4224 7086 -379 -4964 3159 796 -3492
2196c492P466l111p094R153K503j1238L678P844p287j194O058m497j018O822n364
$$ -3492 3974 863 -6231 2922 5425 -5813 -2135 5709 -1578 -2772 3286 -1211 -2229 4593 -771
2211g71m553Q881k74q085M456M312n901J425K800n066K108M565n739j418O852
$$ -771 -5324 3557 3283 -4802 -346 3966 -1935 -510 2290 -2776 -668 3897 -1842 -3260 3592
2226C592k351m425M110J00k673K683j86l469L405J988n231J201L721l089q04K775
$$ 3592 1241 -3184 926 1026 -1647 1036 850 -2619 786 2774 -2457 -1256 2465 -624 -1428 1347
2242A347k053k8K933k605k082M540r07l824L056J487l547J355J615k862J524K464
$$ 1347 -706 -734 2199 -406 -2488 2052 1145 -2679 377 1864 -1683 -328 1287 -1575 -51 2413
2258B413l748n52M282k094k739L497j34k618K463M54k935J911K074l405l40L450
$$ 2413 -1335 -1887 2395 301 -2438 1059 925 -1693 770 1224 -1711 200 2274 -1131 -1471 1979
2274A979j851j471K614q90j936K015L20k142J397J419k402K88K213j876q20K128
$$ 1979 128 -1343 1271 381 -1555 460 780 -1362 35 1454 -948 -660 1553 -323 -1143 985
2290I85o07j062R98R2j158Q69P67j421K0J536j357j36P63l63j86N16J46n50K23
$$ 985 378 -684 314 406 -752 117 884 -537 -517 1019 -338 -474 289 -74 -260 256 402 -148 75
2309G5P7k17Q8q9L22j34r6l94M67j4j69K5L88n34L69K44q15J98P20r36j44J237
$$ 75 152 -65 23 -66 256 122 26 -368 99 85 -84 -59 329 -205 164 408 -407 -209 511 -425 -569 668
2331F68o91m91O47J08j070Q60M61j161N08J094j315j73J268n91r23J262O3j382
$$ 668 -23 -514 133 241 -829 31 492 -669 -161 933 -382 -555 713 122 -801 461 524 -858
2349h58O68O51r65J94J109p58n95J218l83j189J187K67j276O88P60j128j27R34
$$ -858 -190 461 -504 -310 799 41 -554 664 281 -908 279 546 -730 -42 718 -410 -537 397
2367C97o24o6M95m00l84R63j22q43R04l25k08L63k04m81Q23j45o52P04J00q90
$$ 397 -227 -293 202 -198 -582 381 259 -584 320 -5 -213 150 -54 -535 288 143 -509 195 295 -595
2387e95N19N48j033P42P61j888K42K289j752j003J990o65j475K115j12k224K273
$$ -595 -76 472 -561 181 942 -946 -704 1585 -167 -1170 820 155 -1320 795 683 -1541 732
2404G32O84l185J314K336k428r30L132k020q45K906j545k246L876j90l948K059
$$ 732 1416 -1769 -455 1881 -547 -1477 1655 -365 -1210 1696 151 -2095 1781 1591 -2357 -298
2420b98K555l516N11K399k548K0L319l038j881M698j304l503L062J203l539K309
$$ -298 2257 -1259 -748 1651 -897 -877 2442 -596 -2477 2221 917 -2586 476 1679 -1860 449
2436D49P22l573K571K530m599K34M364k723j888L509j268j918L759j968l104M431
$$ 449 1171 -2402 169 2699 -1900 -1666 2698 -25 -1913 1596 328 -1590 2169 201 -2903 1528
2452A528J031n462K235L524m099N11K683l372N95M417n034k136O647j534n021
$$ 1528 2559 -2903 -668 2856 -1243 -732 1951 -1421 -826 3591 -1443 -3579 3068 1534 -3487
2467c487M264J292m413L172J053n403L846M229p752l7P441l972l758N378j544
$$ -3487 777 2069 -2344 828 1881 -3522 324 4553 -3199 -3236 4205 233 -3525 1853 309
2482C09k752N527j846o256O890K812q859J997O661n508j354N182m442m25O824
$$ 309 -2443 3084 1238 -5018 1872 4684 -4175 -2178 4483 -1025 -2379 2803 -1639 -2064 4760
2497D760n246m795Q722M06q594M290L758n724K237L073o661L103O457q133k561
$$ 4760 -486 -5281 3441 3847 -4747 -457 3301 -2423 -186 2887 -3774 -671 5786 -2347 -4908
2512d908R181k388o114N271j29l808N640j453o924P016M706j0166Q67P991n342
$$ -4908 4273 1885 -4229 1042 913 -2895 2745 1292 -5632 1384 6090 -4076 -3209 4782 -560
2527e60j803N010m403q64P830n741n976R726J527r951M437M732o196K041L387
$$ -560 -2363 2647 -1756 -2620 5210 -531 -6507 3219 4746 -5205 -768 3964 -2232 -191 3196
2542C196p481K551Q516r185l843J0990j624p980N988R25n590O076M7r014O802
$$ 3196 -4285 -1734 6782 -2403 -6246 4744 3120 -4860 1128 2053 -3537 2539 2586 -6428 374
2557C74O576j0840q53J0123m780m073O428l380l152Q809m102q313R060M256j0804
$$ 374 6950 -3890 -4743 5380 600 -3473 2955 -425 -3577 5232 1130 -7183 1877 6133 -4671
2572d671J992P037n692J51M576o805Q56Q981o969o332J0484J30q195M202K656
$$ -4671 -2679 4358 -1334 -1183 3393 -3412 -2556 6425 -544 -6876 3608 3738 -4457 -255 2401
2587B401n289M819J025q247N072P044r444k323R119k860m720N501k196l196P915
$$ 2401 -2888 1931 2956 -5291 -219 6825 -2619 -4942 4177 1317 -3403 2098 -98 -3294 4621
2602D621k653q438P968M256r992J369O837n099l46M948o245J12Q945o154o555
$$ 4621 1968 -6470 1498 5754 -4238 -2869 3968 -1131 -1477 3471 -2774 -2662 6283 129 -6426
2617f426R706Q26q543M226L162n779L728K293p950L276Q309q274l773R069j348
$$ -6426 3280 4106 -4437 -211 2951 -2828 900 3193 -4757 -1481 6828 -1446 -5219 3850 2502
2632B502o117N321q70m466O515q6q325N277O009q403r36P124l519k042M734l875
$$ 2502 -3615 1706 836 -3630 2885 2799 -5526 -249 5760 -2643 -3579 3545 26 -2016 2718 -1157
2648a157k009P365k820o788O925K609p068J911L442l951J748K513n677J223O206
$$ -1157 -3166 4199 1379 -5409 1516 4125 -2943 -1032 2410 -1541 207 2720 -2957 -1734 4472
2663D472n053l679O816p45m296L418K83l675M083O23o203L672M487o308p62N621
$$ 4472 -581 -4260 2556 1811 -2485 933 1216 -2459 1624 2247 -3956 -284 4203 -2105 -2867 2754
2679B754k770j859M082k625k133N497j422n719M949K446n866J434L369l404P41
$$ 2754 -16 -1875 2207 -418 -2551 2946 1524 -4195 754 3200 -2666 -1232 2137 -1267 -526
2694e26L437m565l38N862l771l775N205N13m127K185J379l422K368J761m440J483
$$ -526 2911 -1654 -1992 3870 99 -3676 1529 2042 -2085 100 1479 -1943 425 2186 -2254 -771
2710g71L926l593k084M234j208k363K820p10j979K960J32l392K045K196l457K15
$$ -771 3155 -438 -2522 1712 504 -1859 961 251 -1728 1232 1364 -2028 17 2213 -1244 -1029
2726a029K418j957n21K439j869o93K853q00k633K579N53k278P08J100j767P78
$$ -1029 1389 -568 -1089 1350 -519 -1212 1641 841 -1792 787 1340 -938 -230 870 -897 -119
2742a19J216k233M12K360j682j113K050k20j556J352k35j582J903J71k044J240
$$ -119 1097 -1136 -724 1636 -46 -1159 891 671 -885 467 232 -1350 553 724 -1320 -80
2758h0J633k309J35J803j180p36J541j067q95J728n12j268J632O51k229Q48J377
$$ -80 1553 -756 -621 1182 2 -734 807 -260 -1155 573 61 -1207 425 1076 -1153 -305 1072
2775A072j296l87J680j293n88J428l53j342J215M91j011L85P21j041m1R56j083
$$ 1072 -224 -611 1069 -224 -812 616 263 -1079 136 627 -384 1 722 -319 -360 596 -487
2792d87j46J190p72m90Q94J83q00M72L39n71K10M46q62j55O29l68J63K90j99R2
$$ -487 -633 557 -215 -705 189 372 -428 44 383 -188 22 468 -394 -549 80 -288 -125 165 -34 58
2812E8J46k68J6L97o6o25N47l28l74M46j9r2K50L12o46L92M71p49k38O22j55p02
$$ 58 204 -64 -48 349 283 -342 205 -123 -497 -51 -70 -162 88 400 -246 146 617 -132 -370 252 97 -605
2834f05Q20j30p88O42N45p95L57P09r65K6R01p61n68P96j15o87Q06K20n09K78
$$ -605 215 85 -703 -61 484 -311 46 755 -210 -184 717 -44 -612 184 69 -618 188 408 -101 177
2854A77M06p71K4M07n64l72J008l31l97M37k9K15L1L29q01L19N02r41MN02k89
$$ 177 583 -188 -164 243 -321 -693 315 -16 -413 24 -5 210 241 570 -231 88 590 -351 -347 155 -134
2875a34n6N70o13J55O22n85j75N83k73l57M72J2q52Q61j40q25J032K60p59J09
$$ -134 -190 380 -233 -78 544 -41 -216 367 94 -263 209 221 -631 230 90 -735 297 557 -202 -93
2895i3Q91j353J67Q68j002j67J152l80r55J480N9j567R98Q20j231K10P78j467
$$ -93 798 -555 -388 480 -522 -689 463 83 -872 608 667 -900 98 918 -313 -103 675 -792
2913g92J7J839j246j044K085l8j742J453K67j730J175N63j879M91J902j884n24
$$ -792 -775 1064 -182 -1226 859 821 -921 532 799 -931 244 807 -1072 -581 1321 -563 -1087
2930a087J940p09q63J636o23j128J721m40k278K009R38k114L58J564j473K98J523
$$ -1087 853 144 -719 917 294 -834 887 447 -1831 178 1116 -998 -640 924 -549 -251 1272
2947A272k057J17K022j354j466K256l02j806J689N07j674J461N85k764J336K150
$$ 1272 -785 -668 1354 0 -1466 790 488 -1318 371 878 -796 665 1250 -1514 -178 1972
2963A972k635o16K342j182j056K205j097j615L389m58l511K343K126l585M43K376
$$ 1972 -663 -1279 1063 -119 -1175 1030 -67 -1682 1707 1249 -2262 81 2207 -1378 -935 1441
2979A441k389O4K620k750n89M270k084l020L686N46l635J709J335l137K245J662
$$ 1441 -948 -884 1736 -1014 -1603 2667 583 -2437 1249 1795 -1840 -131 1204 -1933 312 1974
2995A974m003R61M060k838k435L790p89k303K474q25k259L331M11m066K165L017
$$ 1974 -2029 -1068 2992 154 -2281 1509 720 -1583 891 66 -2193 1138 1549 -2517 -352 2665
3011B665l848M8K779k136k89K974l153j370M734j443m056L672J580l591J520J386
$$ 2665 -1183 -1135 1644 -492 -781 2193 -960 -2330 2404 961 -3095 577 2157 -1434 86 1472
3027A472l337K246K088m704N57M547k950k686M303n01k926L289n65l609M292P73
$$ 1472 -1865 381 2469 -2235 -1678 2869 -81 -2767 1536 1035 -1891 1398 833 -2776 1516 2289
3043B289n548K219M515m533j134M246k466p43L675k924k389N345o37n381L279
$$ 2289 -3259 -1040 3475 -1058 -2192 2054 -412 -1155 2520 -404 -2793 2552 1915 -3466 -187
3058a87K808m348Q85K640l505J262L660m523j123N515k401m060M529J11l188K580
$$ -187 2621 -1727 -842 1798 -1707 -445 3215 -1308 -2431 3084 683 -3377 1152 1263 -1925 655
3074F55J89l477L478K142n397P76M852l407k227L957j607j734L668k046k480M820
$$ 655 844 -2633 845 2987 -2410 -1634 3218 -189 -2416 1541 -66 -1800 1868 -178 -2658 2162
3090B162J09n112K373L226l833J57K343l097R90L275m062j214N675j737l982L848
$$ 2162 2271 -2841 -468 2758 -1075 -918 1425 -1672 -682 2593 -1469 -2683 2992 1255 -2727 1121
3106A121P35l349K170M23l795L097K630n459M27N368l236k542M059j310j875K938
$$ 1121 1856 -1493 677 1100 -2695 402 3032 -2427 -2000 3368 132 -2410 1649 339 -1536 1402
3122A402r07l441M279Q46n053K026L643l552n02K942k469k06L411k844k408M908
$$ 1402 495 -2946 1333 2179 -2874 -848 2795 -757 -1259 1683 -786 -992 2419 -425 -2833 2075
3138B075p72l772K578J837l447J517J425k933J366K845m124r14M337j682k394
$$ 2075 1303 -2469 109 1946 -1501 16 1441 -1492 -126 2719 -1405 -2319 2018 336 -2058
3153b058K970k87j772K379l82k713K863J095m397Q19L394k299q50K359j634l14
$$ -2058 912 625 -1147 1232 850 -1863 1000 2095 -2302 -1483 1911 -388 -1238 1121 -513 -827
3169h27K883k083j846L646k61l505J841J434k502J220J187k303Q26K613k923j041
$$ -827 2056 -27 -1873 1773 1512 -1993 -152 1282 -1220 0 1187 -1116 -290 2323 -600 -1641
3185a641L209j124k135K339k5k101J913M37k683K060J554k990K49K791k025j220
$$ -1641 1568 444 -1691 648 623 -1478 435 872 -1811 249 1803 -1187 -938 1853 -172 -1392
3201a392K421j121j098K240p34k402K628P79k596P79K200k287K50J221j504l86
$$ -1392 1029 -92 -1190 1050 316 -2086 542 1321 -1275 -496 1704 -583 -333 888 -616 -1002
3217a002J942j192r77K165k6j929J224O11j469P43P17j477L19J090j505j93J891
$$ -1002 940 -252 -1229 936 910 -1019 205 816 -653 90 807 -670 -351 739 -766 -959 932
3234I32q75o64J187m75o54J180m71j034J093K54j726Q43J195j093J83P00o40j39
$$ 932 57 -607 580 105 -549 631 160 -874 219 473 -1253 -410 785 -308 -125 575 -65 -204
3252b04J015j088n95J302j47j128O04P74r98N78N34j001N4J183j318k54J055m01
$$ -204 811 -277 -872 430 283 -845 -241 533 -465 113 647 -354 -300 883 -435 -689 366 -35
3270c5p76J044L02q81M69L97q89N79L47p78j85O11l58m02P49k93k21O24O4n69
$$ -35 -811 233 535 -346 123 520 -369 210 557 -221 -406 205 -153 -555 194 -99 -320 304 368 -201
3290b01M54L44o61j34L36k67r7L71k91J20K16j84M9O2j14j92J1P8l07L23J96k57
$$ -201 253 597 -64 -198 138 -129 -226 145 -146 -26 190 6 55 117 3 -189 -178 -100 -407 -84 112 -145
3312a45J85L55n46J87K16j31l77M74n00j32M61Pl99L53J97n56O32K65q11p4N69
$$ -145 40 395 -151 36 252 121 -256 218 -282 -414 47 54 -345 8 205 -351 281 546 -265 -339 230
3333B30l96l35O40j23o51P05J64n36L54O01p87J54M42o40k17N57k37k76O27k58
$$ 230 -166 -501 139 16 -635 70 234 -302 52 653 -134 20 462 -178 -395 162 -75 -351 276 18
3353A8m3J27M35o99J81M36o50j4L59m21K07J16j72K30J53k45r6R3K74n18J13j06
$$ 18 -25 102 537 -162 19 455 -195 -209 150 -271 -64 52 -120 110 263 18 -78 15 289 -229 -116 -222
3375b22j25L01J81l07L33K88n84K34j75P2k30O51o95j66O10r5l63O66j12m61N68
$$ -222 -347 -46 135 -172 161 449 -135 99 -76 -4 -234 417 -278 -444 166 71 -292 374 262 -199 369
3396C69q6m76j36P65q89o8Q17j25p21Q96m1o03O50o4p60P91L58j313J98J181q81
$$ 369 283 -193 -329 436 -453 -521 296 171 -550 346 305 -298 352 288 -472 319 677 -636 -438 743 -138
3417a38k03Q46m04l53P57l24q65J099J1j081N97P25j013K12O56p69R1Q93r76l08
$$ -138 -341 505 101 -252 505 181 -684 415 426 -655 -58 667 -346 -134 522 -247 -156 737 -239 -547
3437e47J289p49m92O53n5o42P29jo69O82O13j264j40J371j205l3R70n57l77R99
$$ -547 742 -7 -499 154 99 -543 186 185 -484 198 811 -453 -593 778 -427 -460 510 -47 -424 575
3457E75p96q50J622O3j301R07O56j530L90J011j433K49J636j293r93K203n62j551
$$ 575 -221 -1071 551 614 -687 220 876 -654 -264 747 -686 -437 1199 -94 -1087 1116 554 -997
3475i97J602q0j281R84K95j451N56J742k161J51J937j151q04J443o10j030J425
$$ -997 605 525 -756 228 523 -928 -372 1370 -791 -640 1297 146 -658 785 175 -855 570
3492E70l65j787J632R42k125P60J520j439k00J665j582k99J646j273r93K181j02
$$ 570 205 -1582 50 992 -1133 -373 1147 -292 -492 1173 -409 -708 938 -335 -1328 853 751
3509G51j968J566K11j151J053L63k127J024J764k130l97K227j174j133K000q25
$$ 751 -1217 349 560 -591 462 825 -1302 -278 1486 -644 -1041 1186 12 -1121 879 54
3525E4q46J761k92k136J897R58k615R24J437k052M88J680k085K14K237j566j805
$$ 54 -792 969 677 -1459 438 1396 -1219 -295 1142 -910 -422 1258 -827 -613 1624 58 -1747
3542a747K577R4k292J141J180j910J008J316k596R48J965k089q75K688q23j796
$$ -1747 830 924 -1368 -227 953 -957 51 1367 -1229 -281 1684 -405 -1280 1408 585 -1211
3558a211J707m03j641K276L31k697J890J475k644J59K106j682l82J685j357r00
$$ -1211 496 93 -1548 728 1059 -1638 252 1727 -917 -758 1348 -334 -716 969 -388 -1288
3574a288K471r22j994K382P39k377P46J250j715N88J161k265L60K416j958r36
$$ -1288 1183 261 -1733 649 1388 -989 -243 1007 -708 -120 1041 -1224 -864 1552 -406 -1342
3590a342K157k04j874K024k58j708J944j0k364J275K105k832J51K337j302o95
$$ -1342 815 611 -1263 761 503 -1205 739 729 -1635 -360 1745 -1087 -936 1401 99 -596
3606e96J571j249o60K423r49k441K511M70k228Q79J545j957P03J497k054j38K361
$$ -596 975 -274 -934 1489 540 -1901 610 1080 -1148 -269 1276 -681 22 1519 -535 -673 1688
3623A688j509k026K428J30j662J085N91j805J188R93k177P04K039k073o47K109
$$ 1688 179 -1847 581 711 -951 134 725 -1080 108 1101 -1076 -372 1667 -406 -1053 1056
3639A056r76r27J653n04j448K079l76j759J210J203k112L14J377j287K7J468j311
$$ 1056 80 -847 806 302 -1146 933 557 -1202 8 1211 -901 -587 790 -497 -470 998 -313
3656c13k21J793j020j348J668M63k014R12M95j379R10Q94j649M48J581j289r15
$$ -313 -534 1259 239 -1109 559 1022 -992 -80 415 -964 -54 840 -809 -361 1220 -69 -984
3673i84J747l97j088R96Kj131J312J45j509R01J242j645k68J538j224m30J676
$$ -984 763 366 -722 274 276 -855 457 602 -907 -6 1236 -409 -677 861 -363 -793 883
3690H83j040o99J490n11j098J156N56j329P65M03q25j50J028j121j99J555j071
$$ 883 -157 -856 634 123 -975 181 737 -592 173 576 -249 -399 629 -492 -691 864 -207
3707b07n70J153J88r84P33L25j234R52R5j119M04Q40j002n5J134m28l09L87k22
$$ -207 -777 376 564 -420 313 638 -596 356 451 -668 -264 576 -426 -481 653 225 -84 303 81
3726H1n30P57r8n55N13n6p32K43O80n53R0O97m17l62R30p04o86J022k74o59P24
$$ 81 -449 308 210 -345 168 112 -620 -377 303 -250 -160 537 120 -242 688 -16 -702 320 46 -613 111
3747A11K28p28M88M84r61J16J084j075j09O59m42l16O47l63j98P22k1o78K82N46
$$ 111 339 -389 99 583 -378 -262 822 -253 -362 297 -145 -461 186 -177 -375 347 326 -352 -70 476
3767D76o09k22L92k24j23K85J33j78M06r5k60nL39m10j45M85o88K36L99k37k69
$$ 476 -133 -355 37 -187 -310 -25 108 -70 336 241 -19 -24 315 -95 -240 245 -443 -207 192 -45 -314
3788c14P20k46j48J03l3j90J05p1n7O8J52k07L7M09k49j31J22pj63L16l82lM40
$$ -314 406 160 12 115 82 -108 -3 -74 -131 -63 89 -118 -81 328 79 -52 70 63 -100 216 -166 -169 271
3811B71l76l60L72K14k04J84j19q8j65M42j4l93M94m33O4L32p2k15L12J98o19
$$ 271 -105 -465 -93 121 -83 101 -18 -106 -271 171 157 -236 258 -175 -111 221 149 -66 246 444 -175
3832a75N8L92n89m7L94j36k31M85j80j85N69r5l34J53m0k42N1K10p8q8K65Qk73
$$ -175 -117 275 -314 -361 33 -103 -334 151 -29 -214 355 260 -74 79 39 -203 -152 58 -20 -108 157 165 -108
3855a08J54n2k19M43k82k1L26l48pj33K75j47K0K74o1m3j8l0RJ76k60pkR7r6K55
$$ -108 46 -6 -225 218 -64 -85 241 -107 -114 -247 28 -119 -99 175 114 71 53 23 32 208 -52 -59 -61 36 -60 195
3881A95k51p2O8J65k72J08N16o11l9R7q6Q7L31m10j04N85j04m35K27J75m56K42
$$ 195 -56 -128 -60 105 -167 -59 457 -154 -193 -96 -182 -95 236 -174 -278 307 203 -232 -5 170 -286 -44
3903d4K4j74l4N58k12m01L42K56m58J44L9l28Q2L77o16L21N63n72rN86l41m78
$$ -44 -20 -194 -228 330 118 -283 59 315 -143 1 40 -288 -206 171 -445 -124 439 -133 -142 444 103 -375
3925c75O95k47p9J0K18n25M22O3l11J81L05m26m0K20m23K39L45l64k42P15l36
$$ -375 320 73 -6 4 222 -303 119 182 -129 52 357 -69 -109 111 -312 -73 272 -92 -334 381 45
3946D5n07R00k81m69K99K95m51J07L49o78K08M39n23J48O08j68o35O30q7r29P06
$$ 45 -462 438 157 -312 -13 282 -169 -62 287 -391 -183 256 -267 -119 489 321 -314 316 229 -700 6
3967FL12q49O37L50o91j65P02m22j98Q70m84p12R66r0j082J129L39j205L23O06
$$ 6 318 -531 106 456 -235 -400 302 -120 -318 552 68 -644 322 232 -850 279 618 -587 -264 342
3987C42o17K68O83j126J15R00o92k73N76lq94Q55M74j286O81L13o39J81J016j061
$$ 342 -275 -7 676 -450 -335 565 -127 -400 176 173 -721 134 608 -678 3 316 -323 -142 874 -187
4007a87n2O78n21p11J196n59l97J272l79r36P88L45j117M05O54n81NO87p58k23
$$ -187 -239 439 -82 -793 403 -156 -553 719 340 -596 192 537 -580 -175 479 -102 -97 590 -168 -391
4027c91J079n53o57Q29q7p40Q15j57p56O15P76j356K82J105q93l90J050p42m79
$$ -391 688 135 -522 307 220 -520 295 138 -618 -3 773 -583 -301 804 -89 -479 571 -171 -650
4046f50J141m63r41R15N17j044N91P37j058J1P83q77P7P46p43m95J242m24j068
$$ -650 491 28 -913 2 519 -525 66 803 -255 -244 539 -338 -261 485 -258 -753 489 65 -1003
4065a003J608k67r21N74N42p98J8J068j483J23J300r63l84J359o18o70J106l17
$$ -1003 605 338 -583 -9 533 -265 -247 821 -662 -539 761 -202 -586 773 155 -515 591 274
4083B74r83R15K48r46N07O46j225K94O57q57j55J293r07l27J071j01j174R30M22
$$ 274 -709 206 454 -492 15 661 -564 -270 387 -470 -625 668 -239 -566 505 404 -770 160 582
4102E82j222N11Q83j297M04J148j269j76J083m76q40J165m14r56J116K13j120
$$ 582 -640 -129 754 -543 -139 1009 -260 -436 647 171 -669 496 82 -874 242 455 -665
4119f65Q77L49q39R7P12p87l71J126m99m79J087k89j172J299q0j130P30M97r73
$$ -665 212 561 -278 -181 531 -256 -627 499 0 -479 608 319 -853 446 366 -764 -34 463 -510
4138e10K49R03j045j17J048n40m62J033k75o50M41K70q01P70M4r11N66M15q89
$$ -510 -261 642 -403 -520 528 -12 -474 559 284 -366 75 345 -456 314 358 -553 13 428 -461
4157d61K34R33p73m61J004n04k98Q34j94r79J060J02j317P56M11p75L62O36m86
$$ -461 -227 706 -67 -528 476 -28 -326 508 314 -665 395 497 -820 -64 347 -428 -66 570 84
4176H4l75O94n97m69J229n01o96Q41J80q75M07M85q96K62O39r40L14O65n14m41
$$ 84 -291 403 -194 -663 566 65 -631 210 390 -485 -78 407 -489 -227 412 -528 -214 451 -63 -504
4196e04Q61k28m96N29O4o18N82J95p81K97K27m68j14N33mk33L89p0o14P13n0m99
$$ -504 357 129 -367 162 226 -392 190 385 -396 -99 128 -340 -454 79 75 -158 231 161 -453 260 210 -289
4218b89N6N03o04K03M79m41jM29l78l45P61l49m7K81m8p10O88k07j2J15J51n24
$$ -289 -233 270 -334 -131 348 -93 -94 335 -43 -388 373 24 -23 258 210 -500 188 -19 -31 84 235 -289
4240b89J51L40o20K65N27j77m70N82P8o77M42J06m67K29L77n53J03K70q8l13N14
$$ -289 -138 202 -418 -153 374 197 -273 309 387 -290 152 258 -209 20 397 -156 -53 217 129 -184 330
4261C30l47j47M66k26l01R4L46m67Q3L02k13p3L84j59l17L79j63k89M96k47K7
$$ 330 -17 -164 302 76 -225 -131 215 -252 -169 133 -80 -153 231 72 -245 134 -29 -318 178 -69 -42
4282d2r0L14k06K3n9O6m20M62p3J86O4k49l4J37j07n9L7J02p6J9J40j15j94J97
$$ -42 -132 182 -24 -1 -60 6 -414 48 -25 161 225 -24 -58 79 -28 -87 -50 52 -24 -5 135 20 -174 23
4306B3j72J35k8M0n0O4j8j22J26q9m7L2K67j75L92m10N9k44M49k18j14L55k62
$$ 23 -149 -14 -42 -2 -52 12 -6 -128 -2 -91 -138 -106 161 -14 378 -32 27 -217 232 14 -100 255 -7
4329go6L29r7k28j7L91m28L9K45k63K78k63J66k76K82Nk65J11J7j33O8J36R2k41
$$ -7 -73 256 159 -69 -86 305 -123 -84 161 -102 176 -87 79 -197 85 90 -175 -64 -47 -180 -112 24 116 -125
4353a25m0L81l4M8k81J02l8n1k6r3J72R4j43pk29L88k7j68O9k4q2J51J60j79r4
$$ -125 -165 216 182 230 -51 51 13 -38 -64 -157 15 109 -34 -41 -270 118 91 -77 -8 -32 -114 37 197 18 -76
4378g6K08k5k58K13m0K6p8q7K19k37K91k37J82J17k10j82J02J60j95K72%k41J65
$$ -76 132 107 -151 62 22 48 -30 -117 102 -135 156 -81 101 218 8 -174 -72 88 -107 165 165 -76 89
4401H9k12j52K27L5j57M4J73r1l9K91k13m0R3L5k37L53Q2l29n8K40k82m8L41L5
$$ 89 -123 -275 -48 -13 -170 -126 47 -44 -83 208 -5 -45 48 83 -154 199 281 -48 -106 134 -148 -196 145 180
4425A80k50J70j32o0K16k44R4q1R7p5J62k62j17K07J78l65J09K34l02K24K47j48
$$ 180 -70 100 -32 -92 124 -120 -26 -107 -10 -85 77 -185 -302 -95 83 -282 -173 61 -241 -17 230 82
4447H2k21N57m43j42L88r2k84K15O5l24K19L36n22J75L52m25j49M74l67J1K09
$$ 82 -139 418 -25 -167 221 129 -155 60 125 -199 20 356 -166 9 361 -64 -213 261 -106 -95 114
4468A14p1l37P27q0r08O16K64l62R7K21r5m38L50l34j36P28j48l42J07J69l66
$$ 114 43 -294 433 353 -555 61 325 -37 60 281 186 -252 98 -236 -372 356 208 -134 -27 142 -224
4489b24J66L4n08M98L34k93k49N63n12o8M33K6m90O28j55l11J19L26n91K51K99
$$ -224 -58 -24 -532 -34 300 7 -242 321 -191 -259 174 200 -290 338 183 -128 -9 317 -274 -23 276
4510B76n47J31O18n12l77P05l78l99O95j27n56P52p7o43N38k2k82M12J99n78K9
$$ 276 -271 -140 478 -34 -411 294 -84 -483 212 85 -471 281 204 -439 99 77 -205 207 406 -172 -143
4531a43M81m52j55L90O1m82N30k63k68J98K90m31K54L51n60j48Q01m87j73N61
$$ -143 338 -114 -269 121 182 -300 230 -33 -301 -103 187 -244 10 361 -199 -347 454 -33 -206 355
4551C55j89m81N46J34r54M98K99n61J43P08n50l0M59l42l74O14j14k75K77j21
$$ 355 166 -315 231 365 -589 -91 208 -353 -210 498 -52 -82 377 35 -339 275 161 -114 163 42
4571D2l09M23J01p36N77K83l52j62O44n33k9K92k41l59N86k91l48Q66k22n51P8
$$ 42 -267 156 257 -479 98 381 29 -133 511 -22 -51 241 0 -359 227 -64 -412 454 232 -319 -241
4592b41P13p88K36L95n91K35L59o06m6Q17o31j23M59J80o53M93j34l42N6L78k46
$$ -241 472 -316 -80 315 -276 -41 318 -288 -334 483 -148 -271 188 368 -285 208 74 -268 -212 166 -80
4613h0j51O07o76L0Q06l95o87R03p7p97O24L24o94J33M52l44j49N27m21j62O55
$$ -80 -231 376 -300 -270 536 141 -546 357 280 -517 107 431 -263 -130 322 -22 -171 356 -65 -227 428
4634D28o51LP14k28n79J81J50m02K13N34o57J6P57o14N2J05j39k53M23J84l10
$$ 428 -223 -220 494 266 -313 -132 18 -384 -171 363 -294 -278 479 -135 -83 22 -117 -370 53 237 -73
4655g3K54J94p29N53k15j90j4N93m51q5L15j95j81L37J35o31O51j07m89L02K38
$$ -73 181 375 -354 199 -16 -206 -220 373 -78 -163 152 -43 -224 113 248 -383 268 161 -328 -26 212
4676B12n94N49Q6m45J50M68k99l15L52o7l53N98k08m91N94N6m36k01M39k32J2
$$ 212 -382 167 253 -192 -42 426 127 -188 164 97 -256 342 134 -357 237 293 -143 -344 95 -137 -125
4697a25N01n23Q0K65j79l15M31J28l37l9K18j98k9K67j68J1L22l89K44J06k52
$$ -125 376 -147 -67 198 19 -296 135 263 -74 -113 105 -93 -122 145 -23 -12 310 -79 165 271 19
4718A9km2K05m92M46j31J10Q0k20k58M53j39N6k04K61j79J07K24m26N7L61k21
$$ 19 17 -25 180 -312 134 3 113 193 -27 -285 168 29 85 -119 142 -37 70 294 -132 -75 286 65
4740F5j98J67m9j05L97j83J15j19kj23o2M48n81j37L63L12n55K19P3l58K75N8
$$ 65 -133 34 -15 -120 277 94 209 90 88 -35 -97 351 -230 -367 -4 308 -247 -28 45 -313 -38 20
4762B0k18k5K49k07j17M44p6R5o1m3k21L39o0j0j75P6Oj56J03k7J09nPk31N33
$$ 20 -198 -223 26 -181 -298 146 70 165 104 61 -160 179 119 109 -66 10 16 -140 -37 -64 45 40 47 -184 349
4787C49n18P6K30nl47J70J63k81J88J67j91K8o1j33JL38k7k32J43J85l71J69J7
$$ 349 -169 -93 137 132 -215 -45 118 -163 25 192 1 29 -32 -165 -164 174 147 -85 58 243 -128 41 58
4810E8Lkj3l40M56j12k90K71n1mj36J56Nq8M4q1Q5K9K19j30l12K69r7N9RK19n74
$$ 58 61 59 46 -294 162 50 -240 31 -20 -24 -160 -4 1 -87 -43 -124 -39 -10 209 79 -233 36 -61 -2 7 226 -348
4837c48J31M55l86J68Q0n7j46K3L2j40J43l0K32j17j64lL63j56Q6l12K37l5R3
$$ -348 -217 238 -148 20 100 43 -103 -80 -48 -188 -45 -75 157 40 -124 -127 236 80 166 -146 91 56 149
4860A49k63J86j4R9l13K19K67n17K17p3K29l60J71pj55K66k03J60l0J46j31j68
$$ 149 -114 72 58 157 -156 63 330 -187 30 -43 186 -174 -3 -10 -165 101 -102 58 28 174 43 -125
4882a25J6J09m5k2k22K83Q0k35K43j34L88n04J44J59l23K07K55l79n5J42N4q2
$$ -125 -109 0 -45 -67 -289 -6 74 -161 82 -52 336 -168 -24 135 -188 19 274 -105 -160 -18 36 -46
4904d6K1L5O0r0L0j68J75lk73K48J38l28K20k57L08k3K29k56J50q0P2k69Q9KL6
$$ -46 -25 10 70 -20 10 -158 17 14 -259 -11 127 -201 19 -238 70 47 276 20 170 90 162 -107 -18 -16 20
4929B0p8J62j35J10kl64K64J86m4j38K04K1j86J84l1j99J09j42j00L90j14k49
$$ 20 -58 104 -31 79 77 -287 -23 163 119 -19 185 206 20 204 173 -26 83 -59 -159 231 117 -132
4951a32j46L71j44O5J83m76M09k7Q4k50qK11m91K81L23l65J99p4J2p6L39l15J86
$$ -132 -278 93 -51 14 197 -279 130 103 187 -63 -71 140 -351 -70 253 -112 87 13 25 -51 288 -27 159
4974A59m8k55K05l90L79k84K92J14k88q2M25r8r5P7O8k72J35l1j17L32j98j06
$$ 159 111 -144 61 -329 50 -234 58 172 -116 -198 227 129 34 111 179 -93 42 11 -106 226 28 -78
4996g8P4oj0l7K57l75J90Q8j59n7K17j16R2j01%j36J55L14n96M06l4j77j13J97
$$ -78 -4 -10 -20 -57 200 -175 15 103 -56 -113 104 -12 80 -21 -21 -157 -2 312 -284 122 88 -89 -202 -5
5020eP9l74M54k65l4M14j15k23K68j26j0j06K76m87L35K69n20R6N2r5J3K97n0
$$ -5 74 -300 154 -111 -145 269 154 -69 199 73 63 -43 233 -254 81 350 -170 -74 -22 -117 -104 193 143
5043A43m18L62J04l06Q7J77l44J38K82r0k77J12K1j36N5P6k23L77M1m16J9M37
$$ 143 -275 87 191 -115 -28 149 -195 -57 225 135 -142 -30 -9 -145 -90 -14 -237 140 181 -235 -216 221
5065B21k00j36M10p43M75N2k21r4N07l23r3K40J03m29K65K3j73M19l19l36J98
$$ 221 21 -115 295 -448 27 79 -142 -236 271 -52 -145 95 198 -231 34 57 -116 303 -16 -352 -154
5086a54M12k04m13J48R0K02M5j60k32O56n35j53K35K09k37M0M80n38J18K17l41
$$ -154 258 54 -359 -211 -121 81 126 -34 -266 390 -145 -298 -63 146 -91 -51 429 -109 9 226 -115
5107a15o4K89l0m65K82L55m99N65l00k92M10K43l70N0N0Q5j46K59l53l00M47r7
$$ -115 -179 110 80 -385 -103 252 -247 318 18 -274 136 379 9 59 109 194 48 307 -46 -346 101 4
5129DM4P4m6l64K89L3l4j06J00K5j85L37j53l02K65J08k01J30J03j87j7J76k96
$$ 4 48 122 76 -288 1 34 0 -106 -6 19 -166 171 18 -284 -19 89 -112 18 121 -66 -83 93 -203
5152b03K44J48l98L42j77m1J16J15k30m6L36p6rl0p2k08K81J44k32j82L81m41
$$ -203 41 189 -209 133 -44 -85 31 146 -84 -130 206 130 121 91 19 -189 92 236 4 -178 203 -238
5174b38O2P16p86L05O6k58m4K65l9lj07K1j91J71J68m5j00J09J35l10M2J77n9
$$ -238 -176 540 -246 59 125 -133 -177 88 49 46 -61 -40 -231 -60 108 63 -37 72 207 -103 -61 116 57
5197E7J24n7J2J4j03j47j5P5o3J46p3k6j04K06J45r2J11J33n53O3P2k1M4k18R4
$$ 57 181 124 136 150 47 -100 -115 -40 -103 43 -30 -56 -160 46 191 99 210 343 -210 -147 -75 -96 -52 -270 -176
5222a76j16M52k01r9L15j84L6QM03o02M7L09p5j3K75n91Q3J74J33l65K84k58J57
$$ -176 -292 160 -41 -140 175 -9 27 35 438 -164 -117 192 117 104 379 -212 -129 45 178 -187 97 -161 -4
5245dK02k0O7j90J88m42L48l81L73k50J48k1p2j00K42k42K05q2l4k6L58k01n9
$$ -4 198 178 245 55 243 -199 149 -232 141 -109 39 18 -54 -154 88 -154 51 -31 -65 -91 267 66 7
5268Gk40J72K07j97j34J04K74k1j16k31N06k61l47L28M0n8K9j58n5L1o6K67J56
$$ 7 -233 -61 146 -51 -185 -81 193 172 56 -175 331 70 -277 51 91 33 62 -96 -151 -120 -186 81 237
5291B37l00O5M1k27J64J65k44j93J73J2K06l01J38J66j10k25oO9J58j38J00K8
$$ 237 -63 2 43 -184 -20 145 -99 -292 -119 -107 99 -202 -64 102 -8 -233 -239 -170 -12 -150 -50 -22
5313b2M5j46L0k37K69j16K05j27K38j27p7J51j74K4o0J48j23O9J34l4j50K28j09
$$ -22 23 -123 -93 -330 -61 -177 28 -99 139 12 -65 86 -88 -64 -124 24 -99 -30 104 70 -80 148 39
5336C9o6J66M3j42m04N95p5j62K9O0m4j67R4K22l02j2K44o3J39j66J92j79K52
$$ 39 -27 139 182 40 -364 231 156 -6 23 83 39 -128 -34 188 -114 -126 118 55 194 28 220 41 293
5359B93k36k7j17L4p9K73J8r7k03K68o8k25J09M42r6l44r3O8J96j37j21l4J40
$$ 293 57 30 -87 -53 -132 141 159 62 -141 127 59 -166 -57 385 289 -55 -148 -80 116 -21 -142 -176 -36
5382c6n1J29j12J27j59Q1j74L11j9m7L0j63J71n1J5K4J17k51k1l5L81k75o4L9
$$ -36 -87 42 -70 57 -102 -21 -195 116 97 50 80 -83 88 37 52 76 193 -58 -79 -114 267 -8 -72 -33
5406c3k2p9J07q0J42k03K38k19K80l1j29n6K14l19K41J23k37K46j30K12k64R2
$$ -33 -55 -134 -27 -107 35 -168 70 -149 131 100 -29 -85 129 -190 51 174 -63 183 53 265 1 93
5428I3j41j77K85J92q1k17r2J88K7j96J15Pl5J7j00M8nl3K49j30j72J44J18j14
$$ 93 -48 -225 60 252 171 -46 -138 50 77 -119 -4 3 -32 -15 -115 -67 -72 -105 144 14 -158 -14 104 -10
5452a0J99k38q2J61r8j13q9O68o14K0J36K68j77k15K75l04K71J83k73m1Q6k30
$$ -10 189 -49 -131 30 -68 -181 -270 398 -216 -196 -60 208 31 -184 91 -213 58 241 -32 -73 13 -217
5474b17K69j33k2J58j7oK37k30Q1j08j07J40j95J62j7L6Q7L9n9k83P2O2j47K71
$$ -217 52 -81 -103 55 38 32 269 39 120 12 -95 45 -150 12 -5 31 118 157 98 -185 -113 -51 -198 73
5498G3k52J31J87o8k50l3J41j62J69K28k14j09J04j89R0J45L30l29mJ50r8K40
$$ 73 -179 -48 139 71 -179 -212 -71 -233 -64 164 -50 -159 -55 -244 -154 -9 321 -8 -12 138 40 280
5520B80l92J46P2jm49P0J69J07j14J28j17J26L6k36J15K47j38J16p6J15j4Lm58
$$ 280 -112 34 106 105 -344 -274 -105 2 -112 16 -101 25 61 -175 -60 187 49 165 89 204 190 193 -265
5543b65K15j1L44k81p5M20j75k38k02J82J74n1Q1k10L8L86k24k1N1P8k13m35O73
$$ -265 -50 -61 283 2 -73 347 172 -66 -268 -86 88 37 118 -92 -54 332 108 87 138 216 3 -432 241
5566B41n2l6k21k15M22M4l76O3L12q4O0O9j65o9L06j65j47q4K25m56K65N4j31
$$ 241 189 153 -68 -283 139 183 -193 -130 182 98 158 227 62 -7 299 134 -13 -97 128 -328 -63 -9 -140
5589a40QM03l67K63o6l9k06J59K57k46K08k64l7J29L1m57M19N3j95L2J71J01m41
$$ -140 -132 271 -96 167 101 62 -144 15 272 26 234 -30 -67 62 93 -364 55 108 -87 -55 116 217 -224
5612b24L26k80K27M9l68N4L53m2l4k4k4L13k84q9j65J90J86k74o0K61lm6o5K9
$$ -224 102 -178 49 98 -270 -216 137 95 61 37 13 326 42 -47 -212 -22 164 -110 -170 91 88 42 -23 6
5636Fl2l8k2k4L83j48l33P8J09LJ67l59J55J66R3k00k37M58j01j30k7jP2N2j72
$$ 6 -26 -64 -86 -110 273 125 -208 -130 -21 -18 149 -210 -55 111 204 4 -233 225 124 -6 -33 -34 38 90 -82
5661h2o3N32l83j56K1K01J49l21N1J0p7q7M39m13L73l8m16M7K38L8p3K36k32n8
$$ -82 -145 387 4 -152 -131 70 219 -102 -51 -41 -118 -205 234 -179 194 156 -260 -213 25 63 -10 226 -6 -64
5685f4J13N9OJ5k40J84k41L68m65K20j14j20L37r5r5M3P7L9L9m96L21K29j16j72
$$ -64 49 108 114 129 -111 73 -168 200 -265 -45 -159 -279 58 -37 -132 -89 -12 27 66 -430 -109 120 4 -168
5709a68p4K95K61k63j1L11l26L8j12J48j43o0M47n28J68J26R2l49J89j15J42P2
$$ -168 -242 53 314 51 40 351 25 63 -49 99 -44 -104 343 -185 -17 109 201 -148 41 -74 68 140
5731A40j16K1J64k27r6J07mj72m3L81m5J09k80J95j77J85j93j81J78K00r2j00
$$ 140 24 45 209 -18 -114 -7 -11 -183 -226 155 110 219 -61 134 -43 142 -51 -232 -54 146 54 -46
5753d6j2Q4j35j45L59j12R6j71R4K02j74M2j27K31n9J15l1k35J40O9j80j62K88
$$ -46 -58 26 -109 -254 105 -7 89 -82 12 214 40 82 -45 186 127 242 211 -24 116 185 5 -157 131
5776A31j61%K36l79K23K12l7l51K81j58k8j46J66l9K09J50k10j19j3J41p8q1j95
$$ 131 -30 -30 206 -173 50 262 225 -126 155 -3 -31 -177 -11 -50 159 309 99 -20 -33 108 30 -51 -246
5799b46L61p6j74jR8J80m21K87J49N0p0j66r3K29l3L48o93N83k91j41k6L06p4
$$ -246 115 39 -135 -136 -38 142 -279 8 157 207 137 -29 -122 107 74 422 -271 312 21 -120 -146 160 86
5822H6p5J14j54j8J02j9J57m6j97J54r9L7j15J66p9r5N2k44J43L51n9m24K51K27
$$ 86 11 125 -29 -47 55 36 193 147 -50 104 5 42 -73 93 14 -81 -29 -273 -130 221 162 -262 -11 216
5846B16j34j78L10j74J17k96K32r7K4N7o0q0P4k03K45o1OJ28k5r0p1j51J98Nj61
$$ 216 82 -96 214 40 157 -139 93 -4 20 77 17 -63 11 -192 53 -8 -2 126 101 11 -60 -211 -13 -8 -169
5871a69R4J37r5o5L1N6L9o3J48k04P5L2O3j09L5p3L42p4l80j03L63k49K10j57
$$ -169 -75 62 -33 -98 -67 -11 28 -35 113 -91 -16 16 79 -30 5 -68 274 200 -180 -283 80 -169 41 -116
5895a16M5k7P5J37j92r4K19o2k2N5L5m3K16j07K9m05K15N1j96K65k65L36l05L13
$$ -116 -71 -98 -23 114 -78 -172 47 -15 -37 18 53 10 226 119 148 -257 -42 9 -187 78 -187 149 -156 157
5919A57j62l03L97R7L4P4k75m6j91M0L51k1j14j01l6J47o5J4L2J45k15l8J5L2
$$ 157 -5 -308 89 186 220 294 19 -27 -218 -178 173 152 38 -63 -99 48 -17 -3 29 174 -41 -79 -64 -32
5943c2j3j18L49k60J63k19J44J14j26M7L13m49J21k44L49l1o9J2o3K46J10j76
$$ -32 -45 -163 186 -74 89 -130 14 128 2 49 362 -87 34 -210 139 108 39 51 -12 234 344 168
5965A68l93K69J11j16L0j12R2K29l54j1LL35l04R1J32k0r2K8J1j1j4R2m01M38
$$ 168 -225 44 155 39 69 -43 49 278 -76 -87 -84 251 -53 38 170 150 58 86 97 86 72 164 -237 201
5989B01q1k06q8J64J37k75R6j2mj3J11j4L4l19M01l59J35r4Q8K71j88K85j85J54
$$ 201 120 -86 -174 -10 127 -148 -52 -64 -68 -81 30 16 50 -269 132 -227 -92 -186 -98 173 -15 270 85 239
6013B39m55J9K33n2J38j58J03J41m6r8j01J48pj44J8O0Pk32K61M5k2M6l25J73
$$ 239 -216 -197 36 -16 122 -36 67 208 162 64 -37 111 104 -40 -22 38 45 -187 74 119 97 143 -182 -9
6037iR9k13J76O2J04m8j35K6O6k9J01k16J03k26L17j15j97J21j8L39n25K50K63
$$ -9 90 -123 53 115 219 171 36 62 128 99 200 -16 87 -139 178 63 -134 -13 -31 308 -217 33 296
6060B96l52j29jJ20K32p6j70N3N5k24J37N0J65K6n7j94J29O6j30o0k9M9O2J5J91
$$ 296 -56 -185 -186 -66 166 90 -80 -27 28 -196 -59 -9 156 182 125 -69 60 126 -4 -64 -93 -44 18 33 224
6085B24k52J3K96l02j68K07k65p5K52J11k9K6j64M7J87R7n09L85N1r5n3MJ5J04
$$ 224 -28 -15 281 -21 -189 18 -247 -322 -70 41 12 38 -126 -79 108 205 -304 81 132 37 -16 -12 3 107
6109A07j00j25J9L5Om6J42Rr2k33J82j44K49q1M14j43Q7l75K3Q3J11m5k40N7J62
$$ 107 7 -118 -99 -64 -58 -104 38 47 -45 -278 -96 -240 9 -72 342 199 286 -89 -66 17 128 83 -157 -100 62
6134F2j37j15K98j81K42k82K1K88J6k81MM8K1K9N8m13M69p0J65k94m9Q0J49K0
$$ 62 -75 -190 108 -73 169 -113 -92 196 212 -69 -65 -17 4 33 91 -322 147 77 242 -52 -101 -21 128 148
6158A48r3p9L04km75o5L29L8n0j47j86M20j60j03j2K95n3j00N4p8j70K43j70q4
$$ 148 55 -24 280 278 -197 -262 67 105 55 -92 -278 142 -18 -121 -133 162 109 9 63 -15 -185 58 -112 -196
6182a96L16q8j52L8L62l03r1M2K09j13J47k58j55J86J71j10k67L02j82K76j17
$$ -196 120 32 -120 -82 280 -23 -114 -72 137 24 171 -87 -242 -56 115 5 -262 40 -142 134 17
6203A7P4j78J55j46J39j34K8L0j39K24J4j42Q6l2J56K15m36J15r9p4J1M62o15
$$ 17 91 -87 68 -78 61 -73 -45 -15 -154 70 84 -58 28 -4 152 367 -69 46 -53 -127 -116 346 -269
6226b69O8K50o4mN9K6k4lQ5j97O4p4K34j42j07J4O8K59j09pm3q6R7j01r1j28J89
$$ -269 -201 49 -15 -19 40 66 42 39 124 -73 -9 -83 151 9 -98 -84 -16 243 134 127 84 -2 95 -6 -97 -225 -36
6253c6p7K4J9j1j4K3J95r2k71J11K22r9j53L20l76J46L1J1k05M04k57J11K30m49
$$ -36 -113 -89 -70 -81 -95 -72 123 31 -240 -129 93 -6 -159 161 -215 -69 -38 -27 -232 172 -85 26 256 -193
6277a93K52J5P7m5J86l41P8P6o7R7J52n26K46qm2J6n4J75n6m5m0J59jr8j17M1
$$ -193 59 74 151 106 292 -49 29 105 38 135 287 -239 7 -1 -43 -27 -81 94 38 -7 -47 112 111 13 -104 -63
6303f3L45j68k26J31P5j7j90K37p0L7k2o7J34j07J91k54o6q5n7K09j99L26k72
$$ -63 282 114 -112 19 94 77 -113 124 54 91 69 2 136 29 220 -34 -100 -185 -242 -33 -232 94 -178
6326a78L03l42K51n6Qpn0Q4m4M8J53j79p2K60m8j80J77j24p6rl8K70j17j81J91
$$ -178 125 -217 34 -22 -14 -21 -71 13 -31 17 170 -9 -81 179 131 -49 128 4 -72 -81 -119 151 34 -147 44
6351D4k85J92l8N6j60K40j66J50N7J72j54KL3j51J55j79N9j25J26j28K6L1P5r1
$$ 44 -241 -49 -87 -31 -191 49 -117 33 90 262 108 110 143 -8 147 -32 27 -98 28 -100 -74 -43 32 -59
6375e9J46j27K48k10lP2K0j36p2K26m38K37L5J47j05J81J4l28J27LRj04Q8P9k3
$$ -59 87 -40 208 -2 -5 67 87 -49 -121 105 -333 -96 -61 86 -19 162 176 -152 -25 -22 -13 -117 -29 50 27
6400B7J25j50P1J11j72r6J22J70l36jRK03k24K92j81j6O7P5j04p5K11k15RJ93
$$ 27 152 2 73 184 12 -84 38 208 -128 -129 -120 83 -141 151 -30 -46 21 96 -8 -83 128 -87 -78 115
6424A15r2K2M2k63L27k27J41l09J08K70j29n1O5k65K77l33L20K24l05J89L1k87
$$ 115 23 45 87 -176 151 -76 65 -244 -136 134 5 -46 19 -246 31 -302 18 242 -63 126 157 -130
6446a30k7L24r6k41K47o5Q8j07K5j15O7JO5j22J57j48O8O5k40J58PQ3j61j11L35
$$ -130 -157 167 71 -170 77 12 100 -7 18 -97 -30 -29 36 -86 71 -77 -9 56 -184 -26 -19 64 -97 -208 127
6471A27k16l2L99l95Q4qj71L2O5K95k08o9M6M16l64J23k06J71j10k7k7M65n00
$$ 127 -89 -121 278 -117 -33 -41 -212 -180 -115 180 -28 -97 -51 365 1 124 -82 89 -21 -48 -75 390 -110
6494a10J16Lm4n9j8J34o4O8j69oL61k68j09j1K15k80K57j04K7P8K8j11j52J47
$$ -110 6 9 -35 -94 -112 22 -42 26 -143 -149 212 -56 -165 -176 39 -241 16 -88 -61 17 45 -66 -218 -71
6518g1J64j9k22J19K49m13L08r9r3k21J90k2K60j31j14L17j81J95k14LM3K5n0
$$ -71 93 74 -148 -29 220 -193 115 16 -77 -298 -108 -130 130 -1 -115 202 21 216 2 5 48 73 23
6541B3O3k26J56k13J01p7L68j65r3J90l84K17M6K0K0j82N7Q0l4r3L34J75k63k36
$$ 23 86 -140 16 -197 -96 -173 195 30 -63 127 -257 -40 6 26 46 -136 -79 1 -33 -126 208 383 120 -116
6565a16J14L1j20m8J09k6R8L5J23j08K13l29o7J43k37K15J01K5n4k54J28O7J36
$$ -116 -2 29 -91 -139 -30 -56 42 77 200 92 305 -24 -91 52 -185 30 131 156 102 -152 -24 43 179
6588A79l71K15j13K23j34j77J41k48K39J80%k36J51J40l13J31Q4k63J3J33O0l
$$ 179 -192 23 -90 133 -1 -178 -37 -285 -46 134 134 -102 49 189 -124 7 91 -172 -159 -26 34 31
6610C1P7l87L13jM7M3j07l37K02L60m59O6Q2K05k15jJ24P6o1j81K52L5k14j22
$$ 31 108 -279 34 33 80 123 16 -321 -119 241 -218 -152 -70 135 -80 -81 43 119 58 -123 129 164 -50 -172
6634a72L5L35k75l3K01k37K94k14J4J20M0J09l18o5K3n6M29l91k0K51J21l06k05
$$ -172 -137 198 -77 -110 91 -146 148 -66 -52 68 108 217 -101 -166 -143 -199 230 -161 -181 70 191 -115 -320
6657c20K98j66K07k21K20k2m7KK44l48K55pl03K54K19l54j54K51K71k43K50k44
$$ -320 -22 -188 19 -202 18 -4 -51 -49 195 -153 102 95 -208 46 265 -89 -243 8 279 36 286 42
6679D2K63j82k39R4k50L09k30J62J82j80L21k45k19K14J15k32N5J72r5j45J53
$$ 42 305 123 -116 -22 -272 37 -193 -31 151 -29 292 47 -172 42 157 -75 -20 152 57 -88 65
6700F5q2J34Q0k38L0m1J64j22k22j3J34K43l2j20N0k95M92j71r3o0J31j37L24
$$ 65 -17 117 197 -41 -11 -52 112 -10 -232 -245 -111 132 100 -20 30 -265 227 56 -37 -97 34 -103 221
6723B21j28q2j04J63J24Q1l80J0J35L4j43l6K63k33P0j84K87k6Rk06K19Kp4J70
$$ 221 93 11 -93 70 194 275 -105 -95 40 74 -69 -105 158 -75 -5 -189 98 72 81 -125 94 96 22 192
6747A92l17J06J11j78J09K7j08J44mk33N14k03J53j07k07j02K39j75R1Nj4L5r8
$$ 192 -125 -19 92 -86 23 50 -58 86 82 -151 363 160 313 206 -1 -103 136 -39 52 57 43 78 -20
6770b0M8R6k82M16m00K39j01j8J55r8k57K78j24J23L2m1R7l62L08o3r7n1M08k37
$$ -20 28 124 -158 258 -142 97 -4 -22 133 35 -222 56 -68 55 87 46 143 -219 89 26 -71 -122 286 49
6794D9J27l7l8K5m5j98K58n7o9p4l5k27L18K32j73j55L58j09n8J9j0r8O7R4j04
$$ 49 176 139 101 126 81 -117 141 84 15 -59 -94 -321 -3 229 56 -99 259 150 92 111 101 3 70 164 60
6819F0k56K66m7J86j73r8L9m6J08k34P2L56j24l65L26k97m2M67j33p5qM9K1r1
$$ 60 -196 70 23 209 36 -62 -23 -69 39 -195 -123 233 109 -256 70 -227 -269 198 65 -10 -18 31 52 -39
6843c9J46l06L46k2L8l34K56j99J25Q2j21k69L81k81K60p4m7K78j98K12l12J1
$$ -39 107 -199 147 125 163 -171 85 -114 11 93 -28 -297 84 -197 63 -11 -58 220 22 234 -78 -67
6865f7j29J63J46j77L4O0P5l9k88L47l3k96L02J9k47L63p6j49O2l7N2j86K52J9
$$ -67 -196 -33 113 -64 -30 30 105 66 -222 125 92 -204 98 117 -130 233 157 8 70 33 85 -101 151 170
6889A70j90J33J2k05K20L2j01k28K68k15J20J61j61q8J98j8j75J81k06k7J58p9
$$ 170 -20 113 125 -80 140 172 71 -157 111 -104 16 177 16 -72 126 108 -67 114 -92 -119 39 -40
6911d0p7L05j12k05K10j29j0lR1k4j67M40l22k6jL2L6J89k98K23j20K0j58J43
$$ -40 -117 188 76 -129 81 -48 -58 -61 30 6 -161 279 -43 -69 -70 -38 -2 187 -111 112 -8 12 -146 -3
6935ck44L29j34J90Q9m25K59r0q8K63M6j86j86J42M2k21kL0M31l56J92j51J28
$$ -3 -247 82 -52 138 227 -198 61 -29 -117 146 192 6 -180 -38 4 -217 -219 -189 242 -114 78 -73 55
6958E5l83L40P9J76l36R6j91O9J58j79L73m08J28K32j64r5K99m20N04l03p8J24
$$ 55 -328 12 91 267 -69 27 -164 -95 63 -116 257 -151 -23 209 45 -50 249 -171 333 30 -48 76
6980G6k14J29k1N5K02k54r9k1J85L94l91j13O1J17n1j78J72K31l21P7Mk42K28
$$ 76 -138 -9 -30 25 227 -27 -126 -147 38 432 41 -72 -11 106 55 -123 49 280 -41 36 40 -202 26
7003B6J7Mq5o2K03j72J18j72P4P0k13L63r6j79j03L26n7j91o3L51k82L97k03r3
$$ 26 43 47 -38 -100 103 -69 49 -123 -49 21 -192 171 75 -104 -207 119 62 -129 -192 159 -123 274 71 -22
7027b2J15m3j3oL65m68L5P2n3Q1J26k70J70O4n3p5K0J23k92Qj8pK06l8J01j73
$$ -22 93 50 37 31 396 -72 -37 35 -18 63 189 -81 89 153 100 25 45 168 -124 -116 -134 -141 65 27 128 -45
7053d5J3o8L32l07J53j10K28k24j88K21J78l54j3K11M0j48K37m24L06P3j39L29
$$ -45 -32 -100 232 -75 78 -32 196 -28 -216 5 183 -171 -184 27 67 -81 156 -268 38 111 -28 301
7075C01l09Kr8K38j84N0pj7j09j09L95j02l2nj56J44m6J24Q2l6J4l7l08K25l7
$$ 301 -8 -6 -104 134 -50 0 -7 -24 -133 -242 153 51 19 14 -142 2 -44 80 162 126 140 103 -205 20 -17
7100a7J12n7K9j40k01O6J24J02j71J83l01L69k29L8J12k80N24k59j69L14j5j69
$$ -17 95 38 67 -73 -274 -208 -84 18 -153 30 -271 98 -131 -93 19 -261 263 4 -165 149 134 -35
7122c5jj6J93k25K21j29j70L61J05o31K83J35o5j11J89O3j34K4k9k59M21j12j61
$$ -35 -36 -52 141 -84 137 8 -162 199 304 -327 -44 91 26 -85 104 167 33 57 28 -231 190 78 -83
7145h3q6M08n2j45j04M1l5J82j19j44K66M9k36M8R3l38N8K06j63K74k02n6J9M72
$$ -83 -169 239 187 42 -62 -21 -56 126 7 -137 129 178 -58 -10 83 -255 -197 9 -154 120 -82 -138 -119 353
7169C53m18J81k77K4nK03j2j37j6L96l46r2O3J4K20k8j72J47J94n22K91q4J91
$$ 353 -65 116 -161 -137 -142 61 49 -88 -104 292 -54 -146 -83 -69 151 123 -49 98 292 -230 61 -23 168
7192A68k53P1l1J58p3J93k20J38J6K04n53L01nr3J9k43K20M1k21K51k91K73n1
$$ 168 -85 -14 -45 113 40 233 13 151 167 371 -182 119 114 21 40 -203 17 58 -163 88 -203 70 19
7215A9J36j69p4j84K68O2j11P8j52J09K33l6m55J07N9j4j9J80n4j04J62L2k04
$$ 19 155 -14 -88 -272 -4 58 -53 25 -127 -18 215 179 -276 -169 -110 -124 -143 37 -17 -121 41 73 -131
7238a31K46M7o2k35K11l50m4J72L49k10Q1j14%j72K17K7O3j76K34Jj16q4O3l5
$$ -131 115 162 100 -135 76 -274 -318 -146 203 -7 74 -40 -40 -212 5 32 95 -81 153 154 38 -46 17 -18
7262a8M0j31L8l2Q2k1Q3l2L56m11j33K77j91K97o2kr4L6j27J25k92J83J25j77
$$ -18 22 -109 -71 -103 -21 -42 41 9 365 -46 -179 98 -93 204 142 140 46 82 -45 80 -212 -29 96 -81
7286h1n6J61q6P7J45j57J5L7k26O2J55n8n7L4k15N2J07l7P5j8J07QN9j84R8j63
$$ -81 -137 24 -62 15 160 3 18 55 -171 -109 46 -12 -69 -35 -250 -198 -91 -128 -53 -71 36 44 103 -81 17 -146
7312a46K24J49k23l6J77Nj72j39K84j66j92K36k14K53q4q5M4j05N6m0M17k5k31
$$ -146 78 227 4 -32 145 150 -22 -161 123 -43 -235 1 -213 40 -44 -129 -85 -190 -134 -174 243 218 -13
7335a3J30K54l31mq9Q5j21Q0R8k36K74k74K69j96M8R7k09J60r6L49j22k39N9l7
$$ -13 117 371 40 36 -53 32 -89 -9 89 -147 127 -147 122 -74 -26 71 -138 22 -74 275 153 -86 -27 -64
7359f4k19L21m9L9k1r9m2K73k65J11M2Q5l33K67j74k8j79M46j05r4K34k89L21
$$ -64 -283 38 -11 28 7 -92 -134 139 -126 -15 27 112 -221 46 -128 -156 -335 111 6 -88 146 -143 178
7382A78j44k74K82r2j8J31k66J18p8K07m0J76k49j7L00o6j14J7m8J06k45J67n4
$$ 178 34 -240 42 -50 -68 63 -203 -85 -163 44 4 180 -69 -86 214 148 34 51 3 109 -136 31 -23
7405b3j15J54j13K33j56j56J76p1o2J51N3l0l1L0l9M80o02M1RJ68m6k54N22l52
$$ -23 -138 16 -97 136 -20 -176 0 -71 -133 18 71 41 10 40 1 481 -121 -80 -71 97 51 -203 319 -33
7429c3K68k76L12l46nK21k80J29J3J78q3R7j74j12l1K65MJ76m70J67Q9n1q6J5
$$ -33 235 -41 271 -75 -80 141 -139 -10 3 181 98 195 21 -91 -122 143 147 323 -147 20 109 58 -28 -13
7453a3j6m4J22j73J4K45k0j39o8J02j23J77J08j13p9O7J75m79K85L7k63K97j19
$$ -13 -29 -73 49 -124 -110 135 115 -24 -92 10 -113 64 172 59 -20 47 222 -257 28 65 -198 99 -20
7476b0K35k45K0J59j17J81j24k72K16j04K56l36M6K63k98M8J3j63L14q7L2L04
$$ -20 215 -30 -10 149 32 213 89 -183 33 -71 185 -151 -105 158 -140 -92 -79 -242 72 -15 17 321
7498C21m40J60K14l90K0N1j26M6J32j16J00J0J88l17J31J55j26j11J98l5k26L24
$$ 321 -119 41 255 -135 -115 -64 -190 -144 -12 -128 -28 -18 170 -147 -16 139 13 -98 100 65 -161 163
7520A63l69Q2O5K37q7l83K95J82o4j04N6o6P0K7j11R6n2j29R9k00K76l4m3J77
$$ 163 -206 -124 -59 178 91 -292 3 185 121 17 73 7 77 104 -7 89 37 -92 7 -193 83 49 6 183
7544A83k05L0J00j34K34k89L85k30ln5j05k9L16M1l89mP1J72j45L66m26P8K5k29
$$ 183 -22 8 108 -26 208 -81 304 74 71 16 -89 -118 198 239 -150 -154 -83 89 -56 310 -116 -38 -13 -242
7568b42L66J9j08N5j74lJ82j08P3j64K56P0n64M46n0oj86J06Q1m0J8rk01K82J76
$$ -242 124 143 35 90 -84 -87 95 -13 60 -104 152 222 -342 104 54 48 -138 -32 49 9 27 18 -183 99 275
7593B75m09J83j32kQ3n6O6J12j11pk40N7N24k20j61K39j50j63j14L45q9Ll22J71
$$ 275 -134 49 -83 -85 -2 -58 8 120 9 2 -238 -181 343 123 -38 201 51 -112 -226 119 30 33 -289 -118
7617a18K74j13j00L2L52k60j30k7K26J25k49p1r9R3K24j32K6j56K26m2L5k77j12
$$ -118 156 43 -57 -25 327 67 -63 -90 136 261 12 -59 -158 -65 159 27 53 -103 123 81 116 -161 -273
7640b73K91o2ln9J94j16qJ92l27K11o1j88J27J15P3j11lj69q5L94o8j01p2nM7
$$ -273 18 -44 -47 -106 88 -28 -36 156 -171 40 -21 -209 -82 33 106 -5 -8 -177 -262 132 64 -37 -109 -114 -67
7665f7J21K66k88k95K85J28j61j00j01J23M04k85k15M50j49j19J28N4k71j7J99
$$ -67 54 320 32 -263 22 150 -11 -111 -212 -89 315 30 -185 265 116 -3 125 179 -92 -109 90
7686I0n4kJ56k56M21m47Q7J54Q4k66J78k02J03k64K28M8j57M4M9n2J04o7%o2K36
$$ 90 36 34 190 -66 355 -92 -5 149 233 -33 145 -57 46 -218 10 58 -99 -55 -6 -58 46 -21 -21 -83 153
7711A53j02J52k67pJ30k89J01J50R4l51K09m3J96l12P3pJ14jJ67m5k07L6NL30
$$ 153 51 203 -64 -71 59 -230 -129 21 115 -236 -27 -70 126 -186 -113 -120 -6 -7 160 115 -92 -56 -51 279
7735B79k40J51l1k14J7K07J73k78j09P2q6o0J92J3k5J14j93j08J06k5J68k16K6
$$ 279 39 190 159 -55 -38 169 342 64 -45 27 -59 -119 73 86 61 175 -18 -126 -20 -45 123 -93 -67
7758f7K57r7k73M75Kl88J89R5k67L6j36l4%J57j1K85r3j05j2q9k6L03k93n0o2
$$ -67 190 93 -180 295 297 -91 98 193 -74 -38 -174 -208 -208 -51 -62 223 130 25 13 -76 -102 201 -92 -142 -204
7783b04J92l7j52N3k3J58r6j1K50j13J9N6k16O9L11k95J70j18j75J71J34k83J51
$$ -204 -12 -49 -201 -148 -171 -13 -109 -120 130 17 36 92 -124 -55 256 -39 131 13 -162 9 143 -140 11
7806A1j4l5N1N9l72L42l1j36R6M1K97l34jr7O3J95r7Oj67L90j85j20P9k30K74
$$ 11 -3 -38 13 72 -300 42 11 -125 -29 12 309 -25 -26 -123 -60 135 38 44 -123 267 82 -38 41 -189 85
7831H5m6J64q6J06j81Q4q4M9j90L9K23j56Q6J68k44J0j30J88K5j15k2j81J08j59
$$ 85 39 203 117 223 42 126 42 91 -99 -60 163 7 93 261 17 27 -103 85 110 -5 -27 -208 -100 -259
7855b59j3J74J67J46n62M41j15O9p3r7J17L1M4k4j05k38K97k5k9j7k01M19j7l10
$$ -259 -272 -98 69 215 -347 94 -21 48 -25 -122 -5 26 70 46 -59 -297 0 -25 -54 -71 -272 147 130 -180
7879a80K86j56Q7oj34J1K58k07J88k25K82k44j6J50K2p9J70p3k27P8j0q7p4J90
$$ -180 106 -50 37 31 -103 -92 166 -41 147 -78 204 -40 -56 94 116 37 207 134 -93 -15 -25 -112 -186 4
7903Dj58O7K24j45p0j27K44j57J59k37L03l0r0K45m89M09k32J12j98K18J45q2
$$ 4 -154 -87 137 -8 -78 -205 39 -118 41 -196 107 77 -13 232 -257 152 -80 32 -166 52 197 115
7925A15k43J24QP8j18j38K16j6j17K8l9P4N4J29l77L23l78M26j92k01K22L35j25
$$ 115 -128 -4 4 82 -36 -174 42 26 -91 -63 -102 -28 26 155 -222 101 -277 149 -43 -244 -22 313 188
7948A88m42O0O5N2o4M82k99j09Q5L12k95l08J66L20k52J32J6j70Q1K9K29j30j62
$$ 188 -254 -194 -129 -77 -141 341 42 -67 18 330 35 -273 -107 213 -39 93 109 -61 20 49 278 148 -14
7971a4k16J61Ml9J2m5J71O9n3p9k37K45j99L51k68K56p1l7j65R7J99l97L44l47
$$ -14 -230 -69 -65 -104 -92 -137 34 103 50 -29 -266 -21 -220 131 -137 119 48 11 -154 -57 142 -255 89 -258
7995b58J05K07J7J03m5j58O5j54J24j52J29P5r7o0J52K3j14k8R3J94j37J8J19
$$ -258 -153 54 71 174 129 -29 36 -118 6 -146 -17 58 -39 -99 53 76 -38 -66 27 221 84 102 221
8018B21j02j65J27J30r4l28J96k6J24N7J66q1l49J6K91N9j77o9J56j71j71K64
$$ 221 119 -46 81 211 117 -211 -15 -41 83 140 306 225 -124 -108 183 242 65 -4 152 -19 -190 74
8040G4k42J35J48kk63K30j40j1Q0J11o5j24l8J95j46J01P0q9J14k28k37K25Q4
$$ 74 -168 -33 115 113 -150 80 -60 -71 9 120 55 -69 -107 88 -58 43 113 24 138 -90 -327 -102 -18
8063a8k77L57p8m7K0qo9J45p9j87L4K53Pk79L26j00j59K60K2k54J57J74j52m1
$$ -18 -295 62 -16 -63 -43 -51 -120 25 -54 -241 -207 46 53 -226 100 0 -159 101 123 -131 26 200 48 7
8087GJ95m21J07P4o3j09L45Q9l39O0J19L5J08l58J14m0L25j78J00k38j53J79j77
$$ 7 202 -219 -112 -38 -101 -210 135 224 -115 -55 64 99 207 -151 -37 -77 248 70 170 -68 -221 -42 -219
8110b19J50J80k2n0J2j44J74j28mK75k34l08M82k47q7L49m67L58J36l55M2j3R1
$$ -219 -69 111 89 39 51 -93 81 -47 -51 224 -10 -318 164 -83 -170 179 -288 70 206 -149 -107 -120 -29
8133b9J2n9J43l51L46K8NJ3j92L38k57P8n7j57O7J28k3o3N7O7k7k52K59j21J21
$$ -29 -17 -76 67 -284 62 90 95 108 -84 254 -3 75 18 -139 -72 56 33 -30 27 94 67 -185 74 -47 74
8158G4Oj88J79p7m8J24o4l3K49n09J40l3J75l3R7j90J24j78l4M10k71J20j32r7
$$ 74 80 -108 71 -6 -54 70 6 -27 222 -287 -147 -180 -5 -38 59 -131 -7 -185 -219 191 -80 40 -92 -189
8182a89K28k99J18J22K54n30L78l10K81
$$ -189 39 -260 -142 -20 234 -296 82 -228 53
8191E3
$$ Imaginary data points
##PAGE= N=2
##DATA TABLE= (X++(I..I)), XYDATA
0@%%%%%%%%%%Lj1J6j6J6j7K5m0M8m8N6p2Q8j04J20j36J57j82K10k40K70l08L53
$$ 0 0 0 0 0 0 0 0 0 0 0 3 -8 8 -8 8 -9 16 -24 24 -24 32 -40 48 -56 64 -72 85 -97 113 -127 143 -165 188
33A88l98M47n01N60o27P01p81Q66r61J065j178J301j435J583j743J920k116K331
$$ 188 -210 237 -264 296 -331 370 -411 455 -506 559 -619 682 -753 830 -913 1007 -1109 1222
51A222k568K830l125L458l835M266m763N347o044O892p949R298j1088J3590j7320
$$ 1222 -1346 1484 -1641 1817 -2018 2248 -2515 2832 -3212 3680 -4269 5029 -6059 7531 -9789
66i789K3416l4970O3792k53965l37794Q79812p8277n69442L51135Q2673l21935
$$ -9789 13627 -21343 42449 -211516 -549310 330502 252225 -317217 33918 116591 -205344
77b05344M25070q989o34595M18557N23618o97956j91463O43492j25318l19942
$$ -205344 219726 210737 -423858 -5301 518317 -179639 -371102 272390 147072 -172870
87a72870K42527j13214q1854M28355k11421m84802M63625K93011n15854m0656
$$ -172870 69657 -43557 -125411 302944 91523 -393279 70346 363357 -152497 -193153
97a93153L14235j25088P248P1167k82630J46870L79848l73304k61598M58383M9640
$$ -193153 121082 -4006 3242 74409 -208221 -61351 318497 -54807 -316405 141978 191618
108A91618l27287R8060L1970q0412K56084j03595l87727L40869L11971m61140
$$ 191618 -135669 -37609 -5639 -86051 170033 66438 -321289 19580 331551 -129589
118a29589q4944L85599j23498j27095J72908j85974l1343L85475k24689l79812
$$ -129589 -214533 171066 47568 -79527 93381 -92593 -123936 261539 36850 -342962
128c42962M34107J96617m52830M7843K61570j92393M6390J46375l16888N5507
$$ -342962 91145 287762 -165068 -117225 144345 -48048 -1658 144717 -172171 -116664
138a16664M09564k90918k95436M17547O9499l41571J35647J05042j93268J66708
$$ -116664 292900 1982 -293454 124093 193592 -147979 -12332 92710 -100558 66150
148F6150O7497l50009J39953L42197l16996j83688L46104j9800k00143J51976
$$ 66150 133647 -216362 -76409 265788 -51208 -234896 111208 91408 -108735 43241
158D3241l0849j33335K33498j2505l10809J83259K34606k75327p0629K32080o7604
$$ 43241 12392 -120943 112555 100050 -210759 -27500 207106 -68221 -138850 93230 25626
169B5626o5399J15164j16801m1894K28322r0320k21467J83755J12219j86290J1703
$$ 25626 -39773 75391 -41410 -83304 145018 54698 -166769 16986 129205 -57085 -45382
180d5382Q7064p2522N7053M3754j59276N0784J68943j42528j00283J54205n110
$$ -45382 41682 -30840 26213 69967 -89309 -38525 130418 -12110 -112393 41812 36702
191C6702q4459O6582l6524m6145J41788l1273j63830J22436J03375j60095j809
$$ 36702 -47757 18825 -17699 -63844 77944 46671 -117159 5277 108652 -51443 -53252
202e3252J11803q1477m517R1214j05970k2762J67895p2225j40456J44231N1206
$$ -53252 58551 -22926 -27443 63771 -42199 -64961 102934 30709 -109747 34484 85690
213H5690j46450M4109O9826j00336L5415Q1945j20935o516J47671p3183j00393
$$ 85690 -60760 -16651 53175 -47161 -11746 70199 -50736 -57252 90419 17236 -83157
224h3157J18719J7807j02544N0601L0592p8500M6063M9052r4582J1098R6982n7384
$$ -83157 35562 53369 -49175 1426 32018 -46482 -419 48633 -45949 -34851 62131 4747
236D747n0894P2491m031m6365L6181m168l9111M1674Q821n3449K4432L9868l6498
$$ 4747 -46147 26344 22313 -24052 12129 7961 -31150 10524 19345 -34104 -9672 30196 -6302
249f302o918K8176j6165k113J6895k5091l685L1360j7633k0317K8800K398j7585
$$ -6302 -13220 14956 -1209 -3322 13573 -11518 -15203 16157 -1476 -21793 7007 9405 -8180
262h180J7084j01j7985J9879L108k9832J2839J8482k5837k04K3461j4893n245
$$ -8180 8904 8803 -9182 10697 13805 -16027 -3188 15294 -10543 -10747 12714 -2179 -7424
275g424K2440j2745j4208K4163m033k5478J6967R170k3795P324J8160j6550o27
$$ -7424 15016 2271 -11937 12226 8193 -17285 -318 8852 -14943 -7619 10541 -6009 -6636
288f636K0685j2245j0773J9047l792j9628J3177P455j8890L659J6583j0605m855
$$ -6636 14049 1804 -8969 10078 6286 -13342 -165 7290 -11600 -7941 8642 -1963 -6818
301f818J7031k496j2901J0432M792j5668J356J1269j1015o833J4678N74j1710
$$ -6818 10213 7717 -5184 5248 10040 -5628 -4272 6997 -4018 -10851 3827 4401 -7309
314g309R324R284j3048j698J2922q233j1578J1235J487j4711O882J2255j1253
$$ -7309 2015 11299 -1749 -3447 9475 1242 -10336 899 2386 -12325 -5443 6812 -4441
327d441k330J5899m291j2689J1502N112j6123K011J3075j1194p391J7910k34j5685
$$ -4441 -6771 9128 4837 -7852 3650 8762 -7361 -5350 7725 -3469 -10860 7050 6816 -8869
341h869J2122J2365j8966k083J8826j1655j4797J8151J255k1353J4513J5416k3341
$$ -8869 3253 15618 -3348 -5431 13395 1740 -13057 5094 6349 -15004 -491 14925 -8416
354h416J432K5109j6361j6478K4809k886k5694J6475J0210k4334R145K0742k1360
$$ -8416 -6984 18125 1764 -14714 10095 7209 -18485 -2010 8200 -16134 -6989 13753 -7607
367g607k830K6912j2147j7447K1243K74j8953J0661L804j4038J1885P610j7065
$$ -7607 -10437 16475 4328 -13119 8124 8398 -10555 106 3910 -10128 1757 9367 -7698
380g698P072J5284j3556l138Q880q256J768O131j8967L114K4474j8124j3861K7025
$$ -7698 -626 14658 1102 -2036 6844 -1412 356 6487 -12480 -9366 15108 -3016 -16877 10148
394A0148k300j7472J9389o375k0985L1171J238m6883K5598L7337m5608o645M4800
$$ 10148 7848 -9624 9765 3390 -17595 13576 14814 -32069 -6471 30866 -14742 -21387 23413
407B3413k3945j4408L9914k9029k6962O1351j2028o7591N0354L8528o5175R441
$$ 23413 -532 -14940 24974 -4055 -31017 30334 18306 -49285 1069 39597 -25578 -16137
419a6137M6609m4457N743M9028o0147j6761Q6406l6095p4410P2391K5494p0597
$$ -16137 30472 -13985 -8242 40786 -19361 -36122 50284 14189 -60221 12170 37664 -32933
431c2933L0402K8268n6690L9463M1578r0776P677R9454o3152o3985Q2886J905
$$ -32933 -2531 25737 -30953 8510 50088 -40688 -33011 66443 3291 -60694 22192 24097
443B4097n5348M8199p611n4529P6950J7737j11101L9289R1714q1181l6712P1887
$$ 24097 -31251 16948 9337 -45192 31758 49495 -61606 -22317 69397 -11784 -48496 23391
455B3391k6293j6428N5137n6300l1890J11281k2126j10005P2975N9547q2384Q265
$$ 23391 -2902 -19330 35807 -20493 -52383 58898 36772 -73233 -258 59289 -23095 -14830
467a4830L4357n2555M5332M5306j12890R782J32172p1732q8069R7628Q957o3567
$$ -14830 19527 -33028 12304 57610 -55280 -45498 86674 14942 -73127 24501 33458 -30109
479c0109N4223k3592o7076J13562K0131j58478N7928J33945j10510n1278J00188
$$ -30109 24114 522 -66554 47008 67139 -91339 -33411 100534 -9976 -61254 38934
490C8934l9934k4152Q4159q5358o1919J66083j4474j74881R4886J11317j21117
$$ 38934 -1000 -25152 59007 -26351 -88270 77813 63339 -111542 -16656 94661 -26456
501b6456p539P2121p4290L2313Q7373j40166l3102J89719n2720j56412J13021
$$ -26456 -33995 38126 -36164 -3851 83522 -56644 -89746 99973 47253 -109159 3862
512C862O3621r7849L8399J3405q9065R8816O1798j79600J5323J79259q9421j03384
$$ 3862 67483 -30366 8033 21438 -67627 31189 92987 -86613 -71290 107969 18548 -84836
524h4836J06721j549m3152P6787o5455p8452J61634J2779j92549O8566J37097
$$ -84836 21885 20336 -22816 53971 -11484 -89936 71698 84477 -108072 -39506 97591
535I7591j08495l2975P2323o0349K9656R0754j40424m5522J98255m0749j73376
$$ 97591 -10904 -43879 28444 -31905 -2249 88505 -51919 -97441 100814 60065 -113311
546a13311J03502P6436r6432L3071J5362r3379J03140P8000j90145n06J98857
$$ -113311 -9809 66627 -29805 3266 18628 -74751 28389 106389 -83756 -84262 114595
557A14595q2341j25498J09107J0001n6233Q1354n2485r8807J62186M3696k07335
$$ 114595 32254 -93244 15863 25864 -30369 50985 -1500 -100307 61879 105575 -101760
568a01760M5129J63938j04813n9349Q6833n2682K238J06637j17317p9627J95613
$$ -101760 -56631 107307 2494 -56855 29978 -22704 -20466 86171 -31146 -110773 84840
579H4840r71j89452Q0463J04147j00577R941L9886r3699O7263J01673j62996l9190
$$ 84840 83869 -105583 -25120 79027 -21550 -11609 28277 -65422 1841 103514 -59482 -98672
591i8672J94095m3134j39687R0749L4786o5660O1874k2635j01742J22082O7710
$$ -98672 95423 52289 -87398 3351 38137 -27523 34351 11716 -90026 32056 99766
602I9766j77309Q386J57304o8928p1775P3236k8690j1199Q9020q4555q2381J55492
$$ 99766 -77543 -69157 88147 19219 -52556 20680 -8010 -19209 69811 -14744 -97125 58367
614E8367K0678j62288M9898R9843p6290j935L9688p6780M4675R3574j29392n0230
$$ 58367 79045 -83243 -33345 66498 -9792 -11727 27961 -48819 -4144 89430 -39962 -90192
626i0192J62669k3065j25091P4354L7513o4681N4881j433r9940Q8648P8941j48546
$$ -90192 72477 49412 -75679 -1325 36188 -28493 26388 24955 -74985 13663 92604 -55942
638e5942j4139J41767n2033p4657P4168j5543l4379Q2909m2014r1678J11927M6335
$$ -55942 -70081 71686 19653 -55004 19164 3621 -30758 52151 10137 -81541 30386 76721
650G6721j35445J7535R7014n8314k1175M8346m9509P499Q1237p2919o0182J10795
$$ 76721 -58724 -41189 55825 -2489 -23664 24682 -24827 -17328 63909 -9010 -69192 41603
662D1603P347r8793L7313M2283m6594K3951J1758o4817M6074O2135q8889k2232
$$ 41603 48950 -49843 -12530 29753 -16841 7110 18868 -45949 125 62260 -26629 -48861
674d8861R2839k4541n4480M4624o336k6477N3953k1217o3824O9910L6521q7599
$$ -48861 43978 19437 -35043 9581 3245 -23232 30721 9504 -54320 15590 52111 -35488
686c5488R350O5434m2563j4253L9190l8517l824O2981m3448m9285P5637J1261
$$ -35488 -26138 39296 -3267 -17520 21670 -16847 -20671 42310 -1138 -50423 25214 36475
698C6475p1256K8353L3772m2562J4460K3255n0306J5721N3081n2031k6820O4520
$$ 36475 -34781 -6428 27344 -15218 -758 22497 -27809 -12088 40993 -11038 -37858 26662
710B6662q306m4699L2368O791l0658K8969M320m5245K7229L4514m7272p434M4879
$$ 26662 18356 -26343 6025 12816 -17842 11127 15447 -29798 -2569 31945 -15327 -22761 22118
723B2118j7445j9420K6416j0714j4610K9870r344l1632K8802J5595l4598N332
$$ 22118 4673 -14747 11669 955 -13655 16215 6871 -24761 4041 19636 -14962 -9630
735i630K3177j7014m31J4714j6944o14K2338j6136j4865K2524K32j7636J1036
$$ -9630 13547 -3467 -3898 10816 -6128 -6742 15596 -540 -15405 7119 7351 -10285 751
748G51L598j0791J0874K036j6281J0643J0740j8238n4J4969j0832l411J1920q127
$$ 751 4349 -6442 4432 6468 -9813 830 11570 -6668 -6722 8247 -2585 -5996 5924 -2203
762b203m334J5728o425j3066J5846K974j7889P976R595j4828K436J2409j2269
$$ -2203 -6537 9191 2766 -10300 5546 8520 -9369 -1393 8202 -6626 -4190 8219 -4050
775d050k586J6426q131j0722J4537J299j4830P392P524j2541J479J0864q639l846
$$ -4050 -6636 9790 1659 -9063 5474 6773 -8057 -665 6859 -5682 -4203 6661 -1978 -5824
789e824J1870k362r050P617L547r642J528O816o306k946P019q72n586M707L281
$$ -5824 6046 3684 -5366 2251 5798 -3844 -2316 4500 -1806 -4752 2267 1395 -4191 516 3797
804C797n557K24N121l373l994N305K16n500K215M566m137j174N650j577m135M065
$$ 3797 -1760 -1536 3585 212 -3782 1523 1739 -3761 -1546 3020 -1117 -2291 3359 1782 -2353 1712
820A712J464n510J051M164l903k007N351r83m441M356K379n043O8M712l673l036
$$ 1712 3176 -2334 -1283 2881 -1022 -3029 2322 1339 -3102 1254 3633 -1410 -1342 3370 -303 -3339
836c339M745p63m672M188K707n584J082O058m654l003O054j413n465M830J530
$$ -3339 1406 643 -4029 159 2866 -2718 -1636 4422 -232 -3235 2819 1406 -4059 771 2301
851B301o695L560N299o468o52P614m240l830O920k303n659O158N81p900N027M920
$$ 2301 -4394 -834 4465 -2003 -2655 4959 719 -3111 3809 1506 -4153 2005 2586 -5314 -287 4633
867D633q116Q73P494n188k198O402m111l099P038l303o076P494J420p413M056
$$ 4633 -3483 -2610 4884 -304 -2502 3900 -211 -3310 3728 425 -5651 1843 3263 -4150 -94
882i4L074m885L295J410p231M714N367r864l01R267n605k472P238o158j181J1696
$$ -94 2980 -1905 1390 2800 -4431 283 5650 -4214 -4515 4752 -853 -3325 3913 -2245 -3426 8270
898H270q704j0071J6663R78j7327R404Q143j4187O716R528j9012N460K1806k1519
$$ 8270 -434 -10505 6158 7136 -10191 -787 7356 -6831 -115 9413 -9599 -4139 17667 -3852
912c852j2127K9056n604k2694J8918M278k0773J8005P528l0533J4928K7159l3001
$$ -3852 -15979 13077 7473 -15221 3697 7975 -12798 5207 12735 -17798 -2870 24289 -8712
925h712r608L6023j2721k1394K4479m940j8807K7760j745l5348K6823K3727l9170
$$ -8712 -18320 17703 4982 -16412 8067 3127 -15680 12080 10335 -25013 1810 25537 -13633
938a3633j359L2566j8431q701K0986j9055n318L4950j8746l0943L7932J0845l7257
$$ -13633 -14992 17574 -857 -9558 11428 -7627 -12945 22005 3259 -27684 10248 21093 -16164
951a6164J1067J7446k0917J2267R670l5003J4987L7844l8827j9334M5133o360
$$ -16164 -5097 12349 -8568 3699 13369 -21634 -6647 31197 -7630 -26964 18169 11809
963A1809k7973K2780m832j8109L5668p212m7549L7961L3546n4486l024M4225k3108
$$ 11809 -16164 6616 1784 -16325 19343 12131 -35418 2543 36089 -18397 -21421 22804 -304
976c04j0366K8464l0300p339N4961k8878n0935N7716K1375n9895J4619L0688l2739
$$ -304 -10670 17794 -12506 -19845 35116 6238 -44697 13019 34394 -25501 -10882 19806 -12933
989a2933J5210K1540n3144J2608O3470n0572m2103O6956L389m9510K8075N917
$$ -12933 2277 23817 -29327 -16719 46751 -3821 -45924 21032 24421 -25089 2986 8903
1001H903l0873M1254M876o7365L5937N8569o4923k3501O1754j4938k6191L2658
$$ 8903 -21970 19284 24160 -43205 -7268 51301 -13622 -37123 24631 9693 -16498 16160
1013A6160k3730j8524O1975j8810o8498N5308M2247o6565j942M2786k7276M972
$$ 16160 -7570 -26094 35881 17071 -51427 3881 46128 -20437 -22379 20407 -6869 -1897
1025a897K6290n1545M125P2208m4314n6609O6714J7665n5059J9346J1952k9957
$$ -1897 24393 -27152 -23027 49181 4867 -51742 14972 32637 -22422 -3076 8876 -21081
1037b1081L9748P912p2173L3135O8846o5244l3698O5603r291l0442L2510k4359
$$ -21081 18667 26579 -45594 -12459 56387 -8857 -42555 23048 13757 -16685 15825 -8534
1049h534k1462O8576j6252p9697N7538N3095p3043p258N0399k9274P44L4298n5304
$$ -8534 -29996 38580 22328 -57369 169 53264 -19779 -27037 23362 -5912 -5168 29130 -26174
1062b6174n120Q2891l8411p1786O9006L0514o4098J4951K3923l7042L1856K3411
$$ -26174 -31294 51597 13186 -58600 10406 40920 -23178 -8227 15696 -21346 10510 33921
1074C3921p4017J5573Q0722n4485n0945O6262N428m1313K8301q885l0413N7788
$$ 33921 -40096 -24523 56199 1714 -49231 17031 22459 -18854 9447 562 -29851 27937
1086B7937J336p9263L8229O3597o1404k2652N0349j6821q620L1029m1283j3098
$$ 27937 29273 -49990 -11761 51836 -9568 -32220 18129 1308 -7312 23717 -17566 -30664
1098c0664P2994k4158o9847N4207L6354n5678N820K4469l0615K4858K3696o4478
$$ -30664 42330 18172 -51675 2532 38886 -16792 -10972 13497 -17118 7740 31436 -33042
1110c3042P987P4175m3824m9720N7524P617l8504K6114m836l2333N0058R322p2613
$$ -33042 -25055 49120 5296 -44424 13100 20717 -17787 8327 3491 -28842 21216 30538 -42075
1123d2075K6796O1563n1462k5562M7824j4048j4594L3130l0194k2979O3110q348
$$ -42075 -15279 46284 -5178 -30740 17084 3036 -11558 21572 -8622 -31601 31509 23161
1135B3161o6452L9424M0568m8811k428K9515k6382J0033K9280m7851o927O3321
$$ 23161 -43291 -3867 36701 -12110 -14538 14977 -11405 -1372 27908 -19943 -26870 36451
1147C6451k4315m9807M3501J6406l6826J6396O257k9408L0945J7337n3864R125
$$ 36451 12136 -37671 5830 22236 -14590 1806 8063 -21345 9600 26937 -26927 -17802
1159a7802N2004l2877k7544L7140m539j7090K4011j4716k2389M1694K138m8741
$$ -17802 34202 1325 -26219 10921 6382 -10708 13303 -1413 -23802 17892 20030 -28711
1171b8711K2036L2839l2317n896K2469j7012L020K2498k9335r612M2612j2203
$$ -28711 -6675 26164 -6153 -12049 10420 -6592 -3572 18926 -10409 -20021 22591 10388
1183A0388l5007K7270J2753k5298J0467O873k1883J8319J5630l6088K829L6269
$$ 10388 -24619 2651 15404 -9894 573 7446 -14437 3882 19512 -16576 -13747 22522
1195B2522k0889k0511K7342l235j5902J9769n884k0996K6727P744l5097J1467
$$ 22522 1633 -18878 8464 5229 -10673 9096 3212 -17784 8943 16687 -18410 -6943
1207f943K6325k3336o973K1152j2101n579J9844j4023j4037K6984l09k6548J3960
$$ -6943 19382 -3954 -10927 10225 -1876 -7455 12389 -1634 -15671 11313 11004 -15544 -1584
1220a584J4144j8281K213J0984j3283K949J3926j6104m836J9983n743j4635J2202
$$ -1584 12560 -5721 -3508 7476 -5807 -2858 11068 -5036 -9872 10111 4368 -10267 1935
1233A935L404j0307O895R55j0144R011N778j4112K559J1734q375l622Q400m603
$$ 1935 5339 -4968 1927 2882 -7262 1749 7527 -6585 -4026 7708 -667 -4289 4111 -492
1247d92k781Q799n877o230J1222n20j0697O600N120q627K394N231p893K020P599
$$ -492 -3273 5526 -351 -6581 4641 4121 -6576 24 5144 -3483 -1089 4142 -3751 -1731 5868
1262E868q524k479J0400l920p200Q071P26o926M980K137o861L791M625p247k78
$$ 5868 -2656 -5135 5265 1345 -5855 2216 2942 -3984 996 3133 -3728 63 4688 -2559 -2837
1277b837P179m235l817O148j091m358M122J032m745K774K758m970L97M122k671
$$ -2837 4342 107 -3710 2438 1347 -3011 1111 2143 -2602 172 2930 -2040 -1643 2479 -192
1292a92k089L351l41k573K573M24k688J330J844k274NJ618p67j292J171P81j532
$$ -192 -2281 1070 729 -1844 729 1153 -1535 -205 1639 -635 -630 988 221 -1071 100 881 -651
1309f51N39J090j127j07J083m76q38O56M85j045j58O67K9j170R52O78j022l82
$$ -651 -112 978 -149 -256 827 351 -487 169 654 -391 -549 118 147 -1023 -71 607 -415 -797
1327g97J608o19j046Q54Q89j896K94J612j531k78K118p48k063K451N67k738P82
$$ -797 811 192 -854 0 889 -1007 -713 899 -632 -910 1208 460 -1603 848 1415 -1323 -541
1344e41K827l186m97L281j569k349L118J42l484K502J850l748N56K801k729r04
$$ -541 2286 -900 -1397 1884 315 -2034 1084 1226 -2258 244 2094 -1654 -1098 1703 -1026 -1930
1360a930L714j979k080L515K93l753K282K144l177K78J737j963O23K032l049N19
$$ -1930 1784 -195 -2275 1240 1533 -2220 62 2206 -971 -693 1044 -919 -296 1736 -1313 -794
1376g94K563j889r64K176q43j086K304k419j178M360j805l981M253J397m711K928
$$ -794 1769 -120 -1084 1092 249 -837 1467 -952 -2130 2230 425 -3556 697 2094 -2617 311
1392C11J877n304L516L875p713M62Q341n496m771Q140j306o125P086m03p987P820
$$ 311 2188 -3116 400 4275 -3438 -2976 5365 -131 -4902 3238 1932 -4193 2893 2490 -5497 2323
1408B323M184j3030L178J1135r696l881J0511m569m689R997n130q532J3181J285
$$ 2323 6507 -6523 -3345 7790 -1906 -5787 4724 155 -4534 5463 333 -8199 4982 6267
1422F267j5661P547J0322j2502L34R230q961N63J1826j1851o405J8272m132j5225
$$ 6267 -9394 -1847 8475 -4027 -3693 5537 -3424 -2861 8965 -2886 -9291 8981 4849 -10376
1436a0376J1755N098j2021O267L715j2105R032R918j9230L31J9048j0252j0791
$$ -10376 1379 6477 -5544 723 4438 -7667 1365 11283 -7947 -7616 11432 1180 -9611
1449i611J3748k463p455J2359o057j2551J8729M263k3205Q014J6758j5645k287
$$ -9611 4137 1674 -5781 6578 521 -12030 6699 10962 -12243 -4229 12529 -3116 -5403
1462e403J1711j1346J858J5980j7762r003K6957m423k3912J6144R256j6636Q047
$$ -5403 6308 -5038 -3180 12800 -4962 -13965 12992 8569 -15343 801 10057 -6579 1468
1475A468M673j8751J3935J5761k8794k009L1326j3536j9096K0532p08j3169J7271
$$ 1468 6141 -12610 1325 17086 -11708 -13717 17609 4073 -15023 5509 4801 -8368 8903
1488H903n497k2224K6231J1535l6030O295K9330j9386r953J9321j1941l727K4027
$$ 8903 3406 -18818 7413 18948 -17082 -10787 18543 -843 -10796 8525 -3416 -7143 16884
1501A6884j9148j9579L5202K992l6008J4406K0280k0554L267J0200k0162J0831
$$ 16884 -2264 -21843 13359 16351 -19657 -5251 15029 -5525 -2258 7942 -12220 -1389
1513a389K2768l1187j0469L8056p718k7877J9060N912j4782J5926l800k4429K6139
$$ -1389 21379 -9808 -20277 17779 10061 -17816 1244 7156 -7626 8300 4500 -19929 6210
1526F210J6318l8769J282L4334j6732j4822J8878r505m358K5099j9420k3057L8408
$$ 6210 22528 -16241 -14959 19375 2643 -12179 6699 -2806 -7164 17935 -1485 -24542 13866
1539A3866O478m0853J2508K5119k1951J094J3164k3134R979K8908l3527j6677
$$ 13866 20344 -20509 -8001 17118 -4833 -3739 9425 -13709 -3730 25178 -8349 -25026
1551b5026M4330m799l4759K0042J0257j9217J5973J347l0271K4224K5485m2160
$$ -25026 19304 14505 -20254 -212 10045 -9172 6801 8148 -22123 2101 27586 -14574
1563a4574n721M1206j4462k1556K1008n761j0360K6871j3858k9340L5712J5422
$$ -14574 -20295 20911 6449 -15107 5901 140 -10220 16651 2793 -26547 9165 24587
1575B4587m2966N741L0987j9500n162J5201j9018L490K9596k6826k2466M0913
$$ 24587 -18379 -12638 18349 -1151 -6313 8888 -10130 -6640 22956 -3870 -26336 14577
1587A4577L471l6391J4340J5267j7868J0461M670k7042J7404K6581l5678j1214
$$ 14577 18048 -18343 -4003 11264 -6604 3857 8527 -18515 -1111 25470 -10208 -21422
1599b1422L8469p861k2763J7333j842j0438K2181q619k8980K9564J7619l8531
$$ -21422 17047 9186 -13577 3756 1914 -8524 13657 5038 -23942 5622 23241 -15290
1611a5290J688K9413j6115o379J5558j6699k68K9221k2170k3601L5718O227l3779
$$ -15290 -13602 15811 -304 -6683 8875 -7824 -8092 21129 -1041 -24642 11076 17303 -16476
1624a6476J1708J5711j7532Q244Q403k5573J1189K7664k9606j4617L4804l636
$$ -16476 -4768 10943 -6589 1655 10058 -15515 -4326 23338 -6268 -20885 13919 10283
1636A0283k4463J6097K664j3751J7996o91k6818J9385K0961l1109m974K7116r832
$$ 10283 -14180 1917 4581 -9170 8826 8135 -18683 702 21663 -9446 -14420 12696 2864
1649B864j1218J4501q819n931K2284j0452k2007K4197J0392k6595M483J5397j2322
$$ 2864 -8354 6147 -2672 -8603 13681 3229 -18778 5419 15811 -10784 -6301 9096 -3226
1662c226K058Q838j6970M060K1402j8074j3360K3844l8j8200J0409L135j1078
$$ -3226 -1168 7670 -9300 -5240 16162 -1912 -15272 8572 8534 -9666 743 3878 -7200
1675g200J2382J340k0172J2412J6966k1469m832K0303p503q927J1821o302o731
$$ -7200 5182 6522 -13650 -1238 15728 -5741 -10573 9730 2227 -6700 5121 -1181 -7912
1688g912J7107n484j7853J6531R891j9845K308J3468j0275r18J0150j1951j287
$$ -7912 9195 3711 -14142 2389 12280 -7565 -5257 8211 -2064 -2982 7168 -4783 -6070
1701f070J6650r884j2610J6616L170j5028O366N864r342N135N145j2898L487J2685
$$ -6070 10580 696 -11914 4702 7872 -7156 -790 5074 -4268 867 6012 -6886 -3399 9286
1715I286j1381o032J3108k085p960P656j152o207Q475J76j0860O732P348j0831
$$ 9286 -2095 -8127 4981 2896 -5064 2592 1440 -4767 3708 3884 -6976 -244 7104 -3727
1729c727l19Q380m736j703N672m827k254Q292l435p079P635K018p507K771L254
$$ -3727 -4046 4334 -402 -2105 3567 -1260 -3514 4778 1343 -5736 1899 3917 -3590 -819 2435
$$ [...]
8191G3
##END NTUPLES=NMR FID
##END=
