##TITLE=1H_UK-26_2_3
 CD2Cl2
 8 sc, 
 6.04.2022
##JCAMPDX= 6.0         $$ Bruker NMR JCAMP-DX V2.0
##DATA TYPE= NMR FID
##DATA CLASS= NTUPLES
##ORIGIN= UXNMR, Bruker Analytische Messtechnik GmbH
##OWNER= root
$$ XWIN-NMR		Version 3.5
$$ Wed Apr  6 10:39:04 2022 Russian Standard Time (UT+4h)  she@DPX200
##.OBSERVE FREQUENCY= 200.131346
##.OBSERVE NUCLEUS= ^1H
##.DELAY= (6, 6)
##.ACQUISITION MODE= SIMULTANEOUS
##.ACQUISITION SCHEME= undefined
##.AVERAGES= 8
##.DIGITISER RES= 18
##SPECTROMETER/DATA SYSTEM= spect
##.PULSE SEQUENCE= zg30
##.SOLVENT NAME= CD2Cl2
##.SHIFT REFERENCE= (INTERNAL, CD2Cl2, 0, 15.7039)
##AUDIT TRAIL= $$ (NUMBER, WHEN, WHO, WHERE, WHAT)
$$ ##TITLE= Audit trail, XWIN-NMR		Version 3.5
$$ ##JCAMPDX= 5.01
$$ ##ORIGIN= Bruker BioSpin GmbH
$$ ##OWNER= she
$$ F:/spectra/data/she/nmr/H-F/1/audita.txt
$$ ##AUDIT TRAIL=  $$ (NUMBER, WHEN, WHO, WHERE, WHAT)
(   1,<2022-04-06 10:38:02.84 +0400>,<she>,<DPX200>,
      <created by zg, POWCHK disabled, PULCHK disabled
       configuration hash MD5:
       00 E9 B6 7A A2 85 ED C7 34 08 36 98 17 FE 4E 26
       data hash MD5: 16K
       4A 99 7F E8 06 C3 67 1B 34 EA 30 FC 91 AE AA 42>)
$$ ##END=
$$ 
$$ hash MD5
$$ A4 50 9C 99 67 D6 C7 64 15 FB D2 5B 15 02 52 5B
##$RELAX= 
##$RELAX= 
##$RELAX= 
##$RELAX= 
##$RELAX= 
##$RELAX= 
$$ Bruker specific parameters
$$ --------------------------
##$DU= <F:/spectra>
##$EXPNO= 1
##$NAME= <H-F>
##$PROCNO= 1
##$TYPE= <nmr>
##$USER= <she>
##$AMP= (0..31)
100 100 100 100 100 100 100 100 100 100 100 100 100 100 100 100 100 100 
100 100 100 100 100 100 100 100 100 100 100 100 100 100 
##$AQSEQ= 0
##$AQ_mod= 1
##$AUNM= <au_zg>
##$AUTOPOS= <>
##$BF1= 200.13
##$BF2= 200.13
##$BF3= 200.13
##$BF4= 200.13
##$BF5= 200.13
##$BF6= 200.13
##$BF7= 200.13
##$BF8= 200.13
##$BYTORDA= 1
##$CFDGTYP= 0
##$CFRGTYP= 5
##$CHEMSTR= <none>
##$CNST= (0..31)
1 1 145 1 1 1 1 1 1 1 1 1 1 1 1 1 1 1 1 1 1 1 1 1 1 1 1 1 1 1 1 1 
##$CPDPRG= <>
##$CPDPRG1= <>
##$CPDPRG2= <>
##$CPDPRG3= <>
##$CPDPRG4= <mlev>
##$CPDPRG5= <mlev>
##$CPDPRG6= <mlev>
##$CPDPRG7= <mlev>
##$CPDPRG8= <mlev>
##$CPDPRGB= <>
##$CPDPRGT= <>
##$D= (0..31)
0 1.2 0 0 0 0 0 0 0 0.06 0 0.03 0 0 0 0 0.0002 0 0 0 0 0 0 0 0 0 0 0 0 
0 0 0 
##$DATE= 1649227082
##$DBL= (0..7)
120 120 120 120 120 120 120 120 
##$DBP= (0..7)
150 150 150 150 150 150 150 150 
##$DBP07= 0
##$DBPNAM0= <>
##$DBPNAM1= <>
##$DBPNAM2= <>
##$DBPNAM3= <>
##$DBPNAM4= <>
##$DBPNAM5= <>
##$DBPNAM6= <>
##$DBPNAM7= <>
##$DBPOAL= (0..7)
0.5 0.5 0.5 0.5 0.5 0.5 0.5 0.5 
##$DBPOFFS= (0..7)
0 0 0 0 0 0 0 0 
##$DE= 6
##$DECBNUC= <off>
##$DECIM= 32
##$DECNUC= <off>
##$DECSTAT= 4
##$DIGMOD= 1
##$DIGTYP= 9
##$DL= (0..7)
0 120 120 120 120 120 120 120 
##$DP= (0..7)
150 150 150 150 150 150 150 150 
##$DP07= 0
##$DPNAME0= <>
##$DPNAME1= <>
##$DPNAME2= <>
##$DPNAME3= <>
##$DPNAME4= <>
##$DPNAME5= <>
##$DPNAME6= <>
##$DPNAME7= <>
##$DPOAL= (0..7)
0.5 0.5 0.5 0.5 0.5 0.5 0.5 0.5 
##$DPOFFS= (0..7)
0 0 0 0 0 0 0 0 
##$DQDMODE= 0
##$DR= 18
##$DS= 0
##$DSLIST= <SSSSSSSSSSSSSSS>
$$ [...]
##$SUBNAM2= <"">
##$SUBNAM3= <"">
##$SUBNAM4= <"">
##$SUBNAM5= <"">
##$SUBNAM6= <"">
##$SUBNAM7= <"">
##$SUBNAM8= <"">
##$SUBNAM9= <"">
##$SW= 18.0517287032376
##$SWIBOX= (0..15)
0 0 2 0 0 0 0 0 0 0 0 0 0 0 0 0 
##$SW_h= 3612.71676300578
##$TD= 16384
##$TD0= 1
##$TE= 0
##$TE2= 300
##$TE3= 300
##$TEG= 300
##$TL= (0..7)
0 120 120 120 120 120 120 120 
##$TP= (0..7)
150 150 150 150 150 150 150 150 
##$TP07= 0
##$TPNAME0= <>
##$TPNAME1= <>
##$TPNAME2= <>
##$TPNAME3= <>
##$TPNAME4= <>
##$TPNAME5= <>
##$TPNAME6= <>
##$TPNAME7= <>
##$TPOAL= (0..7)
0.5 0.5 0.5 0.5 0.5 0.5 0.5 0.5 
##$TPOFFS= (0..7)
0 0 0 0 0 0 0 0 
##$TUNHIN= 0
##$TUNHOUT= 0
##$TUNXOUT= 0
##$USERA1= <user>
##$USERA2= <user>
##$USERA3= <user>
##$USERA4= <user>
##$USERA5= <user>
##$V9= 5
##$VALIST= <valist>
##$VCLIST= <CCCCCCCCCCCCCCC>
##$VD= 0
##$VDLIST= <DDDDDDDDDDDDDDD>
##$VPLIST= <PPPPPPPPPPPPPPP>
##$VTLIST= <TTTTTTTTTTTTTTT>
##$WBST= 1024
##$WBSW= 4
##$XGAIN= (0..3)
0 0 0 0 
##$XL= 0
##$YL= 0
##$YMAX_a= 504581
##$YMIN_a= -510811
##$ZGOPTNS= <>
##$ZL1= 120
##$ZL2= 120
##$ZL3= 120
##$ZL4= 120
##$ABSF1= 10
##$ABSF2= 0
##$ABSG= 5
##$ABSL= 3
##$ALPHA= 0
##$AQORDER= 0
##$ASSFAC= 0
##$ASSFACI= 0
##$ASSFACX= 0
##$ASSWID= 0
##$AUNMP= <proc_1d>
##$AZFE= 0.1
##$AZFW= 0.1
##$BCFW= 1
##$BC_mod= 2
##$BYTORDP= 1
##$COROFFS= 0
##$CY= 11.3945322036743
##$DATMOD= 1
##$DC= 2
##$DFILT= <>
##$DTYPP= 0
##$F1P= 2.36226072786647
##$F2P= -0.459571619588291
##$FCOR= 0.5
##$FTSIZE= 0
##$FT_mod= 4
##$GAMMA= 1
##$GB= 0.15
##$INTBC= 1
##$INTSCL= 1
##$ISEN= 128
##$LB= 0.24
##$LEV0= 0
##$LPBIN= 0
##$MAXI= 10000
##$MC2= 0
##$MEAN= 0
##$ME_mod= 0
##$MI= 1.114404
##$NCOEF= 0
##$NC_proc= 0
##$NLEV= 6
##$NOISF1= 3.799351
##$NOISF2= 2.8
##$NSP= 1
##$NTH_PI= 0
##$NZP= 0
##$OFFSET= 15.70392
##$PC= 1
##$PHC0= -17673.93
##$PHC1= 18.60078
##$PH_mod= 1
##$PKNL= yes
##$PPARMOD= 0
##$PSCAL= 0
##$PSIGN= 0
##$REVERSE= no
##$SF= 200.130013532006
##$SI= 16384
##$SIGF1= 3
##$SIGF2= 2
##$SINO= 400
##$SIOLD= 16384
##$SREGLST= <1H.CDCl3>
##$SSB= 0
##$STSI= 0
##$STSR= 0
##$SW_p= 3612.71676300578
##$SYMM= 0
##$S_DEV= 0
##$TDeff= 0
##$TDoff= 0
##$TI= <>
##$TILT= no
##$TM1= 0
##$TM2= 0
##$TOPLEV= 0
##$USERP1= <user>
##$USERP2= <user>
##$USERP3= <user>
##$USERP4= <user>
##$USERP5= <user>
##$WDW= 1
##$XDIM= 8192
##$YMAX_p= 0
##$YMIN_p= 0
$$ End of Bruker specific parameters
$$ ---------------------------------
##NTUPLES= NMR FID
##VAR_NAME=  TIME,          FID/REAL,        FID/IMAG
##SYMBOL=    X,             R,               I
##VAR_TYPE=  INDEPENDENT,   DEPENDENT,       DEPENDENT
##VAR_FORM=  AFFN,          ASDF,            ASDF
##VAR_DIM=   8192,          8192,            8192
##UNITS=     SECONDS,       ARBITRARY UNITS, ARBITRARY UNITS
##FACTOR=    0.0002768,     1,               1
##FIRST=     0,             0,               0
##LAST=      2.2672688,     0,               0
##MIN=       0,             -510811,         0
##MAX=       2.2672688,     504581,          0
$$ Real data points
##PAGE= N=1
##DATA TABLE= (X++(R..R)), XYDATA
0@%%%%%%%%qJ6j6J6k4L2m0M8n6P2q9J11j34J60j92K25k64L10l60M17m81N54o34
$$ 0 0 0 0 0 0 0 0 0 -8 8 -8 8 -16 16 -24 24 -32 40 -49 62 -72 88 -104 121 -143 167 -193 224 -257 297 -337
31c37P21q23R35j056J192j343J508j687J884k101K338k596K877l186L523l890
$$ -337 384 -439 496 -560 632 -711 797 -890 994 -1107 1231 -1365 1512 -1674 1849 -2041
47b041M291m728N208n738O322o967P682q479R376j0391J1546j2878J4435j6285
$$ -2041 2250 -2478 2730 -3008 3314 -3653 4029 -4450 4926 -5465 6081 -6797 7638 -8647
61h647J8524k1292K4820k9500L6038m5873O2514r7800L01289l59366k67995P66345
$$ -8647 9877 -11415 13405 -16095 19943 -25930 36584 -61216 240073 -119293 -387288 379057
73C79057k67018l03174L04505j38147k10124N36050j92029n72609N11703M00152
$$ 379057 112039 -191135 113370 -24777 -234901 301149 109120 -463489 48214 448366
83D48366o57803n1285M72740j71068j25967J91404k69987J7923M59415k85138
$$ 448366 -209437 -260722 212018 40950 -85017 106387 -163600 -145677 313738 28600
93B8600m22401M68188J99279m14788K6930J80924j17761J35315J4152l42637K03665
$$ 28600 -393801 74387 273666 -141122 -114192 66732 -51029 84286 98438 -244199 -40534
104d0534L70907l82294k11088L96776Q870k15664J05198q3111n8367L22278j36556
$$ -40534 330373 -51921 -263009 133767 142637 -73027 32171 -50940 -109307 212971 76415
115G6415m00211L40927K80597m17078m9635L05761j30415l4809J55282k55814
$$ 76415 -323796 17131 297728 -119350 -168985 136776 6361 -28448 126834 -128980
125a28980r038M12648k28121l77125L94751J78028l81853O1918J89235j85888
$$ -128980 -138018 274630 46509 -330616 64135 242163 -139690 -77772 111463 -74425
135g4425J06148J39218l45178M5768M08395k62910k96656L59145O9769k83483
$$ -74425 31723 170941 -174237 -128469 279926 17016 -279640 79505 149274 -134209
145a34209J24861O5138j78539J92987Q2932l49014J01776L41598k56156j93330
$$ -134209 -9348 55790 -122749 70238 153170 -195844 -94068 247530 -8626 -201956
155b01956K80393k465j58185J33896m2327j27603K28403J4856k96415J30007K30348
$$ -201956 78437 75972 -82213 51683 9356 -118247 110156 125012 -171403 -41396 188952
166A88952k13456q8880J71495m9540l7596R8987j19736m6673K17630n8083k05118
$$ 188952 -24504 -113384 58111 8571 -29025 69962 -49774 -96447 121183 63100 -142018
177a42018J38105J05199j40848P746N0047p1962P4925M9360j64419L9309J77988
$$ -142018 -3913 101286 -39562 -31816 18231 -53731 21194 70554 -93865 -54556 123432
188A23432j16795j00916J36396n533p3039P7340m5974p7561J47777N613j81191
$$ 123432 6637 -94279 42117 36584 -36455 40885 -5089 -82650 65127 70740 -110451
199a10451R0651J34833j42506k9039J19602o9381k9434J04533q7689p2112J60737
$$ -110451 -19800 115033 -27473 -56512 63090 -6291 -35725 68808 -18881 -90993 69744
210F9744j4836j61892R9166R5775j25664M711Q7919p9196k348R2240q6774n2639
$$ 69744 54908 -106984 -7818 87957 -37707 -32996 54923 -24273 -26621 65619 -21155 -73794
222g3794J28417j9444j11942P5696N4081q0737J8700M3996n7974J6974N3283o8880
$$ -73794 54623 35179 -76763 -1067 53014 -27723 -9023 34973 -23001 -6027 47256 -21624
234b1624j9754P7846k3892n3838M5447J3253l1470K4122M85k9860L2769J2243
$$ -21624 -41378 36468 12576 -41262 4185 17438 -14032 10090 10575 -19285 13484 25727
246B5727m8346J0623L3654k8526p385K3506j5343J828K4361k4540j0508L7669
$$ 25727 -22619 -11996 21658 -6868 -14253 9253 -6090 -4262 20099 -4441 -14949 22720
258B2720j1985l1756K4725N945k6666J4834J0058k4989J4964K0687k8694l42L0834
$$ 22720 10735 -21021 3704 9649 -17017 -2183 7875 -17114 -2150 18537 -10157 -10499 20335
271B0335j8535j7824K5017n141k0564K0255L903k2811J5989J6073k3184K322K1837
$$ 20335 1800 -16024 8993 3852 -16712 3543 7446 -15365 624 16697 -6487 -4165 17672
284A7672j5628j1725J8414n842j6117J4371L819j5981R129J2860j3580j731J5826
$$ 17672 2044 -9681 8733 2891 -13226 1145 4964 -11017 -1888 10972 -2608 -4339 11487
297A1487o205j1866R246J425j2931K769Q754q120k566J2050j48q565Q285N963
$$ 11487 5282 -6584 2662 4087 -8844 -6075 2679 -5441 -8007 4043 3895 -4670 3615 9578
311I578j1198j951R313o305q458R285K743j0623N000J1223p580l399J2022k492
$$ 9578 -1620 -3571 5742 -563 -9021 264 3007 -7616 -2616 8607 1027 -2372 9650 7158
325G158j1981P180M849j3676k33J2031p470q231J3995K350j2954P246J0554j4012
$$ 7158 -4823 2357 7206 -6470 -6703 5328 -2142 -10373 3622 5972 -6982 264 10818 -3194
339c194m295J5222p340j4361J4400N510j7556O862J6324j4122m366J9117p766
$$ -3194 -7489 7733 393 -13968 432 5942 -11614 -4752 11572 -2550 -6916 12201 4435
352D435j4651J5835K168j9870R823J3262j7673n73J9753q580r360J4355j900j1662
$$ 4435 -10216 5619 7787 -12083 -2260 11002 -6671 -7244 12509 3929 -5431 8924 7024 -4638
366d638Q241l01j1571O482M691j0151K285P354k796J929j82n974R058J693j6542
$$ -4638 3603 3302 -8269 -1787 2904 -7247 -4962 2392 -404 1525 1343 -4631 4427 6120 -10422
381a0422N303J2605j4536j341J5333j1987j058K4110j7138j7899L5365j158l9964
$$ -10422 -5119 7486 -7050 -8391 6942 -5045 -6103 18007 869 -17030 18335 17177 -22787
394b2787K1471K1747l5851N834K6843l2091K987M3522l5621k6481N9265o264n6637
$$ -22787 -1316 20431 -15420 -9586 17257 -14834 -11847 31675 -3946 -30427 28838 22574 -34063
407c4063L5583K3907m7458J7608K5892m8394J7027N2495n7194k3074P5463j8456
$$ -34063 1520 25427 -22031 -4423 21469 -26925 -9898 42597 -14597 -37671 37792 19336
419A9336n7615M6228J0927m5697L5983Q790n9969M2734M9221p6894q030P8732
$$ 19336 -38279 7949 18876 -26821 9162 17952 -42017 717 49938 -26956 -34986 43746
431D3746l2902m2258M8054j4777k7172N5095k2879o2317P2590L3920q9650J4230
$$ 43746 10844 -31414 16640 1863 -25309 29786 6907 -55410 17180 51100 -38550 -24320
443b4320O6481m3840j1366L5889m5444P091O9074o4929n0904R9888N004q7980
$$ -24320 42161 -1679 -13045 22844 -22600 -15509 53565 -11364 -62268 37620 42624 -45356
455d5356L9843L5049m7237L3106P621p9604N5165P3675j10808k7324J18953l1811
$$ -45356 -5513 29536 -17701 15405 23026 -56578 -1413 72262 -38546 -65870 53083 21272
467B1272o8355O4092j1434l8940Q4114k9839j07396J05281O8799j45304J877J18737
$$ 21272 -47083 17009 5575 -33365 50749 20910 -86486 18795 87594 -57710 -55833 62904
479F2904o1729l5019P1740n9433j7115J21426p0221j16716J40202N2368j53351
$$ 62904 1175 -33844 37896 -21537 -38652 82774 12553 -104163 36039 88407 -64944
490f4944K4984R4000p0109P242N2788r7444K2699J33949j08066j01057J52987
$$ -64944 -39960 54040 -16069 -8827 43961 -53483 -30784 103165 -4901 -105958 47029
501D7029K3422j29980M3106M2814n8561O0491J0554j25973P4668J24600j39955
$$ 47029 70451 -59529 -16423 26391 -32170 28321 38875 -87098 -12430 112170 -27785
512b7785o3183J44675j5923p9254N5916k6687l2181J16620m3685j41722J26817
$$ -27785 -90968 53707 37784 -41470 14446 -12241 -44422 72198 28513 -113209 13608
523A3608R7223j58837j2833J14288n4201j2505N7102r7918N445J57878r7267j36944
$$ 13608 110831 -48006 -60839 53449 -752 -13257 43845 -54073 -48628 109250 11983 -124961
535a24961J62423N8204j51134L0188O4993p2152N3970L6760j49415M9743J68973
$$ -124961 37462 95666 -55468 -25280 39713 -32439 21531 58291 -91124 -41381 127592
546A27592j36758j10708J67743J6728j14729N7440K228o4162J12149j016j73847
$$ 127592 -9166 -119874 47869 64597 -50132 7308 9536 -54626 57523 56507 -117340
557a17340R2352J52366j54611o7642J44242k2733n5218O8207o4257l8863J55268
$$ -117340 -24988 127378 -27233 -94875 49367 26634 -28584 39623 -24634 -63497 91771
568I1771m4321j73773J24156J14123j49585j8095R6797n3624J3115O1270j21508
$$ 91771 47450 -126323 -2167 111956 -37629 -55724 41073 -12551 564 61834 -59674
579e9674k173J74108q5347j47467J37549O1421j20052K7460L3598o5186P9220
$$ -59674 -61847 112261 26914 -120553 16996 78417 -41635 -14175 19423 -45763 33457
590C3457L5535j57677M1931J63231j13209j00473J27169P452o9569N6702l3097
$$ 33457 68992 -88685 -46754 116477 3268 -97205 29964 37416 -32153 24549 -8548
601h548n6169J30442k057j67503P9050J31318j22713m7605R7458l6135j3139O9084
$$ -8548 -64717 65725 63668 -103835 -24785 106533 -16180 -63785 33673 -2462 -15601 53483
613E3483q9264l5981J57807l5437j54512J00145Q8283j12099J88N5640o3074L8835
$$ 53483 -35781 -71762 86045 50608 -103904 -3759 84524 -27575 -27387 28253 -34821 4014
625D014O4338j24362r808J57259o0575j19900J01070M0869q1804L5283Q239o9058
$$ 4014 68352 -56010 -65818 91441 30866 -89034 12036 52905 -28899 6384 14623 -54435
637e4435P8726M1774j34228J9973J30589p2877p1455Q2779m401l6783N3870m0268
$$ -54435 24291 66065 -68163 -48190 82399 9522 -61933 20846 16445 -20338 33532 -6736
649f736n3721J04241Q326j23327M7401Q8292p3117k0292N2219l7903R129N6892
$$ -6736 -60457 43784 52110 -71217 -23816 64476 -8641 -28933 23286 -14617 -5488 51404
661E1404p7065l0486J12065k1708r9293O2374M5477o3280J8800K1922n6427M2293
$$ 51404 -25661 -56147 55918 34210 -65083 -2709 42768 -20512 -1712 20210 -36217 6076
673F076N0092r3137r850J02565l9649o8455O3124R923m4624M1636m650n7548O0063
$$ 6076 56168 -36969 -46819 55746 16097 -52358 10766 20689 -23935 17701 13051 -44497 15566
686A5566L4531q9914Q528P8295m5190l5104M9793j5707j9670M7677k6272m3709
$$ 15566 50097 -39817 -31289 47006 1816 -33288 16505 798 -18872 28805 2533 -41176
698d1176O4177J3246p1754K1510M6447m0539n230K8706k9625N058M0165l9097
$$ -41176 23001 36247 -35507 -13997 32450 -8089 -13319 15387 -14238 -9180 30985 -8112
710h112k3485N7143n489m7330K7254J6435k9162J5049P658l1793K1753K6777m1506
$$ -8112 -31597 25546 20057 -27273 -19 16416 -12746 2303 9961 -21832 -79 26698 -14808
723a4808m343M2489j7504k2572K5414n092j5745K4236q142k6666K9306J2652l6455
$$ -14808 -19151 23338 5834 -16738 8676 3584 -12161 12075 3933 -22733 6573 19225 -17230
736a7230R113K6797k2007m186J9787j7356m373K5258j6338j9332K9897K235k8138
$$ -17230 -8117 18680 -3327 -7513 12274 -5082 -9455 15803 -535 -19867 10030 12265 -15873
749a5873J5369J3653k0870N864J4085k0412J216K1681j7486j2491K3828j665j9089
$$ -15873 -504 13149 -7721 -1857 12228 -8184 -6968 14713 -2773 -15264 8564 6899 -12190
762a2190J3647P422j5680O965Q951j4925J178J3531j0384p687J3703q89j0043
$$ -12190 1457 8879 -6801 164 9115 -5810 -4632 8899 -1485 -9172 4531 3642 -6401
775f401O738M204o831K360M005n343o13M601k575l604K923J643j768n60J365J771
$$ -6401 337 4541 -2290 70 4075 -1268 -1881 2720 145 -3459 -536 1107 -661 -1221 144 1915
791A915r39j530K065j40l147J585J543m195O10M200k971k456O061mn568L705L149
$$ 1915 976 -554 1511 1371 -1776 -191 1352 -2843 -2233 1967 -1004 -3460 2601 2597 -2971 734 3883
808C883o289K52N614m623l206O607l84n855M926L281o109Q69N562m657l112N583
$$ 3883 -2406 -2154 3460 -1163 -4369 2238 1854 -4001 925 4206 -1903 -1034 4528 -129 -3241 2342
824B342j053n627M336K693n549J378N281l926k551N645j203n009L469J686m937
$$ 2342 1289 -4338 -2 2691 -2858 -1480 3801 -125 -2676 2969 1766 -3243 226 1912 -3025
839c025J246L831l075j433M439n41l130K767Q19k966M61J870k020r90J934L27
$$ -3025 -1779 2052 -1023 -2456 1983 1442 -1688 1079 1898 -1068 -607 1263 -757 -1747 187 514
855E14p77j18J016P71j389J46J060k107l47L041k412l287N121J244o460L627N035
$$ 514 -263 -381 635 1406 17 163 1223 -884 -1231 1810 -602 -3889 1232 2476 -3984 -357 4678
872D678o598j23O851o189l149R877m884q680J1901K396j3980O776R503j2707J412
$$ 4678 -1920 -2043 4808 -1381 -4530 5347 463 -8217 3684 6080 -7900 -1124 8379 -4328 -2916
887b916J1258j1870l401J6704r304j3603J8704K947k0010J0602J0969j6189L863
$$ -2916 8342 -3528 -6929 9775 471 -13132 5572 8519 -11491 -889 10080 -6109 -2246
900b246J2882j7285P7K0602j5112j3949K3654n04j9994J2914O952j5601J0417
$$ -2246 10636 -6649 -6572 14030 -1082 -15031 8623 8119 -11875 1039 7991 -7610 2807
913B807O738k1075Q706J9371k1760q105K3864p187j2054J3867n954q240K0921
$$ 2807 9545 -11530 -2824 16547 -5213 -13318 10546 3359 -8695 5172 -782 -9022 11899
926A1899p316k3245K3143J1951k8705M809J8693j6506K941J4062k3941L700L2486
$$ 11899 4583 -18662 4481 16432 -12273 -7464 11229 -5277 -2336 11726 -12215 -8515 23971
939B3971k5154k3300L8438J356l3024J8572R225k4278K0641J0419m1054J7397
$$ 23971 -1183 -24483 13955 15311 -17713 859 10084 -14194 6447 16866 -24188 -6791
951f791M0552m1427j9685M7356r582k9568K7866n004k5205L8291Q76n2105L1422
$$ -6791 33761 -7666 -27351 20005 10423 -19145 8721 3717 -21488 16803 17679 -34426 -3004
964c004M0809n0651j1268M5678j8650j6241L0160k3821j6637N2428j5401n4195
$$ -3004 37805 -12846 -24114 21564 2914 -13327 16833 -6988 -23625 28803 13402 -40793
976d0793M4861L1011n2711L347L2090k6655P342K4811m5665J606O0603l5403m6678
$$ -40793 4068 35079 -17632 -14285 17805 -8850 -1508 23303 -22362 -20756 39847 4444 -42234
989d2234N4741J3345m4837J9118Q630k8960L5067J0926o3527K3981O0915n2615
$$ -42234 12507 25852 -18985 133 8763 -20197 14870 25796 -37731 -13750 47165 -5450
1001e450l1213N5407o900k6934L0449k0036k4013O0117p635p2816M3617N1610
$$ -5450 -36663 18744 11844 -15090 15359 -4677 -28690 31427 23792 -49024 -5407 46203
1013D6203o0814j0487M4453k4865p48L5036m9142j2587P8636k7899p1433N8491
$$ 46203 -14611 -25098 19355 -5510 -6258 28778 -20364 -32951 45685 17786 -53647 4844
1025D844L4153n8860J1190K4327l7487K9190L0471p3324N036Q5702m6453n9557
$$ 4844 38997 -19863 -8673 15654 -21833 7357 37828 -35496 -30460 55242 8789 -50768
1037e0768O4252J1747m5438K8892l169m0189N7106J6677q6984K4818P8619n6866
$$ -50768 13484 25231 -20207 8685 5516 -34673 22433 39110 -47874 -23056 55563 -1303
1049a303l7779N5871j0213j9750L7893l4142l0759P6635l431q5707M1558N7700
$$ -1303 -39082 16789 6576 -13174 24719 -9423 -40182 36453 33022 -52685 -11127 46573
1061D6573n5697j0371L4914k8832J2292L7967o1871j3844Q5369k4761p1494N1222
$$ 46573 -9124 -19495 15419 -13413 -1121 36846 -25025 -38869 46500 21739 -49755 1467
1073A467K8950m5543J7134P275m0630M4355K9990q1724N859Q4226m2117n0514
$$ 1467 30417 -15126 2008 9283 -31347 13008 42998 -38726 -32867 51359 9242 -41272
1085d1272N3341N41k8494L7105k0824m3339O9028J6154q9446K4339P1073n0320
$$ -41272 12069 12610 -15884 21221 397 -42942 26086 42240 -47206 -22867 48206 -2114
1097b114k5195M4124k2488n041M5492m5367l5130Q0859j039q0835L5699M7421
$$ -2114 -27309 16815 -5673 -10714 34778 -10589 -45719 35140 34101 -46734 -11035 36386
1109C6386m6575J050K4172l7016K0496M2838o2446j8744P8393j7162n9944L9220
$$ 36386 -10189 -9139 15033 -21983 -1487 41351 -21095 -39839 38554 21392 -38552 668
1121F68J8481l2453K2671q42m1543M2407L1021o9081m70O5702k8272l4379L5225
$$ 668 19149 -13304 9367 8525 -33018 9389 40410 -28671 -29141 36561 8289 -26090 9135
1134I135p062j4459L5800k3059l8073N6689J5285o6868J6037M7058l4248q674
$$ 9135 2073 -12386 23414 355 -37718 18971 34256 -32612 -16575 30483 -3765 -12439
1146a2439K5747k6431M876M0683m1030k8009O2073j326n4994K6496K4738l1750
$$ -12439 13308 -13123 -8247 32436 -8594 -36603 25470 24144 -30850 -4354 20384 -11366
1158a1366J3142J1683l7151K1861L6669n0279j4145N6317j3535l7466K9805K961
$$ -11366 1776 13459 -23692 -1831 34838 -15441 -29586 26731 13196 -24270 5535 8496
1170H496k2626K6603l045l7908L3101K6330m9498j420M2815j9562j8127K4534
$$ 8496 -14130 12473 9428 -28480 4621 30951 -18547 -19967 22848 3286 -14841 9693
1182I693j1664j0056L0552j5130l0182L6137J2907m0300Q437K5900k0022j275
$$ 9693 -1971 -12027 18525 3395 -26787 9350 22257 -18043 -9606 16294 -3728 -5003
1194e003J5388k0281L128K7405k3233j8289L3119J28k6887J4376Q102j5928J2066
$$ -5003 10385 -9896 -6768 20637 -2596 -20885 12234 12362 -14525 -149 7953 -7975 4091
1207D091M297k3524J3855J9995k7006n430K6613r854j3379J6514n407j0239J9540
$$ 4091 8388 -15136 -1281 18714 -8292 -13722 12891 3037 -10342 6172 765 -9474 10066
1220A0066m709k1687J9637J1964k5715L291J8676j3738l913J4661j1860m972J9625
$$ 10066 5357 -16330 3307 15271 -10444 -7153 11523 -2215 -6128 8533 -3327 -8299 11326
1233A1326q811j6705J9173N704j9944O324J1415j2868J802J0067j2051q83J4410
$$ 11326 2515 -14190 4983 10687 -9257 -2933 8482 -4386 -2584 7483 -4568 -5451 8959
1246H959q744r694J3930O68j1399O434M008q263M584M351r250K308Q516p494l641
$$ 8959 215 -9479 4451 5119 -6280 154 4162 -4101 483 4834 -4416 -2108 6408 -1086 -4727
1261d727Q075k021m488M879j091l209M996p80n593M612K739n798J196L616l790
$$ -4727 3348 1327 -3161 1718 627 -2582 2414 1634 -3959 653 3392 -2406 -1210 2406 -1384
1276a384L36L023l451nM538l356k643N156r09l944L446J048m075K668K094m450
$$ -1384 -1048 1975 -1476 -1481 3057 -299 -2942 2214 1305 -2639 807 1855 -2220 448 2542 -1908
1292a908J138L623l594j134L908j486k970L613k11l193K081J890l291M47K969
$$ -1908 -770 2853 -741 -1875 2033 547 -2423 1190 979 -2214 -133 1757 -1534 -1087 1882
1307A882k511r74K929o18k306K139M53k452J292J849k215l89K465j148j412K076
$$ 1882 -629 -1603 1326 708 -1598 541 994 -1458 -166 1683 -532 -921 1544 396 -1016 1060
1323A060O7k159Q22J477j991k21J633m73j152J363J78j137O26N81r14m19J135
$$ 1060 1127 -1032 -210 1267 -724 -945 688 215 -937 426 604 -533 93 674 -240 -659 476
1340D76l50r46O65J000o76q48J335K99j400L97J442j884o83K146p00k028K584
$$ 476 126 -820 -155 845 169 -679 656 955 -445 -48 1394 -490 -1173 973 273 -1755 829
1357H29P62l320J198K837k881r60L715k239k812M836o99m865L779K725n469R12
$$ 829 1591 -1729 -531 2306 -575 -1535 2180 -59 -2871 1965 1266 -3599 180 2905 -2564 -1652
1373a652N055m074j433M943k633l185N559j020n759N126K632o464J799M423m265
$$ -1652 3403 -671 -2104 2839 206 -2979 2580 1560 -4199 927 3559 -2905 -1106 3317 -948
1388i48p4M010m782p48O321m083m304O611L6n196L901P66m535M915J014p891M380
$$ -948 -1022 2988 -1794 -2542 3779 -304 -4608 2003 2039 -3157 744 1510 -3025 1890 2904 -4987 -607
1405f07O179q017j286Q076m834k308O860n225l641J1053l450j1198J0562N059
$$ -607 5572 -2445 -3731 4345 -489 -2797 4063 -1162 -4803 6250 2800 -8398 2164 7223
1419G223j2879L289P830r379K487Q299j1867j195J6524r379j2277J6384J752j4764
$$ 7223 -5656 -2367 5463 -3916 -1429 6870 -4997 -6192 10332 953 -11324 5060 6812 -7952
1433g952Q358M897j2937Q934P757j8617M253J9930j6039j0592J9810l164j2388
$$ -7952 406 5303 -7634 1300 9057 -9560 -5307 14623 -1416 -12008 7802 4638 -7750
1446g750J2619k466j2955J7381K680k3764J1043J8829k0148m852J7784q781n246
$$ -7750 4869 2403 -10552 6829 9509 -14255 -3212 15617 -4531 -9383 8401 -380 -5626
1459e626J4639j2357q754K4783n215k4839J8139J3524k0988K449J1551j3479N898
$$ -5626 9013 -3344 -12098 12685 7470 -17369 770 14294 -6694 -4245 7306 -6173 -275
1472b75J2912k2765j078K8887j4256k1416K3092M697j8061J1249J132j6669J9187
$$ -275 12637 -10128 -11206 17681 3425 -17991 5101 9798 -8263 2986 4118 -12551 6636
1485F636Q033l2254Q822K9699k3249j3340K4421o537r812J8982j2977j6125L2533
$$ 6636 14669 -17585 -8763 20936 -2313 -15653 8768 2231 -7581 11401 -1576 -17701 14832
1498A4832j59l8033J9155K5552k8252l123K0659j6957J967K2681k6713j1403M1121
$$ 14832 14673 -23360 -4205 21347 -6905 -10028 10631 -6326 -4359 18322 -8391 -19794 21327
1511B1327r264l6913K5473J6780k7122P367J1010k2486J5529K0097l7215k580
$$ 21327 12063 -24850 623 17403 -9719 -2352 8658 -13828 1701 21798 -15417 -17997
1523a7997M2415j7639k9068K6997N220j9390J6429l771k2937K9493J2050m2782
$$ -17997 24418 6779 -22289 4708 9928 -9462 6967 3196 -19741 9752 21802 -20980
1535b0980Q272L6981k3767j6293K3702q542o121K2922k0273j9382M0933J651m3401
$$ -20980 -12708 24273 506 -15787 7915 -627 -6748 16174 -4099 -23481 17452 19103 -24298
1548b4298J8288K6661k6451p7J5046k1437R911K5977l5831j1786M7245j0239l7129
$$ -24298 -6010 20651 -5800 -5877 9169 -12268 -2357 23620 -12211 -23997 23248 13009 -24120
1561b4120K5194J2566k3345J4777K463k8517K5138K2562m5308j947M5592j8919
$$ -24120 1074 13640 -9705 5072 7535 -20982 4156 26718 -18590 -20537 25055 6136
1573F136k5740K6424k468j4482K4538j1608k8170L6125J4404m7278Q210L6484
$$ 6136 -19604 6820 4352 -10130 14408 2800 -25370 10755 25159 -22119 -13909 22575
1585B2575k3327j1023K1132j5108j771K8742k4684k3049M2461M023m1910J5504
$$ 22575 -752 -11775 9357 -5751 -7522 21220 -3464 -26513 15948 19971 -21939 -6435
1597f435K2639k2045M267J1065k4315J2450K7619l4718j3939M2123o601l0559
$$ -6435 16204 -5841 -1574 9491 -14824 -2374 25245 -9473 -23412 18711 12110 -18449
1609a8449J9425O373j6490J8113k084k8215K5025K1028l9032k788L6010j5351
$$ -18449 976 7349 -9141 8972 6888 -21327 3698 24726 -14306 -17094 18916 3565
1621C565j6125J9454r050p328K6085j4475k6168L3523J1750l8077P527K5120j9065
$$ 3565 -12560 6894 -2156 -9484 16601 2126 -24042 9481 21231 -16846 -9319 15801 -3264
1634c264j669J4517j9633K756K8409k3366k0577L5505K665l1203J3619J2469j7948
$$ -3264 -4933 9584 -10049 -7293 21116 -2250 -22827 12678 15343 -15860 -2241 10228 -7720
1647g720R589Q013k5338J1528K5374k7576j2288L1670m593k0788J4955J259j3264
$$ -7720 1869 9882 -15456 -3928 21446 -6130 -18418 13252 8659 -12129 2826 4085 -9179
1660i179J7467j041k4874J8507J7885k7623k829K3373j0182q584J3809r703n074
$$ -9179 8288 7247 -17627 880 18765 -8858 -11687 11686 1504 -7080 6729 -2974 -8048
1673h048K0438r735j9648K1454Q689k2923N132J3052j2494L267Q840j6449L070
$$ -8048 12390 2655 -16993 4461 13150 -9773 -4641 8411 -4083 -816 8024 -8425 -5355
1686e355J9842j6159j2734K1942j60j6484J0127L657j1290J0550L414j8013Q186
$$ -5355 14487 -1672 -14406 7536 7376 -9108 1019 4676 -6614 3936 7350 -10663 -2477
1699b477J6235j7782o104J8054n295r855J1461l182q585J3884p43j6498J1048
$$ -2477 13758 -4024 -10128 7926 2631 -7224 4237 1055 -7530 6354 5611 -10887 161
1712A61J0416j6118o00J2902p998l022R792p486m096J3372m278j2021J1018N043
$$ 161 10577 -5541 -6141 6761 -1237 -4259 5533 -1953 -6049 7323 3045 -8976 2042 7085
1726G085j2362L253O631p774K048O351q871M9J0521o699o528R555J20p267M633
$$ 7085 -5277 -2024 4607 -3167 -1119 5232 -3639 -3590 6931 232 -6296 3259 3379 -3888 745
1741G45J161n728N405J748q173L712O615o909j833O894k924k991M697k485l109
$$ 745 1906 -3822 1583 3331 -4842 -1130 5485 -1424 -3257 3637 713 -2278 2419 -66 -3175
1756c175N837r63n824M662L146o048J445L989m413L70L591l964j202N291k460
$$ -3175 2662 1699 -4125 537 3683 -2365 -920 3069 -1344 -974 2617 -1347 -2549 2742 282
1771B82l976M936O74m279K417K049l812J367K982m271k87M494k616k801M180K24
$$ 282 -3694 1242 1916 -2363 54 2103 -1709 -342 2640 -1631 -1918 2576 -40 -2841 1339 1563
1787A563l172K020J476l175J254J926k625o55K782j218k002K447J47j807J273
$$ 1563 -1609 411 1887 -1288 -34 1892 -733 -1388 1394 176 -1826 621 768 -1039 234
1802B34Q09j389o7J132j115q1Q05l39p34P21K25k81J02M14l76N6L5k33L89l12
$$ 234 1043 -346 -413 719 -396 -477 328 -11 -745 -24 201 -80 22 436 60 116 151 -82 307 -5
1822el13N94n22l13P22J54p03M91Q03j552L47J111j114m03J274l49j320J495L98
$$ -5 -318 276 -246 -559 163 317 -386 105 908 -644 -297 814 -300 -703 571 222 -1098 397 795
1841G95j492Q92J054j680j46J834j588j021K060j28j887J407O48j645R56J104
$$ 795 -697 195 1249 -431 -577 1257 -331 -1352 708 580 -1307 100 748 -897 59 1163
1857A163j971M80J569j662r76K221o19j388J472L90j169R18L87j575Q49J081j762
$$ 1163 -808 -328 1241 -421 -1397 824 205 -1183 289 679 -490 428 815 -760 89 1170 -592
1874e92L50R46j295N3J253j310l8K067j667p98K117m68j554J655o74j712K440
$$ -592 -242 704 -591 -538 715 -595 -633 1434 -233 -1031 1086 618 -936 719 45 -1667 773
1891G73L06l475K356K639l820m1L630k904q91L722k984k366N705j346n513M919
$$ 773 1079 -2396 -40 2599 -1221 -1262 2368 -536 -1427 2295 -689 -3055 2650 1304 -4209 710
1907G10K543o029J952M029m924O27N136n786j616P510l093o185O800J782p149
$$ 710 3253 -2776 -824 3205 -1719 -1092 4044 -1742 -3358 4152 1059 -5126 1674 3456 -3693
1922c693L951K608o098K962M911q069R9Q502n155n053P630m44n631N658n87o134
$$ -3693 258 2866 -3232 -270 4641 -3428 -3329 5173 18 -5035 2595 2151 -3480 2178 1591 -4543
1938d543O773K167r819L569P834p497k209P157m084j543O525n315m242J0767k022
$$ -4543 2230 4397 -5422 -1853 5981 -1516 -3725 3432 -652 -2195 4330 -985 -5227 5540 3518
1953C518j0586P267M826q605K806M119p406M114P000j1976p63J3966o987r280
$$ 3518 -7068 199 5025 -3580 -774 3345 -4061 53 7053 -4923 -5686 8280 1293 -7987
1967g987J1258L1q433P856j94j0611J0596O173j6864L576J4965j1136o529J2495
$$ -7987 3271 3302 -5131 2725 2531 -8080 2516 8689 -8175 -4599 10366 -770 -7299 5196
1981E196m746n331J1079n619j0816J5915K764j8617P231J3058j2684j895J0239
$$ 5196 450 -4881 6198 579 -10237 5678 8442 -10175 -2944 10114 -2570 -4465 5774
1994E774q966n15J2989j1671q339J9263j708j7752J0465Q141j1963M179M843j2117
$$ 5774 -3192 -3707 9282 -2389 -10728 8535 6827 -10925 -460 7681 -4282 -103 4740 -7377
2008g377P229J1281j7400l047J9947p117j2683J1962K91q367J0508k736j3612
$$ -7377 -148 11133 -6267 -9314 10633 3516 -9167 2795 3086 -5281 5227 2491 -11121
2021a1121J5196P236k1217L174J7759j1762n549J1768p532k389J4512j1145j2176
$$ -11121 4075 11311 -9906 -6732 11027 -735 -6284 5484 -2048 -4437 10075 -1070 -13246
2034a3246K1242K102k2121R012J2797j4201K703Q091j3896M861J6688j8509r120
$$ -13246 7996 10098 -12023 -3011 9786 -4415 -1712 6379 -7517 -2656 14032 -4477 -13597
2047a3597K4311l435j9221J2799N308j2672R867K549j7830J1989J5089k2503m444
$$ -13597 10714 7279 -11942 857 6165 -6507 3360 5909 -11921 68 15157 -7346 -11790
2060a1790K3772q259j3303J3561k302q471J4640m206j7903J8037J0272k3511K047
$$ -11790 11982 3723 -9580 3981 1679 -6792 7848 3642 -14261 3776 14048 -9463 -7416
2073g416J7951j1216m350J0768r761j278J7204j2277j4018K1541L224k0438P308
$$ -7416 10535 -681 -5031 5737 -4024 -5302 11902 -375 -14393 7148 10372 -10066 -2758
2086b758R799j1416N103N159j5170O573J6824j8182q356K1589l250j4823J1012
$$ -2758 7041 -4375 728 5887 -9283 -2710 14114 -4068 -12424 9165 5915 -8908 2104
2099B104R10r309J2162p75j7983J3512J3655k1381k122J8901q431p356J1719p113
$$ 2104 3014 -6295 5867 5092 -12891 621 14276 -7105 -9227 9674 1243 -6113 5606 -1507
2113a507n656J7302p072j7379J8318Q055k0744L416J3907j1215j09J0046j3152
$$ -1507 -7163 10139 3067 -14312 4006 12061 -8683 -5267 8640 -2575 -2684 7362 -5790
2126e790r3J8176j1837j3935J9272K714j6714P066O619j0639O551N521j5748N492
$$ -5790 -5883 12293 456 -13479 5793 8507 -8207 -1141 5478 -5161 1390 6911 -8837 -3345
2140c345J5800j4717q129J6834k424j0069Q202n30p757J1651l41j5353R734J0826
$$ -3345 12455 -2262 -10391 6443 4019 -6050 2152 1622 -6135 5516 5175 -10178 -444 10382
2154A0382j4675j937J1988o158k730P948p063l150J3319n566j2267J2690M894
$$ 10382 -4293 -6230 5758 -400 -3130 4818 -2245 -5395 7924 2358 -9909 2781 7675
2167G675j3187L371O913q099L049O005j1316J474J2856q996p955J2649r2r957
$$ 7675 -5512 -2141 4772 -3327 -278 5727 -5589 -4115 8741 -255 -8210 4439 4347 -5610
2181e610O958J321q001P599L051j2276M616J1033j0942m187J1654l885n671P833
$$ -5610 1348 2669 -5332 2267 5318 -6958 -2342 8691 -2251 -6438 5216 1331 -4340 3493
2195C493k837o122R870k98j1269O403P489r654p52P912n020j816O472m860l375
$$ 3493 656 -5466 4404 4106 -7163 -760 6729 -2925 -3677 4235 -785 -2601 3871 -989 -4364
2210d364R154k561p946O812L474p449J654L719m409J620L767n677j64O724m030
$$ -4364 4790 2229 -5717 1095 4569 -2880 -1226 2493 -1916 -296 3471 -2206 -2370 4354 324
2225C24m243N702K0m119L290Q8l424L761J098n854K528M255m786q41M255k484
$$ 324 -3919 1783 1803 -2316 974 1062 -2362 1399 2497 -3357 -829 3426 -1360 -2201 2054 -430
2241d30r71L448k478k296N295r51m916L861K282n107J302L611m086N56L346l318
$$ -430 -1401 2047 -431 -2727 2568 1617 -3299 562 2844 -2263 -961 2650 -1436 -880 2466 -852
2257h52j335M867j906l955M213R97m068J902J902l458R10L080l519n01L592j534
$$ -852 -2187 2680 774 -3181 1032 2029 -2039 -137 1765 -1693 -783 2297 -1222 -1723 1869 335
2273C35k641L231K18k469J518Q40k155Q00J480k064k42K511j106j309J472K50
$$ 335 -2306 925 1143 -1326 192 1032 -1123 -323 1157 -907 -1149 1362 256 -1053 419 669
2289F69j396P64M89j035N34O12j371L04R73o89j67O02j73K5J54n21L6P28o58m86
$$ 669 -727 37 526 -509 25 637 -734 -430 543 -146 -313 289 116 141 295 -226 -190 538 -120 -606
2309f06J052l74n24M83Mo36Q59M36j162M51O74r78j69J072p41m59J386n51j012
$$ -606 446 72 -452 31 35 -601 258 694 -468 -17 657 -321 -490 582 -159 -618 768 217 -795
2328g95J043L67j157J34J306j173j33J275p17j045J363J02j478J056O50j288L54
$$ -795 248 615 -542 -408 898 -275 -408 867 150 -895 468 570 -908 148 798 -490 -136
2345a36P73m38o58J098l50j028R86J83j061R76L18j018K70O54o92k20P43k92m77
$$ -136 637 199 -459 639 289 -739 247 430 -631 345 663 -355 -85 569 -123 -343 400 108 -369
2364c69L04J11l57M10j3l99O66n70q5O67l18k74M86J52j109J087J59j446R93Q90
$$ -369 -65 46 -311 99 86 -313 353 -217 -302 365 47 -227 259 411 -698 389 548 -898 95 985
2384I85j493J37J645j619o86K230j153j607K628j08k804J972J402k774R16K162
$$ 985 -508 -371 1274 -345 -1031 1199 46 -1561 1067 959 -1845 127 1529 -1245 -329 1833
2400A833k888O4K882k397j562L734q62l043L041Q95k994J323J522k637O33K467
$$ 1833 -1055 -991 1891 -506 -2068 1666 804 -2239 802 1697 -1297 26 1548 -1089 -456 2011
2416B011k944l88L542k129k163L184k52k387K622m16k552K712J146m334J704K958
$$ 2011 -933 -1321 2221 92 -2071 1113 861 -1526 1096 680 -1872 840 1986 -2348 -644 2314
2432B314k923q19K917k039l78L386k837j995M483o52m273L526J415m150J677K210
$$ 2314 -609 -1428 1489 -550 -928 2458 -379 -2374 2109 1457 -2816 710 2125 -2025 -348 1862
2448A862m113J943L816n454n98O070k736m447N397l6m546M340K23n401M234L383
$$ 1862 -2251 -308 3508 -1946 -2544 3526 790 -3657 1740 1704 -2842 1498 1721 -3680 554 3937
2464C937p302Q94P084n129k807O023k452l242N959k249n628P021J974q606K948
$$ 3937 -3365 -2471 4613 -516 -3323 2700 248 -2994 2965 716 -4912 2109 4083 -4523 -1575
2479a575O278o065o58M984m658m07O720n532m077Q404k83q043N106L131n795K961
$$ -1575 4703 -1362 -2020 2964 -1694 -2101 4619 -913 -4990 3414 3131 -4912 194 3325 -2470 491
2495D91K180o524L312N921q135j604R105l396n492N919o25m258N804q30p381P052
$$ 491 2671 -3853 -541 5380 -2755 -4359 4746 1350 -4142 1777 1152 -3106 2698 1868 -5513 1539
2511A539L964r955J630P894o063j889O249m764j459P945m878o858R991J582j0603
$$ 1539 5503 -4452 -2822 5072 -991 -2880 3369 -1395 -2854 5091 213 -6645 3346 4928 -5675
2526e675M584N813p629K087M704p808J795R224q706n230J1874j969r068P141J798
$$ -5675 -1091 4722 -2907 -820 3884 -3924 -2129 7095 -1611 -6841 5033 3064 -6004 1137 2935
2541B935o996N947J784r473N472P863j0753k207J1130m508n763P147k327m490
$$ 2935 -4061 1886 3670 -5803 -331 7532 -3221 -5428 5702 1194 -4569 2578 251 -4239
2555d239Q366j886r229Q475N346j1256J388Q304o193j310N862n779j059R320n678
$$ -4239 4127 2241 -6988 1487 6833 -4423 -3035 5269 -924 -2234 3628 -2151 -3210 6110 432
2570D32p663J0794J445j0026M277M567p000L469L622r126L318Q988r139m446J1371
$$ 432 -7231 3563 5008 -5018 -741 3826 -3174 295 3917 -5209 -1891 7097 -2042 -6488 4883
2585D883k209p376O625n03n847P437K78j0116O304P675j0764j240J0065n186l339
$$ 4883 2674 -4702 1923 1420 -4427 3010 3288 -6828 -524 7151 -3613 -4853 5212 26 -3313
2600c313P019m708l320R777l465r689R123M668j0741K063P034o316P03N808p787
$$ -3313 3706 -1002 -4322 5455 1990 -7699 1424 6092 -4649 -2586 4448 -1868 -1165 4643 -3144
2615c144n61J0036n970p385R920R88q166M122L036o100M137L403q864K443Q785
$$ -3144 -3705 6331 361 -7024 2896 3884 -4282 -160 2876 -3224 913 4316 -4548 -2105 6680
2630F680p902m178Q747j728m900M959q18m945P195Lq612N239O001q521j06O434
$$ 6680 -1222 -5400 3347 1619 -3281 1678 860 -4085 3110 3113 -5499 -260 5741 -2780 -2886 3548
2646C548m557j079N329m805j926Q314l307p179P199K764p480K405L670n503K455
$$ 3548 -1009 -2088 3241 -1564 -3490 4824 1517 -5662 1537 4301 -3179 -774 2896 -2607 -152
2661a52L882o975M62Q061m981n466P897k22o050M343J066n402M820K177p537K392
$$ -152 3730 -3245 -2783 5278 297 -5169 2728 2506 -3544 799 1865 -3537 1283 3460 -4077 -1685
2677a685O692o123k281O500k150l350M436j692l636N343J98o397L786M424n726
$$ -1685 5007 -1116 -3397 3103 953 -2397 2039 347 -3289 2054 2252 -4145 -359 4065 -1661
2692a661Q8M064l054q55M078l261k129N404j392m960M302J738m200J651J863l285
$$ -1661 -1573 2491 -563 -1418 2660 -601 -2730 2674 1282 -3678 624 2362 -1838 -187 1676 -1609
2708a609J776K052m124J68M618k900k804M178l91k603K879m25k908L379Q63m411
$$ -1609 167 2219 -1905 -1737 2881 -19 -2823 1355 964 -1639 1240 815 -2093 1286 2149 -2262
2724b262J594L078l565n30L176j874r17L186j905j763L327l14l584K336J892l235
$$ -2262 -668 2410 -1155 -1685 1491 -383 -1300 1886 -19 -1782 1545 1231 -2353 -17 1875 -1360
2740a360N11K293k307O1K724k460j130L528j237k558K275J003k706J223J036j934
$$ -1360 -849 1444 -863 -802 1922 -538 -1668 1860 623 -1935 340 1343 -1363 -140 896 -1038
2756a038P84J951k185l97K432j192j503J931j86j615J164J39j543J294R73j817
$$ -1038 -254 1697 -488 -885 1547 355 -1148 783 597 -1018 146 285 -1258 36 1009 -808
2772h08M02J310o02q05J066l78p93Q70m75m88R40M6o98R78N8q13M28K95r21K16
$$ -808 -406 904 302 -503 563 185 -608 262 -213 -701 239 285 -413 565 623 -190 238 533 -388 -172
2792a72O76p95m02J073l39o64J046L1p53O57J32j111N65P04j309J08Q66n35n11
$$ -172 504 -291 -693 380 41 -623 423 454 -299 358 490 -621 -56 648 -661 -553 313 -222 -733
2811g33J292o8q63P79N5p89J64O52j101R5Q55l74m78Q47k03o31Q23J63o56K59
$$ -733 559 491 -372 407 462 -327 -163 489 -612 -517 338 -36 -514 333 130 -501 322 485 -171 88
2831H8M48o52k56O65m47k10P45k8p83P65N2l70Q5K3k50O0O3j23Q4M7r0L30R1m75
$$ 88 536 -116 -372 293 -154 -364 381 353 -430 335 387 17 102 125 -125 -65 -2 -125 -41 6 -84 246 337 -138
2855a38L79n4m75J67L86p60J41K82K0n22P31l8n01O34L30p55O0O71q67j10Q88
$$ -138 241 187 -288 -121 265 -495 -354 -72 -52 -574 157 119 -382 252 582 -173 -113 558 -309 -419 469
2876D69n25o42J457l65r47R46L59j441O70P14j463P4J140p58k06J058o62l98J190
$$ 469 -56 -698 759 394 -553 393 752 -689 -19 695 -768 -694 446 -312 -518 540 -122 -520 670
2895F70j40j246R51J68j110O37M99j070L94Q14r34k27J739r42n66P33m00o38Q04
$$ 670 530 -716 235 403 -707 -70 429 -641 -247 567 -367 -594 1145 203 -363 370 -30 -668 136
2914A36Rq93R15L48j352P52J193j682N9J383j249l29J612j195q37K236n81k016
$$ 136 145 -748 167 515 -837 -85 1108 -574 -515 868 -381 -710 902 -293 -1130 1106 525 -1491
2932a491K041P74k289R14J134k011N92J623k567JK637j220k033K746N6k185J984
$$ -1491 550 1324 -965 -51 1083 -928 -336 1287 -1280 -1279 1358 138 -1895 851 907 -1278 706
2949G06Q5k512J880J603l438L29L296k317j216K869j083j216K458q00k837L041
$$ 706 791 -1721 159 1762 -1676 -1347 1949 -368 -1584 1285 202 -1014 1444 644 -2193 848
2965H48O53l654J467K375k633rK369k083j72L030k506j407L841r41l401K527P46
$$ 848 1501 -2153 -686 1689 -944 -953 1416 -667 -839 2191 -315 -1722 2119 1178 -2223 304 1050
2982A050k551J517J228l017J618K959m088m84M380k288k376L110o51k474L364
$$ 1050 -1501 16 1244 -1773 -155 2804 -1284 -1768 2612 324 -2052 1058 407 -2067 1297
2997A297o84l225L671J744n144J243M080l841q26L245k257r63M192k672l146N216
$$ 1297 613 -2612 1059 2803 -2341 -1098 2982 -859 -1685 1560 -697 -1660 2532 -140 -3286 1930
3013A930M98n383K871K532m017J196K391m177J356L937m187j752N546j187m191
$$ 1930 2428 -2955 -84 2448 -1569 -373 2018 -2159 -803 3134 -1053 -2805 2741 1554 -2637
3028b637L504O76l447K655R69m778K819L535n018p62N254k409k635L971j415k188
$$ -2637 867 1543 -1904 751 1720 -3058 -239 3296 -1722 -2484 2770 361 -2274 1697 282 -1906
3044a906M108j410m407M225K242n650J685L783l490J17K972l478k72N022l744
$$ -1906 2202 792 -3615 610 2852 -2798 -1113 2670 -820 -703 2269 -1209 -1481 3541 -203
3059b03l649N856J27n317L075J772l537K304J932n015K046M789n664j913O038
$$ -203 -3852 2004 2131 -3186 -111 1661 -1876 428 2360 -2655 -609 4180 -1484 -3397 2641
3074B641k025l425L795l85k993M212J5n450L987L713o180Q8M665l119j662M149
$$ 2641 616 -2809 986 601 -2392 1820 1835 -3615 372 4085 -2095 -2007 2658 -461 -2123 2026
3090B026k702j687N197j753n106N321K222n980J157L551l573M20L237l977j38
$$ 2026 -676 -2363 2834 1081 -4025 1296 3518 -2462 -1305 2246 -1327 -907 2330 -1647 -1785
3105a785N343l395l494N416Mm368K692J056l485K775Q92m842K329M349m668j298
$$ -1785 3558 163 -3331 2085 2089 -2279 413 1469 -2016 759 1651 -3191 -862 3487 -1181 -2479
3121b479N155j838k674L182r57k544M034q76m642L861K807m945N06L819k971m66
$$ -2479 2676 838 -1836 1346 389 -2155 1879 1003 -3639 222 3029 -1916 -1410 2409 -562 -1028
3137a028L052l114q15M740k521l821M665J101m398J892K145l229J348K265m194
$$ -1028 2024 -1090 -1905 2835 314 -3507 1158 2259 -2139 -247 1898 -1331 17 2282 -1912
3152a912M74M563l477k793M818n27l307K613O28k769K535J196m648J882L265l188
$$ -1912 -1438 3125 -352 -3145 1673 1146 -2161 452 1080 -1689 846 2042 -2606 -724 2541 -647
3168f47j448L744j508j523K964j808j664L742q12l234K706J457l503L65K363k198
$$ -647 -2095 1649 141 -1382 1582 -226 -1890 1852 1040 -2194 512 1969 -1534 -1169 1194 -1004
3184a004K24K179j991n94L544j751k860L226N03k927J182J130k169J547J217k965
$$ -1004 -780 1399 -592 -1186 2358 607 -2253 973 1476 -1451 -269 861 -1308 239 1456 -1509
3200a509R07K672k086j618K865o72k008K221o23j901K122O51k511J247K109k493
$$ -1509 -602 2070 -16 -1634 1231 559 -1449 772 149 -1752 370 1021 -1490 -243 1866 -627
3216f27j27K199j447q74K008j347j039K285o67j894J594J319k299P36J400j776
$$ -627 -754 1445 -2 -876 1132 -215 -1254 1031 364 -1530 64 1383 -916 -180 1220 -556
3232e56R1J512j555k65J817q28j535J856K38j386P56N90j150N09N93j349N7J274
$$ -556 -465 1047 -508 -773 1044 216 -1319 537 775 -611 145 735 -415 94 687 -662 -605 669
3250F69p73p74J115J71n81P15j25j152J207j13j337Q72P19j023J13P94p16o0Q41
$$ 669 -104 -878 237 408 -173 542 417 -735 472 359 -978 -106 613 -410 -297 497 -219 -279 562
3269E62m35l82R54o44q62R05K00r93O77M03q33L89P10o10m96J257m65r25Q40j07
$$ 562 127 -255 699 55 -807 98 298 -695 -18 385 -448 -59 651 41 -455 802 337 -588 252 145
3289A45n52L93K87o41L89L86m33J92M66m79m92M13P3p39M77K41n48N05L31n38
$$ 145 -407 -14 273 -368 21 407 -26 166 632 153 -339 74 147 -592 -115 126 -422 83 414 -124
3309a24N7N56m22j66k9N3k41L23k40K6k17O91m07J88J93j98o4K43l40J30r3rm6
$$ -124 -67 489 67 -99 -128 -75 -316 7 -233 -207 -424 267 -140 48 241 43 -21 222 -118 12 -81 -90 -136
3332a36J53k2k06O03k63J60j63j98k85L73Rk53J39K10k80o9P42l69n50P12p1l88
$$ -136 17 -5 -211 392 129 289 126 -72 -357 16 25 -228 -89 121 -159 -228 514 145 -405 307 236 -152
3354a52K39K84q32L90K34l94p9Q75n31l79Q21j66o50L96q6n74N97K03q20N37P79
$$ -152 87 371 -461 -71 163 -231 -310 565 34 -345 476 310 -340 56 -30 -604 -7 196 -624 -87 692
3375F92q05L4M76l35l42L86j5m18K45K84n40K30J66k62J13L60m41J36K27n95j65
$$ 692 -113 -79 397 62 -280 106 91 -327 -82 202 -338 -108 58 -204 -91 269 -172 -36 191 -404 -569
3396e69P03l12j62O15l45o5P52l58n87O05j31p89M96M35r34M48P17n57k37R17
$$ -569 134 -178 -340 275 -70 -135 617 259 -328 277 146 -643 -147 288 -646 -198 519 -38 -275 642
3416F42o16m39R20j09r47N68K99r46N76N36q71L93P56j186L6J401r09q12J127
$$ 642 26 -413 507 398 -549 19 318 -628 -52 484 -387 6 762 -424 -388 1013 104 -708 419
3435D19k58r53Q84K66j121J003N65j393K06J337j066k35Q09n57m26P81n36m07
$$ 419 161 -792 92 358 -763 240 805 -588 -382 955 -111 -346 463 -94 -520 261 -275 -682
3453f82J412r6j649J122R43j595M56N78j193L92J191j210p81K320q95j371J767
$$ -682 730 634 -1015 107 1050 -545 -89 489 -704 -312 879 -331 -1112 1208 313 -1058 709
3470G09p7j201R06N9j498J171R21j918K00K017j631m32J753p35q96J646r09j291
$$ 709 632 -569 337 396 -1102 69 990 -928 -728 1289 -342 -774 979 244 -652 994 85 -1206
3488a206J906J70k116P70J934k029k7J751j430k84J964j800q70K092Jk471J422
$$ -1206 700 870 -1246 -476 1458 -571 -598 1153 -277 -561 1403 -397 -1267 825 826 -1645 -223
3505b23J243j882P05J167k060R30K183k656m37K393r63j644J578J77j341J660
$$ -223 1020 -862 -157 1010 -1050 -120 2063 -593 -1030 1363 400 -1244 334 511 -830 830
3521H30j84k146J952J386k963L02K305j752q76J893j147k88K063j517j751K918
$$ 830 646 -1500 452 1838 -1125 -823 1482 -270 -1146 747 -400 -688 1375 -142 -1893 1025
3537A025N18l169J383J520k048K99J277k061O29K467k257j302L401p25k500K096
$$ 1025 1543 -1626 -243 1277 -771 -472 805 -1256 -627 1840 -417 -1719 1682 957 -1543 553
3553E53N21k170J438N83k663J331K577l301o25L544j197j826K152n28j365K083
$$ 553 1074 -1096 342 925 -1738 -407 2170 -1131 -1756 1788 591 -1235 917 389 -976 1107
3569A107o08k741K771J341l190M30K448j662m36J717j694l56K553j822j913L048
$$ 1107 499 -2242 529 1870 -1320 -890 1558 -104 -540 1177 -517 -873 1680 -142 -2055 993
3585I93N28l057J137J736j977R02O71k396R87K638k663j529L371o45k041J704
$$ 993 1521 -1536 -399 1337 -640 262 933 -1463 -476 2162 -501 -2030 1341 696 -1345 359
3601C59Q2j721K124K5k572J706J776l075j27K919j549j032K083j125j001K413
$$ 359 441 -1280 844 869 -1703 3 1779 -1296 -1423 1496 -53 -1085 998 -127 -1128 1285
3617A285q03k444K612J232l377P64J857j784N93J344k358J32L047k121j861K906
$$ 1285 482 -1962 650 1882 -1495 -731 1126 -658 -65 1279 -1079 -947 2100 -21 -1882 1024
3633A024J70k534J441M54j655R89J201k489Q99K689k295j194K741p66j852J668
$$ 1024 1194 -1340 101 555 -1100 -111 1090 -1399 -500 2189 -106 -1300 1441 675 -1177 491
3649D91m52j297J943K58k418J313J731k302k92K284j256l56J028j182n29K260
$$ 491 39 -1258 685 943 -1475 -162 1569 -733 -1025 1259 3 -353 675 -507 -1036 1224
3665A224r05j822J822R76j928M06J235j505M31J043j779j10K156j718r11K198
$$ 1224 319 -1503 319 1295 -633 -227 1008 -497 -66 977 -802 -912 1244 -474 -1385 813
3681H13k37j473J159K35j255J244J17j799O93J985j783j025K022j05j115J139
$$ 813 576 -897 262 497 -758 486 603 -1196 -503 1482 -301 -1326 696 591 -524 615
3697F15k58j301J795p2k038J365P17j487L2J342q19n09J249p33o72J737l59j956
$$ 615 357 -944 851 779 -1259 106 823 -664 -632 710 -109 -618 631 -102 -774 963 604 -1352
3715a352J626N27j539N13N85r02N44O85r42j42J281q98o69J032k42n50N69j24
$$ -1352 274 801 -738 -225 360 -542 2 687 -255 -397 884 -14 -683 349 107 -443 126 2
3733Bo47J110J00j246P85R25j093l31R25m72l06J69j13m17J024R8j335R28N20
$$ 2 -645 465 565 -681 104 1029 -64 -395 530 58 -248 -79 -192 -609 415 513 -822 106 626
3752F26p40r8O24n96m9M96m50m63J460n06j103J221J62r06N90K83j014M25M24
$$ 626 -114 -212 412 -184 -233 263 -187 -650 810 304 -799 422 584 -322 268 551 -463 -38 386
3771C86m89j93P80l66m64O10R0l81J19Ok83J04N32q94J43N08k04k79N14J0k71
$$ 386 -103 -296 484 118 -346 264 354 -27 92 98 -185 -81 451 -443 -300 208 4 -275 239 249 -22
3792b2M42m12k40J25K19m69L88J60m24o4N70l60J10J92l94J82R2J61m35O0K23
$$ -22 420 8 -232 -107 112 -357 31 191 -233 -297 273 -87 23 215 -179 3 95 256 -179 -119 104
3813A04k79L38j61q9R7K38m65r7M23j60k05L14P6l90N9K11k45M09M8j55j85L09
$$ 104 -175 163 2 -87 10 248 -217 -314 109 -51 -256 58 134 -256 -197 14 -231 178 226 71 -114 195
3835A95m32J43L82m29k00M79J81p00M95J6l37K79j25j69J58J75k12j98L48l8J65
$$ 195 -237 -94 288 -141 -341 138 319 -381 114 130 -207 72 -53 -222 -64 111 -101 -299 49 11 176
3856A76k2J28l54J60j64J23J7q9m0j55J14J2o1K27J9k68M12l77J12J96k38j18
$$ 176 154 282 -72 88 -76 47 64 -25 -65 -220 -106 -94 -155 72 91 -177 235 -142 -30 166 -72 -190
3878a90J61L80n98L36L52o42L3O54m20p5K19o8n35N63j93l35L75J10l58M03M32
$$ -190 -29 351 -247 89 441 -201 -168 486 66 -9 210 142 -393 170 -23 -358 17 127 -231 172 604
3899F04p24J96K96n18j94N46l78l9K15L82q09P13M5n51K00M11n43M3N51o92N4
$$ 604 -120 76 372 -146 -340 206 -172 -211 4 386 -423 290 335 -216 -16 395 -148 -105 446 -246 -192
3920a92N73n23m39R26n2m42L97Ro76N65J13r84N82O23p07LO64l81j05L85l64k37
$$ -192 381 -142 -581 345 293 -149 248 257 -419 146 259 -725 -143 480 -227 -224 440 59 -46 339 -25 -262
3942b62O70l75p69O98K94n86L24K93q35O08O89j045kR05n70n22Q38k24n61P29
$$ -262 408 33 -736 -38 256 -330 -6 287 -548 60 749 -296 -298 607 37 -485 353 129 -432 297
3962B97J69j005O60O49j533N81P99o79o34Q93k37m29P38k34m87J005J73j474Q98
$$ 297 466 -539 121 770 -763 -182 617 -62 -696 197 -40 -469 269 35 -452 553 726 -748 150
3981A50M49r82J80M05m08o9J042j032l15J239j79j115P22J88o37O71l50m37O19
$$ 150 599 -383 -203 202 -206 -275 767 -265 -580 659 480 -635 87 275 -362 309 -41 -478 141
4000A41M02j188n9J894q61p69Q88j88o75J062n96r99J393L78j771O44J228j187
$$ 141 543 -645 -704 1190 329 -440 448 260 -415 647 51 -948 445 823 -948 -304 924 -263
4018b63k05Q72l80m43J152j018q93J936Q5j730P29R96j321M49N36j134N01J288
$$ -263 -468 404 24 -419 733 -285 -1178 758 843 -887 -158 838 -483 -34 502 -632 -131 1157
4036A157j885k34J707l01j182J089p8q40J085L3j429R67J059j527l82J638p38
$$ 1157 -728 -962 745 444 -738 351 273 -567 518 551 -878 89 1148 -379 -761 877 139
4053A39r48R32l26l51J538j051j196J992L36k062N65J506j452Q4O73r19J61J366
$$ 139 -809 123 -203 -554 984 -67 -1263 729 1065 -997 -432 1074 -378 -294 379 -540 -379 987
4071I87j177j069K197R7j979J007K33p51O05N29j436J064J283k306l29J882j62
$$ 987 -190 -1259 938 1035 -944 63 296 -455 150 679 -757 307 1590 -716 -1045 837 675
4088F75j275P08l03l99J161n8j889J520Q60j975J92J697j007o01J177n39n89J889
$$ 675 -600 108 -195 -594 567 509 -1380 140 1000 -975 -783 914 -93 -694 483 -56 -645 1244
4106A244j025j654J863O48j920M38J132j029K44N70j296M08J851j857p88J983
$$ 1244 219 -1435 428 1076 -844 -406 726 -303 -59 511 -785 -377 1474 -383 -1171 812
4122H12j51j236O55K88r87R81J63j387P06J169j593l64J618m34o77O39k53o09
$$ 812 661 -575 80 368 -619 362 525 -862 -156 1013 -580 -944 674 240 -437 202 -51 -660
4140f60J524k76j546J252N41j493L12Q39n71P5O63j186MJ802j121j257J609K63
$$ -660 864 588 -958 294 835 -658 -346 493 -78 -3 660 -526 -522 1280 159 -1098 511 774
4158G74j508O55K34n71P40L26j438P35J246j214p63J384j79p09M24p2o87J082
$$ 774 -734 -79 155 -416 324 650 -788 -53 1193 -21 -784 600 421 -288 136 64 -623 459
4176D59l1j558J078J167j041k65P66k94o06R65p36o23J375j56j221Q50N05j247
$$ 459 428 -1130 -52 1115 74 -191 575 281 -325 640 -96 -719 656 500 -721 129 634 -613
4194f13N35N52o84J78O40j142j05J312m16j086J253nq74L31K78o52R23J18j247
$$ -613 -78 474 -210 -32 608 -534 -639 673 257 -829 424 419 -455 -124 154 -498 425 543 -704
4213g04N82Q76q71k31P01k89k49M97j37l15O80k31r69N75O98j079K61O20n28l6
$$ -704 -122 754 -117 -348 353 64 -185 312 175 -140 540 309 -660 -85 613 -466 -205 415 -113 -149
4233a49O10n77j58J119r09m80N74N79r16K13N80o35J59Q9k08j04P74o20k55L26
$$ -149 461 -116 -274 845 -64 -544 30 609 -307 -94 486 -149 10 99 -109 -213 561 -59 -314 12
4253A2L01n96K28K20l40L92L63r31K67N80l87l53L90J54k39k7k97J55K67J32n01
$$ 12 313 -283 -55 165 -175 217 580 -351 -84 496 109 -244 146 300 61 34 -263 -108 159 291 -210
4274b10L08J87n19O3M15l47J63Q8j22k34N01k20m76M08K78m90j4J25k06M59J9
$$ -210 98 285 -234 -171 244 -103 60 148 26 -208 293 73 -403 5 283 -207 -221 -96 -302 157 176
4295A76l64q8M26l04m9M30l2m75L33L01m24J74K01m52L2K04k90k40P24j17j59
$$ 176 -188 -276 150 -154 -203 227 195 -280 53 354 -70 104 305 -147 -115 89 -201 -441 283 166 7
4316GO8J1n74O21L3j84j78N51n51k78N22k49Q7L10k03j38O5P2j53P8L81l46K46
$$ 7 75 86 -488 133 166 -18 -196 355 -196 -474 48 -201 -114 196 -7 -145 -80 -8 -161 -83 298 -48 198
4339A98k11J80p9M5k60K11n7M0k47J79L1K9Q7k43K58k18Ok64J78N81p55K95J67
$$ 198 -13 167 88 133 -127 84 27 67 -180 -1 30 59 146 -97 161 -57 -51 -315 -137 444 -311 -16 151
4362A51k24l0K50k21j83L61J41n27J33L54j99j40N42n23J27J54p3l67M26M0l81
$$ 151 -73 -103 147 -74 -257 104 245 -282 -149 205 6 -134 408 -115 12 166 93 -274 152 192 -189
4383a89L02j59l00L86M6l61K64K2K9o4M36n34J27J80J0n05K37K13k32J7L45n69
$$ -189 113 -46 -346 40 86 -275 -11 11 40 -24 412 -122 5 185 195 -310 -73 140 -92 -75 270 -299
4405b99J42M38n83L49K02o3l58P1K84n44L34j37j24M29o4l28J50K38l84K81N7
$$ -299 -157 281 -302 47 249 186 -172 -101 183 -361 -27 -164 -288 141 77 -251 -101 137 -247 34 91
4426I1r7R3P3k70j3N29l77k32K88J46m98J52J40m73M00M13o02J38P00n70n75L92
$$ 91 -6 87 160 -110 -123 406 29 -203 85 231 -267 -115 25 -448 -48 365 -237 -99 601 31 -544 -152
4448a52K16m7L26k44m03N76L36r21K21N00p07o7O58m29J74K50k83m95Q66k21n79
$$ -152 64 17 343 99 -304 272 608 -313 -92 408 -299 -366 292 -137 37 287 4 -491 375 154 -425
4469d25K41M30j52j90L38m06K36K71n27l62P93l02m95P88m7m27N92n42l39P33
$$ -425 -184 246 94 -96 242 -164 72 343 -184 -546 247 -55 -550 238 191 -236 356 -186 -525 208
4489B08J22n31M7O74n33k08L63n1k05L35k63n19J167k35r04M03N48m44k60O81
$$ 208 330 -201 -154 520 -13 -221 142 91 -114 221 -42 -561 606 371 -533 -130 418 -26 -286 395
4509C95n72r0J163j274l89J414k28j170P95K18n38J70L00p50N20P55j281K20Q59
$$ 395 -177 -267 896 -378 -767 647 419 -751 44 262 -276 -106 194 -556 -36 719 -562 -342 517
4528E17m47l84M47j39k91P72l22p18P69L72j341K47J358n94n08M33m67Q7P73o05
$$ 517 70 -314 133 -6 -297 475 153 -565 204 576 -765 -518 840 246 -262 171 -296 -209 564 -41
4548d1p82J427l5j157N18O58q22L75L47j142O68O13p73o39J202k12n58O91p5l84
$$ -41 -823 604 569 -588 -70 588 -234 141 488 -654 14 627 -146 -785 417 205 -353 338 263 -121
4568a21M69l17r67J196M05j249L7J223m24o02N50j95l17J008n99j132J209L80
$$ -121 348 31 -936 260 665 -584 -547 676 252 -350 200 5 -312 696 97 -1035 174 554
4586E54p42n11J194n06j7N03r86J50J259q93r22J165L97j198M51M90p41O37M7
$$ 554 -188 -699 495 -11 -28 475 -511 -361 898 5 -917 248 645 -553 -102 388 -353 284 331
4605C31j201N09J252j208m84J095K0q61Q85m36m05J158n38r83J049P86j343o5
$$ 331 -870 -361 891 -317 -801 294 314 -547 338 -98 -503 655 117 -866 183 969 -374 -439
4623d39P64j31l44M12n90n5P78l52j014J241M02q38j06N25n68L41M71r26J60J178
$$ -439 325 194 -150 262 -328 -383 395 43 -971 270 672 -166 -272 253 -315 26 497 -429 -269 909
4643I09j006m86R50J32o07K50p8m09O87K35j248K85J244j026m96J214l97n38M99
$$ 909 -97 -583 367 499 -108 142 64 -345 342 577 -671 -386 858 -168 -664 550 153 -385 114
4662A14k21k23Q73m87n72M66O68p12l53O52p7n62P61o23l13J218o23l73N56N32
$$ 114 -107 -330 543 56 -516 -50 618 -94 -447 205 128 -434 327 -296 -609 609 -14 -387 169 701
4682G01p32J2L58m69k8L78m92j6R59p35l76P96j71l72L67k81l55P69J3q50M79
$$ 701 -31 -19 339 -130 -158 220 -272 -288 671 -64 -440 356 185 -187 180 -101 -456 313 326 -524 -45
4703d5O33q79m2M94j83L7K04m04k00P29j21o86O42M42q54K29J3j78M9M79n54k16
$$ -45 588 -291 -333 161 -22 15 219 -185 -385 344 223 -463 179 621 -233 -4 9 -169 -120 359 -195 -411
4725d11J145n85q08O74K21j77j70K36m96N18Jn44M33O67o94k72M46J03l14L2P2
$$ -411 734 149 -659 15 236 59 -111 125 -371 147 148 -396 37 704 10 -262 184 287 -27 5 77
4746G7k93L84j31k98J10O07m87k04M44l19M9L87m31J5M65po15K74K78l96R6rJ45
$$ 77 -216 168 37 -261 -151 456 -31 -235 209 -110 -61 326 -105 -90 375 368 -247 27 305 -91 5 -4 141
4769A41J28p5l79Q7K88o0k99K86p5k73M12k33j71M57m2m24N5M08k19p5J42j43
$$ 141 269 194 -185 -98 190 130 -169 117 42 -231 181 -52 -223 234 192 -232 -177 231 12 -63 79 -64
4791f4j69L12J43j74R9n0k10K12J74k55M9K19m44J18O7p3j59L84k48M4J25J72
$$ -64 -233 79 222 48 147 97 -113 99 273 18 67 286 -158 -40 27 -46 -205 179 -69 -25 100 272
4813B72l20J26j4j08P2pr2O3K13j88m4j62K43M9k84J70J73j23J51o3m14N36j84
$$ 272 -48 78 64 -44 28 21 -71 -8 205 17 -27 -189 54 103 -181 -11 162 39 190 127 -287 249 65
4836F5n6J16l8k3k2o2l25M57J66l68j40L39q5L7n6p3j2J63l03O9M40k58PJ06k8
$$ 65 9 125 87 64 42 -20 -345 112 278 -90 -230 109 24 61 5 -68 -80 83 -220 -151 289 31 38 144 116
4861A16j76J8K56m12K27n6Q7j39K07J17l54K47J2l42r5M94l08o8L50k93Q2K52
$$ 116 -60 -42 214 -198 29 -27 60 -79 128 245 -109 138 150 -192 -287 207 -101 -169 181 -112 -30 222
4883B22m31K25Nj72J28J37l0j42o9j71K58J63Q1l10K74j17k72K08J55m55J35L14
$$ 222 -209 16 21 -151 -23 114 84 -58 -127 -298 -40 123 204 -106 168 51 -221 -13 142 -313 -178 136
4905A36j89q2L52j49k25J2J92n03O57M4j50N1n2k29j29M32J8m92K19J45j67n6
$$ 136 -53 -135 217 68 -157 -145 47 -456 201 245 95 146 94 -135 -264 168 186 -306 -87 58 -109 -165
4927a65J78k71M08q2j66j45N20l20k68K51M5m7M14K5m23L06q2o9k13L30m84Q6
$$ -165 13 -258 150 68 -98 -243 277 -43 -311 -60 -15 -62 352 377 -46 260 178 109 -104 226 -258 -172
4949a72O2n7R5K68k39m5M49K4n88J10L16k50j63J43k55K12M36o15J56M82j31m10
$$ -172 -110 -167 -72 196 -43 -88 361 385 -203 -93 223 -27 -190 -47 -302 -90 346 -269 -113 369 238 -172
4971a72L14k69K7L84j31l10K93J03m71r0O25l18k43K02p5n4O26k48p85J123j30
$$ -172 142 -127 -100 284 153 -157 136 239 -232 -322 303 -15 -258 -56 -131 -185 441 193 -592 531 401
4992D01r66N34L94n49J52qm33N04L04n61jN76k53m24L93n2j35K76j05m31L58M02
$$ 401 -565 -31 363 -186 -34 -42 -475 29 333 -228 -229 347 94 -330 63 11 -124 152 47 -384 -26 376
5014C76m20l40Q62l93l81M64k08k61O48n79l91R27K56q51P0M82m61J20K94m50
$$ 376 -44 -384 478 85 -296 168 -40 -301 347 -232 -623 304 560 -291 -221 261 -200 -80 214 -236
5034b36r1Q57q70p6P19R6o72J98J0k23N25no58J89Q08o92n65R77l7o10M43l13
$$ -236 -327 530 -340 -416 303 399 -273 -75 -65 -288 237 232 -426 -237 571 -121 -686 291 254 -356 87 -226
5056b26J95L84j13r18P97L67j096Q2Q60j82j09J68l20K7P61o47o58P89L06p96
$$ -226 -31 353 240 -678 119 486 -610 -528 332 150 41 209 -111 -84 677 30 -628 161 467 -329
5076c29J62N78m60J78K4o46M73Q51p29p06P72J24n05L97j19k27M10m0j012P97
$$ -329 -167 411 -49 129 153 -493 -20 831 102 -604 168 292 -213 184 65 -162 248 208 -804 -7
5096gN82n56m12M03P5k32K50l15r4N04J04r41N90N43o48k09N60n26L82K60o84
$$ -7 575 19 -393 10 85 -147 103 -212 -306 198 302 -639 -49 494 -154 -363 197 -329 53 313 -371
5117c71J39Q84n38q68O86L19m67R4N04o43N18o8o65M84O29n42p33R96l80k37N14
$$ -371 -232 652 114 -754 -68 251 -216 -122 382 -261 257 189 -476 8 637 95 -638 358 -22 -259 255
5138B55k66m44P05O9q33L18P08o79j07N88p1l05L78m75n6Q13k96q19O03K60p64
$$ 255 -11 -455 250 319 -514 -196 512 -167 -274 314 243 -62 316 -159 -215 598 302 -517 86 346 -418
5159d18L2K32J63NM56n53p3Q80n44p46P56k7l72J61l9j87N54J65q39J61Q84o86
$$ -418 -386 -154 9 14 470 -83 -156 724 180 -566 190 163 -209 -48 -87 -274 280 445 -394 -233 651 -35
5181c5l73P16j32m36L96k6n54J026k50o99K63P13q45m5N70l51P5K65n37m2O31
$$ -35 -408 308 176 -260 136 110 -444 582 332 -367 -104 609 -236 -281 289 -62 13 278 -259 -301 330
5202C30kn32j22N00m91n7L83k13L85p4j52p1M27j57l80M02J90m59J38o0p3K33
$$ 330 328 -204 -326 174 -317 -374 9 -204 181 107 -45 -116 311 154 -226 176 366 -93 45 -15 -88 145
5224A45J03n11K82L20m39j4O8j88N2L24k19k03N85k03l78L13l8k08M23l1j86k5
$$ 145 248 -263 19 339 -100 -114 -46 -234 -182 142 -77 -280 305 102 -276 37 -1 -209 214 183 -3 -28
5246b8M06l81l81P43k79m21M78k46K42m2j90K5J18J36m24R9L08J40n19L13M9j78
$$ -28 378 -3 -384 359 80 -341 137 -109 133 91 -99 -74 44 180 -244 -145 163 303 -216 97 146 -32
5268c2J50o4m26M73L74m91K78J9r8m15J53K3J4L67l40k90L21L10m58J04M8Q5j86
$$ -32 118 54 -372 101 475 -16 262 281 183 -232 -79 -56 -42 325 -15 -305 16 326 -132 -28 20 105 -81
5291h1L24m35J05J99j3l34L94J57l91L0P9l3J46p3L2M0n3j18MK67j86j14J0O5
$$ -81 243 -192 -87 112 99 -235 159 316 -75 -45 34 1 147 74 106 146 93 -25 -21 246 60 -54 -44 21
5315B1k08L69j04O6n0np0l7K7o8K42j01m4J1j9j37l92M96K72m94J06P9K69j27
$$ 21 -187 182 78 144 94 89 19 -18 9 -59 183 82 38 49 30 -107 -499 -3 269 -225 -119 -40 229 102
5339A02J4k96J4P8j46K72j2o9J68L6r1L6k90L40j82J71k12j54N3R1J05j2m4nJ29
$$ 102 116 -180 -166 -88 -234 38 26 -43 125 161 70 106 -184 156 -26 145 -67 -221 -168 -77 28 16 -28 -33 96
5364I6n8K9k70J35m4R9j30K86j96M4J10p6j59J55q9KM83k42j42K90j34l19L7O6
$$ 96 38 67 -203 -68 -112 -13 -143 143 -53 -9 101 25 -134 21 -68 -66 417 175 33 323 189 -130 -93 -27
5388b7k2j63J32k61N71k04q9p3R4J0k23L06J41m11R4J2J04q0K62K2k87K76j46
$$ -27 -49 -212 -80 -341 230 26 -63 -136 -42 -32 -255 51 192 -219 -125 -113 -9 -89 173 195 -92 184 38
5411C8j23j09L36n6k4n0l54L07K78m14l6L78l73M1K12q3j43J45J83l68L87j37
$$ 38 -85 -194 142 86 62 12 -342 -35 243 -171 -207 171 -202 -161 51 -32 -175 -30 153 -215 172 35
5433C5l36J26L09J02n16K31k7j49K19r1Q4Q3k46r9L18j44q0J70K01m23L70J89
$$ 35 -301 -175 134 236 -280 -49 -76 -225 -6 -97 -13 70 -176 -275 43 -101 -181 -11 190 -233 137 326
5455C26n71K0M32j71r7K57l91J57K78j28l20R9N12o25J20N80n36j67K68K0Q3K4
$$ 326 -245 -225 207 36 -61 196 -195 -38 240 112 -208 -109 403 -222 -102 478 -58 -225 43 63 146 170
5477A70m91j41P19o2k58J92k59j30J95L51k48k27O19m80r4M84m48m2L23M8l12
$$ 170 -321 -462 257 195 -63 129 -130 -260 -65 286 38 -189 430 -50 -144 340 -108 -150 173 221 -91
5498i1K61k59k58L67K30m27k44O51L5o10P06m19k14M70j42m68O32pn28L92l4j08
$$ -91 170 -89 -347 20 250 -177 -421 230 265 -345 361 -58 -272 198 56 -412 220 213 -315 77 43 -65
5520f5kK8n1k41Q02n72m32Q11j20l35J79R9j91L10k17k54M76L20o87L7K49k32
$$ -65 -67 -39 -90 -331 471 -101 -533 278 158 -177 2 101 -90 220 3 -251 225 545 -142 -105 144 -88
5542h8Q4L2k72l9M77m1n01L47M60n83N0K38j22j09K84k92p6N09j74n76N47J77
$$ -88 -4 28 -244 -283 194 153 -348 -1 459 -124 -74 164 42 -67 217 -75 -151 358 184 -392 155 332
5564C32n56K52%j19K07J76n13j1N34j23o72P94j82k06K1J44m6J78j20p06O78J31
$$ 332 -224 28 28 -91 116 292 -221 -232 302 179 -493 301 119 -87 -66 78 32 210 90 -616 62 193
5586A93j14k27L71k91Q4M7k0l89M90J29q32O94J56l60L9L73o20L19J83q27K88
$$ 193 79 -148 223 -68 16 63 43 -346 144 273 -559 135 291 -69 -30 343 -277 42 225 -602 -314
5607c14Q39m63n28P29j07k72K08N1n44N70p5l91J52O09m91l01M61q5q3J96k97
$$ -314 525 62 -466 263 156 -116 92 143 -401 169 94 -297 -145 464 -27 -328 133 48 -35 161 -136
5628a36l15Q96j85o42O10K32n72N4J53l73K31M02m86k47J013m96r06O59K85k81
$$ -136 -451 445 260 -382 228 460 -112 -58 95 -278 -47 355 -131 -378 635 139 -767 -108 177 -104
5648a04L08j82k14N53R2r39N26K76k80j38j1j18K01J57k63r0L64R8n34L60K72
$$ -104 204 22 -192 361 453 -486 40 316 36 -102 -113 -231 -30 127 -136 -226 138 236 -298 62 334
5669C34k74k14N99m05J54L09p07j66N76L4p66L74L79m45L11M4k44M06Q1m31q9
$$ 334 60 -154 445 40 194 503 -204 -370 206 240 -526 -152 227 -218 93 137 -107 299 380 -51 -140
5690a40M51k34m16M28j61o4r7K49k21J90K27m16rO42m65j05N6J91n9J7j63k28
$$ -140 311 77 -339 89 -72 -136 -233 16 -205 -15 212 -204 -213 429 -36 -141 -85 106 47 64 -99 -327
5712c27L83M0k90o5M00k61Q0J99k45j12L31r8k65O07j60k01k39M17m07L87n0m73
$$ -327 56 96 -194 -259 141 -120 -40 159 -86 -198 133 35 -230 377 217 16 -223 194 -213 174 124 -349
5734c49L93M44o33J91L20l99m6J75K11m76L24K0m23L40K94o15q7N46l84K9K58
$$ -349 44 488 -145 46 366 -33 -79 96 307 -169 155 175 -248 92 386 -229 -316 230 -154 -125 133
5755A33M5l09J38q4k8J37K62n17J53J50R7k68J82M9j05N5l87L42O0Q9j88j6J11
$$ 133 178 -131 7 -77 -105 32 294 -223 -70 80 177 -91 91 140 35 90 -297 45 105 194 6 -10 101
5778A01j01n8O8k42J66N6l9KQ1p6o5N7j26J39K50k21m7q4J69k33K69j8j03l7J52
$$ 101 0 -58 10 -232 -66 -10 -49 -47 34 -42 -107 -50 -176 -37 213 -8 -55 -139 30 -203 66 48 -55 -92 60
5803F0k85J22K85l22M8NL14k39j23J03j05L2Q6R0o6N6k78J37P6K94m55J53K31
$$ 60 -225 -103 182 -140 -92 -87 227 -12 -135 -32 -137 -105 -19 71 5 61 -217 -80 -4 290 -165 -12 219
5826B19j77j0R8j77J43p5j34K0Q8J8r5K19N0k68j2L31j10l38M04k46n0K38k24
$$ 219 42 32 130 -47 96 21 -113 -93 -5 13 -82 137 187 -81 -93 238 128 -210 194 -52 -102 136 -88
5849h8nK5K0j90L57k82K08J37q4k40L05n7j04o4J80j82K8M79k84l21J04PP1Q1
$$ -88 -93 -68 -48 -238 119 -163 45 182 98 -142 163 106 2 -62 118 -64 -36 443 159 -162 -58 -51 20 101
5873A01j46N8j51L84l11K95j91R0j12J85l13K09p7j06P3j00J05j4PM6k33J83J42
$$ 101 -45 13 -138 246 -65 230 39 129 17 202 -111 98 21 -85 -12 -112 -7 -21 -14 32 -201 -18 124
5896A24r8k0J37N7k31N5j7J35k83J71j02K12k03L5oL8m1K10k64r8o6L81o0j85
$$ 124 26 6 143 200 -31 24 7 142 -141 30 -72 140 -63 -28 -34 4 -37 173 -91 -189 -255 126 66 -119
5920a19P2K2j0J95j23j55J15J08k17j6K04j5j00K75l20K09k00m2N9K16j90O3J35
$$ -119 -47 -25 -35 160 37 -118 -3 105 -112 -128 76 61 -39 236 -84 125 -75 -117 -58 158 -32 31 166
5943A66J71k41l08L04L4Q8L6l13K34R3m10nl4K61j02J25o2q9r0J05k68K46J78
$$ 166 337 96 -212 92 126 214 250 -63 171 264 -146 -151 -185 76 -26 99 37 -52 -142 -37 -305 -59 119
5966A19k57J15j81M45m62J12K75l43L14k60r1J67L04k41m00L15J27p5K72j74m5
$$ 119 -138 -23 -204 241 -221 -109 166 -177 137 -123 -214 -47 257 16 -384 -69 58 -17 255 81 36
5987C6mJ06l73O19j04l07K2J56k11OJ96j20J90L6k31r0J16o3l1j2J53k85K28P9
$$ 36 32 138 -235 384 280 -27 -5 151 -60 -54 142 22 212 248 17 -73 43 -20 -51 -63 90 -195 33 112
6011A12j82j72N99l17j38J67j45O9J33k72N8K32j34j61K70K17m34l4J65o9k54
$$ 112 -70 -242 357 40 -98 69 -76 -7 126 -146 -88 144 10 -151 119 336 -98 -132 33 -36 -290
6032b90M09m53J83J61J43l51K28N04n01j59J47Jj13O9j53JL45q9n44N81q8k8J28
$$ -290 119 -334 -151 10 153 -198 30 534 33 -126 21 22 -91 -22 -175 -174 171 82 -462 119 31 3 131
6055A31l3j20M20m12j5j04M33m25j1J75j9q9L54j74k27L26o0o33L70N75o59J1
$$ 131 98 -22 398 -14 -29 -133 300 -125 -136 39 20 -69 285 111 -116 210 150 -483 -113 462 -197 -186
6077a86J76k39J50N09o48K68M52m60j08L36j85l19J81J52k29K05K75m78r2O57
$$ -186 -10 -249 -99 410 -238 30 482 22 -86 250 65 -254 -73 79 -150 55 330 -148 -240 417
6097D17l05l40N46k7n32M36j22k03K77K36m71J79K15k36k90K96N4k77L77m8m86
$$ 417 112 -228 318 291 -241 195 73 -130 147 383 -88 91 306 70 -220 76 130 -147 230 182 -304
6118c04L92P9n07L09K66k89J36O5k81M05K2k26l05N03o9k95L02P7k26M3o3k51
$$ -304 88 167 -340 -31 235 -54 82 147 -134 271 293 67 -238 265 196 -99 203 280 54 97 34 -217
6140b17L91J92o20k37P34k73k77N62j65j55L07j55l63M62r1l44N5N73m97j16O31
$$ -217 174 366 -254 -491 243 -30 -307 255 90 -65 242 87 -276 186 95 -249 -194 379 -118 -234 397
6161C97m88J02K21k81k35O57k09k51J34O7k26J73J06k65J91j6j64p4K96j34j26
$$ 397 -91 11 232 -49 -284 373 164 -87 47 114 -112 61 167 -98 93 77 -87 -161 135 1 -125
6182a25Loq2M66l73j95M45j78m1k38M71j91p4J85o8P0j00K73m49L24J82m97K38
$$ -125 -122 -128 -210 256 -117 -312 133 -45 -86 -324 147 -44 -118 67 -1 69 -31 242 -207 117 299 -198 40
6205D0J53k99J75J28m02j12L47k36j04L18J08o3Jo4j6N8K6j22J80K49m96j94M70
$$ 40 193 -106 69 197 -205 -317 30 -206 -310 8 116 53 54 -10 -26 32 58 -64 116 365 -131 -325 145
6228A45L0m24J80K40k49M02j58l07M33k17k18J85J84k26p8J63o2q9J76K0q2R9
$$ 145 175 -249 -69 171 -78 324 166 -141 292 75 -143 42 226 0 -78 85 23 -66 110 130 48 147
6250A47j55n2N1K59m31R6K4Q0M0J86k14l9R7J49l46J01L22l67L9J09j16q8J04
$$ 147 -8 -60 -9 250 -181 -85 -61 19 59 245 31 -8 89 238 -108 -7 315 -52 -13 96 -20 -108 -4
6273dk74l5L29k60l6K68J76k52K58j79j30N28k56p4n1J34l02J06j7K20k82K06
$$ -4 -278 -313 16 -244 -280 -12 164 -88 170 -9 -139 389 133 59 8 142 -160 -54 -71 149 -133 73
6295G3O0k20J52j72l9P8R1K16k39N7J10j97K68m23K25k81M62k88P1J28j92p1J50
$$ 73 133 -87 65 -107 -146 -68 23 239 0 57 167 -30 238 -185 40 -241 221 -67 4 132 -60 -131 19
6318A9j92k46N41j36k42M38mm57K88l3J28O1k45l3JL6K86k44J72j50J39m0q9q2
$$ 19 -173 -419 122 -14 -256 182 178 -279 9 -24 104 165 -80 -113 -112 -76 210 -34 138 -12 127 87 -2 -84
6342h4J57j52l9L37j55J8j68O1J98k49J70j38L6k45L43j77P4R3j89J16J27mk20
$$ -84 73 -79 -118 219 64 82 -86 -25 173 -76 94 -44 -8 -253 90 -87 -13 80 -109 7 134 130 -90
6365i0J81J68m17L37q5k73L56k17p9K32q4q0K18k24O6p3Q3n9J5p0J26K9l31M49
$$ -90 91 259 -158 179 94 -179 177 -40 -119 113 29 -51 167 -57 9 -64 19 -40 -25 -95 31 60 -271 178
6389A78j35j74P7rnJ74k06J12M2l01L61k1r5N0N8L1qk2k07j32K04R3j56o0M5J22
$$ 178 43 -131 -54 -63 -68 106 -100 12 54 -247 114 93 -2 48 106 137 129 107 -100 -232 -28 65 -91 -151 -106 16
6415A6M2M4k41L63o5n9r9%j39P1J64r1k49L38L28n14R6M6j11q8M07l87O4P5J47
$$ 16 58 102 -139 224 159 100 1 1 -138 -67 97 6 -243 95 423 -91 5 51 -60 -148 259 -128 -64 11 158
6440A58k50K39n8J13k15J55k01%J37L2j32J59j90k73N61O6m08Pl0J71M9O4k62
$$ 158 -92 147 89 202 -13 142 -59 -59 78 110 -22 137 -53 -326 235 301 -107 -100 -130 41 90 154 -108
6463a08K76k87k50N43N4k74k32P78o09J11lJ0m3L0L3j55K07RN2j48q3Pn3M53j96
$$ -108 168 -119 -369 174 228 -46 -278 500 -109 2 -1 9 -34 -4 29 -126 81 90 142 -6 -89 -82 -135 318 122
6488A22l38M71l46J51j71K24k29j30L21j97M76l5l75N3J33j82mOJ20n89N38j2
$$ 122 -216 255 -91 60 -111 113 -116 -246 75 -122 354 319 -56 -3 130 -52 -56 -50 70 -519 19 7
6510Gj54J42j99j25L56j79J18l3J81j51LO4k54N7M50k34l53K18J42j0o0M0j1Q9
$$ 7 -147 -5 -204 -329 27 -152 -34 -67 114 -37 -34 30 -224 -167 283 49 -304 -86 56 46 -14 26 15 104
6534A04J2q0o5J47p7k23L64q8k37J44K65m80M64o8k84M05k0ll14J30l39J82K41
$$ 104 116 36 -29 118 41 -182 182 94 -143 1 266 -214 250 182 -102 303 283 280 -34 96 -243 -61 180
6557A80k25k87L29L27n68L66J98n42P4K87l03N6r4J24l07M98n8L8k95N01l44J14
$$ 180 -45 -332 -3 324 -244 122 320 -222 -148 139 -164 -108 -202 -78 -385 113 55 93 -202 299 -45 69
6579F9m3jL5R2k49N6OL4l33L47j39J50J80n4l05R4J15k39K83K12l40q3K86k24
$$ 69 26 25 60 152 -97 -41 -35 -1 -334 13 -126 24 204 150 -155 -61 54 -185 98 310 -30 -113 173 -51
6603e1J5L85l70p2L84l28o9LK28k24K08N8l80J08L29l50n8M87m40N4J37J3k57
$$ -51 -36 349 -21 -93 291 -37 -106 -103 125 -99 109 167 -213 -105 224 -126 -184 303 -137 -83 54 67 -190
6626a90L32N6o13K82L62j57J15j10Q1m32J47O6J65q1j68L6J40J52m01K81J61k56
$$ -190 142 198 -415 -133 229 72 187 77 158 -274 -127 -61 104 23 -145 -109 31 183 -218 63 224 -32
6648c2j56L12j65J92P2l10r9J96J12k91Q2J28l29L5J44j99K11L68l27j17J63R2
$$ -32 -188 124 -41 151 223 -87 -186 10 122 -169 -87 41 -288 -253 -109 -308 -97 271 -56 -173 -10 82
6670H2l04L39m9p4Q0J03k79K47ok00J22J72j68N9q6J09n32M22L8j44J49k9l47
$$ 82 -222 117 68 -6 74 177 -102 145 139 -61 61 233 65 124 38 147 -385 37 75 -69 80 51 -296
6693b96K37K06O7j08o8j40j98O76l46k28L37L8l94L46ll39K01J77n14M43Q6l47
$$ -296 -59 147 214 106 38 -102 -300 376 30 -198 139 177 -217 129 126 -213 -12 165 -349 94 180 -167
6715a67m7J55N5j44M12k94J90o8J13k40O9Kk42l6L15j01K5j9k72J27J87j96L6
$$ -167 -214 -59 -4 -148 264 -30 160 92 205 -35 34 36 -206 -242 73 -28 -3 -22 -294 -167 20 -176 -140
6738a40L91k04j39m5K14K1J57l57Pj64N14q9k98J20P8k49P4n9Q8J33J28j60j48
$$ -140 251 47 -92 -137 77 98 255 -102 -95 -259 255 166 -132 -12 66 -183 -109 -168 -80 53 181 21 -127
6761a27K55J17k44Q1Q6k21J69j37k03K17N0l34K00J68j63K7J13j80O3K39l58r2
$$ -127 128 245 1 82 168 -53 116 -21 -224 -7 43 -291 -91 77 -86 -59 54 -126 -63 176 -182 -274
6783b74K52J18j37J76k41J76p9J24m6j72J77k30K45Rl37L3K64j40K1K68k44N1
$$ -274 -22 96 -41 135 -106 70 -9 115 69 -103 74 -156 89 98 -239 -206 58 -82 -61 207 -37 14
6805A4J62j03JJ78k31l1j67J37J75l70M35l98k1M0K90l43K90Nk87J98OL4l8L09
$$ 14 176 73 74 252 21 -10 -177 -40 135 -235 200 -198 -219 -179 111 -232 58 63 -224 -26 -20 14 -24 285
6829B85j19k51M34l72l23L68J45m00K64J22k46J28J40l70J95r7K28k7j42qO6J30
$$ 285 166 -85 349 -23 -346 22 167 -233 31 153 -93 35 175 -195 0 -97 131 104 -38 -46 20 150
6851A50j57o8K2j59K94k34K96oj61o1j79K62O9j18RP4j35L19n03L53r7J24m3N1
$$ 150 -7 -75 -53 -212 82 -152 144 138 -23 -84 -263 -1 68 -50 -41 33 -102 217 -286 67 -30 94 51 102
6875A02j30j88Q5J12l1J9P6j4m6K4j02J52j79%K35Pk41L27j84k1J14l44L01J80
$$ 102 -28 -216 -131 -19 -50 -31 45 31 -15 9 -93 59 -120 -120 115 122 -119 208 24 3 117 -227 74 254
6899B54j39j41J48J4j11J09R7l15J90l6N4j78K53j37k93L16j77L08l54J11j31
$$ 254 115 -26 122 136 25 134 231 -84 106 70 124 -54 199 62 -231 85 -92 216 -138 -27 -158
6920a58N3K21Ok15J63P5k69K24j21l1j9LL5J00l0q5P7J24l10M6j01L70k65K85
$$ -158 -105 116 122 -93 70 145 -124 100 -21 -52 -71 -68 -33 67 37 -48 29 153 -157 -111 -212 158 -107 178
6944A78j05j17J95j26j11N2J56j10J81l75p0M00K46l37M7J91n42Q5L26p1p8J9
$$ 178 73 -44 151 25 -86 -34 122 12 193 -182 -252 148 394 57 104 295 -247 -162 164 93 15 34
6966C4q3q8mj4QK91j92n1J75K61l99OK48J5j76Q4N7l61J76R3q3L6Q8p7l09N11
$$ 34 -49 -137 -141 -155 -147 144 -48 -99 76 337 -62 -56 192 207 31 115 172 -189 -13 80 -3 33 121 44 -265 246
6992B46k57O0j40J53j99K35j22j78K32J01j70J44l8n5j00r6M8K45K31l50k84L07
$$ 246 -11 49 -91 62 -137 98 -24 -202 30 131 -39 105 67 12 -88 -184 -136 109 340 -10 -294 13
7014A3m0J1J7j43K30K4k10P4o5J09j45k7L89p0k06J88K8m23R0L21l37L1L91n31
$$ 13 -27 -16 1 -142 88 112 -98 -24 -89 20 -125 -152 237 167 -39 149 177 -246 -156 165 -172 -141 250 -281
7038b81L84J32m14k5J69K69k09l2R1k35L05q7k06J33L1l11L18L9j49j45L52o9
$$ -281 103 235 -179 -204 -35 234 25 -7 84 -151 154 67 -139 -6 25 -286 32 71 -78 -223 129 60
7060F0k10K90l4K81m20J91j12k87M25k48J40Jk14j32N43k14L9J1J53k59j59M4
$$ 60 -150 140 106 387 -33 158 46 -241 184 -64 76 77 -137 -269 274 60 99 110 263 4 -155 -111
7082a11q3J82J45J1j04J61j96J00p1p9J10j4l60K11N6J01j76J29J26l44K25M6
$$ -111 -194 -12 133 144 40 201 5 105 34 -45 65 51 -309 -98 -42 59 -117 12 138 -206 19 65
7104F5l75K06J39l30M68J61l37k87M27J23m61J65K02l32nL48l30L51j13j21o2
$$ 65 -310 -104 35 -295 173 334 -3 -290 137 260 -201 -36 166 -166 -171 177 -153 198 85 -36 -98
7125i8J84q3m3po1j04K13K42n6j14l06J06K36p3N3k3M3j0j83j3N1m2K04J08j69
$$ -98 86 3 -40 -47 -108 -212 1 243 187 73 -233 -127 109 36 89 66 109 99 -84 -97 -46 -88 116 224 55
7150E5r0J67k47J70j29L68l76Q2o1L9o4R9j02K03j06r3J72O1j04j50J98k9j35
$$ 55 -35 132 -115 55 -74 294 -82 0 -61 -22 -86 13 -89 114 8 -85 87 148 44 -106 92 63 -72
7173g2K51m29J43L53m88K10J75P6k59J68J13m05K04m1j68J27P0J52j1Ll49L96
$$ -72 179 -250 -107 246 -242 -32 143 219 -40 128 241 -164 40 -1 -169 -42 28 180 169 172 -177 219
7195B19k05r1j28K07j48J29J31k86J91n0j26K44k55L03j16j06J60k53J4J77P4
$$ 219 14 -77 -205 2 -146 -17 114 -172 19 -31 -157 87 -168 135 19 -87 73 -180 -166 11 85
7216H5k81%J79p2QL25m86K29J86m32K76L1M5M9k77J75j58K9L09l03j18L53L7j45
$$ 85 -196 -196 -17 -89 -81 244 -242 -13 173 -259 17 48 93 142 -135 40 -118 -89 220 -83 -201 152 189 44
7240D4Qj62J17k0k9n2R5K51r9j39K03l20K9j06j5O8L50j49r7J36o4j22K06j25
$$ 44 52 -110 7 -13 -42 -94 1 252 153 14 217 -103 -74 -180 -195 -127 223 74 -23 113 49 -73 133 8
7264Hk26Q7O8r9K46J20k38k38K44L71m01L3L6J02R7l28K73p9lk74L37J9j66K03
$$ 8 -218 -131 -63 -162 84 204 -34 -272 -28 343 -58 -25 11 113 210 -118 155 76 73 -201 136 155 -11 192
7288A92k43K09m1j99J72j48K41N4j08o8J61j65m3L31m58J8K4J07Nq6J20l05J47
$$ 192 -51 158 117 -82 90 -58 183 237 129 61 222 57 14 345 -113 -95 -71 36 41 -45 75 -230 -83
7311h3J36N1j83J83j50n9n6N12k10O5k65K38k14j14K48j12J0m0j27J21r1J51K2
$$ -83 53 104 -79 104 -46 -105 -161 351 141 206 -59 179 -35 -149 99 -13 -3 -43 -170 -49 -140 11 33
7334C3j39MJ84j23J04L15j27l66L35r6k09K8j3o0K7J88l81l2L59L8l5L6N8j91
$$ 33 -106 -102 82 -41 63 378 251 -115 220 124 -85 -57 -70 -130 -103 85 -296 -328 31 69 34 70 128 -63
7358f3L0jJ47k95L26q6j62J23j57J41M8mj33q5K38k07J63O9k68J89p1J2kl5j81
$$ -63 -33 -34 113 -182 144 58 -104 19 -138 3 51 47 -86 -171 67 -140 23 92 -176 13 -58 -46 -48 -83 -264
7383b64P8M2N10n33M6J14K04k11m5n1j53N18l78K63J48j89j85R8k80J67N1K06
$$ -264 -186 -144 366 -167 -121 -7 197 -14 -59 -110 -263 255 -123 140 288 99 -86 12 -268 -101 -50 156
7405A56l65L11k55J42J19pn3q0J68l5j58J11j02l8J79j80l1L14m9k70K77M6k24
$$ 156 -209 102 -153 -11 108 101 48 -32 136 101 -57 54 -48 -86 93 -87 -118 196 147 -123 154 200 -24
7428b4j7J04k78O6K41k63J91K43k00j77Q8j18J81J4J0k58L91K5k83R2j17o6L42
$$ -24 -41 63 -215 -149 92 -171 20 263 63 -114 -26 -144 37 51 61 -197 194 219 -64 28 -89 -155 187
7451A87j54j84J93K42j22K5j44J35j46N3N2j23k48J43L23k30L05k46k17M28k46
$$ 187 33 -151 42 284 162 187 43 178 32 85 137 14 -234 -91 232 2 307 61 -156 272 26
7472B6mJ00p1k91K11M2n0J50k33L58k11J53j32j03J22k38J48l4K73j57MMq3J0
$$ 26 22 122 51 -240 -29 13 -37 113 -120 238 27 180 48 -55 67 -171 -23 -57 216 59 63 67 -16 -6
7496fJ31M6j99j90J51L3R4j81J83J20j53k57L69K48p02J69J77j93K7K19k42J62
$$ -6 125 171 -28 -218 -67 -34 60 -121 62 182 29 -228 141 389 -313 -144 33 -160 -133 86 -156 6
7518Fj31N9K7L9J23l91J90J13o9m2M83n25R0J2r3J17j1J80k37M5J89l95K94j07
$$ 6 -125 -66 -39 0 123 -268 -78 35 -34 -76 407 -118 -28 -16 -109 8 -3 177 -60 -15 174 -221 73 -34
7542c4o8K48J62m78J11J80l86l8L06J28l23L20j38O6k9J24j58q1Q3J14k38R8j41
$$ -34 -102 146 308 -170 -59 121 -265 -303 3 131 -192 128 -10 56 27 151 -7 -88 -5 109 -129 -31 -172
7565a72m8L68L6k20K97l53K12j44K76m75J41L37k60j72L84j57k32L62j73k64L33
$$ -172 -220 148 184 -36 261 -92 120 -24 252 -223 -82 255 -5 -177 207 50 -182 180 7 -257 76
7586G6J19j82p7k51M45k75M45k76qk1J39P0k38J09j66J56R1N9k28K0J14k4r9m
$$ 76 195 13 -64 -315 130 -145 300 24 16 -5 134 204 -34 75 -91 65 156 215 -13 7 121 97 -2 -6
7610fN2J57r9k82L66k90L6J18M9m8j10P2o6l7K63j79K2J04k51J58k18J85k3K31
$$ -6 46 203 104 -178 188 -102 -66 52 101 53 -57 15 -51 -88 175 -4 18 122 -129 29 -189 -4 -27 204
7634B04j00k11M24l58L25o2J36l84m3J46p5m6O8J57pj56K0j01RJ44j03M1N7k67
$$ 204 104 -107 317 -41 284 222 358 -26 -69 77 2 -44 24 181 174 18 38 -63 -54 90 -13 28 85 -182
7658a82K03J22j89R7M1r1j2K77l62K31j25Qo6J5J68j33mj76j60L90j86J12J35
$$ -182 21 143 -46 51 92 1 -11 266 -96 135 10 18 -48 -33 135 2 -2 -178 -338 52 -134 -22 113
7681A13q4J58k76Q8J62o46M09K16j80O7N6k09J05J91k79O9K16j60o3J08q8J82
$$ 113 29 187 -89 -1 161 -485 -76 140 -40 27 83 -126 -21 170 -109 -40 176 16 -47 61 -27 155
7703A55l34L63j06K9k19j43J26J98K8k85R3K75k29J59j12o8J08J0j23l5M04j54
$$ 155 -179 184 78 107 -112 -255 -129 69 97 -188 -95 180 -49 110 -2 -70 38 48 -75 -110 294 140
7725A40r5J96k59J17o3j09j31K94mJ62j86m0m33K59J62P1q9j18N5j38M60Jk78
$$ 140 45 241 -18 99 36 -73 -204 90 86 248 62 22 -411 -152 10 81 -8 -126 -71 -209 251 252 -26
7748b6J11J3qj03L39m19O6Q6j56J95M2N5p3rl66L32j54J06r3J14n5J3J61p7j78
$$ -26 85 98 90 -13 326 -93 -27 59 -97 98 140 195 122 113 -253 79 -75 31 -62 52 -3 10 171 94 -84
7773h4J51L7j93Q0K11m5l44N0J49j47l3L68k94J36J3J87l15k4M7J4K5p4K4R7l19
$$ -84 67 104 -89 -9 202 157 -187 -137 12 -135 -168 200 -94 42 55 242 -73 -97 -50 -36 -11 -85 -61 36 -283
7798b83J86J86J8r7J12nk81r4M02L0j84K31k74j1J57k18R2K56k68j10J71J45j87
$$ -283 -97 89 107 10 122 117 -164 -258 144 174 -10 221 -53 -64 93 -125 -33 223 -45 -155 16 161 -26
7821b6Rr5j28L30l6O1k29N4Q8k20K10m3L00r1n5q7J52r2J25k59J82j22m2LJ80
$$ -26 -17 -112 -240 90 54 115 -114 -60 28 -192 18 -25 275 184 129 42 194 102 227 -32 150 28 -14 -11 169
7846A69l3O3k17O9Q4k1p1j99K33j15K1k4J25j44K42k34Q7n7J54k13nQ3J18rP2
$$ 169 136 199 -18 51 135 114 43 -156 77 -38 -17 -41 84 -60 182 -52 35 -22 132 -81 -86 -3 115 106 178
7871A78j13j59J59J94k9l27K23j59N4l5P9P4J14l02n6L17l08J01P7j71o3K14j71
$$ 178 65 -94 65 259 230 -97 126 -33 21 -14 65 139 253 -49 -105 212 -96 5 82 -89 -152 62 -109
7894a09J48j20n0J08J75m8l5j05K09l09M8J5k46M16j93K27j50L79l15n9j28J07
$$ -109 39 -81 -131 -23 152 104 69 -36 173 -136 -88 -73 -319 97 -96 131 -19 360 45 -14 -142 -35
7916c5r5J86r3K77l23O1L4j02J23k4P4j52Q7j31J35L6o0%K34j95k59K89j90K64
$$ -35 -130 56 -37 240 -83 -22 12 -90 33 9 83 -69 18 -113 22 58 -2 -2 232 37 -222 67 -123 141
7940A41j13q2M3J73j88J33j41rj05n6J19o7m2O1K06k73L33j51K8o9J56j61K49
$$ 141 28 -54 -11 162 -26 107 -34 -43 -148 -204 -85 -152 -194 -133 73 -200 133 -18 10 -59 97 -64 185
7963A85l2j72K02j06m4l9j19j2K30J04k35K26j58k2N7p9K27n65M86j71m1J41l6
$$ 185 153 -19 183 77 33 -6 -125 -137 93 197 -38 188 30 8 65 -14 213 -352 134 -37 -78 63 27
7986B7r4p2K53r5p3K07k36J89q9j6k87K63p8K9n9K72k90J99J04k50K07J0j24j83
$$ 27 -67 -139 114 19 -54 153 -83 106 17 1 -286 -23 -101 -72 -131 141 -149 50 154 -96 111 121 -3 -186
8010a86L04O6n6J03m51K55rJ16o0k40K01j3k27J76M5J47l44J04K85l56J01M7j45
$$ -186 118 184 128 231 -220 35 26 142 82 -158 43 30 -197 -21 24 171 -173 -69 216 -140 -39 8 -137
8033a37K86j73j10K03k49j2L39r7l02L34K9j83R2j76M0P8J41n9L5M2l05K21j81
$$ -137 149 -24 -134 69 -180 -192 147 50 -252 82 111 -72 20 -156 -116 -38 103 44 79 121 -184 37 -144
8056a44K53j89K38J43m39M03j20L9l38J51q6p1K72j49N6OK84m78m3L09j90K49
$$ -144 109 -80 158 301 -138 265 145 184 -154 -3 -89 -160 112 -37 19 25 309 -169 -212 97 -93 156
8078A56j86J57R1l27P6j40M81k72j63J66k3O8k11P7o7OQ8J5J57m6k0j40J95n5
$$ 156 -30 127 218 -109 -33 -173 308 36 -127 39 16 84 -127 -50 -117 -111 -23 -8 149 103 83 -57 138 83
8102H3l80M03L7l13J47R3op5j2J53j65k47J69J74J72n17Q4K43j14k00Q3P8J3L23
$$ 83 -297 106 143 -170 -23 70 64 -11 -23 130 -35 -282 -113 61 233 -284 -200 43 -71 -271 -188 -110 -97 226
8126B26l8k9o2k7J09rj12Q5l12K22J5k51M31k46k25J21J59j15J9Q8j24l19M37
$$ 226 188 159 97 70 179 170 58 143 -169 53 68 -183 248 2 -223 -102 57 -58 -39 49 -75 -394 43
8149D3j04j6p7J79j9j57K64q7q3K2k5N9l6J58j78k9M5j09N02k9j30r1j3k69J02
$$ 43 -61 -77 -154 25 6 -151 113 26 -57 -35 -60 -1 -37 121 -57 -86 -41 -150 352 323 193 102 89 -180 -78
8174g8L1J13O2j3M7j97J66j20j40J11j48k9K75%J32j67L1
$$ -78 -47 66 128 115 162 -35 131 11 -129 -18 -166 -195 80 80 212 45 76
8191G6
$$ Imaginary data points
##PAGE= N=2
##DATA TABLE= (X++(I..I)), XYDATA
0@%%%%%%%%%%%qJ6j6J6j6K4l2L6m4N2o0P2q8J04j20J36j56J80k04K32k64K98l38
$$ 0 0 0 0 0 0 0 0 0 0 0 0 -8 8 -8 8 -8 16 -16 20 -24 28 -32 40 -48 56 -64 72 -84 96 -108 124 -140 158 -180
34a80L83m30M80n34N95o65P38q16R06j004J108j221J346j484J634j799J981k184
$$ -180 203 -227 253 -281 314 -351 387 -429 477 -527 581 -640 706 -778 856 -943 1038 -1146
52a146K407k656K943l265L632m059M560n158N885o790P952r501J1668j4913K0246
$$ -1146 1261 -1395 1548 -1717 1915 -2144 2416 -2742 3143 -3647 4305 -5196 6472 -8441 11805
67A1805l0406N5925k24406l23729Q00751m7216n35267L12409J00012k95390L79188
$$ 11805 -18601 37324 -187082 -510811 289940 242724 -292543 19866 119878 -175512 203676
78B03676J6163n89586L59463N14865o28041k27230N92747q4597l20391K12267
$$ 203676 219839 -369747 -10284 504581 -123460 -350690 242057 157460 -162931 49336
88D9336q7057j04580L92959j53449m74125L98078L20166m70981p9052L15891r8125
$$ 49336 -37721 -142301 250658 97209 -376916 21162 341328 -129653 -208705 107186 9061
99I061k0598Q7687k56154R1732L86608l04674l04924M15361J07135l28161O6904
$$ 9061 -11537 76150 -180004 -88272 298336 -6338 -311262 104099 211234 -116927 -50023
110e0023P0027j04611K16606k8567l86006K48452L63863l99811j68479L85265
$$ -50023 20004 -84607 131999 103432 -282574 -34122 329741 -70070 -238549 146716
120A46716n5319j82982J66291j19250j03007L54365j09689m20573L29601K93620
$$ 146716 91397 -91585 74706 -44544 -147551 206814 97125 -323448 6153 299773
130B99773m13178n2830L05718j42654m2584J86416k40977n8828M01034j60680
$$ 299773 -113405 -166235 139483 -3171 -45755 140661 -100316 -159144 241890 81210
140H1210l72097L32782J89386l44303L8194J84910j73731O6670J45710k91708
$$ 81210 -290887 41895 231281 -113022 -74828 110082 -63649 3021 148731 -142977
150a42977K899L64600j91019k79662K89303R5302k33396Q3633O3180j46941J45358
$$ -142977 -140078 224522 33503 -246159 43144 138446 -94950 -11317 51863 -95078 50280
161E0280Q1749k79602N9567K77481j84666j63553K09260J4714j10922Q8386m3456
$$ 50280 132029 -147573 -88006 189475 4809 -158744 50516 65230 -45692 42694 -762
172g62q3453J80029m115k26047J03154J60413j53691m7012J04644m9084J2489
$$ -762 -84215 95814 91699 -134348 -31194 129219 -24472 -71484 33160 -15924 -3435
183c435P1365j28479r052J83169q2736j48582J35213M6138j15255M9328J7727
$$ -3435 67930 -60549 -69601 113568 30832 -117750 17463 63601 -51654 -2326 15401
194A5401q6255J03924M9693j74761M5453J69055j23716q5827J40139k6072q1637
$$ 15401 -70854 33070 82763 -91998 -46545 122510 -1206 -87033 53106 27034 -54603
205e4603R5987k9968r6546J32385L1599j70502O1749J36040j21039m6171J13570
$$ -54603 41384 11416 -85130 47255 78854 -91648 -29899 106141 -14898 -61069 52501
216E2501m9077m9324R3357m5296p8520J15489J7589j27060N2330Q7194q4324j6505
$$ 52501 3424 -45900 47457 2161 -76359 39130 56719 -70341 -18011 69183 -15141 -31646
228c1646O6419m4537j4980O0746m6560l8350P9397k569o9623L9060L4721m1728
$$ -31646 34773 -9764 -24744 36002 -10558 -48908 30489 27920 -41703 -2643 32078 -9650
240i650P711J6987l2078J6300K3015m3490j62M3855k1160k0849K9563m108j1257
$$ -9650 -1939 15048 -17030 -730 22285 -21205 -21367 22488 1328 -19521 10042 5934 -5323
253e323K2541j4589k0611L2519r54l7011J9705K0042k7848N430K1297k1175L032
$$ -5323 17218 2629 -17982 14537 13583 -23428 -3723 16319 -11529 -6099 15198 -5977 -2945
266b945K4787k4143j2553L0707j1205k6429K2793O067k4377J4539J4161k2172
$$ -2945 21842 -2301 -14854 15853 4648 -21781 1012 7079 -17298 -2759 11402 -10770
278a0770P835K1144k0738p214K3535j0294j8460J7941K054j8182J1257J0906j5362
$$ -10770 -2935 18209 -2529 -9743 13792 3498 -14962 2979 5033 -13149 -1892 9014 -6348
291f348M060J6308j2097p511J4691l160j4708P746O667j2452P43J1497n047n294
$$ -6348 -2288 14020 1923 -5588 9103 5943 -8765 -1019 5648 -6804 -6061 5436 389 -4905
305d905J0681J226j0804L840O751j0120m715J0262l173r095Q569P346j0001J703
$$ -4905 5776 7002 -3802 38 6789 -3331 -8046 2216 -957 -10052 -1483 5863 -4138 -2435
319b435J1588o639p823R810K85j2919N110Q576j0573j680J4347l001r792J1073
$$ -2435 9153 2514 -5309 4501 4786 -8133 -3023 5553 -5020 -6700 7647 4646 -5146 5927
333E927N449j4427J392J1494j1901r050J4967j664j5191J1856J1228j5689Q15
$$ 5927 11376 -3051 -1659 9835 -2066 -11116 3851 2187 -13004 -1148 10080 -5609 -4794
346d794J8140j1509j1679J6806k393j8683J1554Q893j9094M921J8404j3235o291
$$ -4794 13346 1837 -9842 6964 4571 -14112 -2558 6335 -12759 -7838 10566 -2669 -8960
359h960K0365l872j5251J2345L641j4553M970N966j0793M073R566q663q15R456
$$ -8960 11405 7533 -7718 4627 8268 -6285 -1315 4651 -6142 -2069 7497 -1166 -1981 7475
373G475l281k566J419n354L330L798j4468J112J5866r937p590J6844n273r336
$$ 7475 4194 1628 3047 -2307 1023 4821 -9647 -8535 7331 -2606 -10196 6648 1375 -7961
387g961J9673p755k2743K6857R125m0080J1622L3570k9927q242L4517j9737j4026
$$ -7961 11712 3957 -18786 8071 17196 -22884 -11262 22308 -7619 -15861 18656 -1081 -15107
400a5107M0683j9930l7827M9313J0881o2429K2487M3146m4677k723M1206l5278
$$ -15107 25576 5646 -32181 17132 28013 -34416 -11929 31217 -13460 -16183 25023 -10255
412a0255n767N4922l8981m1392O9997J630p1731L4954L6167n0451J4456L1426
$$ -10255 -16022 38900 -81 -41473 28524 30154 -41577 -6623 29544 -20907 -6451 24975
424B4975n1879J7134N9805o3241l1137Q2427j4686o4871M4376J3975m2423L8561
$$ 24975 -26904 -9770 50035 -13206 -44343 38084 23398 -41473 2903 16878 -25545 13016
436A3016M851o3527N0299N2388q5972r682Q2941l3704m2069M4689j9282j7863
$$ 13016 17867 -45660 4639 57027 -28945 -38627 44314 10610 -31459 13230 -6052 -23915
448b3915O2688l6096o4587Q8173L0571r9256K0703O5182m9458q38L2164o1855
$$ -23915 38773 2677 -61910 26263 56834 -42422 -21719 43463 -5995 -6833 25331 -36524
460c6524K1997Q3068q7103n4396J22190l349r9840N3510K9851n9121N1180Q475
$$ -36524 -14527 68541 -18562 -72958 49232 45883 -53957 -447 29404 -29717 21463 29938
472B9938j03884O9501R4996j32664l4815J41279l5531q1442P4971j4017n1383
$$ 29938 -73946 -4445 90551 -42113 -76928 64351 28820 -52622 22349 8332 -43051
483d3051R7076k5624j27761J10275Q9948j55540j2245J32017n4062m4671P0211
$$ -43051 54025 28401 -99360 10915 100863 -54677 -66922 65095 11033 -33638 36573
494C6573n7239k0017J23954o7703j25867J38044O4351j50576J4371R2324n8229
$$ 36573 -20666 -40683 83271 15568 -110299 27745 92096 -58480 -44109 48215 -10014
505a0014J0442M1806j00357L0335J33612j13458j00113J51120K1709j19668M3128
$$ -10014 428 42234 -58123 -27788 105824 -7634 -107747 43373 65082 -54586 -11458
516a1458K7837n1575P7955r89j38692Q8288J27221j51497n7551J45716k6646o8607
$$ -11458 16379 -35196 42759 41770 -96922 -8634 118587 -32910 -90461 55255 28609 -39998
528c9998O4729m5547l2420J37252n0183j56784J36856J02779j67164j1348J16004
$$ -39998 24731 -20816 -53236 84016 33833 -122951 13905 116684 -50480 -61828 54176
539E4176o0109o032O3614j08852L145J70238r6946j47867J62074O4438j51735
$$ 54176 -5933 -11965 51649 -57203 -54058 116180 19234 -128633 33441 97879 -53856
550e3856K6561O2248p0895N8615L8189j52684M6936J73376j30821j14633J59681
$$ -53856 -27295 34953 -35942 22673 60862 -91822 -44886 128490 -2331 -116964 42717
561D2717J9363j07414N3555m483o2890J16685J096j74455Q8574J52348j45686
$$ 42717 62080 -45334 8221 3738 -59152 57533 58629 -115826 -27252 125096 -20590
572b0590o6300J33036k3927m5545O6528p1816l8668J56906m2254j70398J18920
$$ -20590 -86890 46146 22219 -23326 43202 -28614 -67282 89624 47370 -123028 -4108
583d108J08886j38154j3151Q3627n4759K3250N8595j26897K54J69967q2736j38915
$$ -4108 104778 -33376 -46527 37100 -17659 5591 64186 -62711 -62457 107510 24774 -114141
595a14141J29601N3969j06434L1534K1143o4441Q6385L2593j58259M1504J57513
$$ -114141 15460 69429 -37005 -5471 15672 -48769 37616 70209 -88050 -46546 110967
606A10967j08596r2679J18807J806o0142O0788l9272n9681J31309K552j65468
$$ 110967 2371 -90308 28499 30305 -29837 30951 -8321 -68002 63307 65859 -99609
617i9609P2169J27255j14956m3819R1211l7642j0669P2457q5976m2185J49629
$$ -99609 -27440 99815 -15141 -58960 32251 -5391 -16060 56397 -29579 -71764 77865
628G7865k6137j46805Q6928Q3235r9733K74N0139n9581L7000O1895j12745j2280
$$ 77865 51728 -95077 -8149 75086 -24647 -24373 25766 -33815 3185 65080 -47665 -59945
640e9945J40526n0476j06129Q4644L2640o6312L4059k73o0331P6229L4764j20436
$$ -59945 80581 30105 -76024 8620 41260 -25052 9007 8734 -51597 24632 59396 -61040
652f1040K1210J11974o5661n5854O8911j2659k5202N3207m4723m8808J00585N675
$$ -61040 -39830 72144 6483 -49371 19540 6881 -18321 34886 -9837 -58645 41940 47615
664D7615j11720M6438P5706o8465j1519M6923m3135R224N8397p1498l3335J03785
$$ 47615 -64105 -17667 58039 -10426 -21945 24978 -18157 -8933 49464 -22034 -55369 48416
676D8416j6240q9939N6324M0366n8814J9249K2826n5073L3334N0034q0031j4244
$$ 48416 32176 -57763 -1439 38927 -19887 -638 22188 -32885 449 50483 -29548 -43792
688d3792Q9187k9764n9053N2356R241l8362L5789k477n0394M7847L0822p2697
$$ -43792 45395 15631 -43422 8934 18175 -20187 15602 13125 -37269 10578 41400 -31297
700c1297M576O2725l4460k6599L8543j3928j3326L9089k3541l4646N1249Q523
$$ -31297 -26721 36004 1544 -25055 13488 -440 -13766 25323 1782 -32864 18385 26908
712B6908n5370J8457L3205l1259N20K0328k5988P394L2395l3706j7128M4718p511
$$ 26908 -28462 -10005 23200 -8059 -7539 12789 -13199 -5805 26590 -7116 -24244 20474 12963
725A2963l4753K3565Q755k2691J6285N005k7755K0190K1244l5143j484L3269j7082
$$ 12963 -21790 1775 10530 -12161 4124 9129 -18626 1564 22808 -12335 -13819 19450 2368
738B368j6674K2758p527j3724K3559o305k3700K5092J1276l0518P476K2235j9937
$$ 2368 -14306 8452 925 -12799 10760 4455 -19245 5847 17123 -13395 -5919 16316 -3621
751c621m322J8632j4314p215K2454r889j7774K2245N079k2100Q847J3690j5873
$$ -3621 -7943 10689 -3625 -10840 11614 1725 -16049 6196 11275 -10825 -1978 11712 -4161
764d161k23J2723j1808m188J5132o327j1350J3174L652j2265M407P389p288j010
$$ -4161 -4384 8339 -3469 -7657 7475 1148 -10202 2972 6624 -5641 -1234 6155 -1133 -2143
778b143N911m616k426N291j560l934L127K638k348q48J400J345q68k069J149R27
$$ -2143 3768 -848 -3274 2017 457 -3477 -350 2288 -60 -908 492 1837 969 -1100 49 976
794I76k770Q05K526k731n78M709j950l817N085R37o262J832M478n449j613O385
$$ 976 -1794 -989 1537 -1194 -1772 2937 987 -2830 2255 3192 -3070 -1238 3240 -2209 -3822 2563
810B563k459m440O244J289o137K733M828n702j549N808k984m499N378J311o123
$$ 2563 104 -4336 1908 3197 -2940 -207 4621 -1081 -2630 3178 194 -4305 1073 2384 -3739
825c739L259M636n112n23N619k971l964M203O75n472K106L649m565K52M727k233
$$ -3739 -480 4156 -956 -1479 4140 1169 -2795 1408 2083 -3389 -1283 2366 -2199 -1947 2780 547
841E47k612L984O8l851J619J712l320J65K314j341j157J923Q44j077K00J094L36
$$ 547 -2065 1919 1987 -1864 -245 1467 -1853 -1688 626 -715 -1872 51 895 -182 18 1112 1448
858A448j408n19J192j120r36K347p18l002L951K537o263R55O582n731k989P183
$$ 1448 40 -479 713 -407 -1343 1004 286 -2716 1235 3772 -2491 -1536 5046 -685 -3674 3509
874C509l472n304Q948j158j0221R408O093j3439K201J2419j0243m916J3209o879
$$ 3509 37 -5267 3681 2523 -7698 1710 7803 -5636 -3435 8984 -1259 -6175 7034 155
888A55q488J5170l114j5856J4698Q640j9956L857J6255j4438l880J5734j1557
$$ 155 -8333 6837 3723 -12133 2565 11205 -8751 -4894 11361 -3077 -6957 8777 -2780
901b780p173K0727p997j8541K0954P405k3284P488J4277j5676J909J2599j7322
$$ -2780 -9953 10774 2777 -15764 5190 12595 -10689 -3201 11076 -4600 -2691 9908 -7414
914g414N33K1841j6405j4276K4430L66j9382J2307L501j3274J4560J221k4311
$$ -7414 -6881 14960 -1445 -15721 8709 9075 -10307 2000 5501 -7773 6787 8008 -16303
927a6303J5540J8970k7877l194K5197j1950q303J7348j4070o442L0174j4751l0253
$$ -16303 -763 18207 -9670 -12864 12333 383 -7920 9428 -4642 -11084 19090 4339 -25914
940b5914L3762J2796l8078R818K2694k3695O219J9827l3014K843M3928l0842l2245
$$ -25914 7848 20644 -17434 -7616 15078 -8617 -2398 17429 -15585 -12742 31186 344 -31901
953c1901M7229M726m1347K0621J3437k9190K2598J5453m8501J5424M9959m3593
$$ -31901 15328 20054 -21293 -672 12765 -16425 6173 21626 -26875 -11451 38508 -5085
965e085k7589N1578n100l3151K7465m116k6199M0738J669n6667L1581M5003n2094
$$ -5085 -32674 18904 13804 -19347 8118 4002 -22197 18541 20210 -36457 -4876 40127 -11967
978a1967j4131M5923j7860j3420K9166k8086j3480N6672j9020n7144M8193L1166
$$ -11967 -26098 19825 1965 -11455 17711 -10375 -23855 32817 13797 -43347 4846 36012
990C6012n3610M299K8865k7587J3630K3051n2311N672O6562m0267m8538N8067
$$ 36012 -17598 -13299 15566 -12021 1609 24660 -27651 -21979 44583 4316 -44222 13845
1002A3845J1916m4442K1853L839l0928M2326R905p0427K6456O5917n5972l1654
$$ 13845 25761 -18681 3172 7011 -23917 18409 28314 -42113 -15657 50260 -5712 -37366
1014c7366N6762r458k5041L4366k5436k7111O7470p366p9563M5916N5340o3414
$$ -37366 19396 9938 -15103 19263 -6173 -33284 34186 26820 -52743 -6827 48513 -14901
1026a4901j0590M5784k8132J732L8488n4266j5070Q4505k6721p6831N9247L7102
$$ -14901 -25491 20293 -7839 -6107 32381 -21885 -36955 47550 20829 -56002 3245 40347
1038D0347n9709J1092K3951l9259L1043L2558p6337L437Q7514m3877o0982O1175
$$ 40347 -19362 -8270 15681 -23578 7465 40023 -36314 -32877 54637 10760 -50222 10953
1050A0953J2998m1781K7832o159l8947N8432J5863q6171K3964P5377n2948l4426
$$ 10953 23951 -17830 10002 3843 -35104 23328 39191 -46980 -23016 52361 -587 -35013
1062c5013M9611j2038j3178L7916l8363k9314P7771m791q3380M0989N2594n3074
$$ -35013 14598 2560 -10618 27298 -11065 -40379 37392 32601 -50779 -9790 42804 -10270
1074a0270m955K9781l2962J8538L9782o6730j3630Q7989k5501p1087N1981K5701
$$ -10270 -15225 14556 -18406 132 39914 -26816 -40446 47543 22042 -49045 2936 28637
1086B8637m4860K1051N524m4774M6632L3077q3717L777Q5004m0458n0114N2026
$$ 28637 -16223 4828 10352 -34422 12210 45287 -38430 -34653 50351 9893 -40221 11805
1098A1805M9k8112L8395k0594m4635O6676J8877q5935K0232O7724m5829k2953
$$ 11805 11854 -16258 22137 1543 -43092 23584 42461 -43474 -23242 44482 -1347 -24300
1110b4300L9488k2242l173M3932m3253l3662P4649P58p3291L1015M0941l9843
$$ -24300 15188 -7054 -10227 33705 -9548 -43210 31439 32197 -41094 -10079 30862 -8981
1122h981L662J8645l6166K2016L9659n8672j7055P1650j5632n2947L5405J3647
$$ -8981 -5319 13326 -22840 -824 38835 -19837 -36892 34758 19126 -33821 1584 15231
1134A5231k7806K4172l195m1236M2071K9042o5362K92O0424k7635k9154L3275
$$ 15231 -12575 11597 8402 -32834 9237 38279 -27083 -26791 33633 5998 -23156 10119
1146A0119j0542j2370L6885k3621l7105N4443J4093o2266J5963M1746l2175n454
$$ 10119 -423 -12793 24092 471 -36634 17809 31902 -30364 -14401 27345 -4830 -10284
1158a0284K4286k7526M395M0302l7961k7449N6673l23m9404K3968K1071k8802
$$ -10284 14002 -13524 -9129 31173 -6788 -34237 22436 22113 -27291 -3323 17748 -11054
1170a1054J3276J1200l5001J8562L4228m3229j4215M8414j0490l2158K4900K693
$$ -11054 2222 13422 -21579 -3017 31211 -12018 -26233 22181 11691 -20467 4433 7126
1182G126j9518K3093k071l2801K6956K2993m0415k264L5516j6407j3827J9774
$$ 7126 -12392 10701 8630 -24171 2785 25778 -14637 -16901 18615 2208 -11619 8155
1194H155j0421p470K5949j3585k4586L0161R189l1825Q111J8794j7332K764J1396
$$ 8155 -2266 -9736 16213 2628 -21958 8203 17392 -14433 -6322 12472 -4860 -2096 9300
1207I300j9502M816K3412k1537j3388K8198k659k1309J4353M354j5024J3675L435
$$ 9300 -10202 -5386 18026 -3511 -16899 11299 8640 -12669 1684 6038 -8986 4689 8124
1220H124k2072J2684J7974k3952m569K3939r898j1866J5928m913j0809J6968j889
$$ 8124 -13948 -1264 16710 -7242 -11811 12128 2230 -9636 6292 1379 -9430 7538 5649
1233E649j9210J5219J1473k1043J336J6250j1059m503J2471p595o161J4695m388
$$ 5649 -13561 1658 13131 -7912 -6576 9674 -1385 -5888 6583 -1012 -7173 7522 3134
1246C134j3172J2250N500j3483L280P896p976N63O758p671p20R523n390o029Q151
$$ 3134 -10038 2212 7712 -5771 -2491 5405 -2571 -2008 4750 -2921 -3641 5882 492 -5537 2614
1261B614O00o646M163J208m255L318J454n969L184M198n694m99N061k847j463
$$ 2614 3214 -3432 731 1939 -2316 1002 2456 -3513 -329 3869 -1825 -2324 2737 -110 -1573
1276a573L389j918k086M625k006l759M142J148m688K122K807l980R91L123l393
$$ -1573 1816 -102 -2188 2437 431 -3328 814 1962 -2726 -604 2203 -1777 -786 2337 -1056
1291a056m83M123k397k511L850r5l749K750J642l684J063K924l492l42L246j517
$$ -1056 -1539 2584 187 -2324 1526 1431 -2318 432 2074 -1610 -547 2377 -1115 -1457 1789 272
1307B72k210K822k13k320J552J442k677L30K446j723j155K605o27j885J748J113
$$ 272 -1938 884 671 -1649 -97 1345 -1332 -1002 1444 -279 -1434 1171 544 -1341 407 1520
1323A520k585M60J868j428q87K167o09j188R87N59j535N21R42r97l25Q63J30j223
$$ 1520 -1065 -605 1263 -165 -1052 1115 506 -682 305 864 -671 -150 792 -205 -530 333 463 -760
1341g60P31N42n92q08Q48O74j294k08J821r40j061J521R4j861J726J678l036k5
$$ -760 -29 513 -79 -887 -39 635 -659 -867 954 14 -1047 474 568 -1293 433 2111 -925 -950
1359i50L343k502k020L656m69l550L370R29m582K080M174m668j545O007k771l556
$$ -950 2393 -109 -2129 1527 1058 -2492 878 1807 -2775 -695 3479 -1189 -2734 3273 502 -3054
1375c054M770n98m688M806J310o380L463M927o312q18O093l434k218M715k603
$$ -3054 1716 1118 -3570 1236 2546 -3834 -371 4556 -1756 -2574 3519 85 -2133 2582 -21
1390b1k825N969j799n801N734K383o699J962L826m784J791L503o845J314P527
$$ -21 -2846 3123 1324 -4477 1257 3640 -3059 -1097 2729 -2055 -264 3239 -3606 -2292 5235
1405E235o658l957R132k131n618O117r59o048Q826K33j1801P162Q947j2457r84
$$ 5235 -1423 -5380 3752 1621 -3997 2120 1161 -4887 3939 4172 -7629 -467 8480 -3977 -4961
1420d961J0968o714k949R634p332n532J5084m284j5592J3703P662j6957L807J0792
$$ -4961 6007 -707 -3656 5978 -1354 -6886 8198 3914 -11678 2025 9687 -7270 -3463 7329
1434G329j1793K306J1146j4965j840K0380j0253j5952J8259L882j7320Q800N892
$$ 7329 -4464 -2158 8988 -5977 -7817 12563 2310 -13642 4617 8499 -8821 -21 5871
1447E871j4067J0511Q632k1682M283K2452j6785j2549K0497k471j2828J3327l745
$$ 5871 -8196 2315 10947 -10735 -6452 16000 -785 -13334 7163 4692 -8136 5191 1446
1460A446j3071J9826K344k6119J2053K0142k1168n102J7704r462l414J4923j5102
$$ 1446 -11625 8201 10545 -15574 -3521 16621 -4547 -9649 8055 -1407 -4821 10102 -5000
1473e000q125K7966o939k6824K0301J3459k2182M010J0540j5707R625J3583k7591
$$ -5000 -13125 14841 7902 -18922 1379 14838 -7344 -3334 7206 -8501 1124 14707 -12884
1486a2884M78L3035j7473k2600K5916L061j9052J4314q81j9763K4092R065l7706
$$ -12884 -12406 20629 3156 -19444 6472 9533 -9519 4795 3914 -15849 8243 17308 -20398
1499b0398J0378L3693k5648j4723K6857p727j1028K1633j4441j9389L6299J201
$$ -20398 -10020 23673 -1975 -16698 10159 2432 -8596 13037 -1404 -20793 15506 16707
1511A6707m1126J8687K8416k8461m626K1143j6970K128K3252k7692j2701M2359
$$ 16707 -24419 -5732 22684 -5777 -10403 10740 -6230 -4102 19150 -8542 -21243 21116
1523B1116q039l8051K4007J7882k5253O830R018k1842J7110J9579l8351k494M2716
$$ 21116 13077 -24974 -967 16915 -8338 -1508 7510 -14332 2778 22357 -15994 -18488 24228
1536B4228j7533k8118K5871L213j6504J7993p016k3496L2475J1529m4746R087
$$ 24228 6695 -21423 4448 7661 -8843 9150 2134 -21362 11113 22642 -22104 -13017
1548a3017L7313k4810j3696K2689j1886l499K5886k3739k0526M3635J353m4838
$$ -13017 24296 -514 -14210 8479 -3407 -6906 18980 -4759 -25285 18350 19703 -25135
1560b5135J9169K6194k6793J840J4604k4041J1640K7928l7066j3292M8282r581
$$ -25135 -5966 20228 -6565 -4725 9879 -14162 -2522 25406 -11660 -24952 23330 13749
1572A3749l7721K5331J1701k2892J5163K122k9159K5281K3392m4364k894M4371
$$ 13749 -23972 1359 13060 -9832 5331 7453 -21706 3575 26967 -17397 -20291 24080
1584B4080j7485k4739K4427l054j2822K3978j1713k8415L5608J4384m4812O826
$$ 24080 6595 -18144 6283 3229 -9593 14385 2672 -25743 9865 24249 -20563 -13737
1596a3737L4343k1091r086J8604j6175J15K8372k4783k2396M0558L663l8491J4486
$$ -13737 20606 -485 -9571 9033 -7142 -7027 21345 -3438 -25834 14724 18387 -20104 -5618
1609e618J9783k0088O870Q142k5006J3876K6561l4109j2418L9688p322k7158J9084
$$ -5618 14165 -5923 947 9089 -15917 -2041 24520 -9589 -22007 17681 10359 -16799 2285
1622B285L347j5224J9315l027k8121K5077K0516l8156j728L3146j4934j4026J8904
$$ 2285 5632 -9592 9723 6696 -21425 3652 24168 -13988 -15716 17430 2496 -11530 7374
$$ [...]
8191B2
##END NTUPLES=NMR FID
##END=
