##TITLE=1H_UK_26_2_2
 CD2CL2
 8 sc, 
 5.04.2022
##JCAMPDX= 6.0         $$ Bruker NMR JCAMP-DX V2.0
##DATA TYPE= NMR FID
##DATA CLASS= NTUPLES
##ORIGIN= UXNMR, Bruker Analytische Messtechnik GmbH
##OWNER= root
$$ XWIN-NMR		Version 3.5
$$ Tue Apr  5 10:02:56 2022 Russian Standard Time (UT+4h)  she@DPX200
##.OBSERVE FREQUENCY= 200.131346
##.OBSERVE NUCLEUS= ^1H
##.DELAY= (6, 6)
##.ACQUISITION MODE= SIMULTANEOUS
##.ACQUISITION SCHEME= undefined
##.AVERAGES= 8
##.DIGITISER RES= 18
##SPECTROMETER/DATA SYSTEM= spect
##.PULSE SEQUENCE= zg30
##.SOLVENT NAME= CD2Cl2
##.SHIFT REFERENCE= (INTERNAL, CD2Cl2, 0, 15.7039)
##AUDIT TRAIL= $$ (NUMBER, WHEN, WHO, WHERE, WHAT)
$$ ##TITLE= Audit trail, XWIN-NMR		Version 3.5
$$ ##JCAMPDX= 5.01
$$ ##ORIGIN= Bruker BioSpin GmbH
$$ ##OWNER= she
$$ F:/spectra/data/she/nmr/H-F/1/audita.txt
$$ ##AUDIT TRAIL=  $$ (NUMBER, WHEN, WHO, WHERE, WHAT)
(   1,<2022-04-05 10:01:31.40 +0400>,<she>,<DPX200>,
      <created by zg, POWCHK disabled, PULCHK disabled
       configuration hash MD5:
       00 E9 B6 7A A2 85 ED C7 34 08 36 98 17 FE 4E 26
       data hash MD5: 16K
       71 91 7E BA 7B 45 67 7E 61 8D 6A E0 58 93 C3 14>)
$$ ##END=
$$ 
$$ hash MD5
$$ B9 EE A9 2C 37 6A C3 EA 14 15 15 1F 50 B3 17 3D
##$RELAX= 
##$RELAX= 
##$RELAX= 
##$RELAX= 
##$RELAX= 
##$RELAX= 
$$ Bruker specific parameters
$$ --------------------------
##$DU= <F:/spectra>
##$EXPNO= 1
##$NAME= <H-F>
##$PROCNO= 1
##$TYPE= <nmr>
##$USER= <she>
##$AMP= (0..31)
100 100 100 100 100 100 100 100 100 100 100 100 100 100 100 100 100 100 
100 100 100 100 100 100 100 100 100 100 100 100 100 100 
##$AQSEQ= 0
##$AQ_mod= 1
##$AUNM= <au_zg>
##$AUTOPOS= <>
##$BF1= 200.13
##$BF2= 200.13
##$BF3= 200.13
##$BF4= 200.13
##$BF5= 200.13
##$BF6= 200.13
##$BF7= 200.13
##$BF8= 200.13
##$BYTORDA= 1
##$CFDGTYP= 0
##$CFRGTYP= 5
##$CHEMSTR= <none>
##$CNST= (0..31)
1 1 145 1 1 1 1 1 1 1 1 1 1 1 1 1 1 1 1 1 1 1 1 1 1 1 1 1 1 1 1 1 
##$CPDPRG= <>
##$CPDPRG1= <>
##$CPDPRG2= <>
##$CPDPRG3= <>
##$CPDPRG4= <mlev>
##$CPDPRG5= <mlev>
##$CPDPRG6= <mlev>
##$CPDPRG7= <mlev>
##$CPDPRG8= <mlev>
##$CPDPRGB= <>
##$CPDPRGT= <>
##$D= (0..31)
0 1.2 0 0 0 0 0 0 0 0.06 0 0.03 0 0 0 0 0.0002 0 0 0 0 0 0 0 0 0 0 0 0 
0 0 0 
##$DATE= 1649138490
##$DBL= (0..7)
120 120 120 120 120 120 120 120 
##$DBP= (0..7)
150 150 150 150 150 150 150 150 
##$DBP07= 0
##$DBPNAM0= <>
##$DBPNAM1= <>
##$DBPNAM2= <>
##$DBPNAM3= <>
##$DBPNAM4= <>
##$DBPNAM5= <>
##$DBPNAM6= <>
##$DBPNAM7= <>
##$DBPOAL= (0..7)
0.5 0.5 0.5 0.5 0.5 0.5 0.5 0.5 
##$DBPOFFS= (0..7)
0 0 0 0 0 0 0 0 
##$DE= 6
##$DECBNUC= <off>
##$DECIM= 32
##$DECNUC= <off>
##$DECSTAT= 4
##$DIGMOD= 1
##$DIGTYP= 9
##$DL= (0..7)
0 120 120 120 120 120 120 120 
##$DP= (0..7)
150 150 150 150 150 150 150 150 
##$DP07= 0
##$DPNAME0= <>
##$DPNAME1= <>
##$DPNAME2= <>
##$DPNAME3= <>
##$DPNAME4= <>
##$DPNAME5= <>
##$DPNAME6= <>
##$DPNAME7= <>
##$DPOAL= (0..7)
0.5 0.5 0.5 0.5 0.5 0.5 0.5 0.5 
##$DPOFFS= (0..7)
0 0 0 0 0 0 0 0 
##$DQDMODE= 0
##$DR= 18
##$DS= 0
##$DSLIST= <SSSSSSSSSSSSSSS>
$$ [...]
##$SUBNAM2= <"">
##$SUBNAM3= <"">
##$SUBNAM4= <"">
##$SUBNAM5= <"">
##$SUBNAM6= <"">
##$SUBNAM7= <"">
##$SUBNAM8= <"">
##$SUBNAM9= <"">
##$SW= 18.0517287032376
##$SWIBOX= (0..15)
0 0 2 0 0 0 0 0 0 0 0 0 0 0 0 0 
##$SW_h= 3612.71676300578
##$TD= 16384
##$TD0= 1
##$TE= 0
##$TE2= 300
##$TE3= 300
##$TEG= 300
##$TL= (0..7)
0 120 120 120 120 120 120 120 
##$TP= (0..7)
150 150 150 150 150 150 150 150 
##$TP07= 0
##$TPNAME0= <>
##$TPNAME1= <>
##$TPNAME2= <>
##$TPNAME3= <>
##$TPNAME4= <>
##$TPNAME5= <>
##$TPNAME6= <>
##$TPNAME7= <>
##$TPOAL= (0..7)
0.5 0.5 0.5 0.5 0.5 0.5 0.5 0.5 
##$TPOFFS= (0..7)
0 0 0 0 0 0 0 0 
##$TUNHIN= 0
##$TUNHOUT= 0
##$TUNXOUT= 0
##$USERA1= <user>
##$USERA2= <user>
##$USERA3= <user>
##$USERA4= <user>
##$USERA5= <user>
##$V9= 5
##$VALIST= <valist>
##$VCLIST= <CCCCCCCCCCCCCCC>
##$VD= 0
##$VDLIST= <DDDDDDDDDDDDDDD>
##$VPLIST= <PPPPPPPPPPPPPPP>
##$VTLIST= <TTTTTTTTTTTTTTT>
##$WBST= 1024
##$WBSW= 4
##$XGAIN= (0..3)
0 0 0 0 
##$XL= 0
##$YL= 0
##$YMAX_a= 444501
##$YMIN_a= -459222
##$ZGOPTNS= <>
##$ZL1= 120
##$ZL2= 120
##$ZL3= 120
##$ZL4= 120
##$ABSF1= 10
##$ABSF2= 0
##$ABSG= 5
##$ABSL= 3
##$ALPHA= 0
##$AQORDER= 0
##$ASSFAC= 0
##$ASSFACI= 0
##$ASSFACX= 0
##$ASSWID= 0
##$AUNMP= <proc_1d>
##$AZFE= 0.1
##$AZFW= 0.1
##$BCFW= 1
##$BC_mod= 2
##$BYTORDP= 1
##$COROFFS= 0
##$CY= 11.3945322036743
##$DATMOD= 1
##$DC= 2
##$DFILT= <>
##$DTYPP= 0
##$F1P= 2.36226072786647
##$F2P= -0.459571619588291
##$FCOR= 0.5
##$FTSIZE= 0
##$FT_mod= 4
##$GAMMA= 1
##$GB= 0.15
##$INTBC= 1
##$INTSCL= 1
##$ISEN= 128
##$LB= 0.24
##$LEV0= 0
##$LPBIN= 0
##$MAXI= 10000
##$MC2= 0
##$MEAN= 0
##$ME_mod= 0
##$MI= 1.114404
##$NCOEF= 0
##$NC_proc= 0
##$NLEV= 6
##$NOISF1= 3.799351
##$NOISF2= 2.8
##$NSP= 1
##$NTH_PI= 0
##$NZP= 0
##$OFFSET= 15.70392
##$PC= 1
##$PHC0= -17317.05
##$PHC1= 21.80078
##$PH_mod= 1
##$PKNL= yes
##$PPARMOD= 0
##$PSCAL= 0
##$PSIGN= 0
##$REVERSE= no
##$SF= 200.130013532006
##$SI= 16384
##$SIGF1= 3
##$SIGF2= 2
##$SINO= 400
##$SIOLD= 16384
##$SREGLST= <1H.CDCl3>
##$SSB= 0
##$STSI= 0
##$STSR= 0
##$SW_p= 3612.71676300578
##$SYMM= 0
##$S_DEV= 0
##$TDeff= 0
##$TDoff= 0
##$TI= <>
##$TILT= no
##$TM1= 0
##$TM2= 0
##$TOPLEV= 0
##$USERP1= <user>
##$USERP2= <user>
##$USERP3= <user>
##$USERP4= <user>
##$USERP5= <user>
##$WDW= 1
##$XDIM= 8192
##$YMAX_p= 0
##$YMIN_p= 0
$$ End of Bruker specific parameters
$$ ---------------------------------
##NTUPLES= NMR FID
##VAR_NAME=  TIME,          FID/REAL,        FID/IMAG
##SYMBOL=    X,             R,               I
##VAR_TYPE=  INDEPENDENT,   DEPENDENT,       DEPENDENT
##VAR_FORM=  AFFN,          ASDF,            ASDF
##VAR_DIM=   8192,          8192,            8192
##UNITS=     SECONDS,       ARBITRARY UNITS, ARBITRARY UNITS
##FACTOR=    0.0002768,     1,               1
##FIRST=     0,             0,               0
##LAST=      2.2672688,     0,               0
##MIN=       0,             -459222,         0
##MAX=       2.2672688,     444501,          0
$$ Real data points
##PAGE= N=1
##DATA TABLE= (X++(R..R)), XYDATA
0@%%%%%%%%qJ6j6J6j6K4l3M1n6P2q8J04j20J44j73K04k39K79l25L75m34M98n70
$$ 0 0 0 0 0 0 0 0 0 -8 8 -8 8 -8 16 -17 24 -32 40 -48 56 -64 80 -93 111 -128 151 -174 201 -233 265 -305
31c05O50p39Q41r52J074j209J357j518J697j893K104k334K587k865L169l499L860
$$ -305 345 -394 447 -505 569 -640 717 -801 896 -997 1107 -1227 1360 -1505 1664 -1835 2025
48B025m256M689n166N691o268O909p629Q438r351J0390j1589J2992j4654J6666
$$ 2025 -2231 2458 -2708 2983 -3285 3624 -4005 4433 -4918 5472 -6117 6875 -7779 8887
62H887j9158K2333k6540L2417m1261N6215q7900K69991l24675k38563O87501k48642
$$ 8887 -10271 12062 -14478 17939 -23322 32893 -55007 214984 -109691 -348254 339247 90605
74I0605k70856K76743j21850j67223M85869j97152n03611M84649L29836o15723
$$ 90605 -180251 96492 -25358 -192581 293288 96136 -407475 77174 407010 -208713
84b08713k4572M19394j75176j01363J72791k43869N0837M06972k96132l45463
$$ -208713 -233285 186109 10933 -90430 82361 -161508 -110671 296301 169 -345294
94c45294M60517J32500l99740N4466J63681j12324J25399j3017k99151K32981
$$ -345294 115223 247723 -152017 -97551 66130 -46194 79205 66188 -232963 18
104A8L04204l91106j42770L85220l9733k02750J14716p5438l1333K81057j74520
$$ 18 304222 -86884 -229654 155566 115833 -86917 27799 -47639 -78972 202085 27565
115B7565l22962L69693J93539m21618J3517K88107j52432k2785J29419k35401
$$ 27565 -295397 74296 267835 -153783 -140266 147841 -4591 -27376 102043 -133358
125a33358M5903L51303k78583k84112M17852Q6802l74796J13839J67981j82927
$$ -133358 -87455 263848 -14735 -298847 119005 205807 -168989 -55150 112831 -70096
135g0096J09443Q8886l07443J16383L32526l16310k03869L75096l160k70070J48903
$$ -70096 39347 128233 -179210 -62827 269699 -46611 -250480 124616 121456 -148614 289
146B89M7671j49285J82446K0286k95524J66003K56730k93527j10242K83361m8895
$$ 289 47960 -101325 81121 101407 -194117 -28114 228616 -64911 -175153 108208 59313
157E9313j43141J26108m7231p3720J99076n3765k30834J81706J49054k29995k7438
$$ 59313 -83828 42280 -4951 -78671 120405 66640 -164194 17512 166566 -63429 -90867
168i0867J58990o5845k1279O5343j11141J8583J72338j21242j34454J73791L6806
$$ -90867 68123 2278 -19001 46342 -64799 -46216 126122 4880 -129574 44217 81023
179H1023j42908M2813L3040n9484Q3763j315j44017J02056J26675j62882l7632
$$ 81023 -61885 -19072 13968 -45516 38247 36932 -107085 -5029 121646 -41236 -78868
190g8868J51524n2692o3370Q5613n8722m5538J43114m9140j48718J40758Q3069
$$ -78868 72656 19964 -43406 42207 -16515 -62053 81061 31921 -116797 23961 107030
201A07030j66943J8495J16455r0900j3753R0507r4649l0074J44182o3042j22139
$$ 107030 -59913 -41418 75037 -15863 -29616 60891 -33758 -63832 80350 17308 -104831
212a04831J30966M9728j31992L5435P4641p9272J1904O3575q5702r279J05501
$$ -104831 26135 75863 -56129 -20694 53947 -25325 -13421 50154 -35548 -44827 60674
223F0674n6014p5421R1398K0853p4692L1538K8659m5146K5332K1627n9638J4578
$$ 60674 4660 -70761 20637 41490 -33202 -1664 26995 -18151 7181 28808 -30830 -16252
235a6252N3004m5179k4904M8056n335k0364K2233j0295j0619L2651j4652l4111
$$ -16252 36752 -8427 -33331 14725 9390 -10974 11259 964 -9655 22996 8344 -25767
247b5767L1609J1357l5280J1480J6545k1325J3721J4912l0503Q590L2220l0330
$$ -25767 5842 17199 -18081 -6601 9944 -11381 2340 17252 -13251 -4661 27559 -2771
259b771j6886L4516j0298k5355K4523O88k3447K4033J0323l1395J3904K4403k8946
$$ -2771 -19657 14859 4561 -20794 3729 4417 -19030 5003 15326 -16069 -2165 22238 -6708
272f708o733K7773j4869j6099K3354l477j8336K0616P290k2374J0636J6536k0208
$$ -6708 -13441 14332 -537 -16636 6718 3241 -15095 5521 12811 -9563 1073 17609 -2599
285b599m553J7504j0548j1845J4644m01j2461J1044P942j2253K251J2086q075
$$ -2599 -7152 10352 -196 -12041 2603 2202 -10259 785 8727 -3526 -1275 10811 2736
298B736q062Q937r82j0890L508O028o694j057J0607j177o217P159M151r579n34
$$ 2736 -5326 3611 2629 -8261 -4753 1275 -5419 -6476 4131 2954 -3263 3896 8047 -1532 -2066
313b066P145o633o570Q813L62q450O175Q347p190j127J0781m345q848O880J882
$$ -2066 5079 -1554 -8124 689 1051 -7399 -1224 7123 -67 -1194 9587 5242 -3606 3274 5156
328E156j1776J643Q949p471m505J2091N0j0217P935O554j2139q98J0918q402r012
$$ 5156 -6620 -4977 3972 -3499 -8004 4087 4137 -6080 1855 8409 -3730 -4628 6290 -2112 -11124
343a1124J2601L87j1939R468R368j2352Q65J3370q879p547J1567l152j0615Q632
$$ -11124 1477 1864 -10075 -607 8761 -3591 -2726 10644 1765 -5782 5785 2633 -7982 650
357F50L642j0768N526R069p486j219P301k814l159R51m073O37K448o227P28O350
$$ 650 4292 -6476 -950 8119 633 -586 6715 3901 742 1693 -2380 -1743 705 -5522 -4794 1556
373A556m004R63O942q518L22J3812j2771j2491K0836p35k3621J5384J3176k1521
$$ 1556 -2448 -1485 5457 -3061 -2739 11073 -1698 -14189 6647 5912 -17709 -2325 10851 -10670
387a0670Q895J8602k5152K193L1996k6664k1878M0001l960l8930K6238J5534l4181
$$ -10670 -1775 16827 -8325 -6132 25864 -800 -22678 17323 13363 -25567 671 16205 -17976
400a7976J7900K1749l9875J0756M2517m1623k2807N2978j1384m0921L3817N917
$$ -17976 -76 21673 -18202 -7446 35071 -6552 -29359 23619 12235 -28686 5131 11048
412A1048l3468L2245R075m8912L0011M0043n6293r455N4029k4758k6627L5805
$$ 11048 -22420 9825 18900 -30012 -1 40042 -16251 -25706 28323 3565 -23062 12743
424A2743j6698j8746M8777j7613m9308N4766K4598o5436J2535M1794l6469J136
$$ 12743 -3955 -22701 26076 8463 -40845 13921 38519 -26917 -14382 27412 -9057 -7921
436g921K6783m3912R705N9833n2412l8591P7834q07o2538L4783J5287l9388L7233
$$ -7921 18862 -25050 -15345 44488 -7924 -46515 31319 30512 -32026 2757 18044 -21344 15889
449A5889M556p0020M8312O1337q7608j6722Q9827l1056m5365N3129k3381l1697
$$ 15889 20445 -49575 -1263 60074 -27534 -44256 45571 14515 -30850 22279 -1102 -32799
461c2799P5593k9004q8677Q8647N1725j13657J1623Q6433n6623j3747N7624o2781
$$ -32799 42794 13790 -74887 13760 65485 -48172 -36549 49884 -6739 -20486 37138 -25643
473b5643q272J03138o6850q9075J18919K9479j17363L7267O2080o4667K5104L8708
$$ -25643 -33915 69223 2373 -86702 32217 61696 -55667 -18400 43680 -20987 4117 42825
485D2825r2155K8621J06492r9968o7530J26078n92r3550N0638J6224m7542O5202
$$ 42825 -49330 -20709 85783 -14185 -81715 44363 43771 -49779 859 17083 -30459 34743
497C4743l319j05774P5640Q6705j24032k8322J11865l2539m6470N2370m0217j4199
$$ 34743 31424 -74350 1290 87995 -36037 -64359 47506 14967 -31503 20867 -19350 -33549
509c3549J02460n7178j04403J20635N1663j33242J7913P8902n9586J3330M2008
$$ -33549 68911 11733 -92670 27965 79628 -53614 -35701 43201 -16385 -3055 38953
520C8953r5212K9233J25774j08360q7822J49197J0002j21003N5183L1823o7486
$$ 38953 -56259 -27026 98748 -9612 -97434 51763 61765 -59238 -4055 27768 -39718
531c9718O9147J4358j30114P4012J23834j41830n5602J48137k6798q3841O8602
$$ -39718 29429 43787 -86327 -12315 111519 -30311 -85913 62224 35426 -48415 20187
542B0187k1594m7444J08450k8651j36146J12469R6379j49671j5405J17693m9741
$$ 20187 -1407 -48851 59599 30948 -105198 7271 103650 -46021 -61426 56267 6526
553F526k9016N8033p1442p334J27745p5206j16788J36175N2419j32293K3860O6575
$$ 6526 -22490 35543 -35899 -43233 84512 9306 -107482 28693 81112 -51181 -27321 39254
565C9254n8551L1777L0903j10126M0784J25719j14149p9066J39071L363r4904
$$ 39254 -19297 12480 43383 -66743 -25959 99760 -14389 -93455 45616 48979 -45925
576d5925N2418N396m9850Q5089q767j28354Q5451J02616j34574l2425J18588l6852
$$ -45925 6493 11889 -37961 47128 38361 -89993 -4542 98074 -36500 -68925 49663 12811
588A2811m2000O1300n3214k2996J18825n2965j21505J17877O4193j31385J1244
$$ 12811 -29189 32111 -21103 -44099 74726 21761 -99744 18133 82326 -49059 -37815
599c7815P9853n8264J2733M8632r3965J3539J25669q7697r4792J26607K2970j05966
$$ -37815 42038 -16226 -3493 45139 -48826 -35287 90382 2685 -92107 34500 57470 -48496
611d8496M0202L1937n8048N6564K1850j11183M8091J09556j05042n6181J11382
$$ -48496 -8294 23643 -34405 22159 44009 -67174 -19083 90473 -14569 -70750 40632
622D0632j2878o4341N2070j5979m0256Q4949j2470j06461P4928P5199j02861j4607
$$ 40632 27754 -36587 15483 -496 -40752 44197 31727 -74734 194 75393 -27468 -42075
634d2075P8514l7336j4852M5476n6250r816R5438m6834q2772Q9163L3258q5276
$$ -42075 36439 -897 -15749 29727 -26523 -36339 59099 12265 -70507 18656 51914 -33362
646c3362K1495L6635m7238L0210K6687q0847K3543Q7004p0780n0150Q7529l302
$$ -33362 -11867 24768 -22470 7740 34427 -46420 -22877 64127 -6653 -56803 30726 27424
658B7424n7303M1543k039m2046N8316M102q4737M6091O6447p6680k0015P0667
$$ 27424 -29879 11664 9625 -32421 25895 29997 -54740 -8649 57798 -18882 -38897 31770
670C1770k5215k6984M4052k9021k6378O6891j6432p0472N4590L9893o5841M130
$$ 31770 6555 -20429 23623 -5398 -31776 35115 18683 -51789 2801 42694 -23147 -19017
682a9017M3539l3196K297L2957m4229m852O0248l2115m6640N3115J1480m5289
$$ -19017 24522 -8674 -6377 26580 -17649 -22501 37747 5632 -41008 12107 23587 -21702
694b1702K0846J4308l0641K5030J5032m8054J4840M4632m1121j9581M3293j1134
$$ -21702 -856 13452 -17189 7841 22873 -25181 -10341 34291 -6830 -26411 16882 5748
706E748k2322K7769r741k0569L7046k784m2312K8259K5216l9776N36K8750k1994
$$ 5748 -16574 11195 1454 -19115 17931 15147 -27165 1094 26310 -13466 -12930 15820 -6174
719f174l047K4860k3234q507L7068j4062l0154L1339R154l1707J2120J3780k2919
$$ -6174 -9221 15639 -7595 -16102 20966 6904 -23250 8089 17243 -14464 -2344 11436 -11483
732a1483Q694J7315k6169R74K9777j8306j6954K5909j141k0329J5133L315j8485
$$ -11483 -2789 14526 -11643 -10669 19108 802 -16152 9757 8616 -11713 3420 6735 -11750
745a1750J3281Q784k1642O153J8933j6383o540J7711o083r443J1896l051r969
$$ -11750 1531 10315 -11327 -5174 13759 -2624 -9164 8547 2464 -6979 4917 1866 -8103
758h103J1245J163j2346P154P917j0000O67P048n378q58N007n556j596P149m276
$$ -8103 3142 4305 -8041 -887 7030 -2970 -2303 4745 -633 -1491 3516 -2040 -3636 3513 -763
773g63l622O437l53m276M808l23l913M519J21o804M158K986o636J173N773m703
$$ -763 -4385 2052 1699 -2577 2231 1908 -2005 2514 2635 -4169 -11 2975 -3661 -2488 3285 -1418
789a418j233O523l226l741O185o54o363L863K875o532J244N714m802j690O250
$$ -1418 -2651 3872 646 -3095 3090 2436 -3927 -64 2811 -3721 -2477 3237 -1565 -3255 2995
804B995j325m523M708J286n437J320M103m887j630N372q80l911L848K012m273
$$ 2995 1670 -2853 1855 3141 -2296 -976 3127 -1760 -3390 1982 1102 -2809 1039 3051 -1222
819a222O39L896l443k212L942r39l610K438J916l360O52L639j629k546L216M80
$$ -1222 -583 3313 -130 -2342 1600 661 -2949 -511 1405 -1955 -1303 2336 707 -1839 1377 1857
835A857l617O99K428k463j396L373l27k506K557K176l555n2L637k035l262L458
$$ 1857 -1760 -1061 1367 -1096 -2492 881 554 -1952 605 2781 -774 -826 2811 776 -2486 972
851I72N15m618K413L590n082r0O390l506m174O520pp321M445L439p435J856O664
$$ 972 1487 -3131 -718 2872 -2210 -2300 4090 584 -3590 2930 2923 -4398 47 3486 -3949 -2093 4571
868D571o888j449R147m505o032Q726K08q726N368L596q486L169O173q564O59R601
$$ 4571 -2317 -3766 5381 876 -5156 3570 3778 -4948 420 4016 -4470 -1301 4872 -3692 -3033 6568
884F568p038m620R776k188p212O283N0o548O498R02q843O111O379r657O89Q041
$$ 6568 -470 -5090 4686 2498 -4714 1569 1619 -4929 1569 2471 -6372 -261 6118 -3539 -2850 5191
900E191n981q52O344p310j276J1012p637q175J3788k27j2034Q899L468j1377R107
$$ 5191 -790 -1642 4702 -2608 -3884 7128 -509 -8684 5104 4877 -7157 1742 5210 -6167 2940
915B940M812j7468P378J5668j9392n133K1928r368j1981J7808m523j4535K0462
$$ 2940 7752 -9716 -2338 13330 -6062 -11195 10733 1365 -10616 7192 2669 -11866 8596
928H596o8k5786J7893J7201k8914O08K5542j7089p848K2636j4184j2214K9120
$$ 8596 8528 -17258 635 17836 -11078 -10470 15072 -2017 -9865 12771 -1413 -13627 15493
941A5493q390k8899K6985J2888l2487P507K1391k1234J446K0039k3415k663L1766
$$ 15493 7103 -21796 5189 18077 -14410 -6903 14488 -6746 -5300 14739 -8676 -11339 20427
954B0427j8895k3371L1687K987k8426J5657Q786k0746J6003R262l1198J3255K8976
$$ 20427 1532 -21839 9848 12835 -15591 66 8852 -11894 4109 13371 -17827 -4572 24404
967B4404l1192j0982L3161j1128j7146K2301j0046j5330L2325p152l6183L1468
$$ 24404 -6788 -17770 15391 4263 -12883 9418 -628 -15958 16367 9215 -26968 4500
979D500K0356m0693N195K8542k4402n2K3985l0040l768M4488k5918l4078M5803
$$ 4500 24856 -15837 -10642 17900 -6502 -6554 17431 -12609 -16377 28111 2193 -31885 13918
992A3918P195m2581K0824J6207l1829J9318J8335m4787J1648M6771m0819k4458
$$ 13918 21113 -21468 -644 15563 -16266 3052 21387 -23400 -11752 35019 -5800 -30258
1004c0258N1154q302l3882L0540j811k9424L6139M714n1281K8120L9657m9146
$$ -30258 20896 12594 -21288 9252 7441 -21983 14156 18870 -32411 -4291 35366 -13780
1016a3780r240M5360k0781j6685L2105k1533j7380M7358j3641m8186M2152K4172
$$ -13780 -23020 22340 1559 -15126 16979 -4554 -21934 25424 11783 -36403 5749 29921
1028B9921m9137Q778K9649k9244O800K5346m0196J033N1441l3313l5833M9900
$$ 29921 -19216 -10438 19211 -10033 -3233 22113 -18083 -17050 34391 1078 -34755 15145
1040A5145L779m0253K4288P374l0069L0583J0827n2316K2793M5614m8125j7047
$$ 15145 18924 -21329 2959 10333 -19736 10847 21674 -30642 -7849 37765 -10360 -27407
1052b7407M8936j6368k2786L3464j7067k3310M8547p440n4233M0022L2759n3720
$$ -27407 21529 5161 -17625 15839 -1228 -24538 24009 16569 -37664 2358 35117 -18603
1064a8603K476L8176k9801j746L3066l6800j0259N6601k4835m7046M9560J5712
$$ -18603 -16127 22049 -7752 -9498 23568 -13232 -23491 33110 8275 -38771 10789 26501
1076B6501m8702J8390K0785l4275J8333K3782m8206O444N3536l7873l1177M9732
$$ 26501 -22201 -3811 16974 -17301 1032 24814 -23392 -16948 36588 -1285 -32462 17270
1088A7270l240l3754K8125r21k9621L5739O956n1348K4572M0024m4633j0070M0270
$$ 17270 14030 -19724 8401 7480 -22141 13598 20554 -30794 -6222 33802 -10831 -20901 19369
1101A9369j9541j2232K9952k3141j6538M6335j2250m4757L7344K0893m2449R856
$$ 19369 -172 -12404 17548 -5593 -22131 24204 11954 -32803 4541 25434 -17015 -7159
1113g159K3549k8298R808K4096l8723o40M7063k7083l1927M2018K583l3280K2927
$$ -7159 16390 -11908 -2100 21996 -16727 -17367 29696 2613 -29314 12704 15287 -17993 4934
1126D934M956k8960K6592J3309m4478J3554L9831l5695j5956L8393j2610j8868
$$ 4934 9890 -19070 7522 20831 -23647 -10093 29738 -5957 -21913 16480 3870 -14998
1138a4998K8125j1008k3052L5702J046m1948K4360K6833l6595n38K7791k1007
$$ -14998 13127 2119 -20933 14769 15815 -26133 -1773 25060 -11535 -12073 15718 -5289
1150e289l058K5347k3277j1457L7542j1915l1794K9096J0831k9323J1845J2527
$$ -5289 -8347 17000 -6277 -17734 19808 7893 -23901 5195 16026 -13297 -1452 11075
1162A1075k2863J1864J6653k9675J570L1804k0616j7326K7369l429j8124J8592
$$ 11075 -11788 76 16729 -12946 -11376 20428 -188 -17514 9855 6426 -11698 6894
1174F894k501j8632K1145N565k8579J1982K1438k3566l616K0865j3125n654J8975
$$ 6894 4393 -14239 6906 12471 -16108 -4126 17312 -6254 -9870 10995 -2130 -7784 11191
1187A1191j2713j1810K5076l994k3659J8240J0456k2026O253J2559j6882M093
$$ 11191 -1522 -13332 11744 7750 -15909 2331 12787 -9239 -2986 9573 -7309 -3216
1199c216J5678j8553m013K3310j0601j6117J9128J449j6762J1621M490j5937J0178
$$ -3216 12462 -6091 -10104 13206 2605 -13512 5616 7065 -9697 1924 6414 -9523 655
1212F55R661j8647K393J7254j2600p780J5717m431r149J1887k304j0761J1780
$$ 655 10316 -8331 -5938 11316 -1284 -9064 6653 2222 -6927 4960 2656 -8105 3675
1225C675K886j4204O296R133j1085l17R248p383j961R138o450m342J0356k746
$$ 3675 6561 -7643 -1347 7786 -3299 -3616 5632 -1751 -3712 5426 -1024 -5366 4990 2244
1239B244q405P840K032p977M606L064p305L773M739q096N75Q137n658l798Q232
$$ 2244 -6161 1679 3711 -4266 340 3404 -3901 -128 4611 -3485 -2910 5227 -431 -4229 4003
1254D003l104m449O387r58o282O175K224q293L020N858o489p69O138l823k867
$$ 4003 899 -3550 2837 1879 -4403 1772 3996 -4297 -1277 4581 -1908 -2677 3461 -362 -3229
1269c229O099j940m816N287Q89n679K769L692n028N10M371l493j123L977j421
$$ -3229 2870 930 -3886 1401 2290 -3389 -620 3072 -1956 -1446 2925 -568 -1691 2286 865
1284H65k729K844N11l109J531J670k390K19K036j678m14J275m69q24O97K00o94
$$ 865 -1864 980 1491 -1618 -87 1583 -807 -588 1448 -230 -644 631 162 -662 35 235 -459
1301d59l1P69m84j24J30J41J41l40K66K87l70m04Q15m80l21P62L91j168M83R45
$$ -459 -490 279 -205 -329 -199 -58 83 -257 9 296 -74 -478 337 -143 -464 298 689 -479 4 949
1321I49j269L2J121r40q14J330l7j380Q03J354j765J09J580j143r02J565M4k080
$$ 949 -320 -288 833 -107 -921 409 372 -1008 -205 1149 -616 -507 1073 -70 -972 593 637 -1443
1339a443J549O19j777M75J914j645n10K172p48j408J573l9j729R93J102k060J20
$$ -1443 106 725 -1052 -577 1337 -308 -818 1354 606 -802 771 732 -997 -4 1098 -962 -842
1356h42J756j447J49R88n79r29J505l00j108P87L18q84P46n52j7Q55m35o67J526
$$ -842 914 -533 -384 604 25 -904 601 301 -807 -20 298 -586 160 -392 -409 446 11 -656 870
1375H70l23j295J610j16j939J385J629l213N56L056k822j163M024j934k936M397
$$ 870 547 -748 862 746 -1193 192 1821 -1392 -836 2220 -602 -1765 2259 325 -2611 1786
1391A786p86m190M011J687n944K710M596o079k66O012l748k858O324k445m970
$$ 1786 1000 -3190 821 2508 -3436 -726 3870 -2209 -2475 3537 -211 -3069 3255 810 -4160
1406d160O387P14p501M569M589p423R41O460n713j104O633m938l758P975k012
$$ -4160 2227 2941 -4560 9 4598 -2825 -1884 4576 -1137 -2241 4392 -546 -4304 3671 1659
1421A659o750O381J939p139L806L565o878L258N268q380M67Q139o201l619Q045
$$ 1659 -5091 1290 3229 -3910 -104 3461 -3417 -159 5109 -3271 -2804 5335 -866 -4485 3560
1436C560k798n039P556j515p335Q764J460j0798N883O876j0600R99Q421q190r37
$$ 3560 762 -4277 3279 1764 -5571 3193 4653 -6145 -262 6614 -3986 -2987 5434 -2756 -3693
1451c693J0144p866n540J3775l556j2316J1567L448j2505O256O369j1986M073
$$ -3693 6451 -1415 -6955 6820 3264 -9052 2515 5963 -6542 -286 6083 -5903 -1830
1464a830J0587j3478j793J6250q898r653J4170j237j1739J0782J629j3671J0347
$$ -1830 8757 -4721 -6514 9736 838 -8815 5355 4118 -7621 3161 4790 -8881 1466
1477A466P820j7380L773J5016j3050n216J5138p191p604J4019n416j1597J5804
$$ 1466 9286 -8094 -4321 10695 -2355 -7571 7567 376 -7228 6791 1375 -10222 5582
1490E582J440j7589R447J0826j5145K215J1249j2433L86J3960j3208o469J9242
$$ 5582 7022 -10567 -1120 9706 -5439 -3224 8025 -4408 -4022 9938 -3270 -9739 9503
1503I503n821j4961J5125K650j4270J0115M251j5808R586J0904j9534J152J9082
$$ 9503 3682 -11279 3846 6496 -7774 2341 6592 -9216 370 11274 -8260 -7108 11974
1516A1974j3381q329J7309o069r905J5833m017j5803J7758M840k2477R154J5520
$$ 11974 -1407 -9736 7573 1504 -8401 7432 3415 -12388 5370 10210 -12267 -3113 12407
1529A2407j8091o63J5880j3153k793J7858j2360j2107K2550j926k1111J4635Q719
$$ 12407 -5684 -6347 9533 -3620 -6413 11445 -915 -13022 9528 7602 -13509 1126 9845
1542I845j8344P135J0161j7124N304J6317j8796n575K3391r246j5055J7198j55
$$ 9845 -8499 -1364 8797 -8327 -3023 13294 -5502 -11077 12314 3068 -11987 5211 5056
1555E056j4337J3805J356j8021J4095J0644k2292L445J8745j4313o276J6003q997
$$ 5056 -9281 4524 5880 -12141 1954 12598 -9694 -6249 12496 -1817 -8093 7910 -1087
1568a087o635J7097q231j4355K0151K605k1504J0595J2010j6966L304J2058j5683
$$ -1087 -7722 9375 1144 -13211 6940 9545 -11959 -1364 10646 -6320 -3016 9042 -6641
1581f641J680J7349j5712q893K2748n407j6911J5449L105j5313J0944N155j8334
$$ -6641 -4961 12388 -3324 -12217 10531 5124 -11787 3662 6767 -8546 2398 7553 -10781
1594a0781J0044J4068k1194j298K0795j1336r997J6867n092j0571J5815k834j7294
$$ -10781 -737 13331 -7863 -9161 11634 298 -9699 7168 2076 -8495 7320 4486 -12808
1607a2808J6030P798k1264N908J5209j4563j439J3422j1351l696J7154j0125j2114
$$ -12808 3222 11020 -10244 -4336 10873 -3690 -5129 8293 -3058 -6754 10400 275 -11839
1620a1839J8652N14j7927J0716P388j3768O073P831j4740M300J4066j4953n212
$$ -11839 6813 7327 -10600 116 7504 -6264 -191 7640 -7100 -2800 11266 -3687 -8899
1633h899J7657o247j1251J2587p70j0210J1126J041j4219J0485Q932j6797J326
$$ -8899 8758 2511 -8740 3847 3077 -7133 3993 5034 -9185 1300 10232 -6565 -5239
1646e239J3553r757m308J1557p072m961J3633n370j1675J3968L307j5467O737
$$ -5239 8314 -1443 -5751 5806 -1266 -6227 7406 2036 -9639 4329 7636 -7831 -1094
1659a094Q384j1646K204Q737j1217J98J3143r724p514J4622j579j1589R238K327
$$ -1094 7290 -4356 -2152 6585 -4632 -4434 8709 -1015 -8529 6093 4514 -7075 2163 4490
1673D490j0380O798M291j1755M594J0151j1391k547J1891n333n966Q739k323o424
$$ 4490 -5890 908 5199 -6556 -1962 8189 -3202 -5749 6142 809 -5157 3582 1259 -5165
1687e165Q515l75r758P418N295j0082J613P968o621j252O611n803j907Q431m445
$$ -5165 3350 2975 -6783 635 5930 -4152 -2539 5429 -1192 -2444 4167 -1636 -3543 4888 443
1702D43o158Q256O54p604M622K869n984L390L420p181J890O329o467k697P968
$$ 443 -5715 2541 3195 -4409 213 3082 -2902 488 3908 -3273 -1383 4946 -1521 -4218 3750
1717C750k764n035N991l77n188N337J272o632L488M583p096L82N753m285j767
$$ 3750 986 -4049 1942 1565 -3623 1714 2986 -3646 -158 4425 -2671 -2289 3464 -821 -2588
1732b588N128k194l453N797p99n252M060K211n501J466L606l815j91L616k780
$$ -2588 2540 346 -3107 2690 1891 -3361 699 2910 -2591 -1125 2481 -1334 -1525 2091 -689
1747f89j062M210j832k976L414P51l728J893J213k357P80J816k538M80K406j961
$$ -689 -1751 2459 627 -2349 1065 1816 -1912 -19 1194 -1163 -383 1433 -1105 -625 1781 -180
1763a80p74K214q31j495J442l79j047J400j10j327J350N88j537P69J120j707M18
$$ -180 -954 1260 429 -1066 376 -3 -1050 350 240 -1087 263 851 -686 83 1203 -504 -86
1780h6J365j849m67K031r71j367K088n9j581J241P52k181Q40J425k053J26J492
$$ -86 1279 -570 -1037 994 23 -1344 744 685 -896 345 1097 -1084 -244 1181 -872 -746 746
1797G46q21j147K051n8j715J069Q42j770N54J205j266m41J250m07j051J519O7
$$ 746 -75 -1222 829 771 -944 125 967 -803 -249 956 -310 -751 499 92 -959 560 627
1814F27j354N73R39j170Q4Q49o59l63N57Pn92J31P67n26o0N37r1m44L84l4n21
$$ 627 -727 -154 785 -385 -301 548 -111 -474 83 90 -502 -371 396 -130 -190 347 256 -188 196 162 -359
1835c59O9J92J31m30O91j59j41K05L32l61n57P30J72j020M67N02q90l48J243r3
$$ -359 -290 -98 33 -397 294 135 -6 199 531 170 -387 343 515 -505 -38 464 -426 -774 469 376
1855C76q17Q70j22r34M20J036j469p9J446q34o64J432j07j190J193L54j642L59
$$ 376 -441 429 307 -627 -207 829 -640 -719 727 -107 -771 661 554 -636 557 911 -731 -372
1873c72J627k039j35J777j061p73J526k04j226J344M27j610O22J130j611p6J084
$$ -372 1255 -784 -919 858 -203 -976 550 346 -880 464 891 -719 -97 1033 -578 -654 430
1890D30p30r8P14p80M44Q37n80o55J078n59p31O94j62o29J363l87j418J719M87
$$ 430 -300 -398 316 -464 -20 817 237 -418 660 101 -630 64 -98 -727 636 249 -1169 550 1037
1909A037k170R80J776k242j78K084j936n99L011j941k150L742K83l990K448J906
$$ 1037 -1133 -153 1623 -619 -797 1287 -649 -1248 1763 -178 -2328 1414 1697 -2293 155 2061
1925B061l546J091K536l838L14M263l360k495M896r5m444L375J032l749K075K052
$$ 2061 -1485 -394 2142 -1696 -1382 2881 -479 -2974 1922 1827 -2617 758 1790 -1959 116 2168
1941B168m688J325M696m592j770N276j524l480L746k68l065L463K28m563L255
$$ 2168 -2520 -1195 3501 -1091 -2861 2415 891 -2589 1157 889 -2176 1287 1515 -3048 207
1956B07K851m860J12M137k708p83L052k809r33M902l092l706N073J092m978K306
$$ 207 3058 -1802 -1690 2447 -261 -1044 2008 -801 -1734 3168 76 -3630 1443 2535 -2443 -137
1972a37J751l364K493J373n162K572M886n645k228O348j754m105M605q24m057
$$ -137 1614 -1750 743 2116 -3046 -474 4412 -1233 -3461 2887 1133 -2972 1633 809 -3248
1987c248N562j9p328N308N105q320l4O685l779k276M994l717k634P997k315p914
$$ -3248 2314 2295 -5033 275 5380 -2940 -2974 3711 -68 -2344 2650 -1067 -3701 4296 1981 -5933
2003e933P381L819q724J318N422m870M8M715n658n24Q368m949o376Q459J351p600
$$ -5933 1448 5267 -3457 -2139 3283 -1587 -1539 3176 -2482 -3006 5362 413 -5963 2496 3847 -3753
2019c753L525K515m883L666J987p392K731P502p128l689P926j125m341L939j650
$$ -3753 -228 2287 -2596 1070 3057 -4335 -1604 5898 -1230 -4919 3007 1882 -2459 1480 -170
2034a70k808O517j511p841O327M788q004k60O008l582m51M170o048m11R121n269
$$ -170 -2978 3539 2028 -5813 514 5302 -2702 -2962 3046 -536 -987 3183 -2865 -3276 5845 576
2050E76o994Q781J939q302L657K856n569L928L171q954K528R551q051n262R564
$$ 576 -6418 2363 4302 -4000 -343 2513 -3056 872 4043 -4911 -2383 7168 -883 -6145 3419
2065C419o24o553N085j78m965P012N80j0149N079Q446r373k963Q896k661l821
$$ 3419 2795 -3758 1327 1149 -3816 3196 3776 -6373 -1294 7152 -2221 -5184 3712 1051 -2770
2080b770N505l622l219Q703j831r427O820N925q630l38N650l714M80L594o115
$$ -2770 2735 -887 -4106 4597 2766 -6661 159 6084 -2546 -2884 2766 -948 -468 3126 -2989
2095b989M5Q472m713o708P357K208o314K302J637l691M198J251p787L103P539
$$ -2989 -2944 5528 815 -5893 1464 3672 -2642 -340 1297 -2394 1804 3055 -4732 -1629 5910
2110E910o697l879P317j293l381L789k373k725P030j275q315N999N320p993k1
$$ 5910 -787 -4666 2651 1358 -2023 1766 -607 -3332 3698 2423 -5892 107 5427 -2566 -2587
2125b587N605l976p9M405n644j100Q697l717p883P566L148p490K080L355m833
$$ -2587 3018 -958 -1037 3368 -2276 -3376 5321 1604 -6279 1287 4435 -3055 -975 2380 -2453
2140b453K671L533p141N99Q260n152n553P089J110n379L151P57m207M291J697
$$ -2453 218 3751 -3390 -2791 5469 317 -5236 1853 2963 -2416 735 1492 -2715 1576 3273
2155C273p017J880O414m888l129N150o30k516K986j816k149M781m87n784L660
$$ 3273 -3744 -1864 4550 -338 -3467 1683 1053 -1463 1523 -293 -2442 2339 1852 -3932 -272
2170b72L508m507l39K942k194Q56K014l945K39N122l117l710M382Q31l248J862
$$ -272 3236 -1271 -1610 1332 -862 -6 2008 -1937 -1698 3424 307 -3403 979 1810 -1438 424
2186D24K88k687K931J134m828J658M665m219j772M287j125k352K853j079k759
$$ 424 712 -1975 956 2090 -2738 -1080 3585 -634 -2406 1881 756 -1596 1257 178 -2581
2201b581M310O5n124K822L774m512p03L796k261j045L167k132j605L976m75m142
$$ -2581 1729 1794 -3330 -508 3266 -1246 -1949 1847 -414 -1459 1708 -424 -2029 1947 1472 -2670
2217b670K542K394l322P1K301j690k73J955k010q45L273j013k416J971P52j449
$$ -2670 -128 2266 -1056 -985 1316 -374 -647 1308 -702 -1547 1726 713 -1703 268 1020 -429
2233d29J4R72j273R28N73j716M51J465r14j120J419j23m85O05p07k19J464p19
$$ -429 -415 557 -716 212 785 -931 -480 985 71 -1049 370 247 -238 367 -340 -559 905 186
2251A86j342J429P29j544L32J028j508Q35P66j656J01J954j377j243J584M19j579
$$ 186 -1156 273 1002 -542 -210 818 -690 145 911 -745 -644 1310 -67 -1310 274 693 -886
2268h86Q43R34j811Q77R69j647J08J831r42j307J459J88j468R05M22j015L22J160
$$ -886 -43 891 -920 -43 926 -721 -613 1218 276 -1031 428 616 -852 53 475 -540 -218 942
2286I42j199n81J612p73p73J153J11j188L91P64q16j2Q19n19l33Q87m86m19O20
$$ 942 -257 -838 774 1 -772 381 492 -696 -305 459 -357 -369 450 -69 -402 485 -1 -420 200
2305B00K34o03j12K10K84o98M16J82j10lK24k9k32J71J98n94l3M14o3m46K55J66
$$ 200 434 -169 -281 -71 213 -485 -69 113 3 0 224 195 -37 134 332 -262 -295 119 56 -390 -135 31
2327C1m40K36M35n0m80N49n8o73O54K69r11J95O32o15k26J086m74q67R77L44j148
$$ 31 -409 -173 262 212 -268 281 223 -450 204 473 -438 -243 389 -226 -452 634 160 -707 270 614 -534
2348e34M85O88j051J0J067o14n52J002p9p83M96L67o76n7O17n60k02Q79m86m84
$$ -534 -49 639 -412 -402 665 51 -501 501 422 -361 135 502 -174 -231 386 -174 -376 503 17 -467
2368d67Q22k14m94K91J79l03L02K2k88nK68r1j67J35Kl1k35r2N28J57o00L47K84
$$ -467 355 141 -353 -62 117 -186 116 138 -150 -155 113 22 -145 -10 -8 -39 -274 -366 162 319 -281 66 350
2391C50o99RN73l57k67J028m56o28R74j06r89L16Q94j208K22J031j139j84J561
$$ 350 -349 -340 233 -124 -391 637 181 -447 527 421 -568 -252 642 -566 -344 687 -452 -636 925
2410I25r46j199J510L60j646P27J022j379L15J172j866L01J769j042r55J419L37
$$ 925 -21 -1220 290 650 -996 -269 753 -626 -311 861 -1005 -704 1065 23 -932 487 824
2427H24j613P84N16r35M83O95j631N71J815j603n34J141k93o71P28n88m11J614
$$ 824 -789 -5 511 -424 59 754 -877 -306 1509 -94 -628 513 220 -451 277 -311 -722 892
2445H92n43j493J343Q26j858N69P51r92J011L47j992N52K172j706j376K281j36
$$ 892 349 -1144 199 1025 -833 -264 487 -505 506 853 -1139 -587 1585 -121 -1497 784 648
2462F48j436J380n43j027K085j05k921J489K868l164q37K604n00j693K055q69
$$ 648 -788 592 49 -978 1107 1002 -1919 -430 2438 -726 -1563 1041 541 -1152 903 34
2478C4j425L164p34l454K393K307l542O9K184j465K7J717k102m96L603j389l262
$$ 34 -1391 1773 1039 -2415 -22 2285 -1257 -1188 996 -469 -442 1275 -827 -1323 2280 891 -2371
2495b371K708J454k827N40Q30j471J426J231l300P23L769k450k730L310K39j978
$$ -2371 337 1791 -1036 -496 334 -1137 289 1520 -1780 -1057 2712 262 -2468 842 1081 -897
2511h97J201m43j047K784k62l898K136K962k810j672L075q75o33J522k266n59
$$ -897 304 -139 -1186 1598 1336 -2562 -426 2536 -274 -1946 1129 254 -379 1143 -1123 -1682
2527a682M177j727l902L316K414l438J83J408j753J466J582m422N21N017k713
$$ -1682 2495 768 -3134 182 2596 -842 -659 749 -1004 462 2044 -2378 -1857 3160 447
2542D47l346L580J246k861J072O43k635L057J071n359J860M692l267k938L660
$$ 447 -2899 681 1927 -934 138 781 -1854 1203 2274 -3085 -1225 3467 200 -2738 922
2557I22J15k089K031j530j517M195k67n021K348L853l671j098K412n74k07J963
$$ 922 1037 -1052 979 -551 -2068 2127 1860 -3161 -813 3040 -631 -1729 683 109 -98 1865
2573A865l065p74M765j501m647L015K654l046m3J074j557K224J008m227Q27M626
$$ 1865 -1200 -1974 2791 1290 -3357 -342 2312 -734 -777 297 -1260 964 1972 -2255 -1428 3198
2589C198k648l298L390P89k291J487q16j748L747M57n533K487L925l089k087K914
$$ 3198 550 -2748 642 1431 -860 627 -189 -1937 1810 2267 -3266 -779 3146 57 -2030 884
2605H84q27n80K135k714j174N079q32n146K890L035l194q88K170j846J020J967
$$ 884 57 -523 1612 -1102 -2276 2803 1971 -3175 -285 2750 -444 -1332 838 -1008 12 1979
2621A979l409o41M710j475l933K948J887k864M86Q65k059K110J124m041O72M368
$$ 1979 -1430 -2071 2639 1164 -2769 179 2066 -798 -312 553 -1506 604 1728 -2313 -1641 2727
2637B727k241k765K813O10j880J317p48j540K964M46m047J195L238j975j244J717
$$ 2727 486 -2279 534 1144 -736 581 -167 -1707 1257 1703 -2344 -1149 2089 114 -1130 587
2653E87o05J86J316k446j022M084r88l483K025J936k121L27J055j872J456J409
$$ 587 -18 168 1484 -962 -1984 2100 1112 -2371 -346 1590 -531 -204 851 -1021 435 1844
2669A844l325Q0L571k158k052K331Q97k170J278K22j946K337Q50l650O83L153
$$ 1844 -1481 -1401 2170 12 -2040 291 1188 -982 296 518 -1428 909 1759 -1891 -1208 1945
2685A945j731j713J963j75q56J443o05j576K499N42l266O67K313j458j001J531
$$ 1945 214 -1499 464 289 -567 876 271 -1305 1194 1736 -1530 -863 1450 -8 -1009 522
2701E22p17k59J286j275p66K455m73k192J265J059j180j35N85j017R33P55j589
$$ 522 -195 -454 832 -443 -1209 1246 773 -1419 -154 905 -275 -410 175 -842 91 846 -743
2718g43N1J938q10j324J356j4r00O22k09r65J444L05j685O31J712j759k84J386
$$ -743 -692 1246 436 -888 468 454 -446 176 -33 -998 446 751 -934 -303 1409 -350 -634 752
2736G52r54k28J062q41q67J696P3j631Q72J016j085j16J162j124nO79q30n23J672
$$ 752 -202 -430 632 -209 -1076 620 693 -938 -66 950 -135 -251 911 -213 -218 461 -369 -892 780
2755G80m40j503J385O0n81J65M34p83K17P05n04m69Q06l0p77N78K94m12L25J09
$$ 780 340 -1163 222 282 -299 -134 300 -483 -266 439 -65 -534 272 242 -535 43 337 -75 250 359
2775C59p12M18K77o38j33N01l53L1J70K91j71J11J11l46L76k39k35N3J02k39J43
$$ 359 -353 65 342 -296 -429 72 -281 -250 -80 211 40 151 262 -84 292 53 -182 -129 -27 -266 -123
2796a23o5NM71J52p08N27J22l78l58O97j45p91L41N24l45N6N39n59N6M26m13k52
$$ -123 -188 -183 288 440 -268 259 381 3 -355 342 197 -594 -253 271 -74 -18 521 -38 18 444 31 -221
2818b21M46k2r33N54N38p72L51N31q01K67N51l93m79M63M0n21J86J43k83M29J58
$$ -221 225 203 -730 -176 362 -410 -59 472 -329 -62 489 96 -383 80 120 -401 -215 -72 -355 74 232
2839B32p2J12L1k91k47l2M65m26j10M21k99m1L25O0o4N0k22J45J00j67l9l75J78
$$ 232 160 272 303 12 -235 -267 198 -228 -338 83 -216 -257 68 128 64 114 -108 37 137 -30 -69 -444 -266
2862b66M09j98k93N35K90o01K44K2j77j96K77o6l04M50n1k17J10N26o51K2O17
$$ -266 143 -55 -348 187 477 -124 120 142 -35 -231 46 -20 -324 126 75 -142 -32 494 -157 -135 482
2883D82m30k57J13j1n10O75K61j026Q37O23q99L1O75k75m75L35l39m34R37k73
$$ 482 52 -205 -92 -103 -613 62 323 -703 134 757 -142 -111 564 289 -186 149 -190 -624 313 40
2903D0n71O12M84n93J7J75l00K26L00n56j27O15n02l3M26k62j99O36l30q6L05
$$ 40 -531 81 565 -28 -11 164 -136 90 390 -166 -293 322 -180 -213 213 -49 -248 388 58 -28 277
2924B77p6p46M99N11p82j42Q99l75j22Q60r81j97J184o68j142J162K28r48L99
$$ 277 201 -545 -46 465 -317 -459 440 65 -57 803 -178 -375 809 141 -1001 161 389 -559 -160
2943a60N34r43O13P90j534K13J707j070j352J756p1j353R53J95r83J171N30j824
$$ -160 374 -569 44 834 -700 -487 1220 150 -1202 554 483 -870 83 278 -705 466 996 -828
2961h28N34J878j460r20J189k54q92R68l97o04J716j45j787R73J224j341k91Q26
$$ -828 -294 1584 124 -796 393 139 -753 215 -182 -786 930 785 -1002 -29 1195 -146 -437 389
2979C89p36K15R68j582k7J974p33j606J175Q18j218O78k15q11J159L50k098L82
$$ 389 -347 -132 836 -746 -773 1201 468 -1138 37 855 -363 315 100 -711 448 798 -1300 -918
2997i18K575j555j244K043o30r01J313r31j061K444l05k690J221K196k074l12
$$ -918 1657 102 -1142 901 271 -630 683 -248 -1309 1135 830 -1860 -639 1557 -517 -829
3013h29J606r21j00J814k229q39K916p55k719J803J502j815L66P04j275J178J412
$$ -829 777 -144 -244 1570 -659 -1498 1418 663 -2056 -253 1249 -566 -200 504 -771 407 1819
3030A819k948j4L051j279k581J913O04j423J425k52j335J848Q97l064L04K926
$$ 1819 -1129 -1143 1908 629 -1952 -39 565 -858 567 315 -1020 828 1725 -1339 -1035 1891
3046A891j792j521J848o46k51J658j693r47K928R3l413J582J864k171j01J099
$$ 1891 99 -1422 426 -220 -471 1187 -506 -1453 1475 1568 -1845 -263 1601 -570 -671 428
3062D28j467J119J273k495j45L359j004k758J793J028k033R02L26j888K093J300
$$ 428 -1039 80 1353 -1142 -1287 2072 1068 -1690 103 1131 -902 0 326 -1562 531 1831
3078A831l471L92L558j904k030K264r4j306J513r45j853L287L51l718J326K845
$$ 1831 -1640 -1248 2310 406 -1624 640 546 -760 753 -192 -2045 1242 1593 -2125 -799 2046
3094B046k235r75J767p07m26J913k085j242L448k31l088J475J946k091J13R85
$$ 2046 -189 -1164 603 -104 -530 1383 -702 -1944 1504 1273 -1815 -340 1606 -485 -372 613
3110F13j228O45J368k443o03L171q03k532J863R31j247Q32j21j895K196P74l270
$$ 613 -615 30 1398 -1045 -1648 1523 720 -1812 51 982 -265 567 446 -1449 747 1521 -1749
3127a749N62K683j553j156J482k71m29J670j439j413K999j4l063Q96K172j774
$$ -1749 -1187 1496 -57 -1213 269 -2 -431 1239 -200 -1613 1386 1372 -1691 -795 1377 -397
3143c97k46J262j541O01J942k306p42L292j095k307J845P79j825P90M48j839J411
$$ -397 -643 619 -922 -321 1621 -685 -1427 1865 770 -1537 308 1087 -738 52 500 -1339 72
3160G2J643k355m27K887j089k283J998pj401J441j44j611J765R40k596M47K043
$$ 72 1715 -640 -1067 1820 731 -1552 446 439 -962 479 335 -1276 489 1429 -1167 -720 1323
3177A323j007j138J279r11j71J519j280o29J756M56k148P62J362j339j0M43p06
$$ 1323 316 -822 457 -454 -625 894 -386 -1015 741 1197 -951 -189 1173 -166 -176 267 -439
3194d39M51Q55j434m02K048p40j380J386J87r47P91j98j142J282M99j817N18J490
$$ -439 12 867 -567 -969 1079 339 -1041 345 532 -415 376 178 -964 318 817 -1000 -482 1008
3212A008j111n96J317l38n08O73m82j047J510J66j683M78J458r20k28Q90n98J52
$$ 1008 -103 -699 618 280 -228 445 -37 -1084 426 592 -1091 -613 845 -75 -303 587 -11 141
3230A41O00p11q60J313K30j584L49R13n70q9Q36p94L18P63r10n51J081l02p72
$$ 141 741 30 -830 483 713 -871 -522 391 -179 -268 568 -226 92 855 -55 -606 475 173 -599
3249e99O86J09n05L53K77m80N53K09j060K31P60r27j11L84o8j59M26j0n87R99
$$ -599 87 196 -309 44 321 -159 394 603 -457 -226 534 -393 -504 -120 -188 -347 79 69 -518 481
3269D81k95n82K71M61o91J94M72n35N8N27m82l37R26l12n47O55j57o13K92K97
$$ 481 186 -396 -125 336 -355 -161 311 -224 -166 361 -121 -458 468 156 -391 264 107 -506 -214 83
3289H3o80L87M74m50r9O95J58o33N20l8n12k12O31o01o5O55n86J1P68j57k80J50
$$ 83 -597 -210 264 -186 -285 410 568 -65 455 417 -95 -307 324 -277 -342 313 -273 -262 506 349 69 219
3311B19l4k68Q5k56mK39p4j8MK41j09j0J79k53J7J40M7m10M44m43QK89o2P6J28
$$ 219 185 -83 2 -254 -258 -19 -93 -111 -107 134 25 15 194 -59 -42 98 145 -265 179 -264 -256 33 -29 47 175
3336A75j84r4K24j28L5j87M29m83m6L22l46J51M99j75j00k0ql54J36K95m88R0
$$ 175 -9 -103 121 -7 28 -159 270 -213 -259 63 -283 -132 367 192 92 72 64 -290 -154 141 -347 -257
3358b57M38k61k19Q55j94j81j7J39l74J33j10m3O3K15l94J11O25k97l59J92P5
$$ -257 181 -80 -299 556 362 181 164 303 -71 62 -48 -91 -28 187 -207 -96 529 232 -127 65 140
3379A40k26M5L78o40k31M85k35L4O39n29K77%j26k20M74n8n38J71j3q5K90K01
$$ 140 -86 -41 337 -303 -534 -49 -284 -250 389 -140 137 137 11 -209 265 207 -331 -160 -173 -258 32 233
3401B33m38M03K15l43j63L85l40k93N10k21k11O39l19n11J083m37l94L05J92o85
$$ 233 -205 198 413 70 -93 292 -48 -341 169 -52 -263 376 57 -454 629 192 -202 103 295 -390
3421c90J76M72l86j15N33m22k43Q14l43o34O63J42n08L70J23o79J82N60p65O6
$$ -390 -214 258 -128 -243 290 -132 -375 439 96 -538 125 267 -241 129 252 -427 -245 315 -450 -384
3441c84J020m16m89M60k26k95L04j70m48O13L82j009M60P09n73J24L53n65o3P78
$$ -384 636 220 -269 191 -35 -330 -26 -196 -644 -31 351 -658 -198 511 -62 62 415 -150 -213 565
3461E65j139K78P87n69p03P42L24n98L80K89p59M90O38j565K57J374p75r50J363
$$ 565 -574 -296 491 -78 -781 -39 285 -313 67 356 -403 87 725 -840 -583 791 16 -934 429
3480D29k02o15J031n40r39J236M37j708M47J234r94m99J306p13n49J433p56n98
$$ 429 227 -388 643 103 -836 400 837 -871 -424 810 -184 -683 623 -90 -639 794 38 -560
3498e60J603l49j930J004R94j165jO67r65O19R91j218l55J734n93j481J143M38
$$ -560 1043 694 -1236 -232 762 -403 -404 263 -702 -83 908 -310 -665 1069 476 -1005 138 576
3516E76j166O72J41j074J422M26j976O43J602j180p77J049n89k65J322q30j219
$$ 576 -590 82 223 -851 571 997 -979 -336 1266 86 -691 358 -231 -496 826 -4 -1223
3533a223K098ok125J348R57j275k78J086j056L92J140j702m89K333n28j846J159
$$ -1223 875 869 -1256 92 1049 -226 -504 582 -474 -82 1058 -644 -1133 1200 672 -1174 -15
3550a5R13j376N49N42j582R24J063k026j74K677j042j618J635j29r24J268m83
$$ -15 898 -478 71 613 -969 -45 1018 -1008 -1182 1495 453 -1165 470 341 -583 685 202
3567B02j375J766M93k431P20J756j492j91J411r48l02J595j326r88K235j64k264
$$ 202 -1173 593 1086 -1345 -625 1131 -361 -552 859 -89 -391 1204 -122 -1110 1125 961 -1303
3584a303J037J312j414K33P06j151N75J523k098n14K393r56j930J720M6q33Q81
$$ -1303 -266 1046 -368 -135 571 -580 -5 1518 -580 -1094 1299 343 -1587 133 179 -654 227
3601B27r2j222J613O54k363N06J861j215p01J399p55m66J718r49j471K253J3k236
$$ 227 135 -1087 526 1180 -1183 -677 1184 -31 -732 667 -88 -554 1164 215 -1256 997 1010 -1226
3619a226J101J062j385o6R80j032J17J683j738p55K414m64j722J173O73j311L39
$$ -1226 -125 937 -448 -514 466 -566 -449 1234 -504 -1259 1155 691 -1031 142 815 -496 -157
3636a57O69j329M89J557j962k76K192q09j231J146J54r97R86r7j568J433J044
$$ -157 512 -817 -328 1229 -733 -1009 1183 374 -857 289 443 -554 432 335 -1233 200 1244
3653A244k100M01J510j167m72J293p48l59J167r91j066J787N6j573R02Q78r47
$$ 1244 -856 -455 1055 -112 -584 709 -39 -398 769 -222 -1288 499 555 -1018 -116 762 -185
3670a85J3N89r76K14J319j664k54J710o16j047J017N82j088P58K61j224P16O66
$$ -185 -172 417 -559 -345 974 -690 -944 766 150 -897 120 702 -386 372 633 -591 125 791
3688G91j563o2J926j138p07J077k80p58J184O8j404J179N23j560K51J195j036
$$ 791 -772 -834 1092 -46 -753 324 44 -714 470 538 -866 313 836 -724 -473 722 -314
3705c14q8J000p55j95Q48o45o93J203J80j315N57O95j056M40M74p83L08P75r97
$$ -314 -402 598 -157 -352 496 -149 -842 361 541 -774 -217 478 -578 -138 336 -447 -139 636 -361
3724c61pQ92k49r64Q29j23n09L37L68n15K34N96r50J28Q79m33k72L91kn43O30
$$ -361 -368 524 275 -689 140 17 -492 -155 213 -302 -68 528 -422 -294 585 152 -120 271 269 -274 356
3745C56m44l21Q81m7p30M25K77m45K01J75o49Q9N61n36m1N03ko95L36J18j38J01
$$ 356 -88 -409 472 425 -305 120 397 -48 153 328 -321 -232 329 -207 -248 255 253 -442 -106 12 -126 -25
3767b5J50m52J45N13m92r4M93l1n37P38k61l28K17O9m38J38L85l77p7N65m43L6
$$ -25 125 -327 -182 331 -161 -255 238 207 -330 408 147 -181 36 105 -333 -195 190 -187 -264 301 -142 -106
3789a06J13j65J46J65q7m87N71J37m77J95O2m27M98Ol01J92K11l03k99O02j91
$$ -106 7 -158 -12 153 66 -421 150 287 -190 5 67 -360 138 144 -157 35 246 -57 -356 246 55
3810E5l73L83n7k29K75k02J85j9L53l15m2L04j87m11K85j7l20L39J57m80M26J32
$$ 55 -318 65 8 -221 54 -148 37 18 371 56 14 318 131 -280 5 -12 -332 7 164 -316 110 242
3832B42m18J68L70l93m76O62k28j08R0K60j85J58L34n15k23L80k88l5K22J18k75
$$ 242 -176 -8 362 -31 -507 155 -73 -181 -91 169 -16 142 476 -39 -262 118 -170 -205 17 135 -140
3853a40K62k48j47J97J31M1kJ37l52J08K54l35K0K07j58J6K24j52O5L57j79o92
$$ -140 122 -126 -273 -76 55 96 94 231 -121 -13 241 -94 -74 133 -25 -9 215 63 128 485 306 -386
3875c86M44M5m34M23kk81L32P7k35N5L4n6r9J25k04r1L15J86m25J55K48m94L05
$$ -386 58 103 -331 92 90 -191 141 218 -17 38 72 16 -83 42 -162 -253 62 248 -177 -22 226 -268 37
3898C7M36n68J66K33m20j49O14n17j71L62K29l64K68J75j71j30J27k75o9N55n03
$$ 37 473 -95 71 304 -116 -265 349 -168 -339 23 252 -112 156 331 160 30 157 -118 -187 368 -135
3919a35q2O68l54k33L95k75p5L12k95k80N11k8n12O0N31l00K80R3k92j26M68k86
$$ -135 -217 451 97 -136 259 -16 -91 221 -74 -354 157 129 -383 -323 208 -92 188 281 -11 -137 331 45
3941D5m21P68k95m85O41j80m58L42J71l24K90L76r31J30N69k39m09P70m06k59
$$ 45 -376 392 97 -388 253 73 -385 -43 128 -196 94 470 -461 -331 238 -1 -410 360 -46 -305
3961c05L69p4o66P71L19p45K66O13o48k36Q21o16m24J019m64m24R48j05r28L65
$$ -305 64 -10 -676 95 414 -331 -65 548 -100 -336 485 -131 -555 464 0 -424 524 419 -509 -144
3981a44N35p58J37N24o48K15O05p93OR12k64r11P24K16o30K79K16r53R36N74j229
$$ -144 391 -367 -230 294 -354 -139 466 -327 -321 591 327 -584 140 356 -274 5 221 -732 204 778 -451
4002d51J79Q98p63j92P17m11l54Q20m37n53R76Q1j271Q06O53j127J65P72q84m3
$$ -451 -272 626 -137 -329 388 -23 -377 443 6 -547 429 510 -761 45 698 -429 -264 508 -376 -419
4022d19J215j028q07J653k97j314J144M81j168O72L24j235Q39O79j170j93J484
$$ -419 796 -232 -1039 614 317 -997 147 628 -540 132 456 -779 60 739 -431 -624 860
4039H60q01p49R44j67o00Q44O7j280J072N70j669N60P75p38N5Q57q22l50J250
$$ 860 59 -690 254 87 -513 331 398 -882 190 760 -909 -349 426 -312 -257 600 -222 -572 678
4058F78n54p69J139mj135P31N06r88K02O17q83M25O40j015l61J552m81j250J276
$$ 678 124 -645 494 490 -645 86 592 -396 -194 423 -460 -35 605 -410 -771 781 300 -950 326
4077C26j63p91R73j32j183J163N41j437l1J530q35l72Q35l73m21Q35l18j012J482
$$ 326 163 -628 345 213 -970 193 734 -703 -734 796 -39 -411 424 51 -370 465 147 -865 617
4096F17K65j448M03J164j445j02J056p91o5J279r47r36J559l70j073P82P46q07
$$ 617 882 -566 -163 1001 -444 -546 510 -281 -346 933 -14 -950 609 239 -834 -52 694 -113
4114a13L78J77p89L67M50j161m4J388m05r60R41r5o11Q79q6r56Q20J62j289N52
$$ -113 265 442 -347 20 470 -691 -735 653 248 -712 229 134 -477 402 316 -640 180 342 -947 -395
4134c95R98q21j16R00q41j92J046n78p91J411Oj521Q89P84j448O96O58j146L12
$$ -395 603 -218 -334 566 -275 -467 579 1 -790 621 627 -894 -5 779 -669 27 685 -461 -149
4153a49O79o49o02J448m20j103J031K73j402J095M04j072L79P96j274K3J373q94
$$ -149 530 -119 -721 727 307 -796 235 508 -894 201 605 -467 -88 708 -566 -543 830 -64
4171f4n45J119o14m17P44Q5j063J139J21j335O68O58p67J12L76m36q2O35l21m62
$$ -64 -609 510 -104 -521 223 308 -755 384 505 -830 -162 496 -271 -159 217 -219 -301 334 13 -449
4191d49Q95j95p51O00L85o94K26K52q62N81N74r42K23N96j25p56R05j47p67M92
$$ -449 446 251 -500 100 485 -209 17 269 -593 -12 562 -380 -157 439 314 -442 463 316 -451 41
4211D1Q7m44L85L14o81r2Q17l70j64M41j10p84Q78k43o75R78N9o95K18O72r44
$$ 41 128 -316 69 383 -298 -390 427 57 -107 334 224 -560 318 75 -600 378 437 -258 -40 632 -312
4232c12K34L56n17K37P17p01m29O06m8n13M18K24n36J93J19m36L01L18j50l12
$$ -312 -78 278 -239 -2 715 14 -415 191 143 -370 48 272 -264 -71 48 -388 -87 231 81 -231
4252b31N38k97j54K30Kl29M10M0o90N72k23L9N8L63l40m07O32m53Q9L54k40j53
$$ -231 307 10 -144 86 88 -241 169 209 -481 91 -132 -93 -35 328 -12 -419 213 -240 -151 203 -37 -190
4274a90K56K05n64L84j6l02J04L15m84L74J03k15n4J66j50j69O32k46k64J55R6
$$ -190 66 271 -293 91 75 -227 -123 192 -292 82 185 -30 -84 82 -68 -237 395 149 -115 40 136
4295A36l05K88N1k52n3K98J11m37N10j28m61N20k74OJ68l8k63P1K49j01m0K3j59
$$ 136 -169 119 170 -82 -135 163 274 -163 347 219 -242 278 4 10 178 140 -123 -52 197 96 56 79 -80
4318h0J1J00r3J68jj39%K1Q1j55n9K42Ql36M18k5k78r3K44r3K00q4n9P0R8m49
$$ -80 -69 31 -62 106 105 -34 -34 -13 68 -87 -146 96 104 -232 186 161 -117 -210 34 -59 141 57 -2 68 166 -283
4344b83L69l6j17j02L79k70K56p7j54J70j60K18m55K81N3j51J98r2j13j45K09
$$ -283 86 50 -67 -169 210 -60 196 119 -35 135 -25 193 -262 19 72 -79 119 27 -86 -231 -22
4365b2J37j82K76k98M1K28j81R0r3J43k58R2J30j3l17L46k21J03o8Q9k59J94J8
$$ -22 115 -67 209 -89 -48 180 -1 89 -4 139 -119 -27 103 90 -227 119 -102 1 -67 22 -237 -43 -25
4388b5l14M12Qq1j18J66j50j75J68k1j00P06o00l1K98j45j82J57k2k44N7K27r8
$$ -25 -339 73 81 0 -118 48 -102 -277 -109 -130 -230 476 -124 -155 143 -2 -184 -27 -49 -293 -236 -9 -107
4411a07J43J93k46Q0K70m23j83O40k74l15K63J35k31J38K35m64J06K30l98L95
$$ -107 36 229 -17 63 333 -90 -273 367 93 -222 41 176 -55 83 318 -146 -40 190 -208 187
4431A87j93k84L32J13J14n21L67J11m31K61K8j67J85J52l60J78K39m64m5M68k67
$$ 187 -6 -290 42 155 269 -252 115 226 -205 56 84 -83 102 254 -106 72 311 -153 -198 270 3
4452Cj5K19k78M3K72n0n39J84M23n43J98L42n94L10J63k12j15M73k81l51O10k40
$$ 3 -12 207 -71 -28 244 194 -345 -161 262 -281 -83 259 -335 -25 138 -74 -189 284 3 -348 262 22
4474B2k64N14l30j77N57ro85L05O37r33k19J103p43P0L15j37m29N29j21k68K44
$$ 22 -242 272 -58 -235 322 313 -372 -67 570 -363 -582 521 -222 -152 163 26 -403 126 5 -263 -19
4495a9P18r72PM76n05J48L69j34o80J151n60o65P15J58o21M46M46j065M70M26
$$ -19 699 -273 -266 210 -295 -147 222 88 -592 559 -1 -666 49 207 -414 32 478 -587 -117 309
4515C09l65k1N32l21l92O51l19m42O13p1q62Q11L10q27L78M24r07L22M71l05l13
$$ 309 -56 -77 455 134 -258 393 74 -368 245 174 -688 123 433 -394 -16 408 -499 -177 294 -11 -324
4536c24P71n44m79P14M7q53O87L36p51J30P05o95K36P37j084M9R22n22n00Q00
$$ -324 447 -97 -576 138 185 -668 19 355 -396 -266 439 -256 -20 717 -367 -318 604 82 -418 382
4556C82k77n10O23J58q72M90L96q30K08Q37j002K1P17m53l15P93j25q47R59R1
$$ 382 105 -405 218 376 -496 -6 390 -440 -232 605 -397 -376 341 -112 -427 366 241 -606 353 444
4576D44r63L53N73p73M50K39n35J97N12o25l17P48j29m91O61j76q22J040Q0q51
$$ 444 -519 -166 407 -366 84 323 -212 -15 497 -128 -445 303 174 -317 344 168 -654 386 466 -385
4596c85L47M04j060M28R75p67l66Q72k18n57N04q2m00M98P2r34N92M94o12j15
$$ -385 -38 366 -694 -266 709 -58 -424 448 230 -327 177 95 -305 193 265 -669 -77 417 -195 -310
4616c10P05l77k40P63n05n73J012j97n90M59K13q68L48N39r23N20N20n15k90O91
$$ -310 395 18 -222 541 36 -537 475 278 -312 147 360 -508 -160 379 -544 -24 496 -19 -309 382
4636C82n68k11O88j37n54M97P1o30N52M96r48J15R41r58l8P24n50l06O87j83n68
$$ 382 -186 -397 291 154 -400 97 168 -462 90 586 -362 -247 694 -264 -302 422 -128 -434 253 70 -498
4657d98O97J21r34L96M77m75K20L60l08l8M80n36l93Q09j26m48N30J2p65L56K78
$$ -498 199 320 -614 -218 259 -216 4 364 56 18 498 -38 -431 378 252 -196 334 346 -419 -63 215
4678B15n05k4O20p39L74M49n95J44L73k32m19M86N0o53Q92j69k96K57J15n46n5
$$ 215 -290 -314 306 -433 -59 390 -205 -61 312 80 -339 147 197 -456 436 267 -29 228 343 -203 -258
4699b58M57l13k32N74k09l93O04J48p68M40J93m16J53L43n49K60N55p27l21N40
$$ -258 199 -114 -346 228 19 -374 230 378 -390 50 243 -173 -20 323 -226 34 589 -138 -459 81
4719H1j57m38O99P9m23L60k95k25J75K61j48n5O63p15m8P8K28k67K37j07p2M5
$$ 81 -76 -514 185 264 -159 201 -94 -319 -144 117 -31 -86 577 -138 -186 -108 120 -147 90 -17 -89 -44
4741d4J97k18J84L36n00r0J24r1o9L80m0m38N56k27l09L49P3m23K76K80m36J77
$$ -44 153 -65 119 455 -45 -135 -11 -102 -171 209 169 -269 287 60 -249 100 173 -250 26 306 -130 47
4763D7K71m19j39M19k73j11J43J65k56R3P9j05K23p5l0l15N27l13kK42J4k86K31
$$ 47 318 -101 -240 179 -94 -205 -62 103 -153 -60 19 -86 137 62 32 -283 244 -69 -71 171 185 -101 130
4786A30J53n33N94m36M0o2J83j58J66m8p8Q3J73n2j34K61k19m1j33K12l31J46
$$ 130 283 -250 344 -92 -52 -114 69 -89 77 29 -49 34 207 155 21 282 63 22 -111 101 -230 -84
4808h4N4J73L3J3j81j2L22k77O5K6J08m57K15R5j40nR7q4K4K08k76P2m1P5j21
$$ -84 -30 143 176 189 8 -4 318 41 106 132 240 -217 -2 93 -47 -52 45 -39 -15 193 -83 -11 -52 23 -98
4833i8K92k29O9m0J15k03L03l2m18K00J13pj80K65m34L58J85k60q2K13Q8l03J65
$$ -98 194 -35 34 -6 109 -94 209 177 -241 -41 72 65 -115 150 -284 74 259 -1 -83 130 218 -85 80
4856H0K38l25k10L26j43PO9j98l0J66l6L77k55k44K06k45N01l60lK41l98J28K77
$$ 80 318 -7 -217 109 -34 -27 42 -156 -186 -20 -56 321 66 -178 28 -217 284 -76 -79 162 -236 -108 169
4879A69j28l7K03p4n5Q4j99j01J24K31m24J26L36m67J91K54k57k30K91Q9j17M00
$$ 169 41 4 207 133 78 162 -37 -138 -14 217 -207 -81 255 -212 -21 233 -24 -254 37 126 9 409
4901D09l36l27J46L29m95L00K17m46J33L51k86Q4q3J24j07p4J92r3K8J04l98L2
$$ 409 73 -254 -108 221 -274 26 243 -203 -70 281 -5 79 -4 120 13 -61 131 38 66 170 -228 -196
4923a96M74m18J53M7Jl30L95j06J8K88m64r4N44k70m47M71j08j40K89J63n71L61
$$ -196 278 -140 13 60 61 -269 126 20 38 326 -138 -232 312 42 -405 66 -42 -182 107 270 -301 60
4945F0J64l95N3L11j82k32L89k35j6K79J4m83R4N31m66J42L62o06K66L52j68n24
$$ 60 224 -171 -118 193 11 -221 168 -67 -83 196 210 -273 -179 352 -114 28 390 -216 50 402 234 -290
4967b90N00j71p0J06O7l57J08J33j71K27j06j20R2K78k09l09M95j77l12M85k7
$$ -290 210 39 -31 75 142 -215 -107 26 -145 82 -24 -144 -52 226 17 -292 203 26 -286 199 172
4988A72k75j1L52m69J89K22m71M0K75k11k22M68M4k26M14l04k25K63K30l80M2
$$ 172 -103 -114 238 -231 -42 180 -291 -251 24 -187 -409 59 103 -123 291 -13 -238 25 255 -125 -83
5009h3M20q27L06N13l29k51P65n42m56P88j60n62O50L8p65O87K03m99p5O00q34
$$ -83 337 -490 -184 329 0 -251 514 -28 -484 304 144 -418 232 270 -495 192 395 -104 -179 421 -413
5030d13M15L79k52l02L26k1l61L19J2l46J49L74o33M66K53n13mJ61q8m97P39l13
$$ -413 2 381 129 -173 153 132 -229 90 102 -244 -95 279 -354 112 365 -148 -152 9 -79 -576 163 -150
5052a50j41M50R7p53M96M94r04L34L01n94J17P03m77m8L56l53j46M54k06k16J87
$$ -150 -291 159 256 -497 -1 493 -411 -77 224 -370 -253 450 -27 -75 281 -72 -218 236 30 -186 1
5073AJ78n41N8N72p49N59J03k79m25Q16l68Q0n6Q0o08R43k02m00L42K68o93L94
$$ 1 179 -362 -304 268 -481 78 181 -98 -523 293 -75 5 -51 29 -579 364 162 -238 104 372 -321 73
5095G3K79n96Q1N11o13j67Q78m74m02P44k69k18O7K85n05K56M60r13M89Q3l96
$$ 73 352 -244 -163 348 -265 -432 446 -28 -430 314 45 -173 -106 179 -326 -70 390 -523 -34 49 -347
5116c47j82N84K58n56M28o5m69N95j40l41K49N27p65o9N74n83L07L90m21k29L82
$$ -347 -529 55 313 -243 185 120 -349 246 106 -235 14 541 -224 -293 281 -302 5 395 -26 -255 127
5137A27n6n15N79L26p58K36M70p51L53K07k60l32Q97m43m18K94j16k35J97L08
$$ 127 71 -444 135 461 -297 -61 409 -342 11 218 -42 -374 523 80 -338 -44 -160 -395 -198 110
5157A10l65K84J18m96K70N13o24QO87m78n29P53m0l90L62j46j10J24L56m96J64
$$ 110 -255 29 147 -349 -79 434 -190 -182 505 27 -502 251 211 -179 183 37 -73 51 407 -89 75
5178G5m6j85O1R7k24q1M20m8j35J9K28l36J44K66o9m74O2K72K4mP9l66K56P0k22
$$ 75 29 -156 -95 2 -222 -303 117 69 -66 -47 181 -155 -11 255 186 -288 -226 46 70 66 145 -221 35 105 -117
5203a17K10j10k51L51K35n03J8P73o33k28M99o16K46L57k57%L14j34l08K74J69
$$ -117 93 -17 -268 83 318 -185 -167 606 -27 -255 244 -372 -126 231 -26 -26 288 154 -154 120 289
5224B89m72K43K02m42n8L25j00k32L89k81l27N67M5l07J15K49n66J78K77j4K44
$$ 289 -183 60 262 -180 -238 87 -13 -245 144 -137 -464 103 148 -159 -44 205 -361 -183 94 80 324
5245C24k49j16k99P22l61j16L16j23k34O1O0j23K62J3k02j87K87l00L7K02r1n1
$$ 324 75 -41 -340 382 21 -95 221 98 -136 -75 -15 -138 124 137 -65 -252 35 -265 -228 -26 -117 -168
5267a68L22j92J50j35Q6j56N7K34m85P2K53k13K67q5k64K83K41k56l8MQ7j88J36
$$ -168 154 -38 112 -23 63 -93 -36 198 -287 -215 38 -175 92 7 -257 26 267 11 -27 -23 64 -124 12
5290A2o1k87N59k27j24%j16M89j43K9j95p5j65M14k35K1L51n90K88K92l88O2K63
$$ 12 -49 -336 223 -4 -128 -128 -244 245 102 131 -64 -139 -304 110 -125 -104 247 -343 -55 237 -151 -89 174
5313A74m8j40Q3J18k33J87J7j82J9K8j77N03k48J96l16o1r3Q4J83k61L31j30J79
$$ 174 126 -14 69 187 -46 141 158 -24 -5 23 -154 349 101 297 -19 -80 -173 -89 94 -167 164 34 213
5336B13l93J07j48L09j16J63p8J97o7j06j78L88R2l97P6J33l22n1L29k85L12k52
$$ 213 -180 -73 -221 88 -28 135 57 254 187 81 -97 291 383 -14 62 195 -127 -178 151 -134 178 -74
5358g4L1K52j45j57J10L53k87j77M60m68R5k72L84k74P5J31k92J32K95k29j09
$$ -74 -43 209 64 -93 17 370 83 -94 366 -102 -7 -279 105 -169 -94 37 -255 -123 172 -57 -166
5379a66L38M6j78p1j68L11l74M29j99n0K37pk67M6j28K45k34RQ5l1J21j44J47
$$ -166 172 218 40 -31 -199 112 -262 167 -32 -82 155 148 -119 -73 -201 44 -190 -181 -96 -127 -6 -150 -3
5402cOPK5P9l71L49J20j86o7J39l12J31q0R1J37k76K17n3n9K20k3q9J88qk83K43
$$ -3 3 10 35 114 -257 92 212 26 -41 98 -214 -83 -163 -72 65 -211 6 -47 -106 114 91 2 190 182 -101 142
5428A42j51N2k9j79K59j0j91j1J80l3K19j66P5k12Q0J35l05j6J69k2l23L90j9
$$ 142 -9 43 14 -165 94 84 -107 -118 62 29 248 82 157 -55 25 160 -145 -161 8 -14 -337 53 34
5451C4j68L49r2k52J27L35n60K02J44n3Q5Nj89p3L78k00j42P7q6j80L57K39n55
$$ 34 -134 215 123 -129 -2 333 -227 -25 119 66 151 156 -33 -106 272 72 -70 7 -79 -259 98 337 -218
5474b18K23K93o01J42N00m46j0K03j74o7K31K3k88N34k95l9mJ61l55K56n2o4k4
$$ -218 5 298 -303 -161 339 -107 -117 86 -88 -155 76 99 -189 345 50 11 7 168 -187 69 17 -47 -71
5497g1L28j50j85N2k40j5J63K78l73P0J94j32j47M06m09K45K51l26k32M76j71
$$ -71 257 107 -78 -26 -266 -281 -118 160 -213 -143 51 -81 -228 178 -231 14 265 -61 -293 183 12
5518A2l1p3L50k73O7N1k81K2K64p0j49L06r5l60M09j25l44N43ml44J41R2k36K73
$$ 12 -19 -92 258 -15 52 103 -178 -156 108 38 -111 195 100 -260 149 24 -320 223 219 -125 16 108 -128 145
5542A45J11l78O2J63j32n2K41j67j65K48k3p8J88qm26J95M38p33R8M72l28j99
$$ 145 256 -122 -60 103 -29 -81 160 -7 -172 76 53 -25 163 155 -271 -76 362 -371 -273 199 -129 -328
5564c28N37k59l3K50Pm51L12K41n36M15K76n58j01L32k76o5L97om50L10J4l08
$$ -328 209 -50 -83 167 174 -277 35 276 -260 155 431 -127 -228 104 -172 -237 160 154 -296 14 28 -280
5586b80K20J3m11K55M63l79j5M03l34o3L89l86j73M97j96j57L45k56j38M28p9
$$ -280 -60 -47 -458 -203 260 -119 -134 269 -65 -128 261 -125 -298 199 3 -154 191 -65 -203 225 146
5607A46k43j71J05R9o3M27m03j65N68l16j07K90Jm50K99K6j51j0J87k07P8K16
$$ 146 -97 -268 -163 -64 -127 300 -103 -268 300 -16 -123 167 168 -282 17 43 -108 -118 69 -138 -60 156
5629A56k77j7K24K9l41N60q2k54J75R4m77L71J84m65R0L25l13j80N05m28J8M65
$$ 156 -121 -138 86 115 -226 334 252 -2 173 267 -210 161 345 -120 -30 295 -18 -198 307 -121 -103 362
5651C62k59n39O29K63o49N3L11l17j13N24l75j01M81m60r3N49j91j01K44k33k91
$$ 362 103 -436 193 456 -193 -140 171 -146 -259 265 -110 -211 270 -190 -283 266 75 -26 218 -15 -306
5672c06K73RP4l41N68k45Q4p5K1k78M66l10j85M07j98k63L14Lj53J93J7j49k9
$$ -306 -33 -24 50 -291 277 32 116 41 62 -216 250 -60 -245 162 -36 -299 15 18 -135 58 75 -74 -103
5695a03K66k05j53L91k27l70N31l44J14L61k04j41J7K07j88j74L29J38n78O60
$$ -103 163 -42 -195 196 -31 -401 130 -214 -100 261 57 -84 -67 140 -48 -222 107 245 -333 327
5715C27l05j51K81k07N0O2O5j25N9j67Q0k7J14J00k36L06j38n4Q8L2k33K43p5
$$ 327 22 -129 152 -55 -5 57 122 -3 56 -111 -31 -58 56 156 -80 226 88 34 122 154 -79 164 89
5738H9k51L5J13j52P5J12p7m2q2K86l13O04m50j63K49J90n27M15kl32L24kk48
$$ 89 -162 -127 -14 -166 -91 21 -56 -98 -180 106 -207 397 -53 -216 33 223 -304 111 109 -223 101 99 -149
5761a49j8L51l58J28L65j21l72l8N02n56K95p6k25M13j0l11K06J00k98P5M81l49
$$ -149 -167 184 -174 -46 319 198 -174 -212 290 -266 29 -47 -272 141 131 -180 26 126 -172 -97 384 35
5783C5k95L69J3o0p0J85Nr6K6n2k04J58Q8l70M63j77m4q9L09k05k1n9J50j12j35
$$ 35 -260 109 122 62 -8 177 182 86 112 60 -144 14 102 -268 195 18 -26 -115 194 -11 -32 -91 59 -53 -188
5808a88J19j04N84n44Q9K30k25o7K50p0k24J32M67p65L51J47k24L07k46k83K53
$$ -188 -69 -173 411 -133 -44 186 -39 -106 144 74 -150 -18 449 -316 35 182 -42 265 19 -264 -11
5829a1M1Rj58K28k9k42L2K06k9k26M24j99j72J11j16KJ87n0p7M3JK36j57Q4k82
$$ -11 30 39 -119 109 80 -162 -130 76 47 -179 245 46 -126 -15 -131 -129 58 8 -69 -26 -25 211 54 138 -144
5854a44J79m3O9k03J71n1P4j89O4oM3K17l02J50K05j87j64l2L17m8Q5j28m9L9
$$ -144 35 -8 61 -142 29 -22 52 -137 -73 -79 -36 181 -121 29 234 47 -117 -149 168 120 205 77 28 67
5878F7L7j78J07L8j08J8q7n4K53J63k15q3J13p6L0n1m3J99k31J80r1Q0R3l59N4
$$ 67 104 -74 33 71 -37 -19 -106 -160 93 256 41 -42 71 -5 25 -26 -69 130 -101 79 -12 68 161 -198 -144
5903a44M42l83J29R9J0l06K27j04J19o%k21J92M6k51J86J09j30r9J75j03l06M05
$$ -144 298 -85 44 143 153 -153 74 -30 89 83 83 -138 54 100 -151 35 144 14 -85 90 -13 -319 86
5926H6j2o1K5J08k8J4j34j02M22k69k00K53j8j96K4J85j39K74l33Q4P5j25J53
$$ 86 74 13 38 146 118 132 -2 -104 318 49 -151 102 84 -112 -88 97 -42 232 -101 -17 58 -67 86
5949H6j74K21j6n1J55j76l96K16J94R5l56J88J46N2k22K87l02J17O2l03K27k6
$$ 86 -88 133 117 66 221 45 -351 -135 59 154 -202 -14 132 184 -38 249 -53 64 126 -177 50 24
5971B4m6l1J9j03J47j32J42j94L22%m01K85j37J32Q7j22j0L2J43j51k41l4J37
$$ 24 -22 -53 -34 -137 10 -122 20 -174 148 148 -253 32 -105 27 114 -8 -18 14 157 6 -235 -269 -132
5994a32J40j47L02l97K55L5r9L20j06j38R0j18j28J30L12m63J19K36k1m91N42
$$ -132 8 -139 163 -234 21 56 -43 277 171 33 123 5 -123 7 319 -144 -25 211 190 -301 241
6015B41m4j89K13k36k94J41K42j10j5J53l18L39N0j56P2J03j2m95K64K11l08J51
$$ 241 197 8 221 -15 -309 -168 74 -36 -51 102 -216 123 173 17 89 192 180 -315 -51 160 -148 3
6037CJ49k45L7K03j77k7N6RR3K1P6m80K37J99l34M75j33j87n0N8J0k23J68R2j63
$$ 3 152 -93 -56 147 -30 -57 -1 8 101 122 198 -282 -45 154 -180 295 162 -25 -75 -17 -7 -230 -62 30 -133
6062a33L04j78k88L12J46m4m5M9l32L7J95l48K28L26j28j57R5j44J17K24p9l14
$$ -133 171 -7 -295 17 163 119 74 123 -209 -172 23 -325 -97 229 101 -56 39 -105 12 236 157 -157
6084a57J46J87l75K70J22m13J27K69k75m6M49m20Q8K19k21q9J31L01m08P0J48
$$ -157 -11 176 -199 71 193 -220 -93 176 -99 -145 304 -116 -28 191 -30 -119 12 313 -95 -25 123
6105A23k24K1K27j99k15J71n0o8N39k86k00J66K9j39K46Rn01M76J30l96J30P8
$$ 123 -101 -80 147 -52 -267 -96 -146 -214 325 39 -161 5 34 -105 141 150 -351 125 255 -141 -11 67
6127F7k0j32K18m7n06L66O8k28L35k29r3M12O0m09P1J34L6j5R4j08k05J96O6j98
$$ 67 47 -85 133 86 -420 -54 14 -214 121 -108 -201 211 271 -138 -67 67 103 88 182 74 -131 65 131 -67
6151f7K82l18k14O23k56k86k6L89p1j11K93m93J72K72k09k20L95N0m61K16J11
$$ -67 215 -103 -317 306 50 -236 -262 127 56 -55 238 -255 -83 189 -20 -240 155 205 -256 -40 71
6172G1k46M25k68n8K72j19k12q0N29o89L16O1J24j38R0K56k32j30J47j84j13M28
$$ 71 -175 250 -18 -76 196 77 -135 -215 314 -375 -59 2 126 -12 78 334 102 -28 119 -65 -178 250
6194B50l96m3K86j47j76K81j06Op4L03j63j06J82q8M4p8o4j24M08j82oP0J15k68
$$ 250 -146 -189 97 -50 -226 55 -51 -45 -119 184 21 -85 97 9 53 -25 -89 -213 195 13 7 77 192 -76
6218g6m5J82j68J9Q1L3r3M35l77n4J48r3l09L70Mr1Nr1NK34P5j26j80J58J79l85
$$ -76 -121 61 -107 -88 -7 26 -67 368 -9 -63 85 -8 -317 53 57 -34 -29 -120 -115 119 194 68 -112 46 225 -160
6244a60J9J58m1L8L97n71J92J93m09J48M36k81j79J46m7k8N2j09J66k4j4k36K00
$$ -160 -141 17 -24 14 411 -160 32 225 -184 -36 400 119 -60 86 39 11 63 -46 120 96 82 -154 46
6267D6M0p3R7k67P4J34j29O3o4J27nj15n6J76J48j33K4o8m0J78m42J74J34l3j00
$$ 46 86 13 110 -157 -83 51 -78 -15 -79 48 43 -72 -128 48 196 63 87 19 -21 157 -285 -111 23 -10 -110
6292a10R7k3j05J56K24q6k03j28Q9L9j48P7K33q4J88k56N9K56m14J68J27k27n6
$$ -110 -13 -36 -141 15 239 153 -50 -178 -89 -50 -198 -121 112 28 216 -40 19 275 -139 29 156 -71 -127
6315a27k2pK32J21j94J05k95L45q7r5P2k13R4j44J9K58q5j30M5L54k77K0O2j05
$$ -127 -149 -156 76 197 3 108 -187 158 71 -24 48 -165 -71 -215 -196 62 -23 -153 -108 246 -31 -11 51 -54
6339e4m3J86R9l30j7N46n22K1R8K17k53PL7j00K45k38J99k93L8K69j58J42j7l6
$$ -54 -97 89 188 -142 -159 387 -135 -114 -16 201 -52 -45 -8 -108 137 -101 98 -195 -157 112 -46 96 79 43
6363D3Q3l27J82J9j81J48L68m54J23k02M60j47j08J29Rj45J1j05O8mPq3m0O0K98
$$ 43 126 -201 -19 0 -181 -33 335 -119 4 -198 262 115 7 136 145 0 11 -94 -26 -30 -23 -106 -146 -86 212
6388B12j92J04l81K23J9j30J71j49J84p2m9K46l06L69p9r4k45J70Jj62R8M7N0
$$ 212 20 124 -257 -34 -15 -145 26 -123 61 -11 -60 186 -120 249 170 76 -169 1 2 -160 -62 -15 35
6411C5j66J1M1K20j89j18J66J24j41r8L07l82K51M3j13q5Q7N8k68J27K05L9P8
$$ 35 -131 -120 -79 141 -48 -166 0 124 -17 -115 192 -190 61 104 -9 -94 -7 51 -217 -90 115 154 232
6434B32l19l4J47l4j10K76j99p6K04j23mj61J74j47J85K4J75m81K47J35J81n96
$$ 232 -87 -121 26 -8 -118 158 -41 -117 87 -36 -40 -201 -27 -174 11 35 210 -271 -24 111 292 -304
6456c04N90m08J60l2j39j8K06p1J20k81o2L16j12M5J38j05k0J00RQ7l80L86j77
$$ -304 286 -122 38 6 -133 -151 55 -16 104 -177 -239 77 -35 10 148 43 23 123 132 219 -161 225 48
6479D8j56K3K57k36K66k55N5M8l02J68Q7j38p2L57K0J0k84O6J72j60K8M1o8k9
$$ 48 -108 -85 172 -64 202 -53 2 50 -252 -84 3 -135 -207 150 170 180 -104 -38 134 -26 2 43 -25 -54
6503e4J64j45J04R1j87o4J57q6RK4j09K19n46N24k51J62P4j91K81j2j03j01L45
$$ -54 110 -35 69 160 -27 -91 66 -20 -11 13 -96 123 -423 101 -150 12 86 -105 176 164 61 -40 305
6526C05k02m35N06Om38K94l2k20M65j05O3l17P7K5o5J19j97J91q9j3n8J53J27
$$ 305 103 -332 174 180 -258 36 4 -216 249 144 207 -110 -33 -8 -73 46 -151 40 -49 -62 -120 33 160
6549A60k30K64j72l23K4L29J04l85L32j80pJ44q4k37O21k20m05K49K5k77K49j1
$$ 160 -70 194 22 -301 -277 52 156 -229 103 -77 -84 60 -24 -261 360 140 -265 -16 9 -268 -19 -30
6571c0j09O4J17j64n1L32l79l7K96j02K09j81m0J12O4j22j47K44N08n60k13N9
$$ -30 -139 -75 42 -122 -173 159 -220 -257 39 -63 146 -35 -75 37 101 -21 -168 76 584 24 -189 -130
6593a30Q3O1J53k71M0P9J12m65M27O9k87J5J28k46J01J74j02NJ95r2j32k7K29
$$ -130 -47 14 167 -104 -64 15 127 -338 89 158 -129 -114 14 -232 -131 43 -59 -54 141 49 -83 -110 119
6616A19k6j49k5k7J42j39K4J31r0k9J45o7o7j57L98k16k16J79K60l41M7J16j84
$$ 119 93 -56 -81 -108 34 -105 -81 50 -40 -69 76 9 -58 -215 183 -33 -249 -70 190 -151 -104 12 -172
6639a72q2L54l18L58M9l60K54j37Q6m7M3N1j17Pk4j2J0N16o36L01Rj45k86L48
$$ -172 -254 100 -218 140 189 -171 83 -54 32 -15 28 79 -38 -31 -55 -67 -57 459 -177 124 133 -12 -298 50
6663E0L6k85J63J43k89Rr5L54j07O6j44j5Q0j65l9J60J20k39L87k77q7O5O1J48
$$ 50 86 -199 -36 107 -182 -173 -268 86 -21 45 -99 -114 -34 -199 -238 -78 42 -197 190 -87 -174 -109 -48 100
6687A00k6J40m23N37j71m18J92m2K04J17j69r0K44k55o5J34m1k0o0K58k34J30
$$ 100 74 214 -209 328 157 -261 -69 -111 93 210 41 -49 195 -60 -125 9 -32 -52 -112 146 -88 42
6709D2L8N4J30n25J97L1l4M14k83j45j32K28k24R5J82l64K35J13j41k29M81k61
$$ 42 80 134 264 -261 -64 -33 -67 347 64 -81 -213 15 -209 -114 68 -296 -61 52 -89 -318 163 -98
6731i8j80L90k01j7J25J19p0R9p5r1O6j52J39K17m56L44l27J16K03m16L93k49
$$ -98 -278 112 -89 -106 19 138 68 167 92 1 67 -85 54 271 -185 159 -168 -52 151 -265 128 -121
6753a21R8j39K22j39N8q3K16L6k82K90m2k58J59p4n4J06j81j07L85Oq5Q7j96r4
$$ -121 -23 -162 60 -79 -21 -104 112 148 -134 156 114 -144 15 -59 -113 -7 -188 -295 90 96 11 98 -98 -192
6777a92L01q4j06r3K24m0R9r9K9K39j71k33J32oq4O4J02j00n7J94k10J43j95n6
$$ -192 109 25 -81 -174 50 10 109 10 39 278 107 -126 6 0 -84 -20 82 -18 -75 119 -91 52 -143 -199
6801a99j5L42j09p6K72o9k99K03K13m25J24K08l54J53o5K19n4j47O2l18L21Q9
$$ -199 -214 128 19 -57 215 146 -153 50 263 -162 -38 170 -184 -31 -96 123 69 -78 -16 -334 -13 76
6823G6j60j39N00l05J02j18J57J3j27K15l61L21j28k08j0K58p5j28K61J7j74J92
$$ 76 -84 -223 277 -28 74 -44 113 126 -1 214 -147 174 46 -162 -172 86 11 -117 144 161 -13 179
6845A79k20k86M44j0k11J28j3o0J7l9K97l20K2o9J30j14j11K78r5J26k22q8L95
$$ 179 -41 -327 117 107 -104 24 11 -49 -32 -71 226 -94 -72 -141 -11 -125 -236 42 -53 73 -149 -237 158
6868A58o6k14K0K58l18K29J70j25J9k6j25j47L07j99K90k86K45j53o2j82J18L4
$$ 158 92 -122 -102 156 -162 67 237 112 131 105 -20 -167 140 -59 231 -55 190 37 -25 -207 -89 -55
6890e5K4J27l9J36m2p8R1j47k4J90m54J80M0kJ67k2k32K23L5K1k35N6k2O1J07
$$ -55 -31 96 57 193 151 73 164 17 -7 183 -271 -91 -51 -53 114 92 -140 83 118 139 -96 -40 -62 -1 106
6915A06k07l6K75k45k7J65L4r2j04K11k89K30j07P6J10k61J88j59J11m1%p0J93
$$ 106 -101 -137 138 -107 -134 31 65 -27 -131 80 -209 21 -86 -10 100 -161 27 -132 -21 -62 -62 -132 61
6938F1R6PM3k77l4J96l14L0K80R8k10n2k5P6J8nQ6n3J18k47JQ7J40k07J32N9k26
$$ 61 157 164 207 -70 -104 92 -222 -192 88 186 -24 -76 -101 -25 -7 -12 74 21 139 -108 -107 -20 120 -87 45 104 -122
6965a22J02m3K73l25Q0NL2j09M5N4K00m69J44J97J03k43P0j95pK43J09j21r1l7
$$ -122 -20 -63 210 -115 -35 -30 2 -107 -62 -8 192 -277 -133 64 167 -76 -6 -201 -208 35 144 23 -68 -105
6989a05K79j27j98M4J38J74L2l36n9J87j88K33q8j2o1L39ol21K42l52J9K14j57
$$ -105 174 47 -151 -107 31 205 237 -99 -158 29 -159 74 -14 -26 -87 252 246 -75 167 -185 -166 48 -109
7012a09K80k73J95j73J80j34m3M4K43j03j31l9rJ45k20L1l6K11l41J71J07J88
$$ -109 171 -102 93 -80 100 -34 -77 -33 210 107 -24 -63 -72 73 -147 -116 -152 59 -282 -111 -4 184
7034A84k54mJ96k03r2J82j87L01M5j59o2L17j10j60n3nL5K90l24k6n6K41k82J06
$$ 184 -70 -74 122 -81 -173 9 -178 123 168 9 -53 264 154 -6 -59 -64 -29 261 -63 -89 -145 96 -186 -80
7058h0K98j49n7P1k18J32K01k67j07K43p7Q2Q9j46jP9r7k43J63n1M9P8K5J36k57
$$ -80 218 69 12 83 -135 -3 198 -69 -176 67 -10 72 161 15 14 93 -4 -247 -84 -135 -86 -8 17 153 -104
7083a04L30j67j18j3K00j85N3J2l8l40K59O6J51j69n8J44q2K58k86N7J21k18K0
$$ -104 226 59 -59 -72 128 -57 -4 8 -30 -370 -111 -45 106 -63 -121 23 -59 199 -87 -30 91 -127 -107
7106a07L17j62k04J01r4K61j04l4J30j31J08q9J28l33J35K55j31R7j24K84k96
$$ -107 210 48 -156 -55 -149 112 8 -26 104 -27 81 -8 120 -213 -78 177 46 143 19 303 7
7127Gj62J5J58O5Q6l61L42j40L20l46K81j23l6k09j6N4j60K04l19L83r1j79K09
$$ 7 -155 -140 18 83 169 -192 150 10 330 -16 265 142 106 -103 -119 -65 -225 -21 -340 43 -48 -227 -18
7150a8J76j52k6l3L05m71J38J23n0j07L95k45J2j52P0k62M04L8j77k6j15J07J2
$$ -18 158 6 -20 -53 252 -219 -81 42 -8 -115 280 35 47 -105 -35 -297 107 145 -32 -58 -173 -66 -54
7173e4K60l24n6K05K3j66M6j54J22j06J49Q6j88L98m21J87P8k83K24L07m52O8
$$ -54 206 -118 -174 31 54 -112 -66 -220 -98 -204 -55 31 -157 241 -180 7 85 -198 26 333 -119 -51
7195e1J46q9k3j80L95k59j50L26j64K03l3j23O9N3L4l75M36l36L49k27N6K1k22
$$ -51 95 6 -17 -197 198 -61 -211 115 -49 154 121 -2 67 120 154 -221 215 -121 228 1 57 78 -144
7218a44L17m0j9j27q4L4K0m4P3O8J48k54J75oj03J75l5k05n4K62k95Q4R7j96J22
$$ -144 173 133 114 -13 -97 -63 -43 -87 -14 54 202 -52 123 117 14 189 154 -51 -105 157 -138 -54 43 -153 -31
7243c1J62j01o8J62jq8p0R8j41R3j28J49l0J13j3K00j10j4r6L1k53m8J47n8P9
$$ -31 131 30 -38 124 123 35 -35 63 -78 15 -113 36 6 119 106 306 196 182 86 117 -136 -184 -37 -95 -16
7268a6k9k7K25k12j40K68j61k5J33m5L3Q9r7j51J79N3j6J18J9j86r2pJ76K9k27
$$ -16 -45 -72 153 -59 -199 69 -92 -117 16 -29 4 93 -4 -155 24 77 61 179 198 12 -80 -87 89 118 -109
7293a09j66J07R5k26L34q2j61K90j26r8J4R3K18j90k1O2j47K5j00K54j54J36j45
$$ -109 -275 -168 -73 -299 35 -47 -208 82 -44 -142 -128 -35 183 -7 -28 34 -113 -88 -188 66 -88 48 -97
7316i7Rj09K14j84M07j99M6o1n1K2n6j51K30k9K08l11L40l28m8J98J9j17J55j18
$$ -97 -88 -197 17 -167 240 41 87 26 -25 -3 -59 -210 20 -9 199 -112 228 -100 -148 50 69 -48 107 -11
7340a1L7j72P0Q6j24J80O7q4p3k6lK54l62K48M2j78j28N8J9K03m6l71J81J48j34
$$ -11 26 -146 -76 10 -114 66 133 49 -24 -50 -53 201 -161 87 129 -49 -177 -119 -100 103 57 -314 -133 15 -119
7365a19M2p9J89k86K58j01L3R8j15O5j51J74J3j65L40R8m98M4JJ86K3Rr0p6j47
$$ -119 -77 -156 33 -253 5 -96 -63 35 -80 -15 -166 8 21 -144 196 294 -204 -160 -159 27 50 59 -31 -107 -254
7390b54J91N6J74k46R2j10J71q5O1j91J19J36k46Q0K2j63K44j85J79J78l98K49
$$ -254 -63 -7 167 -79 13 -97 74 -11 50 -141 -22 114 -132 -52 -30 -193 51 -134 45 223 -175 74
7412G4q5LN8R7k44K35k11J99l30K97j51l6l6J81k83J21k3OJ72M4r4j97K08K9K38
$$ 74 -11 -8 50 147 -97 138 -73 126 -204 93 -58 -94 -130 51 -232 -111 -134 -128 44 88 -6 -203 5 34 272
7437B72l22J15k3k56J77j47K91n17L00j7J63j99J01K63J13m80P1K63k62J48J5
$$ 272 -50 65 42 -214 -37 -184 107 -410 -110 -127 36 -163 -62 201 314 -166 -95 168 -94 54 69
7458F9p7K94l6o21J01K25J65k72P3P0N3k48K74k18k11N48m52K61J16k50k7K03
$$ 69 -8 286 250 -371 -270 -45 120 -152 -79 -9 44 -204 70 -148 -359 189 -263 -2 114 -136 -163 40
7480D0P4k17q1J00J36J5k61J44o7J22J83q2M5J1l38L49n5j51J75j13k53J37OJ1
$$ 40 114 -103 -184 -84 52 67 -194 -50 -117 5 188 106 151 162 -176 173 118 -33 142 29 -224 -87 -81 -70
7504g0l4l4L38j87oM5j91K01j05j60N14l08m3O3k1j46P3J47j89p6K71q4r8nK6
$$ -70 -104 -138 200 13 7 52 -139 62 -43 -203 311 3 -40 23 2 -144 -71 76 -113 -189 82 -2 -100 -105 -79
7529g9k4K68q3k62K46k8j39J11k7K12ko2j11j29J52p3p6Q6L56j74K1pr9q6op7
$$ -79 -103 165 82 -180 66 38 -101 10 -17 195 193 131 20 -109 43 -30 -106 -20 336 162 183 176 77 -9 -15 -92
7555i2M6J32O3j76K4j90K54k50K05J15l18O8j17L34r5k58K71j64J2Q6L02j71j9
$$ -92 -46 86 149 -27 -3 -193 61 -189 16 131 -187 -119 -236 98 3 -255 16 -148 -136 -50 252 81 62
7578F2J9j24j59J23K88l05J32lp4j9J23j10K61j61m2P1Q2j07K4q1l1p8J76k22
$$ 62 81 -43 -202 -79 209 -96 36 33 -41 -60 63 -47 214 53 11 82 164 57 81 0 -31 -109 67 -155
7602a55j1K92j10P1j33J29r4L7k26L20J1j24k0QJ98l0p7L8O1k67J02K47n62K23
$$ -155 -166 126 16 87 -46 83 -11 26 -200 120 131 7 -13 -5 193 163 86 124 185 -82 20 267 -295 -72
7626g2O8R2j47J83O7q2k32J61n0O7Nk55J76J02j68L3J52q0J40l80J48l9J05l4
$$ -72 -4 88 -59 124 191 109 -123 38 -12 55 60 -195 -19 83 -85 -52 100 20 160 -220 -72 -111 -6 -40
7650d0%n4jn8K08j36K12k88M1n1K25k9OL7r9K33k29j5K57j66J10j82j44n1P5L9
$$ -40 -40 -94 -95 -153 55 -81 131 -157 -116 -167 58 29 35 72 -27 206 -23 -38 219 53 163 -19 -163 -214 -139 -100
7676a00J9K79J0k85K45j9n8j33J23j13j28L39l34J73pp0pn8M01m33J77r1K22r
$$ -100 -81 198 208 -77 168 149 91 -42 81 -32 -160 179 -155 18 11 -59 -66 -124 277 -156 21 -70 152 143
7700A43q9jk77J91K0N2j33O2J90j87J8p2O9j06J94K7j33N0M8M4j16J08j77k10
$$ 143 54 53 -224 -33 -13 39 -94 -32 158 -29 -11 -83 -14 -120 74 101 -32 18 66 110 -6 102 -75 -285
7724b85J12K09k0m9r6K31k35K08k82J96J58k62n5K38J65j95q2o5K08r8P5p5N9
$$ -285 -173 36 16 -33 -129 102 -133 75 -207 -11 147 -115 -170 68 233 38 -44 -109 99 1 76 1 60
7747F0q2Kj44J5P5nR2q6L7J00Q4k88J29K52j53j11j21K8K17k61J36Q6k91J34J21
$$ 60 -22 -20 -164 -149 -74 -79 13 -73 -36 64 148 -140 -11 241 88 -23 -144 -116 101 -160 -24 62 -229 -95 26
7772B6k33P8P0J27q3j40J80N7R8k21J85l04J65J08j91J04j36K4J35J19k60K17
$$ 26 -207 -129 -59 68 -15 -155 25 82 180 -41 144 -160 5 113 -78 26 -110 -86 49 168 -92 125
7794A25k25J05N6j11J27J9j26J57j28j32L6q9J15p8o7K78j66l0J36K42k07K48
$$ 125 -100 5 61 -50 77 96 -30 127 -1 -133 -97 -186 -71 -149 -216 62 -104 -134 2 244 37 285
7816B85k29j31M0R7j42O3j4R7QLj87K57l5k50K77l7o9j4J66j97PK31k08K20k02
$$ 285 56 -75 -35 62 -80 -17 -31 66 74 77 -110 147 112 -138 139 102 33 19 185 -12 -5 226 18 238 36
7841C6p0j07L46j41q3j40J61J28j07N2k73J35M0L8J5P0J8j60K51m39K5K28J44
$$ 36 -34 -141 205 64 -19 -159 2 130 23 75 -198 -63 -23 15 30 100 118 -42 209 -230 -205 23 167
7864A67l46K58r6k0J43j03J6Q9M1j63n6M1k13K48K78m55J52N6l7j53L62k65j9
$$ 167 -179 79 -17 -37 106 3 19 108 149 -14 -70 -29 -242 6 284 -171 -19 37 0 -153 209 -56 -75
7887g5K96k82J21J85n5j1k2k28K40k98J58J76n15L58j50L13k86K04k34n3J54j75
$$ -75 221 -61 60 245 190 179 157 -71 169 -129 29 205 -310 48 -102 211 -75 129 -105 -158 -4 -179
7909a79p8O8J5rK09ok4J90m30L9J75J18l36Q1N8K21J58n62K83J0Q3O1k71K68k45
$$ -179 -257 -189 -174 -183 26 20 -4 186 -244 -205 -30 88 -248 -167 -109 112 270 -292 -9 1 84 145 -126 142 -103
7934a03J28oq0J09o4J0j16j85L27j25O3K81m50L64k73K20k44K14j80k4j00N11
$$ -103 25 19 -61 48 -16 -6 -122 -307 20 -105 -42 239 -211 153 -120 100 -144 70 -110 -134 -234 277
7956B77j50j49J21J52q6j20k32K62r1Q1j3j86J07k04K9L27k61R1R0Q2j49m7J10
$$ 277 127 -22 99 251 165 45 -187 75 -16 65 52 -134 -27 -231 -202 125 -136 -45 45 127 -22 -69 41
7979D1m01L88q9Q0j46k4M7j11K64o6j71K6K22q9l9J7J23P4l6m7Op6n2J69k24q1
$$ 41 -360 28 -61 19 -127 -151 -104 -215 49 -17 -188 -162 60 -29 -68 -51 72 146 110 63 69 -7 -59 110 -114 -195
8005a95L47k23N4J98k38J20rL9k3j26K10j83k02J45R8j4J59n3j43q6J71R6j69
$$ -195 152 -71 -17 181 -57 63 54 93 70 -56 154 -29 -231 -86 12 -2 157 104 -39 -125 46 142 -27
8028b7J85l39J91j28J74o0J49l58J68J60j50j89K04j4K31k35j2J57l71L18p2K01
$$ -27 158 -181 10 -118 56 -4 145 -213 -45 115 -35 -224 -20 -34 197 -38 -50 107 -264 54 -18 183
8050A83k01P7J77m49J89P2j57K28j84o8R3K1J10j38J69l7k81J13J10k1Nk24K64
$$ 183 -18 59 236 -213 -24 48 -109 119 -65 -133 -40 -19 91 -47 122 85 -196 -83 27 6 11 -213 51
8073E1j7Q8j45q6J9L40k53j25O3J57j43j44J82J09k37J2K01j79J12K1o8p1L33
$$ 51 34 122 -23 -109 -90 250 -3 -128 -65 92 -51 -195 -13 96 -141 -129 72 -107 5 26 -42 -113 220
8096B20p5k58L67l29j30J35K25n9K2k43K31k7l13K19r5K63l87J86K27l58PQ1j0
$$ 220 145 -113 254 -75 -205 -70 155 96 118 -125 106 79 -234 -15 -110 153 -234 -48 179 -179 -172 -91 -101
8119a01j06L12K19l02J38l5k67J64p0j19J62J54P5k14N7j05j5l9J28j11J9K56
$$ -101 -207 105 324 22 160 125 -142 22 -48 -167 -5 149 224 10 67 -38 -53 -92 36 -75 -56 200
8141B00N1j73j27lN8P1j1k57l2K58j16M4J30k1J2j23N9p5K26k46J93q0m8J51l36
$$ 200 251 78 -49 -52 6 77 66 -191 -223 35 -81 -37 93 72 84 -39 20 -55 171 -75 118 38 -10 141 -195
8166a95K94K6k91m7O6P4K2P6p6R9j3j66L62l17L74n30L82m8k49J37p2L24k48k64
$$ -195 99 125 -166 -213 -147 -73 -51 25 -51 48 35 -131 231 -86 288 -242 140 92 -157 -20 -92 232 -16 -280
8190b80M49
$$ -280 169
8191A69
$$ Imaginary data points
##PAGE= N=2
##DATA TABLE= (X++(I..I)), XYDATA
0@%%%%%%%%%%%qJ6j6J6j6K4l2L2l8M6n6P0p8Q8j04J20j40J63j87K11k37K71l08
$$ 0 0 0 0 0 0 0 0 0 0 0 0 -8 8 -8 8 -8 16 -16 16 -22 24 -32 38 -40 48 -56 64 -76 87 -100 111 -126 145 -163
34a63L45l87M34m86N45o09O74p44Q23r11J006j109J223j346J482j634J801j985
$$ -163 182 -205 229 -257 288 -321 353 -391 432 -479 527 -582 641 -705 777 -857 944 -1041
52a041K188k414K674k967L299l686M140m682N343o166P221q626J0594j3540J8378
$$ -1041 1147 -1267 1407 -1560 1739 -1947 2193 -2489 2854 -3312 3909 -4717 5877 -7663 10715
67A0715k7584N0690k03313k89730P21421m8542m77193K89665R1630k56719L41115
$$ 10715 -16869 33821 -169492 -459222 262199 213657 -263536 26129 117759 -138960 202155
78B02155j1184n30749L45882M38397n92756j77554N43329r6031k74504K07225
$$ 202155 190971 -339778 6104 444501 -148255 -325809 217520 121489 -153015 54210
88E4210q3998p5139L52674j77646m07423L96867K42384m60184l0831K97828j07543
$$ 54210 -29788 -104927 247747 70101 -337322 59545 301929 -158255 -189086 108742 1199
99A199j3728O9852k29454J23213L29101l25751k34510M13126M5692l13091R7244
$$ 1199 -12529 57323 -172131 -48918 280183 -45568 -280078 133048 178740 -134351 -37107
110c7107O5144r3552J93977o4378l26760K83839K77123m17565r0235L76406r8853
$$ -37107 28037 -65515 128462 64084 -262676 21163 298286 -119279 -209514 166892 68039
121F8039j64068J63446j16675n7596L14537j66403l40795L67139J95159m19731
$$ 68039 -96029 67417 -49258 -106854 207683 41280 -299515 67624 262783 -156948
131a56948K3135K88223j68350k7172J56424k24848P143L42747k26430k84268L67124
$$ -156948 -133813 154410 -13940 -41112 115312 -109536 -102393 240354 13924 -270344 96780
142I6780J01350l41959Q9869J65749j70187P3305R6071k59927P1547K92524k44704
$$ 96780 198130 -143829 -53960 111789 -58398 14907 110978 -148949 -77402 215122 -29582
153b9582j92183L08114K6929k23099J04443M9452j13609J34845J5497k31072J23373
$$ -29582 -221765 86349 113278 -109821 -5378 44074 -69535 65310 80807 -150265 -26892
164b6892K00487k19653q8706K08779k6065r2735P9604m9337l0781J53210p2899
$$ -26892 173595 -46058 -134764 74015 47950 -44785 34819 -14518 -45299 107911 35012
175C5012j65507J55343Q6760j71638P598R2929o0941K9226L7631j23559N1260
$$ 35012 -130495 24848 111608 -60030 -52432 40497 -20444 8782 46413 -77146 -25886
186b5886J45827j40980q7680J66799j2012j15874P8861K479p3277J10779L076
$$ -25886 119941 -21039 -108719 58080 46068 -69806 9055 11534 -61743 49036 52112
197E2112j55262J00423J23926j63599l2858J50862o2347o9953R9880m4424o6587
$$ 52112 -103150 -2727 121199 -42400 -75258 75604 13257 -56696 43184 -1240 -67827
208f7827J29520j5795j41609J03712R0240j40639n520J08830o5470l3155P8180
$$ -67827 61693 45898 -95711 8001 98241 -42398 -47918 60912 -4558 -37713 40467
219D0467n4254l9879J03506k4128r5476P9498M9591q8552Q054N3933m3703j464
$$ 40467 -13787 -53666 49840 25712 -69764 9734 59325 -29227 -21173 32760 -10943 -12407
231a2407L6652m6865l711O1435l1913m0031N0794Q845l6218J6742M125j9637K2915
$$ -12407 24245 -22620 -26331 35104 3191 -36840 13954 22799 -13419 3323 7448 -12189 10726
244A0726j968l6907K5128K4795l5388J720K8561j7885j365K0241k4097m900L3399
$$ 10726 8758 -28149 -3021 21774 -13614 -11894 16667 -1218 -2583 17658 -6439 -11339 22060
257B2060k1466k6641L4675L373l1256K0032J4101k5387J3092J8051l0011J202
$$ 22060 594 -26047 8628 12001 -19255 777 14878 -10509 2583 20634 -9377 -8175
269h175K8684k4447j7442K9795n043k3059K1443P620k1807J4285J4293k2589J664
$$ -8175 20509 -3938 -21380 8415 3372 -19687 1756 9376 -12431 1854 16147 -6442 -4778
282d778K0207j7404j1803J9782l947j5192J3745O599j4057P214J1247j1691k995
$$ -4778 15429 -1975 -13778 6004 2057 -13135 610 7209 -6848 366 11613 -78 -3073
295c073J2324n862j1214Q086K989j0170K157R251n129l248R500m8q751L849N182
$$ -3073 9251 3389 -7825 261 3250 -6920 -4763 4488 -641 -3889 5611 5563 -3188 661 5843
310E843r417l091Q004k945p098Q318M650q321L243R244p056n200Q928j881j0662
$$ 5843 -3574 -6665 1339 -1606 -8704 -386 4264 -4057 -814 8430 1374 -3826 5102 3221 -7441
325g441N741N607r045J20J1900l891o667J0320K289j1686L100P858j1724n189
$$ -7441 -1700 3907 -5138 -5018 6882 2991 -3676 6644 8933 -2753 347 8205 -3519 -8708
339h708J2198m231j0211J1582N682j2362N052J1758j1786m741J2743o307j1634
$$ -8708 3490 -741 -10952 630 6312 -6050 -998 10760 -1026 -5767 6976 669 -10965
352a0965J0402J966j1480O824Q639r307K126J1460p089m607P322j807n984K240
$$ -10965 -563 1403 -10077 -3253 5386 -3921 -1795 9665 2576 -2031 5291 3484 -2500 -260
366b60r16j007M324l095o81P295k253l230O260n593n020J1074o745j5386J7200
$$ -260 -1176 -2183 2141 -954 -1635 5660 3407 177 6437 844 -4176 6898 153 -15233 1967
381A967O919k3636Q358K0649j9350k425K2060j8220r682L0343j4742k9564L5813
$$ 1967 8886 -14750 -6392 14257 -5093 -7518 14542 -3678 -13360 16983 2241 -27323 8490
394H490J0259m2123J6714L0155l2246J405L0662l1421p109M3705k7847l5591N0363
$$ 8490 18749 -23374 -6660 23495 -8751 -7346 23316 -8105 -15214 28491 644 -34947 15416
407A5416N594m9994K5731K5577l6969J4973K3789m4263J0088M8032m6660k7033
$$ 15416 21010 -28984 -3253 22324 -14645 328 24117 -20146 -10058 37974 -8686 -35719
419c5719N8803r135m3138L4398N870l0621L6005K307n3251L7870L9178o5020o448
$$ -35719 23084 13949 -29189 5209 11079 -19542 16463 18770 -34481 3389 42567 -22453 -28901
432b8901N7097k7875k1734L6280k4175j0666N6769l1285n2508O8640J9458p5553
$$ -28901 28196 321 -21413 14867 -9308 -19974 36795 5510 -46998 21642 41100 -34453
444c4453J9768M1654m2495J1809K6233n7658K1844P1914p0830m1386R4865q461
$$ -34453 -14685 26969 -15526 -3717 22516 -35142 -13298 58616 -12214 -53600 41265 32804
456C2804p2707M6847J1131m8290N2980L918q8687O1442P5796j07732k0440J06613
$$ 32804 -39903 6944 18075 -30215 22765 26683 -62004 -562 75234 -32498 -52938 53675
468E3675l8716n3663O3360k7266l8688Q9267k9105j03241R8098O3417j25376O075
$$ 53675 14959 -38704 24656 -2610 -41298 47969 18864 -84377 13721 77138 -48238 -42163
480d2163R6084n7188j9350N8342o3917p811J06998o7505r2253J20805L4734j17187
$$ -42163 53921 -3267 -22617 35725 -28192 -36003 70995 3490 -88763 32042 66776 -50411
492e0411L0974N8666n6550K6759K7037r3420L9765J03192j06385o0190J26336
$$ -50411 -19437 39229 -17321 9438 36475 -56945 -17180 86012 -20373 -80563 45773
503D5773m864q4003M9911K827l9958P6868j9922j11921R1945Q2896j35141j6853
$$ 45773 40909 -43094 6817 9644 -30314 46554 26632 -85289 6656 89552 -45589 -62442
515f2442J13603m4406l4158N9136n8007j0719J18902p0759j14508J36067M9963
$$ -62442 51161 6755 -27403 31733 -26274 -36993 81909 11150 -103358 32709 82672
526H2672j44299K6868Q1693o9471K0495M8960j06800K9115J36539j13513r4967
$$ 82672 -61627 -34759 46934 -22537 -2042 46918 -59882 -30767 105772 -7741 -102708
537a02708J54072J2272j24044N4789L2969o6723P0350J4470j31381P2936J24209
$$ -102708 51364 63636 -60408 -5619 27350 -39373 30977 45447 -85934 -12998 111211
548A11211j39319n7703J42511k2669p8606O2280k3823l9020J07739l3527j30548
$$ 111211 -28108 -85811 56700 34031 -44575 17705 -6118 -45138 62601 29074 -101474
559a01474J11849Q8773j43246j2547J06016m8491j8636N2479p6555J380J27439
$$ -101474 10375 99148 -44098 -56645 49371 880 -17756 34723 -41832 -40452 86987
570H6987p9985j08617J35147M2251j25227L0055N3116n9609M2850K5734j15162
$$ 86987 7002 -101615 33532 75783 -49444 -19389 33727 -25882 16968 42702 -72460
581g2460M8089J23769j17146o9480J35668n073q6058N6472o291m9521R1490j3477
$$ -72460 -24371 99398 -17748 -87228 48440 43367 -42691 13781 7490 -42031 49459 35982
593C5982j28969Q9501R8326j32775k5244J13211m0258l5204O1004n7414k2445
$$ 35982 -92987 -3486 94840 -37935 -63179 50032 9774 -25430 35574 -21840 -44285
604d4285J17538n2241j17978J13419O1193j24297J2573P3972n6221J4054M6606
$$ -44285 73253 21012 -96966 16453 77646 -46651 -34078 39894 -16327 -2273 44333
615D4333r0481J1741J18155q1296q7648J15480K0659r4231L8108K6043n2633N5047
$$ 44333 -46148 -34407 83748 2452 -85196 30284 50943 -43288 -5180 20863 -31770 23277
627B3277J7683j03022M5331R6645r5084m6545R7350j5500n0283M7892k1912l2313
$$ 23277 40960 -62062 -16731 79914 -15170 -61715 35635 20135 -30148 17744 -4168 -36481
639c6481Q1584j8094r5117P2199O0608r3961m000O5084l9740l430M2647n9393
$$ -36481 45103 27009 -68108 4091 64699 -29262 -33262 31822 -7918 -11348 31299 -28094
651b8094l608R0127m9301p2642Q4727K3207p7912K6067K9425m7403L2307K7100
$$ -28094 -31702 58425 9124 -63518 21209 44416 -33496 -7429 21996 -25407 6900 34000
663C4000p6448K1723Q0540o4667m5306P8930m793n2008L8585j725l9767N1613
$$ 34000 -42448 -20725 59815 -4852 -50158 28772 23979 -28029 10556 8831 -30936 20677
675B0677O298p3657L8005N8991o4543j7692N8855k1505k2569L7245k5638k1931
$$ 20677 26975 -46682 -8677 50314 -14229 -31921 26934 5429 -17140 20105 -5533 -27464
687b7464N6088j4045n7468M5979L0712n2866P049L2063k8955N799K5618l9976
$$ -27464 28624 14579 -42889 3090 33802 -19064 -12015 20048 -8907 -3108 22510 -17466
699a7466n96M9390k9812l4115M5138M043l4947K1776P245k6846K5295R832m2431
$$ -17466 -18062 31328 1516 -32599 12539 16582 -18365 3411 10656 -16190 9105 18937 -23494
712b3494J6190L5684l6728j2608L7068j3107j6820K6026j0813j8340L2540k864
$$ -23494 -7304 28380 -8348 -20956 16112 3005 -13815 12211 1398 -16942 15598 12734
724A2734l6394K4049K0669l3922K056K4825j9278k558K2364j8937q977L0188j0583
$$ 12734 -23660 389 21058 -12864 -10808 14017 -5261 -7819 14545 -4392 -13369 16819 6236
737F236k4778K3630P567k5216R463J2506j8119O071J4904j8640j366K1545j2155
$$ 6236 -18542 5088 12655 -12561 -3098 9408 -8711 -2640 12264 -6376 -7742 13803 1648
750A648j3182J7640m02j4427R571L408j1879Q040O187j2848L990J1004r450l755
$$ 1648 -11534 6106 5704 -8723 848 4256 -7623 417 6604 -6244 -2254 8750 -700 -4455
764d455R259l993m563N861k949l563P002j430n523N732J948n334K711K032m740
$$ -4455 4804 811 -3752 2109 -840 -4403 2599 1169 -4354 1378 3326 -2008 703 2735 -2005
779b005K512J841o084J911N380n419r24O689l062l684O016q63n718M720J695o834
$$ -2005 507 2348 -3736 -1825 3555 -1864 -2788 3901 839 -2845 3171 2308 -3410 1310 3005 -3829
795c829K580M793n793o89O731l239l795N826K12n942L056L013n681pN116l308
$$ -3829 -1249 3544 -2249 -2938 3793 554 -3241 2585 2797 -3145 -89 2924 -2757 -2764 2352 -956
811i56k605N245N68m408K621K845m163p64M021k412l211M108O24l734J546L402
$$ -956 -3561 1684 2252 -2156 465 3310 -853 -1617 2404 -8 -3219 889 1513 -2221 -675 2727
827B727k832q97L574j221l094K320J263l715p6L177j502j852L131M61l090K009
$$ 2727 -105 -1002 2572 1351 -1743 577 1840 -1875 -1951 1226 -276 -2128 1003 1464 -1626 383
843C83K283l360j554M046j362l858L255K162m298Q16M860l563j997N917j658n842
$$ 383 2666 -694 -2248 1798 436 -3422 -167 1995 -2303 -1487 3373 -190 -2187 3730 2072 -3770
859c770M983J972p370K347N615o401m14P260m231l999Q518j771q288P105L170
$$ -3770 1213 3185 -4185 -1838 3777 -2624 -3038 4222 -9 -4008 4510 2739 -5549 1556 4726
874D726r707K966O715p447n24Q169o100k557R335l831p398Q679J275r166M583
$$ 4726 -4981 -2015 4700 -2747 -3271 4898 -1202 -3759 5576 1745 -5653 3026 4301 -4865 -282
889b82L908p370L531M368q533K685Q319q489k870R217l941m724O862l426m458
$$ -282 3626 -3744 -213 4155 -4378 -1693 6626 -1863 -4733 4484 543 -4181 2681 -745 -5203
904e203J0203k786j0624J1572M432j4043N014Q551j1465K561R214j4048J214J7718
$$ -5203 5000 2214 -8410 3162 7594 -6449 -1435 7116 -4349 -1788 7426 -6622 -5408 12310
918A2310j3689j1209K1834k124j8232J4745L881j7861J2655Q354k4881R144K3186
$$ 12310 -1379 -12588 9246 7122 -11110 3635 7516 -10345 2310 10664 -14217 -5073 18113
931A8113k5162q230K9296r903j7771K1681k868j9191K2985K313l1075J8475K2412
$$ 18113 -7049 -15279 14017 4114 -13657 8024 5156 -14035 8950 11263 -19812 -1337 21075
944B1075l2053k509K9410j6024j0364K2877j3574j2666K9498q392l0200K7380
$$ 21075 -10978 -13487 15923 -101 -10465 12412 -1162 -13828 15670 7278 -22922 4458
956D458J3922l2472P156K0116k0153L944J7016k5381J261L2198k3117k1480L4824
$$ 4458 18380 -14092 -6936 13180 -6973 -3029 13987 -11394 -10133 22065 -1052 -22532 12292
969A2292q83k6964J9009L706k0946K2664M915l6559J9965L0163l8517p784L7336
$$ 12292 11409 -15555 3454 7160 -13786 8878 13793 -22766 -2801 27362 -11155 -18939 18397
982A8397j7021j5332K7333j5867j6376M0341j0913m2217L7964K1824m7629Q179
$$ 18397 1376 -13956 13377 -2490 -18866 21475 10562 -31655 6309 28133 -19496 -11317
994a1317L1277k9418J805K8192l4602m398M9946k7565l8495M9172Q711m5790K1412
$$ -11317 19960 -9458 -7653 20539 -14063 -18461 31485 3920 -34575 14597 23308 -22482 -1070
1007a070J7386l3540K0196J9274m7107J2365M8697m1509k5464N0735p420l2756
$$ -1070 16316 -17224 2972 22246 -24861 -12496 36201 -5308 -30772 19963 12543 -20213
1019b0213K9355k899k7823L6796K897n1286K9521L8727m9026p633M2829k1459
$$ -20213 9142 6243 -21580 15216 18113 -33173 -3652 35075 -13951 -21584 21245 -214
1031b14j2555L0512k5001j4244M9254j7604m6597M4357K0788m8473J1965K5637
$$ -214 -12769 17743 -7258 -21502 27752 10148 -36449 7908 28696 -19777 -7812 17825
1043A7825l0644J2529K2958m4420N428N2826l7836l3484N2462n75l8791K8007
$$ 17825 -12819 -290 22668 -21752 -16324 36502 -1334 -34818 17644 17069 -21722 6285
1055F285L232l1488L4816R543n5272K4904M6349m9799j5890M9671j8315k1637
$$ 6285 9517 -21971 12845 22388 -32884 -7980 38369 -11430 -27320 22351 4036 -17601
1067a7601L5303j8968k4170N0186p176n5458L9733L2521n2538K377L7111k9528
$$ -17601 17702 -1266 -25436 24750 17574 -37884 1849 34370 -18168 -15791 21320 -8208
1079h208r84L2261l6159r708N4840k3735m5103M7055J4268m4871J7576J7717l1957
$$ -8208 -9192 23069 -13090 -22798 32042 8307 -36796 10259 24527 -20344 -2768 14949 -17008
1092a7008J9948K0517m7056R144M8884l7020k6109M5343n776k8246K7436n514
$$ -17008 2940 23457 -23599 -14455 34429 -2591 -28700 16643 10867 -17379 10057 4543
1104D543k6305L7180K967m8718K6629L4906m3214n398L5948k1570p563K9198k6056
$$ 4543 -21762 15418 18385 -30333 -3704 31202 -12012 -17410 18538 -3032 -10595 18603 -7453
1117g453j4021M6158j4368m1881L7569J7461m0524J1968K0783k9085J1566K3818
$$ -7453 -21474 24684 10316 -31565 6004 23465 -17059 -5091 15692 -13393 -1827 21991
1129B1991l8463m10M5519k6500k9812M0301J092l1001K2618M321k8112K5234J2914
$$ 21991 -16472 -16882 28637 2137 -27675 12626 13718 -17283 5335 9656 -18456 6778 19692
1142A9692m1391J2140L6505l2305j4248L4832j1977j6454K5494j0842k0326L2445
$$ 19692 -21699 -9559 26946 -5359 -19607 15225 3248 -13206 12288 1446 -18880 13565
1154A3565Ol6930K2120K2294l1566J357K2963j9475n72K1757k2216q267L2845
$$ 13565 13571 -23359 -1239 21055 -10511 -9154 13809 -5666 -6238 15519 -6697 -14964 17881
1167A7881j1964k5970K5809P089k4688J2223Q691k0776J2824J3756k7251L330
$$ 17881 5917 -20053 5756 12845 -11843 380 9071 -11705 1119 14875 -12376 -9046
1179i046K6876j9242j3232K4423n703j4740J7687l604j6652K0045M402k6322J2257
$$ -9046 17830 -1412 -14644 9779 4076 -10664 7023 3419 -13233 6812 11214 -15108 -2851
1192b851J8144k1797j654J8911j3388m678J8060j2111j0773K2560l782k0570J5835
$$ -2851 15293 -6504 -8158 10753 -2635 -7313 10747 -1364 -12137 10423 6641 -13929 1906
1205A906R285j9440N709J1308j4953L009J4204j5762m042J9282q452j3211J5468
$$ 1906 11191 -8249 -2540 8768 -6185 -3176 11028 -4734 -8776 10506 2054 -11157 4311
1218D311J468j3399R024L591j2019P416P625j3955J562J2790r418n220J1042l836
$$ 4311 5779 -7620 1404 4995 -7024 392 8017 -5938 -4376 8414 -1004 -6224 4818 982
1232I82o044Q893k567o756Q813R07j0209N828N625q850J501N979o628L73O705
$$ 982 -5062 3831 1264 -5492 3321 4228 -5981 -153 5472 -3378 -1877 4102 -2526 -2153 4552
1247D552o228k488Q716l382o167P321N22o743M745K336p185L881M775p707O15
$$ 4552 -1676 -4164 4552 1170 -4997 2324 2846 -3897 848 3184 -4001 -120 4655 -3052 -2437
1262b437P214n027l440O855j786n154N680Q7n689L926L087n918R99M939m343j600
$$ -2437 4777 -250 -3690 3165 1379 -3775 1905 1992 -3697 229 3316 -2602 -1603 3336 -1007 -2607
1278b607N077k182k975L623J44l326K609J561l724R38K943k240r50K523p38j528
$$ -2607 2470 288 -2687 936 1080 -2246 363 1924 -1800 -862 2081 -159 -1109 1414 676 -852
1294h52J372n5j349R54L57m76j90N80p1n17O08m33L38m55j97M34k79o06P60l5
$$ -852 520 465 -884 70 427 -49 -239 341 270 -247 361 -72 266 -189 -386 48 -231 -837 -77 -112
1314a12p88R24N48j137L30R75p85m77J206l63j310J180M51j289M78J238j225l85
$$ -112 -900 24 572 -565 -235 740 -45 -522 684 321 -989 191 642 -647 -169 1069 -156 -541
1332e41J542n31j479J069O47j564O37J092j826J56J960r63j317J850mk216J869
$$ -541 1001 470 -1009 60 707 -857 -220 872 -954 -798 1162 199 -1118 732 728 -1488 381
1349C81M69j797P61J360j701j19J668o04j101J262j16j214R83K87j258M65N04
$$ 381 850 -947 -186 1174 -527 -646 1022 418 -683 579 463 -751 232 519 -739 -274 230
1366B30n79R8L70n64O44J44r21N58P30j479N75R70j901R46J874k579l50L388j911
$$ 230 -349 -251 119 -445 199 343 -578 -20 710 -769 -194 776 -1125 -179 1695 -884 -1234 2154 243
1385B43k007L795p86l802L408J111m646K363L066n016N02N541m312k824O297j737
$$ 243 -1764 2031 1245 -2557 851 1962 -2684 -321 2745 -2271 -1769 3772 -540 -3364 2933 1196
1401A196n016N300O56o103M544L024p358K107O592o544j658P150l538l920O471
$$ 1196 -3820 1480 2136 -3967 577 3601 -3757 -1650 4942 -1602 -3260 3890 352 -3568 2903
1416B903j642n789P219N09q019M943M686p576J283N692o388J3O394o036k540Q772
$$ 2903 1261 -4528 2691 3200 -4819 124 4810 -2766 -1483 4209 -2179 -2166 4228 -1808 -4348 4424
1432D424l386o725P807Q72p338N519K296q086N362M710j0479K558R256q639l436
$$ 4424 1038 -5687 2120 2992 -4346 1173 3469 -4617 745 5455 -5024 -2466 6790 -1849 -5285
1447e285J0574m889n571J0572l627q813J1250J380j3729P500Q296j2970J730J0186
$$ -5285 5289 400 -5171 5401 1774 -7039 4211 5591 -8138 -638 7658 -5312 -3582 6604
1461F604j0081q70J2393r461o871J5999l397j4348J2694M287j4225O940P273j3543
$$ 6604 -3477 -4347 8046 -1415 -8286 7713 4316 -10032 2662 6949 -7276 -336 6937 -6606
1475f606M673J1526j4573k275J7589r042j0961J4990j075j2161J1411J044j3863
$$ -6606 -1933 9593 -4980 -7255 10334 1292 -9669 5321 4246 -7915 3496 4540 -9323
1488i323J1465P231j7949M113J5456j3773m211J4417q121o172J4472p138j1073
$$ -9323 2142 9373 -8576 -4463 10993 -2780 -6991 7426 -695 -6867 7605 467 -10606
1501a0606J7220O94j8243J1187R503j5873L737J0313j4007K782J4292j5972n013
$$ -10606 6614 7308 -10935 252 9755 -6118 -2381 7932 -6075 -3293 10999 -4973 -9986
1514i986K0979p834j4700J6571J002j4798J2181K901j7182J1745J1399k1829K221
$$ -9986 10993 3159 -11541 5030 6032 -8766 3415 6316 -10866 879 12278 -9551 -7330
1527g330K0343j4536q418J8311o838j0528J7468m894j6678J8383N639k3377R032
$$ -7330 13013 -1523 -9941 8370 1532 -8996 8472 3578 -13100 5283 10922 -12455 -3423
1540c423J5795j7689o94J5678j3353k670J8311j3066j1860K2638k330k0561J4460
$$ -3423 12372 -5317 -6011 9667 -3686 -6356 11955 -1111 -12971 9667 7337 -13224 1236
1553A236P954j7419P800Q880j7112O643J5243j9419l784K1968r644j3698J6727
$$ 1236 9190 -8229 -429 8451 -8661 -2018 13225 -6194 -9978 11990 2346 -11352 5375
1566E375j901j2497J4586k66j7451J5127R198k2446M787J7659j5196m507J5827
$$ 5375 3474 -9023 5563 5297 -12154 2973 12171 -10275 -5488 12171 -3025 -7532 8295
1579H295j0530n380J7909r684j3658K0573J774k1062J1184J0853j7003M383J1038
$$ 8295 -2235 -7615 10294 610 -13048 7525 9299 -11763 -579 10274 -6729 -2346 8692
1592H692j6216K911J7183j6296q010K2320n678j6541J5583K317j4762J1172M475
$$ 8692 -7524 -4613 12570 -3726 -11736 10584 4906 -11635 3948 6265 -8497 2675 7150
1605G150j8025J0309J3427k0346q85J9576j0959r050J5501n399r668J5616l548
$$ 7150 -10875 -566 12861 -7485 -8370 11206 247 -8803 6698 1299 -8369 7247 3699
1618C699j5824J5391O910j9655N891J3307j3273n11J1968j1386k141J5406j0559
$$ 3699 -12125 3266 10176 -9479 -3588 9719 -3554 -4065 7903 -3483 -5624 9782 -777
1631g77j0206J7558n63j5433J0124N773j2581O741O327j4217N181J2663j4604
$$ -777 -10983 6575 6012 -9421 703 6476 -6105 636 6963 -7254 -2073 10590 -4014
1644d014l960J5958o077r916J2050j682r164J1388K04j3755J0082Q140j5913J947
$$ -4014 -7974 7984 1907 -8009 4041 2359 -6805 4583 4787 -8968 1114 9254 -6659 -4712
1658d712J2570j0032l005J1098p049n063J3508n314j1050J3057K719j3877O132
$$ -4712 7858 -2174 -5179 5919 -1130 -6193 7315 2001 -9049 4008 6727 -7150 -1018
1671a018P319j0676K523P761j0065L93J1759q482o778J2228j576r393P783J693
$$ -1018 6301 -4375 -1852 5909 -4156 -3763 7996 -486 -7264 4964 3388 -6005 1778 3471
1685C471q339O081L121r979M335Q045r373j920R647m486m733P153k788m497P464
$$ 3471 -4868 1213 4334 -5645 -1310 6735 -2638 -4558 5089 603 -4130 3023 235 -4262 3202
1700C202j164p550O645L421q275K415N502o040L44N245n812j154P589m631m626
$$ 3202 2038 -5512 1133 4554 -3721 -1306 4196 -1844 -1500 3745 -2067 -3221 4368 -263 -4889
1715d889P585M9o602M482K507o030L377K903o587J558O035n935k189O727k237
$$ -4889 2696 2745 -3857 625 3132 -2898 479 3382 -3205 -1647 4388 -1547 -3736 2991 754
1730G54l807N007m47m513M489J074n851K788L830n338m10N079k973j962M153j246
$$ 754 -3053 1954 1507 -3006 1483 2557 -3294 -506 3324 -2014 -2424 2655 -318 -2280 1873 627
1746F27k599L832o18l685K571J978l872J030K427k387j02K255j788o28K793j538
$$ 627 -1972 1860 1242 -2443 128 2106 -1766 -736 1691 -696 -798 1457 -331 -959 1834 296
1762B96j547K023J7j956J134N36j470J256M43j657J205P66j810l3J581j094q12
$$ 296 -1251 772 789 -1167 -33 503 -967 289 732 -925 280 1046 -764 -797 784 -310 -1122
1779a122J917j170q59K023l93j436J565O47k067Q50J237k028K3J802j323p44J964
$$ -1122 795 -375 -1234 789 396 -1040 525 1172 -895 -45 1192 -836 -813 989 -334 -1078 886
1796H86l79j736J907L55j912P89J322j779J10J193q68q53J183L96j510J228M20
$$ 886 507 -1229 678 1033 -879 -90 1232 -547 -437 756 -112 -965 218 614 -896 332 752
1813G52j248K35J010n92r79J217k88q74Q63K96p34P4P74m83l86M82K23p23J53
$$ 752 -496 -261 749 157 -822 395 107 -767 96 392 -342 -268 506 23 -363 119 342 -381 -228
1832b28K99k55k90M12J9l8J38K56j64j81M54m36l43J78N28j032M62P34q05m18
$$ -228 71 -184 -474 -62 -43 -81 57 313 149 -32 422 -14 -357 -179 349 -683 -221 513 -292 -710
1852g10J083M00j322O75N47j337J44J254j360o38J956l49j324J273L01j112N19
$$ -710 373 773 -549 126 673 -664 -520 734 -626 -1264 692 343 -981 292 593 -519 0
1869@J071j613j32J735j336r20J718j78j566J443Q13j628O18Q71j349J00J141
$$ 0 1071 -542 -674 1061 -275 -1195 523 345 -1221 222 1035 -593 25 896 -453 -353 788
1886G88j208m01J216j52r59R86r6k27O85m48r99J184J01j182M76O56r65Q17L33
$$ 788 -420 -821 395 243 -716 270 174 -53 632 184 -815 369 470 -712 -236 420 -545 272 605
1905F05j582J124J229k247j54K400j537q93J773q53j114K484l03l212K812J566
$$ 605 -977 147 1376 -871 -1025 1375 -162 -1055 718 -135 -1249 1235 932 -2280 532 2098
$$ [...]
8191B28
##END NTUPLES=NMR FID
##END=
