##TITLE=1H_UK_26_2_1
 CD2CL2
 8 sc, 
 4.04.2022
##JCAMPDX= 6.0         $$ Bruker NMR JCAMP-DX V2.0
##DATA TYPE= NMR FID
##DATA CLASS= NTUPLES
##ORIGIN= UXNMR, Bruker Analytische Messtechnik GmbH
##OWNER= root
$$ XWIN-NMR		Version 3.5
$$ Mon Apr  4 11:02:25 2022 Russian Standard Time (UT+4h)  she@DPX200
##.OBSERVE FREQUENCY= 200.131346
##.OBSERVE NUCLEUS= ^1H
##.DELAY= (6, 6)
##.ACQUISITION MODE= SIMULTANEOUS
##.ACQUISITION SCHEME= undefined
##.AVERAGES= 8
##.DIGITISER RES= 18
##SPECTROMETER/DATA SYSTEM= spect
##.PULSE SEQUENCE= zg30
##.SOLVENT NAME= CD2Cl2
##.SHIFT REFERENCE= (INTERNAL, CD2Cl2, 0, 15.7039)
##AUDIT TRAIL= $$ (NUMBER, WHEN, WHO, WHERE, WHAT)
$$ ##TITLE= Audit trail, XWIN-NMR		Version 3.5
$$ ##JCAMPDX= 5.01
$$ ##ORIGIN= Bruker BioSpin GmbH
$$ ##OWNER= she
$$ F:/spectra/data/she/nmr/H-F/1/audita.txt
$$ ##AUDIT TRAIL=  $$ (NUMBER, WHEN, WHO, WHERE, WHAT)
(   1,<2022-04-04 11:00:48.67 +0400>,<she>,<DPX200>,
      <created by zg, POWCHK disabled, PULCHK disabled
       configuration hash MD5:
       00 E9 B6 7A A2 85 ED C7 34 08 36 98 17 FE 4E 26
       data hash MD5: 16K
       60 97 30 AE 69 CA FE 20 56 27 75 00 D7 93 FA 3E>)
$$ ##END=
$$ 
$$ hash MD5
$$ 0A B1 6D A3 38 2D 33 C7 66 7B 39 00 41 06 62 1C
##$RELAX= 
##$RELAX= 
##$RELAX= 
##$RELAX= 
##$RELAX= 
##$RELAX= 
$$ Bruker specific parameters
$$ --------------------------
##$DU= <F:/spectra>
##$EXPNO= 1
##$NAME= <H-F>
##$PROCNO= 1
##$TYPE= <nmr>
##$USER= <she>
##$AMP= (0..31)
100 100 100 100 100 100 100 100 100 100 100 100 100 100 100 100 100 100 
100 100 100 100 100 100 100 100 100 100 100 100 100 100 
##$AQSEQ= 0
##$AQ_mod= 1
##$AUNM= <au_zg>
##$AUTOPOS= <>
##$BF1= 200.13
##$BF2= 200.13
##$BF3= 200.13
##$BF4= 200.13
##$BF5= 200.13
##$BF6= 200.13
##$BF7= 200.13
##$BF8= 200.13
##$BYTORDA= 1
##$CFDGTYP= 0
##$CFRGTYP= 5
##$CHEMSTR= <none>
##$CNST= (0..31)
1 1 145 1 1 1 1 1 1 1 1 1 1 1 1 1 1 1 1 1 1 1 1 1 1 1 1 1 1 1 1 1 
##$CPDPRG= <>
##$CPDPRG1= <>
##$CPDPRG2= <>
##$CPDPRG3= <>
##$CPDPRG4= <mlev>
##$CPDPRG5= <mlev>
##$CPDPRG6= <mlev>
##$CPDPRG7= <mlev>
##$CPDPRG8= <mlev>
##$CPDPRGB= <>
##$CPDPRGT= <>
##$D= (0..31)
0 1.2 0 0 0 0 0 0 0 0.06 0 0.03 0 0 0 0 0.0002 0 0 0 0 0 0 0 0 0 0 0 0 
0 0 0 
##$DATE= 1649055648
##$DBL= (0..7)
120 120 120 120 120 120 120 120 
##$DBP= (0..7)
150 150 150 150 150 150 150 150 
##$DBP07= 0
##$DBPNAM0= <>
##$DBPNAM1= <>
##$DBPNAM2= <>
##$DBPNAM3= <>
##$DBPNAM4= <>
##$DBPNAM5= <>
##$DBPNAM6= <>
##$DBPNAM7= <>
##$DBPOAL= (0..7)
0.5 0.5 0.5 0.5 0.5 0.5 0.5 0.5 
##$DBPOFFS= (0..7)
0 0 0 0 0 0 0 0 
##$DE= 6
##$DECBNUC= <off>
##$DECIM= 32
##$DECNUC= <off>
##$DECSTAT= 4
##$DIGMOD= 1
##$DIGTYP= 9
##$DL= (0..7)
0 120 120 120 120 120 120 120 
##$DP= (0..7)
150 150 150 150 150 150 150 150 
##$DP07= 0
##$DPNAME0= <>
##$DPNAME1= <>
##$DPNAME2= <>
##$DPNAME3= <>
##$DPNAME4= <>
##$DPNAME5= <>
##$DPNAME6= <>
##$DPNAME7= <>
##$DPOAL= (0..7)
0.5 0.5 0.5 0.5 0.5 0.5 0.5 0.5 
##$DPOFFS= (0..7)
0 0 0 0 0 0 0 0 
##$DQDMODE= 0
##$DR= 18
##$DS= 0
##$DSLIST= <SSSSSSSSSSSSSSS>
$$ [...]
##$SUBNAM2= <"">
##$SUBNAM3= <"">
##$SUBNAM4= <"">
##$SUBNAM5= <"">
##$SUBNAM6= <"">
##$SUBNAM7= <"">
##$SUBNAM8= <"">
##$SUBNAM9= <"">
##$SW= 18.0517287032376
##$SWIBOX= (0..15)
0 0 2 0 0 0 0 0 0 0 0 0 0 0 0 0 
##$SW_h= 3612.71676300578
##$TD= 16384
##$TD0= 1
##$TE= 0
##$TE2= 300
##$TE3= 300
##$TEG= 300
##$TL= (0..7)
0 120 120 120 120 120 120 120 
##$TP= (0..7)
150 150 150 150 150 150 150 150 
##$TP07= 0
##$TPNAME0= <>
##$TPNAME1= <>
##$TPNAME2= <>
##$TPNAME3= <>
##$TPNAME4= <>
##$TPNAME5= <>
##$TPNAME6= <>
##$TPNAME7= <>
##$TPOAL= (0..7)
0.5 0.5 0.5 0.5 0.5 0.5 0.5 0.5 
##$TPOFFS= (0..7)
0 0 0 0 0 0 0 0 
##$TUNHIN= 0
##$TUNHOUT= 0
##$TUNXOUT= 0
##$USERA1= <user>
##$USERA2= <user>
##$USERA3= <user>
##$USERA4= <user>
##$USERA5= <user>
##$V9= 5
##$VALIST= <valist>
##$VCLIST= <CCCCCCCCCCCCCCC>
##$VD= 0
##$VDLIST= <DDDDDDDDDDDDDDD>
##$VPLIST= <PPPPPPPPPPPPPPP>
##$VTLIST= <TTTTTTTTTTTTTTT>
##$WBST= 1024
##$WBSW= 4
##$XGAIN= (0..3)
0 0 0 0 
##$XL= 0
##$YL= 0
##$YMAX_a= 400928
##$YMIN_a= -421998
##$ZGOPTNS= <>
##$ZL1= 120
##$ZL2= 120
##$ZL3= 120
##$ZL4= 120
##$ABSF1= 10
##$ABSF2= 0
##$ABSG= 5
##$ABSL= 3
##$ALPHA= 0
##$AQORDER= 0
##$ASSFAC= 0
##$ASSFACI= 0
##$ASSFACX= 0
##$ASSWID= 0
##$AUNMP= <proc_1d>
##$AZFE= 0.1
##$AZFW= 0.1
##$BCFW= 1
##$BC_mod= 2
##$BYTORDP= 1
##$COROFFS= 0
##$CY= 11.3945322036743
##$DATMOD= 1
##$DC= 2
##$DFILT= <>
##$DTYPP= 0
##$F1P= 2.36226072786647
##$F2P= -0.459571619588291
##$FCOR= 0.5
##$FTSIZE= 0
##$FT_mod= 4
##$GAMMA= 1
##$GB= 0.15
##$INTBC= 1
##$INTSCL= 1
##$ISEN= 128
##$LB= 0.24
##$LEV0= 0
##$LPBIN= 0
##$MAXI= 10000
##$MC2= 0
##$MEAN= 0
##$ME_mod= 0
##$MI= 1.114404
##$NCOEF= 0
##$NC_proc= 0
##$NLEV= 6
##$NOISF1= 3.799351
##$NOISF2= 2.8
##$NSP= 1
##$NTH_PI= 0
##$NZP= 0
##$OFFSET= 15.70392
##$PC= 1
##$PHC0= -17316.72
##$PHC1= 21.40078
##$PH_mod= 1
##$PKNL= yes
##$PPARMOD= 0
##$PSCAL= 0
##$PSIGN= 0
##$REVERSE= no
##$SF= 200.130013532006
##$SI= 16384
##$SIGF1= 3
##$SIGF2= 2
##$SINO= 400
##$SIOLD= 16384
##$SREGLST= <1H.CDCl3>
##$SSB= 0
##$STSI= 0
##$STSR= 0
##$SW_p= 3612.71676300578
##$SYMM= 0
##$S_DEV= 0
##$TDeff= 0
##$TDoff= 0
##$TI= <>
##$TILT= no
##$TM1= 0
##$TM2= 0
##$TOPLEV= 0
##$USERP1= <user>
##$USERP2= <user>
##$USERP3= <user>
##$USERP4= <user>
##$USERP5= <user>
##$WDW= 1
##$XDIM= 8192
##$YMAX_p= 0
##$YMIN_p= 0
$$ End of Bruker specific parameters
$$ ---------------------------------
##NTUPLES= NMR FID
##VAR_NAME=  TIME,          FID/REAL,        FID/IMAG
##SYMBOL=    X,             R,               I
##VAR_TYPE=  INDEPENDENT,   DEPENDENT,       DEPENDENT
##VAR_FORM=  AFFN,          ASDF,            ASDF
##VAR_DIM=   8192,          8192,            8192
##UNITS=     SECONDS,       ARBITRARY UNITS, ARBITRARY UNITS
##FACTOR=    0.0002768,     1,               1
##FIRST=     0,             0,               0
##LAST=      2.2672688,     0,               0
##MIN=       0,             -421998,         0
##MAX=       2.2672688,     400928,          0
$$ Real data points
##PAGE= N=1
##DATA TABLE= (X++(R..R)), XYDATA
0 0 0 0 0 0 0 0 0 0 0 2 -8 8 -8 16 -16 24 -24 32 -40 49 -57 72 -88 103 -120 137 -161 185 -217 249 -283 322
32 322 -366 417 -470 529 -595 666 -743 830 -925 1028 -1139 1263 -1397 1544 -1704 1879 -2070
49 -2070 2280 -2512 2767 -3050 3364 -3716 4114 -4564 5079 -5677 6381 -7222 8247 -9532
63 -9532 11194 -13436 16647 -21640 30513 -51024 200137 -101959 -317657 317544 80116
74 80116 -167931 92846 -15035 -166226 271753 78084 -374100 76474 358821 -205388
84 -205388 -203684 179552 6124 -85920 73427 -138553 -85475 252117 -30587 -298663 127914
95 127914 204088 -155600 -74528 75045 -29392 70269 36982 -197444 35720 247663 -119097
106 -119097 -177325 165739 76523 -89659 36493 -33252 -50090 170137 -19666 -241562 117147
117 117147 198340 -184031 -85020 159906 -25550 -32468 87794 -109634 -40611 215298 -69787
128 -69787 -231957 158339 136708 -189128 -12878 121873 -69514 23745 88701 -141835 -8904
139 -8904 202031 -99042 -180598 148725 64701 -155395 18087 56044 -72907 55271 47658
150 47658 -135705 28832 151484 -100367 -103461 119228 23554 -79794 33498 6995 -26574
161 -26574 81815 3310 -94227 67694 87609 -83538 -31707 63962 -14267 -14051 15345 -49127
173 -49127 10907 74157 -56486 -59471 79155 11487 -70773 17959 7161 -39998 36159 -3458
185 -3458 -78710 47794 68570 -81798 -17770 90692 -23174 -42105 53067 -16114 -38266
196 -38266 64122 -8380 -77479 59531 55539 -77871 572 74858 -32571 -26002 47098 -25124
208 -25124 -32187 49792 -15299 -59680 42857 31699 -55162 3235 44475 -21713 -11405 24506
220 24506 -17941 -12039 25253 -16007 -27552 24020 10464 -21442 6506 15470 -2556 5000 -93
233 -93 -9891 8447 2029 -18819 -248 8356 -8919 2765 8001 -8093 9509 16818 -15361 -5290
247 -5290 21049 -9703 -19965 14399 1110 -18136 13093 9966 -16752 10868 20398 -17498 -4565
260 -4565 21812 -11514 -18840 13868 -1401 -19569 10026 9291 -14801 5917 16804 -11487 -5338
273 -5338 15599 -5899 -14701 7977 1612 -13429 3863 9336 -6076 1864 13348 -1402 -5397
286 -5397 7804 1361 -10565 -776 3520 -7111 -3780 7542 888 -3555 7436 6394 -5063 -122
300 -122 5229 -6325 -7940 2999 -2054 -8889 3132 6275 -4388 1423 10601 -548 -4551 6229
314 6229 604 -9840 201 3339 -7932 -2355 8770 -176 -2637 9975 5624 -5202 2849 5888
328 5888 -7677 -5770 4839 -3907 -8223 4821 3914 -6078 3086 8558 -4515 -3064 6499 -3340
342 -3340 -9568 1834 448 -8370 396 6367 -2691 337 8859 1821 -3173 4265 2970 -5371 -1960
357 -1960 2381 -2139 -2614 3320 3618 -103 2876 5727 251 -2921 2464 13 -8195 -2841 3393 -5353
373 -5353 -5473 6401 1851 -5452 5485 4943 -7465 1114 5945 -10510 -6543 9253 -4071 -10248
387 -10248 9200 5578 -6897 7127 8361 -7826 3190 9586 -10795 -6089 11295 -5011 -10952
400 -10952 9051 4086 -6411 7718 4493 -7005 6261 5786 -12902 -1876 8692 -8919 -6718
413 -6718 7356 -1782 -1669 8328 -3278 -3320 12575 -1526 -13729 5678 3702 -12448 -257 2782
427 2782 -8125 6257 7622 -13037 2738 17626 -9968 -10865 13203 -2275 -11675 8079 -2752
440 -2752 -9948 16467 5123 -18798 12249 19770 -16502 -5248 16763 -8133 -7350 12054 -10958
453 -10958 -8650 22471 -2675 -22229 18548 15569 -21264 -561 12683 -13503 -1400 8094 -19610
466 -19610 -2791 23382 -12197 -18297 22517 7720 -17130 6673 4876 -10708 9843 597 -22394
479 -22394 10748 20310 -19409 -5947 23591 -1227 -5930 11327 -7403 -3372 19867 -12314 -23266
492 -23266 22394 10099 -26801 4541 17646 -11039 3948 9477 -19875 4865 24048 -25343
504 -25343 -20004 30334 -45 -27471 12049 9415 -13111 14067 4003 -25011 15874 22795 -32243
517 -32243 -11389 31354 -7447 -19097 15328 -56 -6610 20327 -6819 -21851 25602 13317
529 13317 -32810 316 22769 -12459 -6435 9687 -10284 6370 20769 -20079 -12276 31406
541 31406 -1019 -27938 9759 8859 -13142 6195 -1878 -17394 20173 15642 -30954 44 32289
554 32289 -13228 -18911 14933 -4038 -8323 15006 -13166 -17764 30966 7684 -34299 11682 28032
567 28032 -18481 -6807 14557 -12222 1064 18250 -22303 -12196 35200 -1907 -30123 18031
579 18031 17741 -17642 2835 6455 -15766 10313 12227 -28279 -2914 31185 -11311 -20656 18070
592 18070 5467 -10598 7922 -5555 -12629 18951 1409 -28191 8555 21830 -15359 -7207
604 -7207 13902 -3316 1555 9536 -15781 -3398 23794 -9578 -22736 16850 10188 -15713 4551
617 4551 6383 -8561 12360 7140 -22997 4749 23234 -18244 -16119 19385 -448 -12957 10644
630 10644 -1707 -9761 18392 1822 -24306 10932 18418 -21064 -8612 16430 -6345 -6464 10799
643 10799 -7564 -4882 19415 -3345 -18350 14006 10814 -16829 -1482 8712 -6655 992 5681
656 5681 -10069 2962 15120 -8520 -9071 12822 1526 -10018 2802 -525 -4449 7111 -2223
669 -2223 -10524 9893 9050 -11635 -201 10034 -5390 -2840 4602 -7836 -1111 10721 -7984
682 -7984 -9163 13957 3351 -12042 5789 6782 -8305 2479 4269 -11014 1453 10424 -10303
695 -10303 -6241 13841 -240 -9145 7488 3799 -7238 4324 2126 -9349 2966 6957 -9217
708 -9217 -2677 9628 -1389 -4514 5536 895 -2894 3879 -1032 -5729 3277 1862 -6199 152
722 152 3866 -1805 -134 1956 -1029 1591 2289 -3391 -1169 2898 -2412 -2965 2255 -566 -1154 3239
738 3239 -474 -2008 4503 748 -4925 1670 2600 -4727 -922 3284 -2882 -1064 4679 -1564 -2244 5296
754 5296 548 -4926 2369 2269 -5163 -873 3335 -3028 -1016 4066 -1023 -2131 4142 985 -3810
769 -3810 1253 2061 -3165 -1482 2007 -1407 -1592 2465 812 -980 1795 2190 -1286 -601 1372 -935
785 -935 -2151 249 215 -1490 -148 1662 -225 -218 1697 688 -1468 1 838 -2090 -1398 1293 -441
802 -441 -1910 1347 1413 -1032 551 2293 -986 -980 1875 -720 -2293 908 829 -1946 354 2474 -647
819 -647 -541 2308 2 -1840 867 342 -2613 -493 1313 -1515 -1051 2062 236 -1056 1571 1316
835 1316 -1509 -247 834 -1025 -1748 984 -128 -1397 1114 1543 -686 553 1765 -326 -731 949
851 949 240 -1644 -220 881 -819 -391 1405 706 -726 1314 1261 -1013 -160 1224 -1270 -1559 1128
868 1128 164 -1532 688 1700 -1188 41 2339 -755 -1591 1928 5 -2855 1010 1336 -2470 247
884 247 2457 -1342 -850 2469 -551 -2116 1652 -216 -2951 534 1129 -1982 166 2287 -731 55
900 55 2319 -656 -1032 1845 -113 -1732 796 324 -1105 440 241 -75 1342 109 -1288 1241 947
917 947 -1992 -45 657 -1863 242 1145 -2422 52 3462 -2313 -1980 3868 -45 -3084 2212 744
933 744 -3211 2367 1866 -4457 1638 4743 -3946 -1968 5724 -1071 -3895 3530 -315 -3740 3308 435
949 435 -5287 2779 4340 -4942 -784 5258 -1982 -2683 3132 -1948 -2199 3793 -1445 -4418 4142 2281
965 2281 -4677 1263 3239 -2066 432 1522 -3891 970 3440 -4614 -1945 5274 -1446 -3554 3262
980 3262 54 -2253 3665 -1281 -4833 4991 2322 -7783 929 5828 -4336 -1320 4490 -3046 -598
995 -598 6251 -4152 -4499 8352 607 -8361 3659 4808 -5552 1014 3668 -5085 1681 6192 -6915
1010 -6915 -3412 8885 -2206 -7478 4956 2029 -4641 2980 880 -5085 4940 4270 -8280 199
1024 199 7914 -4171 -4453 4561 -1002 -1714 4296 -3296 -3267 8031 189 -8215 3799 5013 -5235
1039 -5235 18 2708 -3881 2391 4041 -7573 -593 9815 -3744 -6646 6895 1229 -5184 3688
1053 3688 -244 -5653 6626 2531 -10266 2965 9255 -6850 -4053 7597 -1640 -3022 5668 -3790
1067 -3790 -4353 8936 -253 -10134 5501 6998 -7827 -1175 5566 -3689 194 4959 -6389 -1973
1081 -1973 9579 -3290 -8230 7035 3559 -6356 1787 1885 -4076 3879 2093 -7966 1889 7833
1095 7833 -6119 -4104 6617 -782 -3277 3509 -2370 -2510 6817 -2133 -8041 5948 4562 -7814
1109 -7814 -129 5154 -3671 630 3877 -5700 -62 8274 -5087 -6441 7866 1436 -7159 2948
1123 2948 2331 -4676 3803 2477 -7445 2512 7800 -6750 -3692 7982 -1020 -5083 3963 -529 -3606
1138 -3606 5273 110 -7286 4432 5109 -6654 -1113 5798 -2470 -1762 3354 -2999 -1049 5423 -2680
1153 -2680 -4876 5932 1558 -5760 1315 2638 -2918 1657 1403 -4111 2177 4252 -4951 -2031 5479
1168 5479 -1417 -3214 2985 -810 -2268 3932 -758 -4434 4133 2512 -5883 840 4338 -3157 -838
1183 -838 3430 -2584 -913 4582 -2568 -3465 5068 731 -5042 2234 2977 -3482 641 2478 -3228 483
1199 483 3816 -3338 -2251 4274 -389 -3679 2179 876 -2499 1507 776 -2755 1265 2586 -2959
1214 -2959 -441 3127 -1138 -1635 1655 -426 -566 1770 -647 -1353 2012 233 -2037 990 952 -1439
1230 -1439 360 776 -1367 495 1154 -2005 -347 2006 -1198 -1240 1776 -31 -1300 1388 9 -1797
1246 -1797 1410 792 -2218 449 1893 -1474 -656 1841 -687 -987 1757 94 -1793 1216 790 -1805
1262 -1805 176 1448 -1277 -550 1273 -594 -745 968 -17 -1158 732 210 -938 440 727 -352
1278 -352 -528 680 140 -223 325 -2 -133 -100 139 -137 -426 -99 -49 90 -473 268 411 -446 34 424
1298 424 -431 -195 192 -408 -505 389 193 -861 240 688 -635 -124 836 -285 -679 434 186 -893
1316 -893 91 383 -635 254 490 -331 -568 598 -83 -672 145 412 -759 -403 431 -308 -545 555 289
1335 289 -433 839 -300 -295 -292 113 787 -100 823 562 -935 374 1031 -356 380 1061 -685 -223 552
1354 552 498 -542 180 481 -98 -580 381 908 -163 205 721 -183 -203 794 -451 -215 831 422 -1028
1373 -1028 42 748 -850 -273 909 -293 -853 570 -181 -1061 487 662 -786 67 924 -862 -448
1390 -448 1230 -246 -700 628 -289 -791 499 558 -996 170 824 -416 46 776 -218 -98 468 -251
1408 -251 -59 626 -455 -561 647 173 -122 480 -178 -527 615 -186 -1053 251 689 -1309 -49 711
1426 711 -837 175 1249 -871 -300 1973 -228 -1495 1169 277 -2241 416 1042 -1409 561 1552
1442 1552 -1491 -301 2509 -908 -1777 1870 200 -1911 825 437 -1986 1047 1240 -2246 339 2207
1458 2207 -1350 -1121 1525 -449 -1115 1310 -547 -1158 1763 379 -1876 1304 1361 -1668 88 1070
1474 1070 -1023 211 741 -1880 60 2223 -1315 -1338 2123 35 -1413 1157 -88 -1283 1569 121
1490 121 -2924 976 2175 -2408 -553 2407 -998 -630 2161 -1292 -1300 3015 -498 -3235 2248 1694
1506 1694 -2940 425 2037 -1502 107 2041 -2312 -773 2909 -1670 -2624 2774 987 -2659 989
1521 989 1021 -1509 1229 805 -2823 762 2380 -2416 -1371 2388 -561 -1110 1630 -427 -739 2722
1537 2722 -465 -2724 2299 1510 -2937 103 1733 -1506 307 1598 -2061 586 3102 -1921 -2216
1552 -2216 3225 -129 -2818 1308 775 -1815 1891 756 -2840 1835 2881 -2865 -728 3521 -1184
1567 -1184 -1701 1933 -781 -1408 2511 -486 -3222 2629 1928 -3170 228 2849 -1645 -412 1684 -1836
1583 -1836 -413 2326 -1434 -2050 3054 431 -2537 1446 1148 -1734 1337 379 -2340 1091 2038 -2662
1599 -2662 -451 3091 -691 -1477 1928 -349 -696 1996 -843 -2093 2278 817 -3212 575 2277
1614 2277 -1581 40 1845 -1732 49 2241 -1901 -1695 3038 -297 -2709 1718 1283 -2018 968
1629 968 1192 -2141 933 2076 -2503 -850 2659 -982 -2093 1866 -127 -1370 1633 29 -1759
1644 -1759 1940 1134 -2493 254 1625 -1268 -856 1337 -767 -246 1359 -1190 -733 2281 -63 -1804
1660 -1804 1082 548 -1544 454 381 -1533 838 1180 -1918 189 2158 -1240 -928 1420 -329 -1047
1676 -1047 1063 -402 -1539 1551 689 -2203 832 1596 -1330 -653 1523 -891 -598 1215 -966 -1057
1692 -1057 1420 14 -1735 1146 1169 -1088 181 908 -1015 -196 676 -1171 -620 1158 -270 -1015 1148
1709 1148 437 -599 586 223 -719 477 97 -1247 119 590 -501 100 762 290 -408 1185 -615
1726 -615 104 566 -785 -830 1144 -55 -532 664 1165 -158 764 643 -471 -334 713 -436 -549 930
1744 930 324 -690 283 24 -57 814 36 -1063 -163 1447 -895 18 915 34 -625 169 460 -416 406
1763 406 955 -631 208 703 -314 -557 556 33 -728 1010 -19 -212 100 186 -102 -47 125 -63 79
1782 79 -324 -15 382 -314 -444 188 -104 48 206 -217 410 454 226 -322 -75 187 -454 -518 522 -210 -135
1803 -135 343 131 -700 190 730 -385 149 332 -360 -114 627 48 -67 379 475 209 168 220 -486 -522 -15
1824 -15 228 -275 -11 551 -607 -12 135 46 -186 53 186 336 235 167 73 -328 286 -102 -228 153 142
1845 142 -317 545 80 217 -719 -156 -372 -142 -587 -150 83 -98 828 102 -562 -506 123 -607 290 132
1865 132 -209 -343 344 -55 -502 514 216 -317 76 192 -322 -118 363 -195 -598 389 -188 -523 402 187
1885 187 -400 142 308 -220 -218 317 -230 -363 257 299 -203 267 85 -17 -144 151 -177 -69 27 -178 -221 -35
1907 -35 100 320 189 -183 278 437 -296 222 151 -399 -123 111 -583 -239 649 -77 -263 601 0 -721 311
1928 311 646 -765 -252 727 -651 -517 674 -367 -671 1017 428 -931 440 490 -767 -12 542 -730
1946 -730 -240 1173 -366 -660 970 339 -727 294 370 -469 391 223 -741 28 726 -467 -216 689
1964 689 -152 -132 400 -304 -191 376 -269 -229 502 -64 -803 207 474 -430 563 -24 -543 531 610 -1138
1984 -1138 -301 1132 -629 -593 780 -202 -585 769 88 -1014 929 676 -1600 -311 1397 -699 -568
2001 -568 1375 -464 -597 1500 -577 -1072 1179 553 -1784 348 1299 -980 -388 874 -628 -94 963
2018 963 -741 -777 1398 228 -1207 337 569 -576 116 41 -773 825 847 -1402 162 1231 -638
2035 -638 -733 473 -61 -173 473 -885 -533 1403 116 -1340 697 797 -929 -80 477 -920 384
2052 384 796 -1696 -426 2000 -442 -1782 1386 610 -968 663 110 -1174 671 843 -1628 12
2068 12 1964 -731 -972 1387 137 -916 947 -142 -1253 1342 509 -1893 419 1742 -914 -786
2084 -786 805 -320 -139 563 -744 -415 1437 -320 -1122 814 888 -844 157 388 -401 553 290 -1161
2102 -1161 192 1171 -947 -707 1144 -4 -682 743 -482 -549 1537 -303 -1412 1020 936 -1410 -349
2119 -349 1109 -670 -117 981 -945 -335 1836 -604 -1335 1338 683 -1684 223 652 -763 296
2135 296 818 -1140 104 1622 -1054 -833 1138 401 -1198 290 167 -531 732 341 -1250 287 1323
2152 1323 -1034 -665 1088 -209 -399 327 -228 -362 915 -205 -839 728 357 -862 159 479 -568
2169 -568 141 299 -653 150 950 -912 -287 1101 57 -691 538 -123 -395 568 -30 -944 549 396
2187 396 -953 205 1255 -544 -442 636 -334 -410 962 -311 -1066 907 447 -922 163 808 -337
2204 -337 -314 528 -466 -207 582 -152 -606 721 57 -694 170 498 -285 -326 55 -417 136 337 -159 -20
2224 -20 453 -127 -210 313 -264 -120 297 77 -165 386 124 -296 161 121 -337 216 269 -212 34 216 -278
2245 -278 -26 456 -317 -533 384 -112 -458 420 161 -419 207 374 -267 -8 621 -272 -292 523 203 -97
2265 -97 -111 63 -423 123 374 -321 -127 544 -179 -291 383 119 -191 135 121 -108 44 -123 69 71 75 17 -223
2288 -223 -26 110 -41 47 35 91 -117 -15 15 176 100 155 -120 -416 78 114 -187 -235 41 -57 -128 166 -30
2311 -30 -199 -46 0 -93 -251 125 103 -215 83 161 -258 -158 197 120 -186 247 242 -20 97 9 19 -80 223 -139
2335 -139 -30 124 -405 -150 75 32 -304 -185 -35 -139 18 312 -117 -311 -58 -262 9 -193 161 -42
2355 -42 -55 93 -29 -65 260 -128 -187 -35 88 -296 -415 103 -44 -18 -88 266 152 -216 163 -68 -422 26
2377 26 -78 -283 -182 313 -33 -15 365 29 -154 23 242 -340 109 300 -174 -42 213 -120 -210 399 -39
2398 -39 -148 176 142 -192 126 116 -125 -30 327 -313 33 291 -37 -60 212 171 -106 43 -21 -45 203 115 -324
2421 -324 50 226 -234 153 138 43 137 -34 -362 323 261 -511 -394 141 -337 22 158 -71 -44 223 181 -502
2443 -502 44 344 -501 -115 337 -252 -40 273 -99 -222 504 -34 -359 127 280 -359 -159 305 -189 -57
2463 -57 263 -333 14 461 -340 -431 247 307 -329 59 3 -352 292 -121 -524 347 402 -466 -370 72 -76 -164
2485 -164 -32 -342 30 169 -291 -547 528 50 -506 270 308 -118 2 -101 -836 253 461 -774 -147
2504 -147 854 135 -456 414 -35 -88 484 -215 -782 496 470 -761 -490 706 -60 -195 211 -109 52
2523 52 505 -13 -811 782 325 -943 -188 619 -269 -51 22 -266 416 473 -572 -380 959 -69 -709
2542 -709 329 409 -8 408 -193 -390 886 264 -898 -98 839 -247 -390 466 -217 -84 564 -497 -579
2561 -579 949 114 -878 183 571 -358 116 191 -376 283 603 -582 -386 992 -62 -794 310 537
2579 537 -376 286 -111 -523 332 495 -738 228 899 -168 -639 371 -17 -251 390 -539 -362 916 -5
2598 -5 -805 27 980 -243 -231 388 -16 281 255 -702 -360 674 32 -639 566 394 -432 85 95 -384 259
2619 259 -63 -970 -49 827 -359 -615 625 125 -96 226 -355 -205 933 -63 -903 125 452 -550
2637 -550 -390 378 -63 -24 318 -530 -100 834 -161 -844 450 206 -329 -8 253 -237 303 173 -489 81
2657 81 400 -623 -511 609 -21 -218 -22 -3 243 474 163 -545 324 571 -352 -193 311 -202 -103 79
2677 79 -424 222 387 -327 -196 592 53 -478 40 -24 -306 150 -227 -276 322 764 -337 -248 738 1 -494
2698 -494 71 -84 -270 37 106 -388 221 352 -388 -151 450 32 -73 314 -225 -64 168 -359 -391 254 206
2719 206 -264 12 227 -95 183 69 -166 193 178 -255 -141 71 -176 33 441 88 1 107 -218 -393 300
2740 300 88 -169 62 277 -63 -56 -193 -84 -42 130 -51 -237 54 -34 -276 -61 228 -330 -4 271 -183
2761 -183 116 341 -78 -142 -169 -16 -394 -83 6 -231 162 158 -31 35 202 -75 27 -29 43 -217 -32 30 76
2784 76 213 73 88 206 113 11 97 15 239 2 -171 -94 -288 -122 -37 71 143 119 -12 -160 30 -90 112
2807 112 276 -79 -124 117 -130 106 221 220 149 300 35 111 -38 -89 -167 -42 -41 112 -12 124 -125 36 100
2830 100 -94 -62 80 -67 -116 123 -16 -178 44 371 278 113 88 61 -39 -131 -235 -97 -1 9 141 -140 294
2853 294 112 44 -19 -62 -74 -43 -267 -165 -299 -66 -16 -5 138 107 -32 -3 219 -240 200 -129 113 -9 -219
2876 -219 -91 -151 -240 -53 241 242 255 147 66 -71 84 -65 61 24 -55 -92 137 90 28 78 44 55 -138 -17 -61
2901 -61 -318 104 -258 -97 -8 -2 215 139 102 13 -46 84 -78 -177 -153 -195 -134 174 -72 -213 62 -118 165 117
2925 117 123 8 109 0 -85 -151 -24 275 333 299 -117 114 412 -153 -16 144 -44 -119 3 -190 -108 247 30
2948 30 -28 249 192 -375 -148 48 -63 -386 -33 -62 -124 106 -205 -244 90 206 -219 100 -160 -261 -49 -323
2970 -323 -128 109 363 -410 -233 81 220 -40 -32 -245 20 200 -136 13 -166 363 -46 -89 256 215 73
2991 73 -121 -272 -30 290 -295 -330 127 93 -165 -74 167 71 34 -183 -403 19 137 -502 -370 61 134 -98
3013 -98 50 144 231 156 -28 -174 207 476 -333 -180 58 181 -101 136 -9 156 305 60 14 232 -84 -298
3035 -298 -22 -37 0 -294 53 180 145 180 -31 123 502 161 -53 -230 47 103 74 -191 -325 346 143 -287
3057 -287 93 187 -238 -88 -237 -211 -23 -154 -249 -169 542 379 -191 -50 122 -114 22 -396 -208 289 157
3078 157 -338 -45 690 -87 -168 161 -63 94 12 -431 53 240 -116 -408 -62 276 55 -65 14 -50 451
3099 451 46 -403 132 439 -267 -520 151 58 -40 244 59 23 256 -148 -391 141 358 -326 -599 123 68
3120 68 -68 84 -30 -16 585 -101 -270 88 225 -300 -287 -12 -116 254 268 -273 -145 412 -135 -247 39
3141 39 208 -58 -132 -206 109 330 -116 9 326 429 -372 -133 -98 -18 144 -78 -477 243 429 -104 -314 292
3163 292 240 -52 -91 119 -46 53 -37 -358 160 364 -240 -61 472 164 103 148 74 77 276 -473 -197 100 243
3186 243 -172 -157 434 141 159 -89 -93 148 208 -382 -347 183 218 -6 125 197 -20 46 -2 -120 113 191 -441 -202
3210 -202 265 -138 -196 -201 118 82 73 -52 -157 45 -170 -438 -190 -71 25 -48 298 -81 494 102 -225 77 28
3233 28 135 -310 -99 -24 -131 135 -187 -78 40 214 -50 52 62 22 -202 4 -22 -145 334 33 32 1 217
3256 217 107 -135 293 -99 -136 385 -26 -83 190 -121 -186 192 185 -165 105 75 -14 -23 -128 -348 -153 -32 26
3279 26 -248 -11 375 -2 266 87 21 -171 -133 -119 -83 -33 138 90 194 -94 106 294 -107 229 13 49 69
3302 69 -128 -17 -291 16 0 -52 -148 124 43 67 245 33 -46 -121 196 -85 -12 -115 -89 197 211 44 164 -12
3326 -12 -6 -144 -153 64 -267 -124 -95 -88 -20 108 97 49 172 83 -224 -2 -47 -174 -118 -105 -91 88 131 -98 164 -10
3352 -10 62 116 94 58 -129 -84 -165 -65 51 202 -29 66 -86 264 93 -69 122 -208 -195 55 -184 21 82
3375 82 -154 168 135 118 159 -88 -124 127 -58 83 4 -6 107 149 390 -90 42 172 -102 69 64 -258 -165 -169
3399 -169 63 -108 101 -65 183 156 -153 -95 102 45 -489 77 146 -209 -30 127 156 123 416 -250 -309 43
3421 43 -65 -172 -351 219 -309 -183 -138 -138 132 184 -163 89 555 -25 -418 164 -35 -349 15 -3 34 144
3443 144 150 -56 236 117 -179 109 -37 -234 -196 182 32 -157 66 4 -13 259 169 -203 124 49 -186 35
3465 35 89 -204 -319 82 361 -34 154 88 13 175 -129 -271 -152 170 -119 50 99 -127 100 191 -179 -173 235
3488 235 182 -203 -190 -89 -249 -36 87 -89 115 -48 -218 283 168 -185 -231 64 152 -18 -7 -133 116 395
3510 395 225 -192 178 186 -379 -151 208 -138 -164 56 -37 150 405 -670 -280 -517 344 -854 -113 498 147
3531 147 -360 474 508 96 229 -188 -147 337 524 -396 -22 232 -253 112 340 -392 5 381 -61 -310 427
3552 427 59 -94 262 -394 -90 342 32 -410 194 138 -487 132 385 -249 -36 154 -93 -261 89 -348
3572 -348 -519 353 330 -438 117 294 -51 247 274 -317 -79 415 -507 -171 273 -130 -214 270 23 -80 263
3593 263 88 -117 72 207 -544 -240 505 -169 -3 154 110 -93 261 -4 -266 235 208 -425 75 324 -233
3614 -233 122 48 -81 20 213 -59 -308 436 87 -13 690 -31 -352 25 76 -118 148 205 -289 8 454
3635 454 -46 -77 150 -202 -198 81 5 -346 441 257 -80 161 254 -188 -12 -76 -135 -212 24 -203 76 392 -233
3658 -233 95 1144 547 -577 572 64 -83 -238 -67 -442 103 131 -124 -415 296 89 169 -39 75 40
3678 40 78 -33 -140 38 381 -164 33 78 -149 -42 14 -51 -203 364 -129 -175 179 324 -160 -67 74 84 158
3701 158 357 -258 5 80 -166 -204 412 194 282 139 -141 -59 81 132 -99 196 102 -184 30 198 -32 15
3723 15 -22 64 -215 154 124 -195 249 -90 -273 -242 301 -97 -27 34 209 105 223 -34 -32 102 100 -415 -50 89
3747 89 -284 262 9 -248 241 295 17 221 245 -153 -130 25 162 -99 -59 -141 80 30 108 121 77 -122 -304
3770 -304 -87 -210 31 90 202 76 65 4 192 -44 151 162 -94 -112 76 52 -202 -22 -215 -203 -1 -89 7
3793 7 73 -41 -241 58 -52 -45 -120 30 -365 -38 -6 -18 119 68 163 250 -274 -433 -470 -73 328 -246 -192 215
3817 215 212 365 352 68 -120 -91 -29 111 -199 -39 -34 33 -16 -133 92 -54 49 -50 38 -68 179 23 -174 -229
3841 -229 -132 155 46 -142 -71 -107 -33 47 32 -263 -83 -162 -128 51 83 22 -174 42 60 171 203 17 -1 -97 21
3866 21 31 -205 -92 -71 159 -141 -201 179 -87 -125 18 17 57 -85 88 -75 40 87 -127 164 400 -22 168
3889 168 132 -49 -94 -40 -139 -206 -27 28 -105 169 -42 -2 134 87 -249 -119 96 -144 -129 208 -57 249 262
3912 262 -85 113 262 49 -132 -47 -113 88 -114 -117 -167 25 22 16 -159 254 79 -179 -21 -151 -11 63 -27 86
3936 86 259 -1 4 -30 8 -249 -54 142 85 -128 244 -187 -127 12 50 29 89 193 121 143 53 -30 161 247 68
3961 68 167 -6 41 115 12 -227 72 312 174 25 142 -208 -316 -67 -53 -62 -16 211 45 95 10 29 -105 310
3985 310 194 -141 146 -33 -187 -24 -28 17 -25 128 -46 -34 402 -48 -120 93 156 60 77 -44 -175 291 -34
4008 -34 -274 98 152 -128 -213 149 38 -11 -123 -146 25 357 -59 -339 -44 98 -205 266 -196 -389 31 123
4030 123 -163 113 150 146 -270 291 113 -142 49 23 -351 124 127 -295 116 18 -223 13 309 -217 36 57 -253
4053 -253 -279 256 169 -177 -51 -6 -64 -49 303 -179 161 -7 -207 -206 342 -83 -117 239 -9 -153 218 -23 -115
4076 -115 141 -128 -468 -78 118 -13 -253 472 -69 -194 169 46 -256 60 -182 2 152 36 -259 17
4096 17 -14 -239 -81 142 -90 -202 286 -407 -134 -3 -58 -410 215 70 -196 172 -36 -189 120 300 -311
4117 -311 -104 321 -112 -161 112 130 -28 158 -24 -98 127 -1 -216 274 427 -88 -121 -11 -163 -44 65
4138 65 -63 -166 203 84 -177 -14 279 -358 -64 3 -60 210 -36 -201 -285 97 234 -204 106 -27 -203
4159 -203 -3 -10 -269 94 -170 -14 411 252 -212 -215 191 -158 -211 51 -87 -242 366 47 -324 33 155 -160
4181 -160 -100 301 -100 87 217 50 -102 118 -266 -252 78 -108 -203 -18 134 -217 199 1 -3 -175 222 -62
4203 -62 -225 93 91 -401 97 140 -22 -26 -120 -24 126 -34 -24 -214 70 151 -93 -168 -207 -187 -204 -70 -76 84 185
4228 185 76 22 -67 -264 -56 11 -29 -3 35 -129 41 277 -393 -238 144 163 -145 -1 -1 -59 80 245 -274
4251 -274 315 91 -1 -101 148 -108 -185 -2 18 -275 169 28 -258 -43 124 23 -101 44 55 39 -162 -59
4273 -59 -104 -98 78 -7 -59 95 -119 230 -106 44 -6 -101 -273 -73 144 124 28 -39 101 -30 174 -96 -100 -87 -154
4298 -154 32 46 17 6 -207 114 -59 49 144 -68 -301 87 272 -170 70 22 35 106 114 -104 7 140 -115
4321 -115 -21 -146 -106 -74 -60 -193 -131 -58 -1 62 -102 -333 10 -64 33 -80 -67 -27 54 -123 164 -85 -131 -46 23
4346 23 -84 96 -116 45 -371 101 -61 65 -268 37 -41 -49 -51 -188 69 -341 -13 -67 -84 -40 -155 160 80
4369 80 -43 57 80 -66 -69 44 -33 175 209 100 -31 -53 -59 39 30 27 -266 59 254 97 -165 44 -6 -12 -143 176
4395 176 -2 -71 64 -21 -2 -3 36 -101 -95 94 -15 151 117 -211 17 -265 74 -298 -29 -81 9 166 125 1
4419 1 137 -16 119 -144 -224 132 223 100 103 131 -25 71 -147 144 -151 356 -56 -148 228 -107 -14 31 130 111
4443 111 -53 25 38 157 101 66 -46 23 -149 -67 -100 -133 -49 -59 -138 232 130 -175 66 21 55 62 46 38 -21 81
4469 81 180 -1 -38 -57 144 -115 65 -83 94 99 96 -62 55 -115 -232 -67 6 -214 -240 292 -340 75 -138
4492 -138 29 -6 89 -57 -31 -21 -141 173 165 79 161 -54 -143 90 89 44 1 -204 113 32 -33 40 -174 -28 129
4517 129 45 -177 -88 81 -28 -51 18 -251 -50 45 -127 -81 -219 -182 14 9 -59 104 -4 -102 36 233 -136 -366
4541 -366 199 182 -212 141 -141 48 -356 128 -179 121 197 -71 -62 200 -126 64 -31 -21 -97 -63 -15 74 0 16
4565 16 47 -135 174 -37 52 -125 160 89 177 -5 -83 55 36 -47 -30 -16 -148 -57 -113 -83 122 117 41 -4 127 144
4591 144 -18 -37 276 222 5 165 57 150 70 -143 -25 78 -111 62 143 47 125 -152 172 -43 -91 249 -47
4614 -47 -256 24 132 64 -165 -95 61 -14 131 162 97 41 68 -7 -148 132 12 -23 -281 68 233 34 -191
4637 -191 8 -48 -67 -15 29 -90 87 -176 157 209 224 19 46 -51 -130 -26 110 -113 -75 116 104 -185 -112 -2
4661 -2 -165 18 120 -26 187 149 -32 -111 -86 -28 -5 164 -156 -294 118 44 -183 169 -60 -142 237 -3 8
4684 8 -23 -104 113 121 57 20 -188 37 -8 106 -258 -1 12 34 143 -86 -183 261 29 -94 75 67 -28 335 -36
4709 -36 -120 172 -66 -49 -56 -7 -70 23 -6 138 58 -29 30 4 396 42 21 -320 -16 -132 -83 29 -75 0 -56 -50
4735 -50 37 95 -94 -166 56 145 118 -214 46 54 156 -121 199 240 112 -77 -32 107 -158 67 -153 97 -60
4758 -60 249 -157 168 -109 -40 -21 43 54 -168 51 -30 44 57 97 -26 -75 307 -38 31 -309 224 -74 -335 25
4782 25 -177 135 -62 14 173 175 -38 -35 51 -127 56 259 -189 89 90 60 158 136 150 -71 -131 114 -166 -41 -89
4807 -89 65 112 210 -103 112 6 -2 -103 -82 -79 14 60 -45 148 48 -34 143 -21 -153 -130 79 56 44 -149 -82
4832 -82 -152 -130 123 127 -18 -130 67 46 10 95 -317 -166 154 60 -46 131 72 -32 -319 -116 87 -17 -36 -43
4856 -43 9 -190 18 -3 -2 -110 93 -65 -244 -232 59 29 33 -8 -27 -40 -125 57 -378 2 54 120 -135 -29 275
4881 275 117 12 -91 -6 225 -66 39 -19 255 115 71 -207 -156 89 -60 72 -228 -6 137 -23 -82 -165
4903 -165 70 27 31 -91 170 -56 -381 2 39 84 44 53 -197 205 -43 -2 114 -139 152 -135 99 70 -19 -20
4927 -20 -32 26 -213 50 53 -39 102 -263 -269 79 33 -88 -36 174 -29 61 136 -240 -119 -318 -22 -57 73 -65
4951 -65 -93 -113 -80 19 283 132 -70 82 212 61 -41 126 -126 98 -51 -239 -133 2 -59 38 47 -75 33
4974 33 -265 -90 -152 0 -111 56 166 47 177 -85 -63 100 228 -35 -56 -3 -46 191 156 127 -66 -98 38
4997 38 -95 -72 -26 28 124 175 12 -98 71 -154 223 88 -64 -154 279 -60 118 -73 -7 -35 -71 134 -162
5020 -162 36 129 6 -93 -272 33 -18 -66 -31 100 4 116 -76 254 -123 53 -113 -330 -70 76 -67 -36
5042 -36 72 -246 231 -14 -4 65 -40 25 26 89 -72 -364 -62 90 -7 5 -182 -54 206 39 -84 -76 -186 -54
5066 -54 71 55 241 -100 23 3 58 -47 -36 -130 193 172 -96 64 -143 -232 -35 -245 113 -177 35 75 -151
5089 -151 10 223 26 -80 185 5 147 60 -38 69 -2 -128 -47 210 28 -113 95 -147 -261 28 -24 -191
5111 -191 -86 -61 -155 -69 36 250 -58 205 -167 118 157 -17 -31 133 102 25 -49 -320 23 45 178 60 53 -36
5135 -36 10 148 198 77 -389 363 -50 146 103 173 139 90 -163 103 3 -259 -10 18 5 120 43 169 155 -40
5159 -40 153 61 -39 -65 108 13 -207 -174 -173 -262 198 -22 -92 115 -21 -108 76 -118 -125 128 13 41 37 74 -45
5184 -45 -16 276 -250 75 -8 -7 101 -148 18 176 -39 -257 203 389 -20 -42 -112 29 146 -115 57 -12 76
5207 76 243 -51 -127 -297 -1 -109 115 -109 -97 -90 68 -226 202 77 -7 102 66 54 -129 135 201 -100 73
5230 73 -48 192 194 -60 194 179 -186 -58 72 197 -11 -37 -90 158 21 -129 92 -69 -29 -107 -62 -51 231
5253 231 -266 44 -224 -313 121 -63 -28 3 101 -13 54 11 -232 29 273 247 -236 88 24 4 -6 -108 -13 94
5277 94 76 -33 -97 -138 33 -282 83 76 -255 -108 353 227 36 -60 -62 -133 173 -31 -138 -289 -106 -314 -103
5300 -103 164 -40 57 3 32 175 31 -50 109 101 63 -36 -24 -42 17 191 31 -197 -97 -14 -149 219 -91 -58
5324 -58 152 -64 240 147 262 104 -152 -112 92 42 -183 -107 -16 -24 122 -77 233 33 47 59 101 -28 -17 170
5348 170 -87 90 -161 -47 -178 -141 -214 -298 -143 180 201 122 47 86 121 -67 -80 -160 -93 69 33 80 19 -54 11
5373 11 11 190 -1 3 -216 -48 21 114 -12 20 -84 -30 -5 -196 -94 -45 -7 174 -141 8 162 -51 -155 37
5397 37 -78 -105 132 -6 140 -60 68 -54 -73 164 71 -185 -70 107 57 -57 -68 -79 15 78 -208 29 100
5420 100 116 122 8 -183 -171 -208 -239 -194 33 -2 -40 -548 31 194 47 -55 -232 -39 322 76 258 -95 -157
5443 -157 199 86 -271 -164 143 -154 77 -12 -51 -29 61 22 -32 1 -110 -41 -239 -78 221 -86 92 -53 54
5466 54 151 -3 -10 115 -92 94 36 -38 30 36 -62 -89 -6 85 108 -103 165 134 75 -5 55 78 181 88 -101 79 -27
5493 -27 214 -36 -63 -10 -150 -108 -200 122 -90 72 165 167 -100 -137 -269 -284 -6 76 188 -65 -77 243 71 25
5517 25 75 18 46 52 50 -284 279 -73 76 104 4 -71 -139 60 -171 119 -37 -24 -102 -6 130 -347 -194 -66 95
5542 95 105 -143 -105 29 28 -105 -88 164 84 135 -250 -159 55 -106 0 -45 -49 156 -161 174 111 31 -88 -260 -177
5567 -177 102 103 -150 -27 65 -176 160 162 1 2 -44 202 43 122 -73 -163 -9 97 -36 115 -196 -234 -211 -159
5591 -159 -139 57 3 46 -118 75 84 108 159 -56 -79 -79 80 -124 -283 114 119 64 -46 -64 -58 7 163 -116 220 156
5617 156 -125 -67 287 35 -112 19 179 -10 242 91 14 305 -226 161 -164 55 82 -102 -173 27 -87
5638 -87 -102 -78 33 -56 -32 -92 -9 31 196 -25 -186 88 43 -38 -230 -67 61 136 -167 157 -164 -45 119 116
5662 116 -6 110 -55 163 161 157 52 -120 -157 -65 90 -11 -125 -44 105 -208 -12 -265 -121 -81 164 -285 -80
5685 -80 238 -184 213 63 -194 -99 -57 73 -96 -28 -28 -140 -3 -50 139 98 240 -251 36 -54 -286 -55 155
5708 155 -60 34 252 -211 69 135 100 -44 59 -82 187 -35 -23 260 270 -13 122 44 103 139 -57 -23 194
5731 194 206 -49 47 13 -250 57 -191 -59 55 248 64 -10 88 -206 -281 -7 -24 15 -20 129 173 27 57 -200
5755 -200 169 -253 -229 161 -79 -48 25 -36 -163 -169 -159 -39 -81 -89 56 -103 -30 15 -3 -213 185 61 10 112 252
5780 252 104 -43 170 92 120 -1 18 -25 27 -240 38 -133 11 147 -124 -81 62 -105 58 71 -213 -165 -447
5803 -447 63 36 -108 64 -132 -19 63 -79 -252 47 -25 -29 -40 110 -95 -12 -49 22 -300 120 -87 -51 -151
5826 -151 -115 37 -79 -74 155 50 171 39 -102 -229 118 11 -43 212 173 10 64 -12 27 47 -127 76 -249
5849 -249 -97 -121 47 83 198 53 -63 66 96 -3 211 34 -161 98 248 -232 -437 -25 -86 -146 -19 -42
5871 -42 -161 126 -138 -123 -175 112 29 -86 174 -2 34 -155 -48 -192 -109 -87 -15 108 -73 -20 -297 -120 -103
5894 -103 -97 28 124 -44 -49 200 -77 135 -70 177 336 -166 -216 -7 110 199 2 -69 -129 99 -78 18 182
5917 182 -61 49 160 165 127 150 -86 98 -128 220 -135 -83 51 -226 -354 7 -45 -8 58 -82 7 160 52
5940 52 55 42 255 230 20 62 -69 -49 59 228 67 -10 107 42 120 1 13 -309 9 98 14 -336 64 -31 -89
5965 -89 -279 47 57 16 96 -30 -230 85 -141 -73 26 87 312 53 4 142 23 20 3 76 60 202 65 52 -193
5990 -193 -83 -164 99 210 -157 -121 154 35 -101 -164 -119 153 -147 213 126 -22 46 36 105 -208 131 7 -182
6013 -182 258 -89 -9 -2 68 -89 240 3 -227 210 -85 94 -72 -90 -160 -200 218 111 -68 266 64 -205
6035 -205 191 -154 27 -340 63 78 18 -68 -112 -265 109 66 148 108 -17 -181 -390 66 162 -174 40 -76 42
6058 42 10 -239 -74 -239 -142 39 50 33 -112 -57 -22 203 184 -87 -30 -69 -120 -44 69 30 63 130 -126 52 -95
6083 -95 59 -160 -50 221 92 -150 -44 211 -101 24 -183 -77 -231 120 -66 -63 -199 -3 93 -151 -139 33
6105 33 20 -202 19 72 4 -93 112 -30 -36 -90 139 -62 16 193 -15 -206 178 -30 -204 -30 -299 51 125
6128 125 119 -85 -163 6 -18 1 -10 198 -13 -127 72 -9 319 -40 -18 320 -60 -101 -53 -67 -87 -24 -14 110 -65
6153 -65 -193 -97 -45 -253 -67 145 61 -178 96 177 -121 38 -256 83 82 -76 53 -39 84 -48 336 -208 65
6176 65 110 -48 144 23 -264 158 -94 68 -94 -199 193 -159 257 -145 -51 202 -136 -140 117 95 96 168 -78
6199 -78 -213 56 94 71 -26 442 -188 -130 2 3 47 185 -157 5 -88 -26 43 57 106 -141 179 -162 -214 -102 -86
6224 -86 43 -84 56 36 29 -201 -17 -133 115 50 -185 56 -122 213 -58 -147 9 35 -66 -275 -152 -2
6246 -2 -141 -148 -94 0 -63 282 120 -5 24 -52 -156 15 -59 -142 105 -26 59 -3 87 52 -11 40 -76 113 -113 34
6272 34 27 160 275 89 -61 174 -24 -283 -50 -154 -126 210 133 -107 62 -29 -292 -28 -68 144 63 20 -64
6295 -64 -17 60 -153 -101 180 -101 -110 -4 69 -209 248 66 -268 -183 59 -189 125 221 -38 -135 159 54 -20 139
6319 139 167 4 133 -4 -33 -79 -131 326 -141 84 16 -355 93 -50 126 19 12 189 107 17 -303 -7 -65
6342 -65 -135 -89 -30 79 -29 -48 150 -110 -4 96 -253 97 102 -179 -274 147 -28 -37 89 -30 -46 158 124 66
6366 66 -131 275 128 287 40 -63 107 142 -255 -112 213 -179 112 -110 -10 -131 -117 -56 97 25 53 13
6388 13 -205 34 -187 -92 177 68 344 148 -52 92 149 203 -316 -33 -122 -14 -87 -266 165 179 119 -170 -88
6411 -88 148 -198 63 -256 102 -20 -100 177 75 -73 -72 325 -200 247 -10 -128 -102 -182 224 53 -24 149
6433 149 -18 -12 182 88 201 36 -382 -154 36 -135 -56 -183 61 -107 16 84 8 -14 -21 -136 35 144 3
6456 3 112 -400 -113 186 49 -85 -64 144 -79 5 -177 -15 128 54 -24 116 -120 65 -94 68 -197 106
6478 106 119 85 -197 -95 -80 -81 -68 14 -32 145 -133 61 -135 -25 -149 -70 46 -162 -29 104 101 -23 46 111
6502 111 221 -68 196 7 92 -108 -64 -51 -8 86 99 -65 124 -139 -102 -43 221 -4 -17 -254 -176 -205 62 113
6526 113 -222 22 -252 -3 -42 202 99 16 185 -157 -107 -151 45 134 85 25 -14 -180 -97 -197 165 3 88
6549 88 5 99 -128 61 -263 60 -105 10 11 7 -67 -34 73 -26 -21 -189 17 -141 180 23 -262 -69 133 -227
6573 -227 38 -76 -77 11 -155 -80 -122 -8 301 381 -99 -196 -88 -80 -220 221 45 6 -183 95 19 31 107 166 -24
6598 -24 57 -70 140 198 -60 -93 53 193 60 214 -241 17 -299 120 -73 -42 -96 142 -180 182 -93 -146
6620 -146 -161 74 -32 114 -265 -110 1 -5 -147 107 -213 35 192 110 313 -107 -115 -271 153 -2 -118 16
6642 16 93 -142 84 95 -98 4 -24 94 26 -182 -134 -13 -94 35 -223 114 -21 -146 113 -188 -74 -69 160
6665 160 103 0 -30 -218 -184 -7 -109 -51 68 -134 -111 -33 321 51 116 124 128 -178 68 305 58 151 70 206
6689 206 102 -107 -75 -119 -35 258 196 -30 159 -84 -121 72 54 33 -156 98 0 312 5 24 -119 99 28
6712 28 8 -18 -95 -61 -27 59 190 141 17 -94 -243 78 -164 148 198 -87 18 -39 -247 35 -186 28 -47 95
6736 95 -41 -25 82 250 -114 73 -210 -119 46 -112 123 -113 -168 92 229 98 -68 -108 -1 129 -142 -161
6758 -161 -57 -138 -52 -5 -150 90 -21 -164 208 -139 -5 349 114 53 -118 82 -135 60 56 39 125 62 192
6781 192 80 355 1 225 -177 46 153 55 256 -23 62 -163 -16 -16 109 -41 83 -169 -15 -37 14 -7
6803 -7 171 1 -49 81 48 59 -25 -20 20 37 198 -21 -70 125 -58 -154 76 136 167 13 -114 68 93 -77 52
6828 52 47 194 232 36 21 -123 1 8 -77 -158 133 186 276 -116 63 30 115 -15 -209 -34 -35 -25 -21 107 1 -107
6854 -107 140 296 197 -146 -38 8 46 -87 108 111 -4 -20 -128 -62 -35 20 43 167 -46 29 88 -1 -47 88 226
6879 226 -31 -192 -329 14 138 -45 59 197 -88 75 167 -73 266 -10 -16 -96 150 -192 -230 -2 -149 -32
6901 -32 -53 -169 169 150 60 107 -38 -210 82 -87 274 103 -13 -158 114 -28 37 208 40 220 23 27 -162
6924 -162 -55 133 -324 87 201 272 -52 -96 40 -54 -55 -230 -190 -49 47 -69 -130 -190 -5 -97 3 69 -16 -194
6948 -194 -15 130 -308 -231 -109 -215 -47 16 235 73 -196 -28 -166 -247 51 -114 16 -143 243 -84 3
6969 3 200 97 -40 -103 -139 -4 -177 -105 2 -68 -53 -180 91 -66 -94 -116 50 -105 -110 -144 -108 -220 -78 252
6993 252 -96 -104 20 158 291 18 -106 78 38 292 -130 145 27 -52 -120 -224 -64 142 164 -96 96 -294
7015 -294 -114 52 -77 -191 -12 61 10 312 366 -303 -5 -179 -83 -135 1 103 -143 71 248 -10 -50 81
7037 81 -151 -29 -205 110 -73 -176 -163 -4 303 74 40 0 -62 30 -205 -93 -170 144 115 -95 -183 -147 37
7060 37 21 39 26 99 0 75 93 45 -77 9 -205 -222 -324 -268 25 -291 56 -13 20 -131 16 -88 -84 -227 -2
7085 -2 13 -50 -239 -80 63 30 51 26 3 -339 -171 72 139 139 -55 87 -154 43 197 87 -13 -68 94 -187
7109 -187 -82 -22 -128 -182 169 -120 -238 30 81 25 24 -75 22 -308 139 -3 175 77 1 -64 153 -207 131 -57
7133 -57 105 -140 -148 -42 -51 181 73 -199 -75 -238 0 -12 131 139 32 -125 -227 112 -92 -327 -143 -45 -75
7156 -75 205 -50 20 28 -22 50 -11 -216 9 -41 13 -13 19 -50 134 -85 -61 56 171 160 -172 61 -205 -48 -6
7181 -6 129 -276 172 223 174 219 -200 74 100 60 45 128 -118 80 168 -172 -283 29 80 -101 83 -63 52 87
7205 87 -119 67 85 -104 0 -35 -65 100 -174 -39 -110 -18 -18 -16 45 70 -186 80 -34 -23 -12 -268 -136 -99 -217
7230 -217 18 200 -134 -66 209 -248 47 -51 -19 -101 67 565 170 -145 -148 14 -144 297 5 -58 -36 -17 204
7253 204 107 18 -17 34 -112 112 -3 123 -13 -51 8 -183 -250 152 121 21 60 54 -71 -309 32 -264 -318 -57
7277 -57 138 -58 -38 -101 -48 -52 67 56 -150 90 122 75 -40 -138 194 -231 119 41 -87 154 34 -96 -278 49
7301 49 277 -174 60 45 -55 -46 52 -103 187 -56 -115 -204 121 9 140 83 -129 241 -193 -62 7 2 318 46
7325 46 -360 131 71 -113 35 182 -92 107 -34 105 32 63 9 -50 339 37 -57 322 -378 -51 -90 -26 110
7348 110 99 -60 -79 32 126 223 -289 65 219 31 -211 3 -109 -253 -131 -181 -34 3 -30 94 277 217 -62
7371 -62 -296 245 -64 -82 -65 79 25 -3 -307 -87 -222 -31 159 -29 -15 -23 39 -166 -214 -3 283 15 -186
7394 -186 -84 -85 -21 71 -242 -7 -48 -148 -33 -33 8 -365 48 132 -7 167 7 10 31 -156 -323 96 39 -62
7418 -62 -299 -79 -2 -125 250 -11 7 -77 -30 -129 -35 -58 67 7 18 63 -303 89 79 89 -235 -61 92 -234
7442 -234 -209 10 16 -1 -60 263 -7 -39 -81 207 131 -58 -181 150 20 -2 105 -23 59 78 -27 73 39 59
7466 59 189 167 105 -64 -2 170 117 -40 -358 264 240 -148 -216 -145 82 28 -318 -225 113 -104 -293 357 4
7489 4 -234 -143 21 -263 272 9 159 252 -87 44 224 27 240 240 184 -87 -122 101 -47 -86 54 115 29 158
7513 158 5 58 14 133 -42 -155 12 11 -23 -162 -270 8 -16 131 184 171 104 -273 85 219 56 -10 125
7536 125 9 37 -78 -82 -167 264 135 -48 274 -61 60 -186 30 -59 188 -144 140 47 -59 -186 14 -71
7558 -71 -319 -304 53 94 -106 139 37 -80 -160 -124 -269 -43 217 -1 -129 257 -95 10 119 -161 -82 131
7580 131 -94 58 -87 -56 239 -170 -97 26 129 39 -126 -111 -81 -34 -217 -99 90 -9 76 -48 -150 61 186
7603 186 118 3 229 -168 -10 0 -77 119 91 136 -74 -161 86 93 -70 7 -62 -66 -66 -129 84 70 -172 24 234
7628 234 -246 39 117 283 288 15 128 49 17 -230 -68 -157 314 80 19 24 -302 -181 96 -43 -244 168 3
7651 3 222 -50 -130 -51 28 30 -101 -193 -107 80 -117 38 -186 43 51 76 165 -39 66 94 166 -72 29 130 198
7676 198 44 -40 106 -325 -81 -87 -39 62 -57 330 -190 -4 -248 159 -71 -30 71 111 41 -18 -96 140 -120
7699 -120 -68 186 -267 91 -151 75 174 4 -143 -131 69 -77 -64 -89 -61 125 -146 -50 -158 121 -293 90
7721 90 -211 -57 39 -90 195 97 -139 -32 252 -68 35 -56 142 21 -68 125 -1 -158 20 39 80 -1 389
7744 389 58 62 -43 -91 -34 -102 178 -115 -76 122 -205 104 162 113 1 244 284 -78 101 -78 113 159 -71
7767 -71 141 -52 -157 116 -37 243 -60 272 14 184 48 -83 136 24 -28 -107 -312 -20 -64 28 -50 -122
7789 -122 120 -189 129 -4 -175 -73 15 -282 167 -54 26 -100 -182 -140 34 238 37 18 -90 164 -42 -211
7811 -211 -206 146 -54 -20 -83 65 -101 -81 184 30 241 -175 -153 28 -55 109 -42 -81 -453 -243 208 173 361
7834 361 -61 -21 -157 -189 158 26 -147 199 57 -79 -112 34 105 -293 -158 189 50 -220 104 -29 -92 249
7856 249 -89 -51 102 -140 -103 -5 -1 -29 4 -181 -223 201 210 156 147 17 44 -189 -116 99 -70 117 -106 -43 12 -145
7882 -145 -129 -83 -166 6 0 -275 196 -159 54 131 -69 -60 95 -151 -183 -111 -149 148 16 133 105 45 -186 -130 175
7907 175 -76 -100 -256 -20 -69 -261 243 -72 -158 -148 10 -155 47 -67 -107 -72 134 -175 74 -92 -72 18 46
7930 46 106 96 -59 -155 69 -50 -182 175 159 166 -79 -50 -81 -12 117 148 106 -54 308 -19 0 76 -93 74 -132
7955 -132 -124 -58 6 7 -10 7 177 119 -153 -96 140 130 56 235 -22 79 -27 -18 17 184 -30 118 34 -167 -80 -42
7981 -42 59 -275 -66 21 -3 -55 -279 -182 -96 14 -51 163 -13 -95 -156 -248 24 -84 1 -199 -195 178 30 229
8005 229 43 -226 -6 192 -221 48 84 114 -188 -39 -144 111 33 -245 -4 -179 52 103 20 -22 -234 -113
8027 -113 20 86 -220 109 -123 180 -72 151 -25 -93 27 16 -24 -316 169 -56 270 -187 49 -65 136
8048 136 -71 2 73 -34 54 -146 55 -148 20 -79 -105 -27 66 199 139 -55 126 -112 -77 -420 -185 -64 -79
8071 -79 -134 13 175 -148 -21 158 -254 26 -23 -172 258 -96 24 61 107 -59 39 -56 -67 66 -14 99 35
8094 35 -156 38 -78 -45 120 227 45 67 96 -302 74 -77 300 -186 7 -60 -72 -195 111 134 1 -2 -136
8117 -136 78 178 101 -127 124 85 67 247 -222 -203 30 -177 -226 -100 75 -16 83 -133 -79 42 91 76 -43
8140 -43 -198 33 -28 -229 -123 -117 -78 -141 -7 -139 -55 68 -289 109 -28 77 -76 198 104 -330 -28 -121 95
8163 95 -359 56 55 -30 -40 24 185 78 -149 -232 74 117 -23 68 18 -289 33 -137 39 82 -51 27 -47 -35 72
8188 72 233 -55 142
8191A42
$$ Imaginary data points
##PAGE= N=2
##DATA TABLE= (X++(I..I)), XYDATA
0 0 0 0 0 0 0 0 0 0 0 0 0 -7 8 -8 8 -8 9 -16 16 -17 24 -31 32 -40 48 -54 62 -72 81 -93 105 -120 136 -152
34 -152 171 -193 214 -240 268 -298 329 -367 406 -448 495 -545 601 -661 729 -803 885 -973
52 -973 1074 -1188 1316 -1462 1628 -1824 2054 -2333 2673 -3104 3661 -4418 5500 -7166 10013
67 10013 -15748 31521 -157679 -421998 246681 195214 -243868 30617 115290 -124188 183051
78 183051 163402 -314485 13388 400928 -144973 -283375 213695 106426 -143045 51920
88 51920 -22669 -89144 209245 35688 -294144 79626 253327 -166174 -153861 113516 -848
99 -848 -19006 33131 -150296 -14153 233393 -79956 -221205 156445 133214 -136946 -10886
110 -10886 34519 -55367 104843 21984 -219947 68048 233219 -157437 -143496 189588 29917
121 29917 -100948 70675 -37821 -75362 170865 -12743 -239883 117419 192819 -185361
131 -185361 -72920 169807 -32923 -48914 94450 -84187 -52990 186689 -42917 -200083
141 -200083 134552 130027 -159952 -17174 114285 -54614 -2113 64585 -108861 -20399 143971
152 143971 -77990 -142916 109262 56910 -111015 8084 44992 -36532 41631 19700 -93709
163 -93709 34109 97220 -79425 -59203 82954 10528 -35115 28417 -10789 2938 74756
174 74756 -27535 -67535 74245 37072 -82021 2639 38228 -37880 12341 19919 -63864 23603
186 23603 77246 -70712 -49224 87227 -8955 -75885 37287 9083 -53777 42008 17750
197 17750 -73968 38239 74309 -69080 -25059 83783 -17261 -52521 44312 -721 -43464
208 -43464 41883 11151 -56067 33915 50795 -49802 -12433 53142 -15134 -30696 23220 -7348
220 -7348 -22533 21741 -3347 -28589 22630 20936 -23034 443 19982 -5938 -5690 428 -10366
233 -10366 2879 5901 -15202 -1048 15365 -3823 -1441 10932 -5180 -73 12807 -14377 -13992
246 -13992 17681 -3580 -22748 13321 12217 -15925 8317 16968 -14454 1244 20182 -15543
258 -15543 -14071 19788 -4581 -21858 14111 10777 -15932 8460 17586 -11626 -1013 16829 -10855
271 -10855 -13786 11545 -3201 -18010 5707 7780 -11301 2174 13416 -3948 -2703 10994 -1495
284 -1495 -10274 3370 1861 -10922 -1944 6926 -2581 -2382 9340 4427 -3645 5097 6172 -6372
298 -6372 -3926 4609 -4579 -8111 3941 2823 -5766 3263 9021 -3184 -2202 7902 -1993 -9122 2038
313 2038 1014 -10022 -1487 6397 -4255 -2335 9890 2534 -5095 5908 4372 -8478 -2167 5321
327 5321 -5996 -6108 7348 2418 -5167 6655 8374 -4122 1079 8029 -4317 -7528 4187 -2031
341 -2031 -10344 1467 4613 -5378 397 8435 -1119 -3177 5477 -267 -8148 -812 934 -7132 -3498
356 -3498 3662 275 -1305 4668 5388 573 1564 3997 -662 -4159 1133 1100 -5387 -1356 6725 39
372 39 -3297 7903 5453 -5358 2068 5091 -8356 -4095 5291 -8048 -8369 9081 597 -10248
386 -10248 7410 8573 -8456 716 7709 -9061 -4240 8080 -8404 -9043 11736 1233 -10567
399 -10567 9137 9359 -7127 3578 6729 -8168 357 6280 -11222 -4561 11699 -3674 -7447
412 -7447 9897 3700 -3851 6887 -333 -6697 8017 460 -14822 3295 8871 -9695 -1453 9356
426 9356 -3524 2315 9514 -9893 -3603 15137 -8640 -17181 10458 2955 -14521 4972 4968 -9682
440 -9682 10620 9200 -18415 3279 20201 -16007 -14213 17284 -2272 -13188 12031 -461 -9932
453 -9932 19827 5938 -21666 13029 21201 -20643 -8206 18101 -8013 -8150 12056 -9427 -6169
466 -6169 22959 -5228 -22084 18683 12544 -22671 -1563 9919 -11875 960 5346 -18470 4188
479 4188 22661 -15736 -13289 23022 1911 -15917 7407 -855 -9006 14897 -3427 -22330 19598
492 19598 19368 -24466 -984 25038 -7871 -6939 11729 -13300 -4078 23256 -16208 -23670 29501
505 29501 11150 -29894 7907 20020 -14632 2487 9283 -22303 4018 24280 -27004 -19238
517 -19238 33151 1412 -26556 13487 10584 -11714 11852 956 -23182 16053 17966 -31964
529 -31964 -7275 29102 -7596 -14844 13759 -1128 -1336 17874 -12795 -17547 27056 5755 -31803
542 -31803 6004 19188 -12827 -347 7768 -12400 11647 18589 -26475 -8374 32838 -8135
554 -8135 -27732 14864 6454 -13601 10995 -1704 -18174 23130 13878 -35002 1435 31999 -17563
567 -17563 -19277 17263 -4219 -8299 17189 -11306 -15826 31397 6498 -33954 11527 25348 -20083
580 -20083 -7831 13126 -11078 1956 16115 -19625 -6707 32719 -3431 -26216 16877 13273
592 13273 -16348 1459 2308 -12657 12013 7161 -25444 3619 26684 -12999 -14616 16264 1224
605 1224 -7228 6912 -9937 -8739 20363 -3269 -24969 14387 17886 -16981 -1724 12800 -7440
618 -7440 2942 9083 -18765 -2063 24402 -12000 -20302 20834 8811 -16749 7253 6612 -11160
631 -11160 10842 6508 -23331 3858 21976 -17660 -14491 20018 949 -11758 10159 -430
643 -430 -9082 14224 455 -20954 8642 14726 -17415 -6158 13744 -3223 -3293 7785 -5502
656 -5502 -1191 14032 -5815 -13279 11239 4849 -12518 856 4995 -4255 4687 2327 -8822 6715
670 6715 10605 -11473 -4962 11647 -3734 -7539 5303 -2923 -3685 10037 -2863 -10148 11810 7057
684 7057 -13623 1295 9436 -8575 -2763 6226 -7914 -1945 11563 -5761 -8494 13290 3391
697 3391 -12240 4384 6236 -8500 213 4651 -7842 -33 8900 -6028 -4569 10362 894 -7074
711 -7074 4493 2658 -5135 1482 665 -5458 2134 4034 -4721 -390 6046 -555 -1785 2386 -773
726 -773 -945 1304 -3259 -2236 3308 -709 -3028 2921 1564 -1153 2315 581 -2983 2222 1382 -5416
742 -5416 117 3618 -3693 -1950 4654 -914 -1695 4674 108 -3488 3626 1393 -5833 398 3610
757 3610 -4294 -1760 4437 -1329 -1927 4283 322 -3034 2523 1460 -4345 -363 2617 -2588 -1997 2748
773 2748 156 -1456 2438 1128 -1788 818 1468 -1630 -1370 1321 -624 -1728 909 1465 -337 219
789 219 1796 274 -995 626 221 -1671 -718 808 -919 -1222 1785 726 -1158 1369 1978 -1459
805 -1459 -567 1544 -1141 -2267 997 -150 -2594 743 2070 -927 129 2957 -51 -1172 1957
820 1957 224 -2353 94 868 -2030 -699 1992 -109 -923 2252 1211 -1359 710 1145 -1717 -1097
836 -1097 1010 -794 -1615 1126 770 -1264 682 1882 -688 -853 1209 -591 -1647 276 306 -1626
852 -1626 -25 1571 6 -432 1768 796 -1159 318 534 -1440 -1052 974 -525 -1542 1288 1102
868 1102 -1322 498 1897 -1021 -798 2053 -808 -2090 1180 577 -2460 604 2445 -1239 -317 2957
884 2957 -447 -1356 1963 -171 -2712 1110 625 -3103 86 2261 -1669 -568 2639 -603 -1087 1476
900 1476 -476 -1486 1112 -326 -1886 758 1406 -935 440 1272 84 1072 683 -1393 658 1136
916 1136 -1861 -535 1390 -773 70 2055 -1100 -476 3006 -1393 -3022 2603 101 -4131 844 1418
932 1418 -3365 823 2786 -3227 365 5268 -2668 -3444 5074 173 -5089 2377 1707 -3899 2101 2655
948 2655 -4403 1269 5289 -3752 -2343 5446 -1018 -4086 2744 17 -3244 2699 336 -4532 3118
963 3118 3450 -4965 -367 4376 -2216 -1356 2381 -2443 -542 4222 -2894 -3070 5756 586 -4640 2421
979 2421 1727 -3336 1870 467 -5006 3136 3943 -6528 -680 7189 -2646 -3809 4790 -970 -3021
994 -3021 4788 -1926 -6245 6472 3098 -9171 2007 7175 -4933 -1420 5365 -3126 -745 6484
1008 6484 -4480 -5223 8448 581 -8661 3636 5106 -5161 735 3198 -4889 1909 5180 -6982
1022 -6982 -2315 8386 -2504 -6759 4451 1462 -3725 3256 -689 -4380 6082 2589 -8660 2112
1036 2112 7257 -5014 -2427 4755 -2154 -206 4557 -5141 -2687 9250 -1762 -8847 5798 4127
1050 4127 -6629 1422 2720 -4996 3653 4574 -8443 24 10349 -5232 -6983 7803 556 -5662
1064 -5662 4098 -113 -5467 6765 2557 -10264 3323 9294 -7099 -4148 7054 -1901 -3146 4501
1078 4501 -3589 -3945 8352 -716 -9229 5617 6330 -6863 -705 4407 -3315 853 3407 -6495 -233
1093 -233 8411 -4332 -6204 7036 1758 -5282 2863 397 -3420 4929 452 -8149 4007 6833
1107 6833 -7286 -2291 6772 -2319 -2719 4347 -3689 -2004 7591 -2824 -8083 6838 4144 -8258
1121 -8258 1107 5114 -4357 773 3844 -5833 0 8080 -4845 -6137 7854 1400 -6862 2893
1135 2893 2322 -4097 2970 2135 -6692 2569 6665 -6241 -3120 6560 -937 -4058 3296 -736 -2732
1150 -2732 4447 -872 -5661 4320 3236 -6273 -251 4409 -2857 -632 2354 -3182 377 4607 -3787
1165 -3787 -3074 5723 192 -4779 2516 1148 -2894 2386 561 -4672 2754 3758 -5348 -1246 5300
1180 5300 -2504 -2787 3512 -688 -2321 3759 -844 -4507 4060 2434 -5482 698 4327 -3230 -970
1195 -970 3195 -2116 -1055 3935 -1887 -3222 4232 998 -4260 1529 2457 -2548 271 1496 -2365
1210 -2365 349 2778 -2323 -1620 3070 -410 -2404 1482 467 -1460 1341 -164 -1682 1509 972
1225 972 -2338 524 1568 -1371 12 1171 -1066 -23 1611 -1265 -813 2278 -321 -1792 1643
1240 1643 571 -1782 990 741 -1974 600 1207 -2024 -334 2448 -1269 -1495 1754 -147 -1693 1056
1256 1056 586 -1714 837 1438 -1648 -258 1719 -628 -953 1699 -109 -1114 960 215 -1164 189
1272 189 467 -950 -288 1219 -374 -379 424 227 -483 -68 265 -222 109 100 222 -120 169 420 -174 75
1292 75 371 254 -296 -171 416 -336 -78 533 -55 -424 259 206 -517 -277 582 -505 -432 313 -235 -749 112
1313 112 53 -729 83 628 -199 -139 874 48 -507 423 306 -754 173 295 -557 -252 576 19 -19 128
1333 128 1009 -477 -376 262 -759 -228 21 -175 -278 495 -287 -342 -35 231 1807 342 609 364 -55
1352 -55 67 74 -649 -871 -450 -96 15 843 -332 -461 88 -78 -470 -1250 579 443 -709 316 559 -635
1372 -635 876 573 -157 -530 1057 37 -1310 699 643 -910 477 1198 -654 -51 1385 -319 -1031
1389 -1031 784 3 -1051 162 455 -848 107 566 -766 -121 1134 -201 -572 643 -161 -800 425
1406 425 -297 -560 471 336 -634 379 505 -277 599 -39 -735 360 303 -950 464 851 -699 -271
1424 -271 1176 -322 -298 1292 -447 -967 1263 249 -2041 728 1256 -1698 -233 1532 -1118 31
1440 31 1689 -1066 -1262 1856 -596 -1990 1550 840 -1795 872 1339 -1386 422 1599 -1834 -440
1456 -440 2105 -937 -1855 1764 279 -1499 1027 275 -1335 1051 771 -1845 476 1682 -1794 -761
1472 -761 1275 -698 -590 1217 -789 -719 2370 -376 -1895 1633 645 -1888 357 420 -1795 907 1176
1489 1176 -2224 512 2727 -1947 -1479 2807 -295 -1894 1526 -146 -1938 2214 509 -3084 1561
1504 1561 2926 -2622 -636 2834 -1225 -1105 2133 -1425 -1462 2942 -575 -2925 2501 1748 -2703 411
1520 411 2030 -1817 322 1514 -2429 -238 3053 -1789 -1887 2553 366 -1870 1311 311 -1081 1733
1536 1733 301 -2976 1319 2203 -2977 -663 2625 -831 -924 1892 -1389 -431 2735 -1168 -2818 2661
1552 2661 860 -3187 816 1722 -2100 607 1791 -2466 527 3228 -2520 -2245 3520 -501 -2955
1567 -2955 1667 421 -2244 1850 770 -2578 1474 2703 -3168 -1009 3147 -1158 -1750 1670 -671
1582 -671 -1004 2501 -516 -2352 2637 1344 -2758 452 1875 -1789 -199 1151 -1672 255 2539
1597 2539 -2059 -1219 3077 -10 -2364 1271 695 -1718 1026 159 -2279 1839 1842 -2806 -18 3118
1613 3118 -1309 -891 1926 -797 -1078 2276 -901 -2395 2510 922 -3019 1107 2110 -2104 32
1628 32 1778 -1777 -233 2128 -1778 -1468 2648 47 -2558 1557 1152 -1499 663 559 -1883 676
1644 676 1500 -2274 -356 2115 -507 -1391 1792 200 -903 1487 -451 -1174 1654 561 -2256 460
1660 460 1248 -1596 -343 1300 -725 330 1754 -1322 -573 2253 -687 -1732 1156 14 -1543 961
1676 961 313 -1508 1080 1342 -1771 119 2062 -1117 -1327 1219 -223 -1247 1069 -171 -1216 1366
1692 1366 724 -1547 557 1612 -1242 -397 981 -646 -473 1135 -550 -674 1183 107 -969 816
1708 816 626 -823 111 608 -916 191 288 -734 -161 789 -136 -321 676 -223 -565 261 -834 -432 935
1727 935 109 -1179 1018 881 -525 575 102 -92 -204 440 -773 -135 687 -299 -558 1051 131 -1002
1745 -1002 847 1210 -104 308 713 -686 -971 437 37 -310 506 -323 -713 315 618 -570 179 188
1763 188 -278 -440 579 -231 -658 124 -192 -585 84 -6 -645 -68 561 183 107 84 11 152 35 -329 991
1784 991 -238 124 421 -93 -326 33 -45 -360 8 -94 -634 695 449 -749 69 812 107 -335 591
1803 591 -33 -668 -172 649 -649 37 57 -165 -867 197 -425 -386 303 -54 -398 -529 189 181 -376 48 552
1824 552 -299 789 230 -469 -213 726 -334 -231 234 -333 -748 -448 250 -70 -275 377 38 79 440 398
1844 398 -29 -200 587 43 -356 892 390 132 416 100 -482 -483 720 -72 -23 374 160 -767 -175 265
1864 265 -257 -249 441 63 -205 228 363 -677 -121 314 -312 -304 108 -176 -405 416 366 -376 135 272 -93
1885 -93 -124 213 -404 -274 343 -9 -716 67 464 -158 -199 139 105 -133 258 -364 -388 6 77 -288 132 230
1907 230 282 231 -69 117 -54 -221 -178 223 -512 -320 493 -209 -349 630 257 -250 525 351 -659 -4 465
1928 465 -596 -294 604 -333 -266 854 74 -764 646 522 -704 12 810 -569 -297 486 -217 -582 786
1947 786 -192 -737 567 547 -850 149 485 -567 -152 483 -364 -57 593 -653 -286 668 34 -740 263
1966 263 127 -577 358 -131 -704 578 388 -769 454 643 -233 140 345 -809 184 806 -987 -611
1984 -611 1153 -110 -993 763 477 -608 452 387 -1165 362 947 -1480 -478 1336 -572 -1122 1011
2001 1011 62 -826 993 178 -1152 1008 925 -1755 -280 1402 -610 -784 1121 70 -530 1100 -678
2018 -678 -1217 1183 443 -1679 169 1193 -701 -73 463 -294 306 778 -971 -311 1486 -132 -1042
2035 -1042 444 232 -456 524 -196 -631 1200 418 -1513 207 1308 -896 -705 519 -639 -49 974
2052 974 -964 -527 2029 -251 -2125 935 1025 -1332 50 649 -1037 456 937 -1630 -427 1972
2068 1972 -370 -1629 1379 793 -1367 270 357 -1110 747 840 -1683 250 1873 -848 -832 893 76
2085 76 -537 697 -559 -853 1166 288 -1578 569 872 -1159 -229 609 -210 183 293 -1081 51 1458
2103 1458 -774 -996 972 590 -865 571 -12 -648 914 62 -1665 520 1543 -1536 -645 1113
2119 1113 -369 -586 869 -559 -545 1485 -140 -1574 961 1083 -1580 -268 1367 -745 -93 1052
2135 1052 -629 -431 1382 -775 -1459 1142 391 -1207 207 933 -685 481 594 -772 28 1326
2151 1326 -914 -742 907 -36 -910 377 154 -319 752 14 -829 652 479 -732 -19 541 -607
2168 -607 -212 540 -506 64 671 -301 -466 1021 58 -975 619 227 -622 90 157 -561 158 1110 -884
2187 -884 -314 1083 -132 -728 701 94 -778 600 -40 -975 624 940 -1096 35 984 -264 -514
2204 -514 915 -21 -565 575 -52 -651 485 550 -684 173 545 -318 -23 366 -285 -19 473 -271 -68
2223 -68 325 -72 -374 251 -54 -371 -110 -179 -209 295 315 -507 65 327 -218 -153 317 -382 79 401 59 -162
2245 -162 300 -47 -376 488 230 -214 113 249 -232 -116 581 -255 -178 395 -169 -140 23 105 -538 133 269
2266 269 -282 17 308 -46 -200 259 -49 -395 99 88 -319 268 432 -117 -115 119 -24 -344 76 217 -57
2287 -57 191 83 -75 -99 1 39 116 -15 18 99 -236 -35 -186 -102 87 43 40 -5 168 -3 -300 153 177 -12
2311 -12 -16 257 -7 34 113 63 -222 98 12 -94 -59 396 171 -164 126 -105 -78 137 216 -203 -34 252 -111
2334 -111 -180 394 57 -267 247 70 -251 276 23 4 164 194 -119 152 119 221 -223 154 -51 -62 10 142
2356 142 22 -42 65 -30 -122 -305 97 -262 -250 152 62 25 141 259 -11 176 161 71 -65 51 -195 -108 3
2379 3 135 111 -213 295 -117 -257 442 82 -58 -58 96 -242 -56 207 -287 -200 471 8 -263 225 -22 -93
2401 -93 7 228 -221 79 62 -330 94 -49 -126 -96 47 154 104 31 -108 -243 40 45 -25 279 29 -363 51
2424 51 363 3 210 26 -493 141 402 -403 -443 101 58 -175 328 40 -336 365 -138 -715 -2 436 -409
2445 -409 -188 537 -261 -423 335 -63 -236 566 -66 -727 458 255 -475 -216 479 -180 38 241 -43 -82
2465 -82 377 3 -460 607 277 -401 -201 211 -413 -77 229 -383 149 308 -313 -269 514 222 -382 284
2485 284 -30 -62 313 -212 -576 443 595 -556 30 638 -3 -162 349 -450 178 746 -316 -709 759
2504 759 477 -561 87 442 -437 120 156 -511 226 284 -692 -302 898 60 -651 144 145 -39 497 -106 -486
2525 -486 523 364 -889 -264 850 -191 -497 283 -94 78 541 -475 -427 799 103 -871 381 666
2543 666 -157 -81 175 -196 399 274 -754 -279 780 -204 -769 322 55 -196 233 -429 -389 577 298 -1271
2563 -1271 -118 693 -606 -285 404 -80 79 406 -573 -718 1055 120 -1142 151 602 -496 -325 103
2581 103 -507 228 727 -726 -36 989 -231 -1181 218 364 -460 -30 -294 -423 822 341 -587 50
2599 50 863 -277 -248 528 -142 -241 155 -335 -167 791 227 -708 149 550 -320 -174 320 -157 84 148 -692
2620 -692 -79 996 -146 -608 897 368 -469 236 -173 -321 532 -5 -865 277 880 -452 -262 535
2638 535 184 -295 58 -245 -314 566 31 -789 -82 584 -679 -166 675 -156 203 236 -569 -268 497 -460
2658 -460 -823 131 376 -480 77 345 -18 154 34 -380 252 407 -395 -469 450 1 -165 -21 121 -75
2678 -75 520 81 -505 398 332 -345 125 267 -152 216 260 -334 242 616 -95 -432 458 74 -551 -161 245
2699 245 -287 196 48 -297 250 353 -231 -206 435 32 -357 121 -388 -369 204 43 -329 147 294 -204 -155
2720 -155 328 121 -194 137 -172 -48 104 -37 12 209 122 -264 -4 265 -37 -212 62 -406 -12 100 -572
2741 -572 25 138 47 -74 183 60 54 49 -185 -223 205 269 -368 213 267 -29 -33 246 -57 -180 54 -72 -196
2764 -196 89 42 -108 38 148 -18 -115 200 215 80 78 82 -73 49 -217 -463 -442 -162 116 109 257 180 18 29
2788 29 -102 -24 -169 -67 -45 -263 58 -60 -247 -75 -4 153 61 14 126 276 -131 -129 153 9 -72 -8 150
2811 150 221 227 189 30 82 -114 1 -188 -223 -83 120 28 -102 19 151 168 -201 186 -185 -128 -96 198 -99
2834 -99 -26 -262 3 78 67 305 -5 53 -175 -243 -50 -136 -2 -28 81 304 76 321 181 112 -123 -49 39 -189
2858 -189 -166 52 -98 -99 145 -15 -3 274 -119 -215 -22 -202 -375 -96 -199 -155 -183 89 -134 4 -94 -57 -94
2881 -94 -19 49 84 -112 29 -47 -225 164 212 -183 470 164 -113 -89 151 11 -172 -215 -69 72 156 266 53
2904 53 -70 43 19 101 152 -113 -60 -268 70 -30 -76 50 -26 102 -21 -52 -33 22 2 -63 -66 -396 -186 70 47
2929 47 -140 186 -96 -4 -101 84 -55 85 -202 -207 204 84 -20 106 55 31 173 27 -7 -106 214 -151 -622
2952 -622 30 3 -14 -105 205 125 109 326 3 288 79 -184 -258 -120 -58 -160 -36 289 -184 176 97 -163 -1
2975 -1 275 -95 -56 -159 -43 -19 -29 -229 376 146 -142 -269 211 222 22 106 -165 -50 273 -457 -467 253 185
2998 185 -280 213 207 101 116 -151 -128 74 -14 -434 -200 171 308 -195 -80 277 71 148 40 -314 45 281
3020 281 -209 -244 4 90 -92 85 141 -28 90 -231 -147 129 -24 -283 -220 -60 185 134 64 55 287 278 6 -295
3044 -295 162 154 -431 -183 141 48 46 -219 235 433 203 -244 -61 274 -138 -465 -69 253 95 278 -33 107
3066 107 629 231 -106 -174 280 6 -341 -129 -100 198 417 -196 278 351 244 -130 -191 -80 -194 174 -289
3087 -289 -407 117 -46 -347 164 453 263 -198 -75 63 -63 -89 -376 26 192 -111 -285 290 356 -101 -71
3108 -71 -196 138 339 -139 -640 -53 519 -55 -83 268 10 146 213 88 265 240 72 -669 -32 263 -220
3129 -220 -202 211 267 163 144 -251 102 297 -284 -318 190 -15 -368 -265 -20 138 120 193 -495 344 432 -309
3151 -309 -75 269 267 87 -151 -79 21 590 140 -227 207 242 -293 -187 273 -71 -81 -64 -226 -113 338 -167
3173 -167 0 300 -31 -304 -137 124 86 52 43 -424 202 213 81 -15 415 239 -189 -72 -143 47 53 -213 -310
3196 -310 242 317 -260 40 334 197 -78 64 -55 132 171 -249 -18 167 180 -222 -74 87 -72 96 -14
3217 -14 -184 93 172 -423 -96 23 165 104 122 152 154 384 95 -63 172 345 -221 -51 -108 -37 -227 65 50
3240 50 279 242 -43 74 -96 20 -297 -67 181 -253 140 164 99 229 71 -224 44 90 17 -38 175 -93
3262 -93 -42 121 -31 2 106 229 -55 158 134 -89 -333 -48 -331 -45 42 -57 -252 66 123 170 115 212 158 -259
3286 -259 -257 -86 -19 78 54 8 323 -29 148 167 66 -288 -81 -62 -281 -181 70 -129 156 -5 230 -26 -26
3309 -26 -78 27 -50 8 81 14 1 61 91 292 55 -85 339 41 133 16 -53 -131 -45 -13 89 -158 -67 39 1
3334 1 -105 100 36 138 7 32 -69 -62 135 -25 78 317 -134 -24 -99 -43 26 -147 -18 -165 -6 -113 89
3357 89 -21 197 173 154 81 40 -32 -54 -20 273 -7 18 -48 36 150 60 66 124 236 -62 39 101 -66 -87 180 -19
3383 -19 -77 -31 154 -67 103 432 -63 54 -12 -54 -297 -95 -66 -197 -195 83 156 -238 113 -67 31 230 -174
3406 -174 -67 -108 -152 -112 262 92 283 277 -53 29 50 2 -112 -225 -22 -210 -47 -100 -153 183 146 66 -177 70
3430 70 129 -322 100 23 -374 -282 85 -39 226 517 -167 57 122 20 44 3 -185 -213 110 80 -232 -34 64
3453 64 -103 229 249 -421 -28 279 -165 -122 179 -93 2 -16 79 -262 109 38 -36 32 77 -137 -58 201 -221 23
3477 23 292 -90 128 -56 126 146 169 -42 -16 249 -91 -284 67 72 -127 8 228 37 -76 209 -272 -141
3499 -141 299 -156 -656 161 225 -52 160 155 -268 188 341 -207 -195 170 -113 -317 205 -91 -150 194 261 -544
3521 -544 767 94 -119 488 -520 -982 -426 -362 475 146 -324 -217 -766 -456 460 -153 60 131 -395 -120
3541 -120 769 -440 -45 331 -142 -89 827 -15 -270 423 138 -310 90 172 -301 172 -56 -283 284 500
3561 500 -153 -177 441 14 -388 31 -7 -154 -53 -128 -361 228 353 -275 -181 542 -86 -103 227 -70 228 251
3583 251 -162 -387 233 141 -238 149 218 -16 142 212 -263 -64 259 -353 -71 334 168 -343 186 98 30 151
3605 151 -126 -113 206 162 -680 104 421 -192 16 262 -76 -119 320 -251 -355 326 -386 -372 291 134 -170
3626 -170 221 -13 -5 296 95 -240 -173 164 -86 -385 35 357 38 169 -158 -109 414 180 -203 -46 233
3647 233 -294 -48 336 31 -192 266 -175 102 33 75 -187 248 356 -767 -227 -210 -545 335 177 285 204
3668 204 70 -43 -309 -118 36 -438 61 126 -199 -102 231 -267 349 254 2 8 174 -64 -195 -7 69 -214
3690 -214 150 -156 -161 250 549 67 -118 526 -320 -34 7 -48 20 422 -82 -67 350 218 -106 95 185 -233
3712 -233 9 207 -221 -139 102 -537 44 267 106 160 256 27 -57 206 37 -124 -12 233 -269 -53 54
3733 54 60 -121 378 158 75 303 45 -18 -126 157 -304 106 64 -71 25 433 -2 202 194 -82 22 120 72 14
3757 14 150 110 -18 -73 92 -7 85 -250 -75 -91 59 -283 -359 93 -79 58 -39 -63 69 57 204 -140 -95 29
3781 29 -216 -147 48 178 -34 55 -218 -7 58 -30 -93 -49 24 -147 37 -78 -102 -168 109 -310 90 81 -90 116
3805 116 90 -51 96 185 -81 -50 -18 -28 195 115 58 81 15 94 -467 158 301 -261 163 131 -252 -262 -3 19
3829 19 -240 219 27 96 -89 -233 33 -105 62 41 95 -7 -98 -138 137 -160 73 111 155 -391 11 -144 211
3852 211 198 159 -61 112 196 136 16 81 189 -242 -194 88 -243 -112 233 -178 34 89 -23 -124 184 -123
3874 -123 -288 103 -222 -193 -34 183 49 35 76 -206 116 156 -90 174 139 -136 -67 78 106 7 270 -100 -37
3897 -37 -25 -26 154 124 46 -311 187 -246 -172 -66 59 208 114 111 -30 -85 73 -194 -47 -198 86 -106 0 -242
3921 -242 -28 -20 -37 -130 -52 -24 78 -159 186 -143 -257 11 19 -66 146 90 8 39 157 251 -54 191 135 -49 -138
3946 -138 176 147 115 231 100 -91 0 144 -72 -268 -117 37 -96 -382 -155 347 15 21 85 289 -150 91
3968 91 107 -70 262 58 -78 34 357 -400 39 346 -144 -64 -20 -15 21 69 -71 -391 -29 136 195 216 74
3991 74 -311 35 275 -35 -172 54 -23 -385 -30 -89 -50 -50 29 -261 60 329 -154 -61 226 -38 -262 28 -13
4014 -13 -127 61 -2 -160 159 -214 -245 124 -8 -233 -133 -26 -17 -138 159 77 -34 242 -87 -91 270 -24 -188
4037 -188 -142 -43 -148 360 -64 -130 -20 167 -98 -145 -19 94 -128 21 134 -302 240 115 28 -94 123 -304
4059 -304 8 127 -31 -266 148 -50 16 275 40 -198 -46 175 -457 166 289 69 -40 38 -360 -178 134
4080 134 -55 -321 325 -4 -79 34 181 33 192 26 -37 -190 270 -170 87 353 -110 -213 266 -357 -38
4101 -38 93 -4 -44 271 71 -390 78 17 149 -141 -4 -54 -255 -11 -392 -29 223 -109 -178 237 42 21
4123 21 -124 -24 -118 -117 220 18 -22 131 -167 -148 324 81 14 302 209 -245 227 22 -430 235 179 -76 145
4146 145 122 11 93 -24 -174 -300 184 143 -318 153 278 -199 -97 189 -65 82 340 15 124 55 -5 -198
4168 -198 251 -190 -40 -70 43 -24 72 188 22 184 246 -67 -121 167 37 -157 99 63 -48 27 154 -317
4190 -317 36 349 77 -117 88 17 -45 -196 -245 1 95 10 -246 270 251 -83 -84 136 55 201 52 -249 12
4213 12 -71 -151 -267 -74 120 -129 7 267 33 72 154 49 177 217 -120 0 4 55 31 57 29 -175 57 189
4237 189 -23 79 60 -192 104 -61 104 -26 94 40 -65 188 -113 -115 163 -69 51 -82 132 -24 164
4258 164 -295 120 32 68 -244 -180 -45 -40 -314 154 152 12 20 -48 -55 82 -149 3 -84 68 -20 -27 32 33 127 3 72
4285 72 -90 -51 -62 28 156 1 116 77 252 -55 63 22 -119 23 90 55 -25 24 28 110 120 -16 -54 122 -55
4310 -55 53 -39 119 -45 -39 2 -36 -236 -71 61 -43 -238 111 -161 -169 169 -100 174 -113 -119 136 155 41 33
4334 33 47 -125 -184 -179 -210 -53 -205 118 -93 100 -51 -158 -32 242 59 39 -264 -185 -311 -120 67 -174 115
4357 115 20 -64 -68 -188 -135 -151 347 -62 288 185 27 -67 -90 -6 -85 172 236 -131 181 -164 123 144 -77 -200
4381 -200 -302 -33 -203 -94 239 89 -151 152 -148 -29 155 177 -86 43 63 207 9 -28 -56 -155 -22 -12
4403 -12 -85 -36 -133 -164 87 89 -45 -190 39 -86 -59 181 140 -30 -142 219 -52 51 -11 -49 121 87 203 50
4427 50 -65 31 250 5 -47 -84 -219 43 -193 216 -61 61 -41 56 23 73 68 -191 -189 278 -15 -69 -127 -46 60
4452 60 102 -53 150 195 -179 124 250 -276 62 -97 143 -37 -113 -21 -21 176 103 67 136 18 -103 197 -145
4475 -145 110 -3 157 193 -122 367 -72 -35 73 -21 -178 -117 286 -20 277 34 15 19 -72 180 62 195 -363
4498 -363 32 112 130 -111 60 -173 -317 -189 285 56 -209 -65 -15 15 13 -106 -21 147 32 -22 -296 -343 -148
4521 -148 51 -49 -144 -4 -10 112 101 -239 -118 151 -69 -51 20 13 -26 -85 161 -231 -114 -64 -40 4 -146 -153 68
4546 68 113 -24 113 41 -33 -20 -56 219 -277 -48 -119 -82 42 205 158 -124 174 -115 121 -160 28 -117 -201
4569 -201 109 159 85 -116 183 -115 150 -54 -320 186 95 4 4 169 -196 125 154 -60 -237 126 -255 -198 8
4592 8 123 102 -146 185 -50 -126 3 120 95 -27 -232 125 -225 43 -16 -9 20 34 -232 -25 -94 79 -111 -266
4616 -266 -130 83 130 23 -55 38 -45 -49 45 -13 112 6 24 -126 200 85 -172 139 -41 167 86 -49 40 154
4640 154 105 -222 81 175 -133 3 39 -95 94 274 -153 -123 128 45 -150 9 139 -138 165 -168 -222 -132
4662 -132 197 87 -101 -255 -247 -8 -46 126 -221 -71 -62 -140 -59 -81 -118 90 215 -197 103 166 -273 -62 -262
4685 -262 -32 -120 -66 -175 7 27 5 -12 -107 -89 197 59 208 -175 227 78 -30 -97 192 10 -180 29 -51
4708 -51 -94 -52 33 -122 91 -31 -27 25 36 -154 -62 49 -27 -220 32 65 -164 12 145 194 176 22 66 -61 61
4733 61 -97 122 101 -101 162 -45 -45 172 32 -80 -219 96 -30 -342 115 14 -90 -28 -8 76 150 89 -136
4756 -136 -14 -102 59 69 -72 -105 -148 9 -6 2 -60 193 -167 -214 -122 127 -305 -99 -11 -110 21 -45 62 2 -16
4781 -16 -59 -54 -273 17 145 61 128 -8 -40 -72 164 54 243 95 110 128 -94 96 -38 188 -111 88 123 -246
4805 -246 100 -219 196 -197 -56 66 -113 -135 69 -129 32 93 11 116 -185 -188 -38 -96 -210 84 64 152 47
4828 47 -22 14 -281 -88 163 -184 -78 29 416 -52 -102 -242 -72 86 49 -44 -75 261 -42 -163 136 -53
4850 -53 -164 123 -172 54 183 398 -18 127 -312 -128 -241 -110 59 -93 -58 44 269 84 -11 -20 41 -10
4872 -10 -176 -234 83 183 -60 31 358 8 -135 180 -54 -29 -76 189 32 -169 148 -189 -106 5 233 20
4894 20 105 -59 -28 153 -48 32 -287 -224 40 -39 -32 157 77 180 8 -81 -273 -18 394 -115 -127 151 -144 74
4918 74 18 207 -114 -236 47 -57 -184 -193 260 42 -70 33 46 -62 -113 -2 36 -23 -89 -144 195 -93 50
4941 50 104 -83 140 24 -7 -87 21 257 94 39 39 188 199 -85 -26 80 -88 -24 52 88 161 -129 150 13
4965 13 4 -128 -56 68 94 -276 50 58 -106 -144 -73 -78 -22 -166 -2 239 311 -33 -112 44 9 64 71 -98 118 -4
4991 -4 -88 38 64 71 -9 51 -193 0 -51 -76 -205 -282 125 37 -80 -22 131 82 27 -211 -3 87 17 25 -180 52
5017 52 127 -132 6 188 -164 342 -112 82 115 -129 270 262 -143 150 -22 -45 382 -74 220 -107 -129 -15
5039 -15 131 -84 156 66 -171 -44 3 -16 68 -16 31 33 26 155 -69 72 -181 -174 -37 -16 54 -30 5 -98 89 35
5065 35 101 -13 -112 -106 -112 -54 -102 110 -99 110 37 -151 -48 48 89 65 87 180 41 18 -19 89 -6 102 -384 -20
5091 -20 -38 -143 -160 -32 111 -221 -57 -166 -46 -292 -82 31 170 150 -132 45 -68 -186 93 337 322 -75
5113 -75 92 -17 98 -122 41 52 80 132 -37 -30 228 352 -220 -39 -98 26 -40 7 118 -166 -16 130 -165
5136 -165 268 17 -58 -32 187 95 79 245 20 39 101 40 -117 -148 326 -158 199 32 -291 -194 214 -40 55
5159 55 -35 -176 55 220 -3 -77 -119 13 -8 -58 -124 -111 -162 -113 125 76 -58 60 136 77 -111 26 44 -113 -117
5184 -117 104 -48 -57 138 46 -167 -78 197 105 -16 312 -21 -246 66 -52 127 66 -55 67 -67 -176 -8
5206 -8 -24 -109 -53 -4 203 41 96 49 119 -105 102 27 -219 381 -78 -66 108 -116 42 15 -169 -1 -90 -351
5230 -351 -202 234 160 -192 101 108 99 -235 -23 -73 -103 177 -266 -50 -179 47 2 -81 -91 78 40 -42 -16 -58 -66
5255 -66 -107 -150 -235 337 56 -78 -87 -123 26 190 -131 -48 -2 -19 -189 119 -30 6 270 -97 -163 34 -66 -238
5279 -238 -58 135 161 19 -7 -193 -25 235 155 -10 105 -39 -6 -3 150 -256 106 188 79 58 269 -148 -49
5302 -49 -98 18 52 99 103 -377 -98 -113 226 73 10 202 32 22 157 -22 13 118 49 77 141 4 -101 83
5326 83 53 -106 -187 18 128 -13 -118 10 39 24 -6 14 -285 103 112 135 -38 -171 -56 -126 -114 -25 25 -152 28
5351 28 -88 -186 -180 -227 -35 -96 280 219 -4 205 178 107 155 302 3 -131 176 0 -133 215 -17 24 45 141
5375 141 19 28 -150 87 111 -189 41 -14 97 -241 115 52 268 124 -64 247 -57 -13 93 73 -117 -245
5397 -245 -24 177 -116 130 113 -153 -250 39 32 -14 95 67 151 -102 26 14 -77 -4 -115 62 161 -180 -170 170
5421 170 75 159 128 -200 90 37 217 -399 -1 -90 -54 69 93 -118 9 116 9 -77 145 -227 -80 -103 11
5444 11 -19 -287 160 31 -140 41 173 -166 -68 77 59 -58 -123 87 -108 48 -97 -236 71 -211 -313 -242
5466 -242 -6 5 -68 154 -90 -256 -203 -124 -194 191 -49 -78 138 -140 -3 -119 -166 -135 -258 191 -264 -45 -133
5489 -133 -162 -55 120 -94 183 -119 -151 256 -39 129 211 102 -60 -42 -27 -125 -144 -20 5 113 -13 -43 111
5512 111 -11 -102 -185 -58 -61 0 -165 57 78 -95 211 151 -161 -59 143 -62 195 361 -50 9 -258 253 -117
5535 -117 134 185 -72 96 -239 183 -55 -100 24 -83 -112 91 173 147 -279 -100 169 -45 25 31 115 29 89 76
5559 76 -353 -232 134 -194 331 -21 -163 49 32 56 366 -169 -98 -2 -43 42 13 188 -89 -28 -52 -217 -40
5582 -40 -302 -289 -82 -113 68 -287 101 -101 -25 -104 73 179 16 -20 -71 -56 85 52 -216 -29 -39 14 91 -116
5606 -116 -196 265 -173 -147 -151 225 -59 93 34 47 113 70 78 -122 -75 -62 96 61 -6 3 -28 -71 107 116 -92 27 114
5633 114 -92 7 -49 18 -11 51 217 276 240 -16 -184 -102 5 -92 -202 153 48 -68 77 131 163 -18 -217 51
5657 51 -138 -66 33 122 -23 -76 -64 176 199 -176 131 109 -221 90 -119 141 -153 33 299 -2 152 115 -127
5680 -127 190 -19 124 -59 -10 49 -152 188 131 -105 168 21 87 -117 -200 59 58 169 104 181 67 -81 -71
5703 -71 16 125 274 -42 58 135 80 41 95 25 282 -97 -76 82 -91 -51 64 -77 -223 68 -94 0 309
5726 309 181 14 24 247 -87 -47 -83 -264 -110 136 -27 110 399 -211 -97 191 374 14 49 -196 -28
5747 -28 4 3 -99 32 -131 7 150 -95 36 -36 83 -10 20 -210 241 73 -96 -305 -80 -52 -109 -61 79
5770 79 -102 55 133 -53 144 -220 78 94 -14 16 36 72 -65 36 99 169 11 11 -173 -260 -62 -46 -49 -116 -198
5795 -198 216 52 -96 -53 -36 -210 69 69 62 -131 -69 -113 -245 -63 -60 6 75 -5 162 82 118 70 -205 246 59
5820 59 128 -248 25 -14 129 156 94 58 -74 -78 -57 -298 -65 40 26 -133 -6 156 272 103 11 91 67 -57
5844 -57 -50 -268 -172 -49 254 -83 102 -79 113 267 -318 -32 -123 230 -40 274 117 52 5 46 -152 -168 -135
5867 -135 291 8 241 64 1 146 13 -86 -73 -18 70 -213 51 -17 -208 -127 243 -239 87 -142 -62 -249 -38
5890 -38 100 -155 88 -11 -92 20 -184 -39 239 -154 12 -124 -128 -23 -162 20 -3 -200 -73 122 130 -62 197
5913 197 7 -10 -76 87 87 -182 166 32 -81 81 -139 47 -30 -130 -31 -7 -198 172 -86 5 -44 87 12
5936 12 1 64 80 -180 -18 -218 96 71 -29 143 -98 -102 -46 -113 9 -37 -58 94 57 126 -83 471 155 59 135
5961 135 -73 -146 -26 -116 58 127 261 188 -153 50 424 -64 -76 -107 -17 -8 -2 -19 136 186 35 -230 -26 -216
5985 -216 -155 34 -179 -233 166 114 -82 -38 -96 54 -14 111 -148 -127 -95 -39 -20 -126 195 19 107 -108 129 17
6009 17 -27 -94 33 62 -28 106 104 -41 0 18 78 -146 -155 45 158 -100 -47 96 -34 144 -16 206 -88 40
6033 40 14 138 48 78 124 -278 -85 -13 190 -84 114 -17 -6 -17 -55 -11 -318 177 -123 -130 12 -18 38 18 142
6058 142 151 -21 204 -1 104 0 -123 -44 -113 36 -61 162 97 16 -29 -27 -11 129 -80 -3 25 -62 -20 -40 285
6083 285 190 -4 23 -189 -245 120 -66 -195 59 85 2 93 -17 45 -127 -83 146 56 -47 -135 127 -184 -112 2
6107 2 27 234 -115 69 123 -172 170 -33 0 -131 148 -5 105 137 -135 -109 76 -102 38 -13 61 16 -212
6130 -212 106 -132 -44 -119 -94 -53 265 278 73 113 -19 -92 86 -101 -108 29 -6 -305 -100 15 -34 290 8 -38
6154 -38 -257 103 -80 -93 114 -246 53 154 113 -60 139 -69 -91 -15 311 7 48 73 25 -364 57 240 160
6177 160 138 -170 11 95 -148 -81 -258 26 -49 -102 36 -70 36 -271 39 -79 -63 -160 106 -71 230 -146
6199 -146 237 28 -144 -39 142 292 -63 -18 -85 -144 253 105 133 -151 -204 4 -3 157 -114 -5 -40 -153 -83
6222 -83 33 106 125 75 -109 84 354 45 -25 -13 90 -14 27 142 -160 164 172 -14 -86 38 97 -157 74 -120
6246 -120 86 -152 24 -101 0 16 -138 126 -81 -129 148 -62 187 -18 -83 131 -303 -62 125 -72 -241
6267 -241 -28 -145 -45 95 135 -90 85 -44 100 25 96 -103 205 93 -49 39 63 289 155 161 10 156
6289 156 -270 -129 -263 86 97 119 113 -36 -5 -208 -65 112 -108 -186 -110 -17 143 -74 -49 -107 81 33 19 -69
6313 -69 -132 -529 2 82 -58 -59 -6 200 -4 -56 -25 -69 191 -108 169 238 120 102 -339 135 119 300 234 -7
6337 -7 38 -28 148 147 -151 163 14 -43 -223 -167 -51 -277 48 -104 49 81 -51 149 -72 136 53 45 127 -155
6361 -155 -11 -70 -96 -115 48 -133 -66 -54 13 -148 -54 -147 -119 41 -97 -12 -55 -195 32 -13 83 282 303 -79 77
6386 77 -306 76 219 56 -86 -36 -84 49 -234 238 86 220 179 163 -87 -144 20 45 331 -100 -177 -180 -105 -6
6410 -6 -35 -145 23 36 -246 -42 38 49 255 -300 -43 -163 -114 -110 -85 -39 -127 -99 -68 -27 -97 261 -38 -45 133 -123
6436 -123 137 103 -73 104 127 100 -17 -75 76 -54 -67 -242 -126 113 102 170 -18 -172 -29 -23 87 -352 64
6459 64 -60 143 35 158 -198 59 -58 -61 -33 -68 1 230 -54 64 228 128 27 59 317 -65 83 36 -39
6482 -39 -160 -192 71 -67 75 147 -125 187 114 -67 -30 44 116 -55 -95 -179 -100 -180 33 161 114 78 -133 65
6506 65 -80 70 103 155 -200 -53 -103 202 34 -63 11 283 -39 40 263 45 104 95 43 -198 -6 147 119 -78
6530 -78 67 30 14 51 -93 204 78 -142 21 345 -89 -200 -147 14 82 -158 -134 -241 -195 13 -101 -196 63
6553 63 75 216 -150 103 67 182 -243 206 -44 11 69 -135 26 -165 31 220 -82 80 147 67 179 -14
6575 -14 -21 109 -109 13 -90 33 -165 -62 21 -104 111 206 -106 90 -81 -62 -164 -59 -94 -140 1 -27 173
6598 173 78 -30 44 118 92 -55 -43 161 120 135 90 -172 77 -123 135 2 190 -86 54 141 30 81 -23
6621 -23 114 -134 -72 -246 110 -20 -6 -265 -152 45 -33 -325 5 10 -257 80 -28 -224 262 173 -195 -257 59
6644 59 43 -346 -153 -16 13 -101 45 42 -52 61 -49 20 255 -25 -16 119 86 221 93 182 118 -20 -228 -95
6668 -95 161 -38 -19 -20 38 351 150 -38 -54 201 -60 -96 -167 37 -58 139 99 66 -41 -163 -2 -172 -197 194
6692 194 31 267 -113 39 95 -148 38 62 140 30 41 -24 -64 -101 -75 -22 -263 -175 -6 -43 194 189 36 263
6716 263 303 -32 202 -171 5 242 0 59 -183 -73 49 8 -193 141 -21 37 -18 21 67 -142 -24 162
6738 162 -93 -207 -18 42 -87 -46 74 159 75 -48 -91 -260 187 -220 41 174 -132 -30 125 59 4 -15 24
6761 24 20 -101 58 -66 -25 97 291 -77 36 112 -225 63 35 -61 -20 105 -136 116 -136 -28 55 -93 88
6784 88 -86 2 312 157 125 141 390 65 32 54 20 104 7 269 221 -196 -90 -48 177 28 20 -202 6 38 21
6809 21 28 64 -76 -268 -96 173 -100 82 96 101 14 422 85 -40 -53 293 266 -118 -110 -42 94 56 -17 -148 -14
6834 -14 69 -183 65 -11 220 -126 26 18 107 26 -60 146 -27 53 199 -153 -230 83 123 58 -106 56 -107 -28
6858 -28 -151 -43 146 27 124 112 -223 109 42 66 -90 51 235 68 -147 -68 133 -95 69 -7 -44 9 12 109
6882 109 66 -1 208 -84 6 -116 74 -63 70 33 22 -48 -124 133 62 69 -120 79 7 -44 -111 -243 77 -54
6906 -54 -69 -115 160 -121 47 -125 -64 100 -159 -164 38 89 -62 -128 202 31 -101 -16 11 -98 -185 79 -111 168
6930 168 -93 -141 -22 -16 32 -113 81 -254 -45 123 -26 105 204 30 100 186 -37 31 -117 54 106 163 4
6953 4 111 -102 99 113 151 -45 -19 -24 107 -217 -147 195 -76 -68 -93 81 -185 148 49 189 -331 -37 -6 -329
6977 -329 70 192 -148 -30 -4 -93 93 -123 75 109 -116 -71 3 -39 63 14 -85 89 103 -16 -168 1 200
7000 200 -190 -114 52 -77 79 199 84 81 -155 -99 -161 -92 153 143 114 81 5 -42 -83 181 -54 -203 4 -96
7024 -96 -45 38 -79 -127 200 -8 -84 97 -119 259 -192 85 -118 270 9 43 64 101 142 -201 73 -53 -91
7047 -91 -165 -238 244 -78 30 211 29 137 -294 49 63 -145 -120 93 175 -70 90 -163 -94 93 -24 102
7069 102 -27 91 -14 80 -201 -56 5 211 128 -59 114 -5 94 81 87 142 -28 -126 -78 182 257 -37 19 19 -97
7094 -97 127 31 -192 -93 -59 -98 -240 -536 35 -4 4 101 -142 -102 63 -26 29 97 3 175 120 -69 4 103 -33 93
7120 93 247 -65 32 -39 -68 3 -166 -47 -19 -42 43 -64 116 -135 -42 -69 -134 191 -218 41 132 67 6 83 -107
7145 -107 173 -188 -85 -164 59 -153 -78 -37 93 71 250 -11 14 -126 42 26 -302 184 -315 150 -140 100
7167 100 -209 -49 236 -63 -7 176 157 208 36 -137 -148 -140 -265 18 102 172 37 -55 32 144 -139 87 195
7190 195 54 -105 182 122 105 167 -135 138 80 46 -142 77 3 71 89 -13 -104 -129 32 170 2 138 100 -137
7214 -137 -33 -16 -88 -40 38 -142 -175 224 -62 -39 -91 237 29 -225 -209 -79 9 -102 -86 -107 18 -83 -11 -173
7238 -173 125 -82 45 271 -64 76 -38 -15 113 -246 65 -4 125 123 3 6 -83 -38 248 227 60 -52 190
7261 190 78 4 -34 -2 60 138 -152 -117 123 -15 -174 12 -189 5 -58 -129 -167 77 70 -253 224 -59 13 48
7285 48 -55 238 149 -106 -71 -62 -80 39 -5 -117 122 -253 -101 12 -19 98 40 251 30 220 -92 142 -133
7308 -133 -156 -48 -205 5 -131 77 -83 -56 -39 -2 182 -61 -31 6 8 15 -144 174 41 111 52 169 -125 67
7332 67 93 -25 93 21 64 26 207 98 -111 -115 48 -60 -10 -98 68 338 262 -66 -87 154 298 160 -176 5
7356 5 -59 26 67 172 119 172 -48 139 -202 -103 91 -205 -22 202 196 208 -192 -149 7 -82 165 91 -44 95 130
7381 130 -111 51 -50 85 1 86 28 -82 -147 -57 103 -20 158 24 8 -90 77 -165 -155 87 -114 -87 -38
7404 -38 134 4 113 -64 -369 266 -17 -138 209 82 136 11 14 49 50 -87 -278 -13 -85 -133 100 -101 -11
7427 -11 -57 115 20 99 150 -59 -105 -337 -178 -291 134 46 -91 -42 -114 -155 214 -187 -132 -400 -87 32 -104 -19
7451 -19 -226 55 116 77 -66 -167 47 219 156 -203 172 32 125 59 -23 -189 80 -8 -139 122 -65 -206 108
7474 108 212 -79 28 -193 43 165 41 211 -122 38 -83 127 -49 210 130 -83 111 60 120 37 -182
7495 -182 -86 -29 137 -181 141 -244 -42 55 0 58 143 174 181 -1 -27 117 -131 -204 189 115 -53 -210 127 -312
7519 -312 86 -159 -193 191 -309 181 55 -202 -38 -170 158 -272 84 -31 242 -66 234 -216 -200 0 152
7540 152 -11 -32 61 -243 59 -68 136 -30 125 -137 -4 40 -99 -86 67 166 229 123 -242 -168 86 -85
7562 -85 -6 -61 126 -59 -270 -101 6 -72 306 -282 -16 -51 -190 21 -136 221 -25 6 -12 226 -16 131
7584 131 189 15 -91 -148 -30 45 134 77 181 -56 -131 153 -4 -99 -166 -143 -40 175 -105 -45 -1 -34 86 237
7608 237 -99 -32 -404 132 77 65 32 119 -96 -155 -77 -143 62 -80 -44 57 -148 39 28 -141 125 -382 -84
7631 -84 333 -93 -127 -54 -65 64 125 179 -293 92 -78 -71 90 -133 59 -213 82 -27 -58 -281 -228 161 175 -30
7655 -30 -118 -124 62 -12 52 224 36 231 -23 -295 155 -139 -4 48 -91 -243 -79 270 -55 135 -22 174
7677 174 -25 -69 -42 179 239 119 -9 38 24 153 24 -142 -124 -71 -61 -48 -195 150 -68 33 88 -33 -33 42
7701 42 -168 191 -40 -66 221 167 151 120 -229 -233 39 23 -29 -22 -94 17 453 -70 -25 2 289 171 -182 -24 -123
7726 -123 -59 146 102 -129 1 301 -94 -246 -262 -4 -54 20 -116 -35 -69 -157 120 162 64 167 -38 -116 158 26
7750 26 24 -207 61 36 -38 -51 -148 3 -149 -372 -27 28 -250 17 69 17 -152 65 -33 -9 -44 -243 105 -230
7774 -230 72 -23 23 -137 152 51 107 39 -196 -166 -76 228 0 -90 112 -74 -31 182 -242 47 -53 -52 122
7797 122 -164 172 -64 -35 58 91 -81 -150 -57 -203 121 259 192 40 -45 95 -137 -10 41 -157 202 256 -133
7820 -133 44 7 -54 85 -90 0 136 -133 -196 -82 78 -49 29 52 117 -81 -15 69 85 -16 -66 20 5 -71 -4
7845 -4 -226 -2 -24 -138 -99 33 -251 -120 203 35 -71 105 136 31 -104 -66 27 -110 -135 -123 35 65 140 307
7869 307 66 -403 116 -131 -182 72 -1 92 -149 -66 -56 -222 -62 -126 -155 -214 26 93 -342 -26 -34 115 -105 182
7893 182 242 -53 -180 260 -16 -103 97 163 -24 221 -250 58 -137 -96 104 153 165 81 204 135 205 141 -203
7916 -203 277 144 56 351 -192 -26 -298 -53 -203 -14 81 -228 -134 -151 215 119 -24 -55 -128 111 -167 -208 28
7939 28 -42 -100 89 82 -267 -96 -66 -28 -230 -153 -8 177 17 -234 -86 -126 -148 -375 -20 -28 81 -86 -141 164
7963 164 16 -168 99 -96 127 -181 -195 -142 16 -237 142 -6 -90 -4 24 -102 58 -86 27 103 -195 -23
7985 -23 -99 -45 37 166 0 154 151 68 -67 -225 -60 248 302 -61 11 -5 -105 -38 -166 257 19 85 -1 127
8009 127 57 -289 -81 35 23 89 -50 -156 -105 197 171 98 156 40 45 -15 38 57 -236 -49 113 -113 116 202
8033 202 -164 14 79 5 -1 -21 -47 109 36 -64 244 7 224 253 65 2 -99 -64 43 -67 -1 -104 -3 -71
8057 -71 -196 -11 38 73 184 57 -236 8 -236 -80 -109 -194 11 86 -166 -117 -27 7 112 205 10 -314 -178
8080 -178 -115 -75 -306 -99 -217 96 186 -50 92 -137 27 138 278 -5 75 177 91 -8 181 -26 70 149 -138
8103 -138 -3 -85 52 3 11 8 -150 266 126 -180 51 104 -167 118 -163 153 -22 40 235 312 -202 167 222
8126 222 91 -30 17 -101 72 -90 269 20 -95 -151 114 -29 8 -253 125 240 -50 -299 -9 -197 -73
8147 -73 -147 -47 -80 -109 -19 147 -145 -238 -24 175 38 112 296 -36 -15 -95 186 -337 7 80 318 -116 -180 123
8171 123 136 -1 -78 16 320 29 -1 -72 -46 -11 -104 -8 -54 -187 -82 0 -12 -261 -22 -20
8191b0
##END NTUPLES=NMR FID
##END=
