##TITLE=1H_UK_26_2
 CD2CL2_CF3COOD
 8 sc, 
 17.03.2022
##JCAMPDX= 6.0         $$ Bruker NMR JCAMP-DX V2.0
##DATA TYPE= NMR FID
##DATA CLASS= NTUPLES
##ORIGIN= UXNMR, Bruker Analytische Messtechnik GmbH
##OWNER= root
$$ XWIN-NMR		Version 3.5
$$ Fri Mar 18 10:48:43 2022 Russian Standard Time (UT+4h)  she@DPX200
##.OBSERVE FREQUENCY= 200.131346
##.OBSERVE NUCLEUS= ^1H
##.DELAY= (6, 6)
##.ACQUISITION MODE= SIMULTANEOUS
##.ACQUISITION SCHEME= undefined
##.AVERAGES= 8
##.DIGITISER RES= 18
##SPECTROMETER/DATA SYSTEM= spect
##.PULSE SEQUENCE= zg30
##.SOLVENT NAME= CD2Cl2
##.SHIFT REFERENCE= (INTERNAL, CD2Cl2, 0, 15.7039)
##AUDIT TRAIL= $$ (NUMBER, WHEN, WHO, WHERE, WHAT)
$$ ##TITLE= Audit trail, XWIN-NMR		Version 3.5
$$ ##JCAMPDX= 5.01
$$ ##ORIGIN= Bruker BioSpin GmbH
$$ ##OWNER= she
$$ F:/spectra/data/she/nmr/H-F/1/audita.txt
$$ ##AUDIT TRAIL=  $$ (NUMBER, WHEN, WHO, WHERE, WHAT)
(   1,<2022-03-18 10:47:45.01 +0400>,<she>,<DPX200>,
      <created by zg, POWCHK disabled, PULCHK disabled
       configuration hash MD5:
       00 E9 B6 7A A2 85 ED C7 34 08 36 98 17 FE 4E 26
       data hash MD5: 16K
       5E 1D 2A 45 14 2C AC 38 BE 07 9B F6 97 EC 42 E4>)
$$ ##END=
$$ 
$$ hash MD5
$$ E8 87 81 FF BE F5 65 0B 89 38 EC C0 88 EB E2 6C
##$RELAX= 
##$RELAX= 
##$RELAX= 
##$RELAX= 
##$RELAX= 
##$RELAX= 
$$ Bruker specific parameters
$$ --------------------------
##$DU= <F:/spectra>
##$EXPNO= 1
##$NAME= <H-F>
##$PROCNO= 1
##$TYPE= <nmr>
##$USER= <she>
##$AMP= (0..31)
100 100 100 100 100 100 100 100 100 100 100 100 100 100 100 100 100 100 
100 100 100 100 100 100 100 100 100 100 100 100 100 100 
##$AQSEQ= 0
##$AQ_mod= 1
##$AUNM= <au_zg>
##$AUTOPOS= <>
##$BF1= 200.13
##$BF2= 200.13
##$BF3= 200.13
##$BF4= 200.13
##$BF5= 200.13
##$BF6= 200.13
##$BF7= 200.13
##$BF8= 200.13
##$BYTORDA= 1
##$CFDGTYP= 0
##$CFRGTYP= 5
##$CHEMSTR= <none>
##$CNST= (0..31)
1 1 145 1 1 1 1 1 1 1 1 1 1 1 1 1 1 1 1 1 1 1 1 1 1 1 1 1 1 1 1 1 
##$CPDPRG= <>
##$CPDPRG1= <>
##$CPDPRG2= <>
##$CPDPRG3= <>
##$CPDPRG4= <mlev>
##$CPDPRG5= <mlev>
##$CPDPRG6= <mlev>
##$CPDPRG7= <mlev>
##$CPDPRG8= <mlev>
##$CPDPRGB= <>
##$CPDPRGT= <>
##$D= (0..31)
0 1.2 0 0 0 0 0 0 0 0.06 0 0.03 0 0 0 0 0.0002 0 0 0 0 0 0 0 0 0 0 0 0 
0 0 0 
##$DATE= 1647586064
##$DBL= (0..7)
120 120 120 120 120 120 120 120 
##$DBP= (0..7)
150 150 150 150 150 150 150 150 
##$DBP07= 0
##$DBPNAM0= <>
##$DBPNAM1= <>
##$DBPNAM2= <>
##$DBPNAM3= <>
##$DBPNAM4= <>
##$DBPNAM5= <>
##$DBPNAM6= <>
##$DBPNAM7= <>
##$DBPOAL= (0..7)
0.5 0.5 0.5 0.5 0.5 0.5 0.5 0.5 
##$DBPOFFS= (0..7)
0 0 0 0 0 0 0 0 
##$DE= 6
##$DECBNUC= <off>
##$DECIM= 32
##$DECNUC= <off>
##$DECSTAT= 4
##$DIGMOD= 1
##$DIGTYP= 9
##$DL= (0..7)
0 120 120 120 120 120 120 120 
##$DP= (0..7)
150 150 150 150 150 150 150 150 
##$DP07= 0
##$DPNAME0= <>
##$DPNAME1= <>
##$DPNAME2= <>
##$DPNAME3= <>
##$DPNAME4= <>
##$DPNAME5= <>
##$DPNAME6= <>
##$DPNAME7= <>
##$DPOAL= (0..7)
0.5 0.5 0.5 0.5 0.5 0.5 0.5 0.5 
##$DPOFFS= (0..7)
0 0 0 0 0 0 0 0 
##$DQDMODE= 0
##$DR= 18
##$DS= 0
$$ [...]
##$SUBNAM2= <"">
##$SUBNAM3= <"">
##$SUBNAM4= <"">
##$SUBNAM5= <"">
##$SUBNAM6= <"">
##$SUBNAM7= <"">
##$SUBNAM8= <"">
##$SUBNAM9= <"">
##$SW= 18.0517287032376
##$SWIBOX= (0..15)
0 0 2 0 0 0 0 0 0 0 0 0 0 0 0 0 
##$SW_h= 3612.71676300578
##$TD= 16384
##$TD0= 1
##$TE= 0
##$TE2= 300
##$TE3= 300
##$TEG= 300
##$TL= (0..7)
0 120 120 120 120 120 120 120 
##$TP= (0..7)
150 150 150 150 150 150 150 150 
##$TP07= 0
##$TPNAME0= <>
##$TPNAME1= <>
##$TPNAME2= <>
##$TPNAME3= <>
##$TPNAME4= <>
##$TPNAME5= <>
##$TPNAME6= <>
##$TPNAME7= <>
##$TPOAL= (0..7)
0.5 0.5 0.5 0.5 0.5 0.5 0.5 0.5 
##$TPOFFS= (0..7)
0 0 0 0 0 0 0 0 
##$TUNHIN= 0
##$TUNHOUT= 0
##$TUNXOUT= 0
##$USERA1= <user>
##$USERA2= <user>
##$USERA3= <user>
##$USERA4= <user>
##$USERA5= <user>
##$V9= 5
##$VALIST= <valist>
##$VCLIST= <CCCCCCCCCCCCCCC>
##$VD= 0
##$VDLIST= <DDDDDDDDDDDDDDD>
##$VPLIST= <PPPPPPPPPPPPPPP>
##$VTLIST= <TTTTTTTTTTTTTTT>
##$WBST= 1024
##$WBSW= 4
##$XGAIN= (0..3)
0 0 0 0 
##$XL= 0
##$YL= 0
##$YMAX_a= 102851
##$YMIN_a= -88861
##$ZGOPTNS= <>
##$ZL1= 120
##$ZL2= 120
##$ZL3= 120
##$ZL4= 120
##$ABSF1= 10
##$ABSF2= 0
##$ABSG= 5
##$ABSL= 3
##$ALPHA= 0
##$AQORDER= 0
##$ASSFAC= 0
##$ASSFACI= 0
##$ASSFACX= 0
##$ASSWID= 0
##$AUNMP= <proc_1d>
##$AZFE= 0.1
##$AZFW= 0.1
##$BCFW= 1
##$BC_mod= 2
##$BYTORDP= 1
##$COROFFS= 0
##$CY= 11.3945322036743
##$DATMOD= 1
##$DC= 2
##$DFILT= <>
##$DTYPP= 0
##$F1P= 2.36226072786647
##$F2P= -0.459571619588291
##$FCOR= 0.5
##$FTSIZE= 0
##$FT_mod= 4
##$GAMMA= 1
##$GB= 0.15
##$INTBC= 1
##$INTSCL= 1
##$ISEN= 128
##$LB= 0.24
##$LEV0= 0
##$LPBIN= 0
##$MAXI= 10000
##$MC2= 0
##$MEAN= 0
##$ME_mod= 0
##$MI= 1.114404
##$NCOEF= 0
##$NC_proc= 0
##$NLEV= 6
##$NOISF1= 3.799351
##$NOISF2= 2.8
##$NSP= 1
##$NTH_PI= 0
##$NZP= 0
##$OFFSET= 15.70392
##$PC= 1
##$PHC0= -17310.92
##$PHC1= 12.40078
##$PH_mod= 1
##$PKNL= yes
##$PPARMOD= 0
##$PSCAL= 0
##$PSIGN= 0
##$REVERSE= no
##$SF= 200.130013532006
##$SI= 16384
##$SIGF1= 3
##$SIGF2= 2
##$SINO= 400
##$SIOLD= 16384
##$SREGLST= <1H.CDCl3>
##$SSB= 0
##$STSI= 0
##$STSR= 0
##$SW_p= 3612.71676300578
##$SYMM= 0
##$S_DEV= 0
##$TDeff= 0
##$TDoff= 0
##$TI= <>
##$TILT= no
##$TM1= 0
##$TM2= 0
##$TOPLEV= 0
##$USERP1= <user>
##$USERP2= <user>
##$USERP3= <user>
##$USERP4= <user>
##$USERP5= <user>
##$WDW= 1
##$XDIM= 8192
##$YMAX_p= 0
##$YMIN_p= 0
$$ End of Bruker specific parameters
$$ ---------------------------------
##NTUPLES= NMR FID
##VAR_NAME=  TIME,          FID/REAL,        FID/IMAG
##SYMBOL=    X,             R,               I
##VAR_TYPE=  INDEPENDENT,   DEPENDENT,       DEPENDENT
##VAR_FORM=  AFFN,          ASDF,            ASDF
##VAR_DIM=   8192,          8192,            8192
##UNITS=     SECONDS,       ARBITRARY UNITS, ARBITRARY UNITS
##FACTOR=    0.0002768,     1,               1
##FIRST=     0,             0,               0
##LAST=      2.2672688,     0,               0
##MIN=       0,             -88861,          0
##MAX=       2.2672688,     102851,          0
$$ Real data points
##PAGE= N=1
##DATA TABLE= (X++(R..R)), XYDATA
0@%%%%%%%%%%%%%JrJ6j6J6j6K4l2L4m2N1n9P2q6R6j07J23j45J67j90K15k42K74
36A45l07L46l89M32m82N36n94O59p28Q06q90R80j082J193j313J447j597J760j943
55a021K149k380K645k953L313l738M255m894N711o799Q328j0652J4643k3381P9901
70F5127m4460n1142J33326q3882p9220J03419K0856j18461N5754O2617j03514
81c9580j3737J14678n3037p9471Q3925J6241j13207L1440Q2363o8181k5548J01265
93C7151j7281p5050O8476M1332q8494J6248Q1172o3633m9226Q6496o682q1622
105e1113O0093N2462q5978K764Q4454n6205n8911P9871J886q4329M5162N2781
117D2937p3473R33Q0568m3711n0567P6881Q689q0000L5192N5075o8327j9495O9043
$$ plain form
0 0 0 0 0 0 0 0 0 0 0 0 0 0 0 1 -8 8 -8 8 -8 16 -16 18 -24 27 -32 40 -46 50 -57 66 -79 88 -102 113 -129 145
36 145 -162 184 -205 227 -255 281 -313 346 -382 424 -466 514 -568 625 -688 759 -838 922 -1021
55 -1021 1128 -1252 1393 -1560 1753 -1985 2270 -2624 3087 -3712 4616 -6036 8607 -14774 65127
70 65127 20667 -30475 102851 18969 -60251 43168 64024 -54437 1317 63934 -39580
81 -39580 -53317 61361 8324 -71147 12778 29019 -84188 -52748 29615 -38566 -64114 37151
93 37151 19870 -55180 13296 54628 -33866 -17618 63554 -79 -49305 37191 30509 -51113
105 -51113 8980 61442 -24536 -21772 62682 6477 -52434 27437 29323 -55006 -9844 42937
117 42937 -30536 -29603 50965 7254 -43313 33568 42257 -37743 -2551 52524 -15803 -35298 33745
130C3745k6905n0966N8323J6771o6365K3162M8966o0208k2393O8262j8742n8270
142e4620N0418K9090o1523J3198N8335l8614k1581O3544j0315n6453M2622K8259
154D2360o1761O551N7646l7119l0813N7197m851n5343L5154L0382n7642l619M9525
167B7667l6070l6962M9747K890m9807L2070L7832m7373m248N2419k5935l7615
179c5385M6751Q717n2287K2338M0515m1847r882N2955j5972l6342M2488J1143
191C3192n3205J3999L7687m3947j8470M9653j0963l9218L7662J8997m4703J1434
203g882M0003l5323k0092M4107r555m3175L0431K2695m2271N868M3426k5312k3610
216b0690M1883j963m2552K2969K3504m3180k816M1738k3284k7558M1584P702l9370
$$ plain form
130 33745 6840 -44126 14197 30968 -35397 -12235 36731 -23477 -45870 22392 3650 -54620
142 -54620 -4202 24888 -36635 -23437 34898 -3716 -25297 38247 27932 -28521 14101 42360
154 42360 -19401 -12850 44796 7677 -23136 34061 29210 -26133 9021 39403 -18239 -21858 27667
167 27667 -8403 -45365 4382 7272 -42535 -10465 27367 -20006 -24254 28165 2230 -35385
179 -35385 11366 20083 -32204 -9866 30649 -11198 -21080 31875 15903 -20439 22049 33192
191 33192 -20013 -6014 31673 -12274 -30744 18909 7946 -31272 6390 25387 -19316 -7882
203 -7882 32121 -3202 -23294 20813 11258 -31917 -1486 21209 -21062 -15194 28232 2920 -20690
216 -20690 21193 19230 -23322 -353 23151 -20029 -22845 18893 -4391 -31949 9635 17337 -22033
229b2033K1825L0099l8067q180M0792k0267l2935L6446J0598m1054J7176L4546
241B8946l2627j0128M1800j3284l5225L0306J1292m2882P625L2907k9496j3952
253b4718M0840n470l3358K7665J8332l8820K349L2717k5549k0674L6554q24l3706
266b4662K4448K4687l3201o41L5341k0602k4916L2011J894l7492J7631K6350l1187
279a0339n372L6703j3634k5781L0101O897l7183J1363K6610l0324j1173L5934
291A3802r183k7073K8706J3746l4212P979K9556k6216j6567L2038n665k9979K3542
304D74J6875l0906M664L2095k0226j8357L1001j001l2547J6828J8111l0687j969
317a5645L1305j5187j9915K9528N193k9282J3535K0822k8162p492K9001j2811
$$ plain form
229 -22033 -208 29891 -8176 -16356 24436 4169 -28766 7680 18278 -22776 -5600 28946
241 28946 -3681 -13809 27991 14707 -20518 9788 21080 -21802 -14177 18730 -10766 -24718
253 -24718 16122 10652 -22706 4959 23291 -15529 -13180 19537 -6012 -26686 9868 9044 -24662
266 -24662 -214 24473 -8728 -9369 25972 5370 -19546 12465 14359 -23133 -5502 20848 -10339
279 -10339 -15711 20992 7358 -18423 11678 18575 -18608 -7245 19365 -10959 -22132 13802
291 13802 4619 -22454 6252 19998 -14214 -6235 23321 -2895 -19462 12576 6911 -23068 474
304 474 17349 -13557 -8893 23202 2976 -15381 15620 14619 -17928 -1100 17011 -13676 -15645
317 -15645 15660 473 -19442 10086 15279 -14003 -468 20354 -7808 -15300 13701 890
329H90k4046K5442R699k7952J0990K5344k2295r241K9093q414k6606K0399J0598
342A3901k9798N123K6024j9447j1861L0281k033k5755J8272J4549k8523l88K4039
355A4384j8531j6249K7041J216k5290J6621J9498k3391k927K5578j3699j9370
367a5119K1845K817k7747J1437J9850k1076n100K6755p788j9152K0947O693k6509
380a2147O203J9365k0367r424K4578m487j9904J9677J1724k2706M357K1773j6900
393A742j2326K1343l877k2133J5137J3016k2492J089K4092j2555j4526K0957J067
406A0534k2395J0258J2733k1925k677K2522j0509j5954K2211O228k1943Q696J7146
419A4925j9041o723K0898q264j7100J8245O799k0877P894J9397j6170q313K1872
$$ plain form
329 890 -23156 2286 11985 -15967 -4977 20367 -1928 -11169 17924 9510 -17096 3303 13901
342 13901 -15897 -10774 15250 -4197 -16058 14223 12190 -13565 4707 19256 -9267 -9655 14384
355 14384 -4147 -20396 6645 7861 -17429 -808 18690 -4701 -7628 17950 4251 -15119
367 -15119 6726 9543 -18204 -6767 13083 -7993 -13093 13662 5874 -13278 7669 14362 -12147
380 -12147 -5944 13421 -6946 -16370 8208 3721 -16183 3494 15218 -7488 -3131 18642 1742
393 1742 -10584 10759 6882 -15251 -114 12902 -9590 -8501 15591 3036 -11490 9467 10534
406 10534 -11861 -1603 11130 -10795 -13472 9050 -1459 -17413 4798 11026 -10917 -2221 14925
419 14925 -4116 -10839 10059 1795 -15305 2940 9739 -11138 -3244 16153 -17 -8330 13542
432A3542m250k0322J2974P686k0199L036J8631j3488q671K1773j317j9878J2055
445A572J1328j9734j389J7722j2028j2287J8923J812j8288J1591J5051j7363l795
458f885J8225r976j4964J5855K967j8793Q895J5624j5990m052K1192n542j6416
471i860J5568O603k0115K574J4735j3912o127J8846l349j4148J5508Q801k0429
484e305J504J7373j2440j1897J5874p44j6461R784R353j5374J982J7970r725j1635
498i741J6048M06j9361P402J2313j5288k975J8116o184j1443J5498M851j6039
511f397P367J2724j4799n958J5391o043j3851J4332O082j5761N878J5394j3585
524G74p924J6851k762j6007R671O894j6044J140J3593j0696o202J8201o29j6120
$$ plain form
432 13542 9292 -11030 1944 9630 -10569 -7533 11098 -2390 -11061 10712 9395 -10483 1572
445 1572 12900 -6834 -8223 9499 -2529 -14816 4107 5919 -12369 -778 14273 -3090 -6885
458 -6885 11340 1364 -13600 2255 5222 -13571 -4676 10948 -5042 -9094 12098 6556 -9860
471 -9860 5708 12311 -7804 -5230 9505 -4407 -10534 8312 4963 -9185 6323 15124 -5305
484 -5305 -3801 13572 1132 -10765 5109 4365 -12096 -2312 7041 -8333 -6351 11619 1894 -9741
498 -9741 6307 6713 -12648 -5246 7067 -8221 -11196 6920 736 -10707 4791 9642 -6397
511 -6397 970 13694 -1105 -7063 8328 2285 -11566 2766 8848 -6913 -1035 14359 774
524 774 -7150 9701 6939 -9068 603 7497 -8547 -7407 6186 -4510 -10712 7489 6860 -9260
538i260R931R758j6891k948J5548p161j0354J3835K254j3839Q292J0319j3274
551c790o62J6285q079j2994J3046L392j6258M816J3001j0416l590J4931n000j2211
565g529J2113M622j5639L447J2488j1633o970J4136k447j2464J1408Q019j4668
578e117J256J2775j0523q843J3113l6j2916Q808Q590j3256K43J3884p526q433
592g981J3600J512j5013O093R723j2606k692J4687m083q442J1688K397j3956N389
606C16R786j2632m267J3854m412j2059R934N151j1939L907J1172r548m814J1565
620F014m375j2274R078N542j2363K511J2745p663o283J2863j64j1197P632O247
634H313j2787l81J1143p958p493J2684K672j1328O946Q321j1402k060J1097o659
$$ plain form
538 -9260 671 10429 -6462 -9410 6138 -1023 -11377 2458 4712 -9127 -835 9484 -3790
551 -3790 -4452 11833 3754 -9240 3806 7198 -9060 -4244 8757 -1659 -5249 9682 4682 -7529
565 -7529 4584 9206 -6433 -2986 9502 -2131 -9101 5035 2588 -9876 1532 9551 -5117
578 -5117 -3861 8914 -1609 -10452 2661 2625 -10291 -1483 7107 -6149 -5906 7978 452 -7981
592 -7981 5619 7131 -7882 -1789 7934 -4672 -7364 7323 3240 -5202 6486 8883 -5073 316
606 316 10102 -2530 -6797 7057 2645 -9414 520 5671 -6268 -2361 8811 -737 -5551 6014
620 6014 1639 -10635 -1557 3985 -8378 -5867 6878 -785 -7068 5795 5631 -5566 2066 8313
634 8313 -4474 -4855 6288 -1670 -9163 3521 6193 -5135 1811 10132 -1270 -3330 7767 1108
648A108r461J0637K419j2638M543R624r454j790J2600l995r213R188K534j2943
662f841K394R529q548m116J1997j980r266Q544N536j0758J469R584p883o133J0056
677C584j561j0839Q098P037r879N45J0797o042o460R519k02j0569N869O187j0276
692d192j027J0254m914o410R931J804j0002M675O734r804k572R702m007p512Q786
707A446K796r625L430Q568p866l135R613k512q454O694L075r498K340R041o683
722g70l927R808j346q644O047M401r600R89Q245o059n137R023m15p790N877M936
738E638q387K51P746n381n995P783J060q114M309O152p007r41Q395l912o481P334
754B450J772q821K543O338o615k057Q865k226o734O969K647q257J627O100o328
$$ plain form
648 1108 -8353 2284 4703 -7935 -3392 6232 -3222 -5012 7588 3593 -5620 3568 6102 -6841
662 -6841 -4447 5082 -3466 -7582 4415 2435 -6831 1713 7249 -3509 -2040 7544 -339 -6472 3584
677 3584 2023 -8816 -718 6319 -3560 -3015 7782 1740 -4720 4799 4597 -5972 -103 6084 -4192
692 -4192 -5219 5035 121 -6289 3642 5446 -4556 119 6853 -2951 -5523 4179 172 -7340 1446
707 1446 4242 -5383 -1953 6615 -1251 -4386 5227 2715 -5739 955 4030 -5468 -3128 5913 -770
722 -770 -4697 5111 3765 -4879 1168 5569 -4031 -3042 5203 -856 -5993 3030 2615 -5175 702 5638
738 5638 -2749 -2498 5248 -133 -6128 1655 2715 -5399 -1090 5062 -1945 -2886 5509 1597 -4884 2450
754 2450 4222 -4599 -2056 4282 -2333 -4390 4475 2249 -4485 2484 5131 -3126 -1499 4601 -1727
769a727l356P471j726o864O688L695p372J689O845m902l850O936j771o954M765
784d33L596o809Q04O920l491l405O550J67o664L600L443o788j071O206l077m739
800e191O535J443o165L335N172n800j841O149l030n428N285J399o508K274O038
815C667m629j934O553j452n021M662J233o399J577M681m536k740O471n35m805
830c207M433L067n339K14M650m064k987M946k45n131L300L385m995K34N455k881
846H35l695M794K62m865K014K972m753l89N089j882m043M593J450m733J600L332
862B581l891r70M565j822l654M320J522m782J355M062l539j391M190j513l613
877b580L410J678m348Q94L624k752k140M313n29l964K253K136l820J05L336j891
$$ plain form
769 -1727 -5083 2388 662 -6202 486 4181 -3191 -1502 5343 441 -3409 3527 1756 -5198 -433
784 -433 3163 -3646 -2842 4078 587 -2818 3732 3899 -2765 835 4278 -2510 -3581 2625 -452 -5191
800 -5191 1344 2787 -3378 -43 5129 -671 -2512 3637 607 -4821 464 1863 -4645 -2371 3667
815 3667 -962 -2896 3657 2205 -2816 1846 3079 -3320 -1743 2938 -1598 -4338 2133 1598 -3207
830 -3207 1226 4293 -1046 -832 3818 -246 -3233 1713 1468 -3663 -363 3022 -1973 -1739 3716 835
846 835 -2860 1934 2196 -2669 -655 2317 -2436 -2825 2264 382 -3661 932 2382 -2351 -751 2581
862 2581 -1310 -2280 2285 463 -3191 1129 2651 -2131 -776 3286 -253 -1644 2546 1033 -2580
877 -2580 830 2508 -1840 -946 2678 -74 -2214 2099 1570 -2394 -141 1995 -1825 -1720 1616 -275
893b75k132M024l51l670K320K679l452r79L289j593k351L370o2k921K208K699
909B803l494n18L560j501k864K780O06l363J224K507k886l18L356r63k367K910
925A472R98l689K36K689k409j601K786k69k239K401R62k662O53L197j787k005
941a267K150q3k705J493J139k409R53K683j720j567K647N44k638P34J559k206
957f93n26J591q76j199J800M47j507J246J991k123q59K183r88j830J380Q81j792
974h74P73Q13j100k12K051l54j616J294O61k269l23J275j141m78K017r1j527Q58
992b43J069j472m3J995j101r29J019l09j006R28P29r00J93J353n93j168J007K26
1010G55j367N58J040p82k14L29q80o05J219K95j127N04J263j068r29R98L08n03
$$ plain form
893 -275 -2407 1617 1266 -2404 -84 2595 -857 -1836 1453 -140 -2491 879 817 -2104 104 2803
909 2803 -691 -1209 2351 850 -2014 766 1372 -1991 -767 1740 -1146 -1464 1892 929 -1438 1472
925 1472 2470 -1219 -983 1706 -703 -2304 482 213 -2026 375 1337 -1325 -672 2525 738 -1267
941 -1267 883 800 -1905 -412 727 -1682 -729 1954 234 -1333 1314 1858 -780 -46 1513 -693
957 -693 -1219 372 -504 -1703 97 544 -963 283 2274 151 -708 1475 487 -1343 37 918 -874
974 -874 -101 712 -388 -600 1451 1097 -519 775 1436 -833 -1156 119 -1022 -1500 517 426 -1101 -243
992 -243 826 -646 -689 1306 205 -724 295 -14 -1020 -92 637 -263 -70 1283 690 -478 529 755
1010 755 -612 -54 986 204 -10 319 -561 -1166 53 348 -779 -275 988 -80 -1009 -11 297 -206
1028b06O68L88r10j74M75q17l66J248j13l65N71L72j179j71R63l61k30L74Lo41
1048d71m9J94n39P59P32J36n15J72L5n24L6N17k80j64O05l58q01j0N46j7K63O03
1070H70n40m61J76l42p26N23K14k8j94J12P5j99L12N36K66K46j47l06k91k76p7
1091b57j74O12N27l65k54L9K95n62J84K65M01l39m49n20n43M82M97o7L47M75n69
1112B5j03k1O3j34L70K63j34o05J26o7k57O10J25J85p5M13n32o31J6M39Jm9J45
1135A73m16l54O89l55n02M73O15M20n39r7m09q6K69q1J16K11j17k56k08M86n3
1156b1m45J114m4m62m1Q7n74l1L81j67J13L23n23o7K12N42m6l61N86k53k29l74
1178b80Q1o14M51P77o07j57N36J98n60L04N12p36j29P36o98o96N00O2l35O17O91
$$ plain form
1028 -206 462 850 -60 -234 241 -576 -942 306 193 -172 399 771 -408 -579 384 23 -207 167 170 -471
1048 -471 -520 -326 -865 -106 626 762 247 419 454 -70 -34 483 203 39 644 286 -515 -525 21 4 267 870
1070 870 330 -131 45 -297 -1023 -500 -286 -314 -508 -396 -321 -520 -208 328 594 840 693 387 96 -180 -257
1091 -257 -431 181 708 343 89 128 423 -139 45 310 711 372 -77 -597 -1140 -658 -161 -228 119 594 25
1112 25 -78 -99 -36 -170 200 463 329 -276 -150 -217 -474 136 261 446 371 784 252 -379 -363 76 77 28 173
1135 173 -243 -597 92 -263 -765 -292 323 743 204 107 -302 -388 -119 -200 -84 127 10 -246 -454 32 -21
1156 -21 -466 648 604 142 101 188 -386 -417 -36 -203 -90 233 -290 -357 -145 397 351 -10 576 323 94 -280
1178 -280 -199 -813 -362 415 -192 -349 187 385 -175 129 641 -95 -224 512 -186 -882 -382 -320 -655 -38 653
1199F53n85k44R94m59o97Q50l8p15L47Pn05j11J039M7p28O82N09r39o4M22q38
1220c73l55O87j60o21K93N48o98R8Q12k19l91O33M1j182N33P32m47k20Q52n67
1240dJ71Q22m9q27J91P12n48j94J68j47n94K45L67j017J28R33p62k75N51l38k87
1261g54N78N11q71J35O86n08k07P32k03o22O65K89n84O1R95o24k44M22m2n82K55
1282H8N7p94j01Q87l72p19Q86N25o99N33N17o59l48O44q9q40N98J9n44L46P37
1303F72n64n56J066m7j027L57J58o96k29N40p05j88Q70N77j001P53N10j74k22
1322I4P27m49m82L78L14r68N57P48n29j75Q22j69o68J32K51j008l43M92n55l41
1342a172J073m82m17P94N80p29J8P00l99o12Q78l42n96N40M64l73l49J406l56
$$ plain form
1199 653 68 -176 818 359 -338 512 474 -241 106 113 -392 -503 536 583 -145 537 1046 107 43 465 -373
1220 -373 -728 -41 -201 -822 -529 19 -679 -581 231 12 -379 254 295 -887 -354 378 -69 -289 563 -4
1240 -4 167 989 940 113 304 1016 468 274 442 295 -299 -54 313 -704 -576 357 -405 -680 -129 -467 -754
1261 -754 -176 335 -536 -401 285 -223 -430 302 99 -523 142 431 -153 -92 903 279 35 457 415 -167 88
1282 88 145 -649 -750 137 -235 -954 -68 457 -242 291 808 149 -199 445 356 -484 114 133 -411 -65 672
1303 672 108 -448 618 571 -456 -99 59 -637 -866 -326 -1031 -1219 -349 228 -773 -20 490 316 94
1322 94 821 372 -110 268 582 -386 171 919 390 215 1037 868 200 332 583 -425 -768 -276 -831 -1172
1342 -1172 -99 -581 -998 -204 376 -353 -335 365 -34 -646 232 -110 -706 -166 298 -75 -424 982 626
1361F26m76L84L85q63J80K25p00o17J133o19l75O47N65q73N15N62q05j52M77J35
1381C54q92N68M21r10M79Q60o47n25Q97J12r54L85J89r06P4P16o49m66J091n1
1401A46o97L23N72p60k39Q54k86l29P10J84n94M02N30m62n17P71k68o93L63L66
1421C76q95L41O96n90j50O23j99p92M22M88j060r2N07Nk59O93N2n82J141J56q48
1442C3n15J124o41r42R84q5m53L97P94m35k61O23j57p05N45O5j227J93O15o27
1462f75k95J172M17o37N85J79o90n1N17n62p31Q49k14q35N97O11l31K87R32n79
1482E46p68P41k27j239L83L23m32J32Q26j84p14R84K66p12N36N46j193m15N93
1501hqj045P75Q22o63J98O45p77N0O36l12q07M15N09j128q6R69n10j28R41K24
$$ plain form
1361 626 150 534 919 56 236 461 -239 -856 277 -342 -717 -70 495 -378 137 699 -106 -258 219 354
1381 354 -538 30 451 -459 20 880 233 -292 605 717 -237 148 337 -569 -495 221 -428 -894 197 146
1401 146 -551 -228 344 -416 -655 199 -87 -416 294 478 -116 286 816 354 -163 608 340 -353 10 376
1421 376 -519 -178 518 -72 -222 401 202 -590 -168 320 -740 -832 -325 -320 -579 114 166 -416 725 881 33
1442 33 -482 642 1 -941 43 -42 -495 -98 696 261 0 623 466 -239 306 371 -856 -663 -48 -675
1462 -675 -970 202 619 -18 567 746 56 5 522 -40 -771 78 -136 -971 -374 237 -94 193 1125 546
1482 546 -222 519 292 -947 -564 -241 -673 -541 285 101 -613 371 637 -75 461 1007 -186 -601 -8
1501 -8 -16 -1061 -286 536 -127 71 716 -61 -11 625 313 -494 -79 430 -698 -784 185 -325 -453 488 712
1522G12j253O09M00p15m26Q77l06p57J157k7j010M93J087p37n9P38n48n06K03
1541f8J65q38L54R21n11l59R06k24q08M74K92p48L02Q10q42n81Q84J99p86N64
1561A06N08n45l52R30p31q77J253J87j010P22O29r91j15R37k51q66O06K43r53
1580e70J73N85r01J06J527n87m06N37M43j391Q3O42p96k60R71l09p86Q74N79r55
1600d41O82Q40q18q44R46l26j191O95P85o69L66R69n99r66J226J63j090M62L48
1619E38r75m42J070p85l68J140K61n20L88Q32j230k26Q87r38n68O53L10r67L25
1638f15Q85n98j13J192j02p92N88n1j275K58P12n12k67J082l19n66J091M35j196
1657a63L75J223j290o53N24m9o47P17N82r20J87R20m77j129Q28rq33M24M87j031
$$ plain form
1522 712 -541 68 468 -247 -673 204 -102 -859 298 271 -739 -246 841 104 45 783 235 -271 -68
1541 -68 97 -741 -387 534 23 -336 570 346 -462 12 304 -444 -142 668 -174 -755 129 328 -458 106
1561 106 614 69 -283 647 -84 -961 292 479 -531 191 820 -171 -286 651 400 -466 140 383 -570
1580 -570 -397 188 -713 -607 920 333 -73 464 907 -484 -401 241 -555 -815 156 -153 -939 -65 514 -441
1600 -441 241 1081 263 -581 365 39 -1152 -457 328 -341 25 994 395 -571 655 818 -272 190 538
1619 538 -437 -879 191 -594 -962 178 439 -81 307 1139 -91 -317 570 -368 -936 -283 27 -940 -615
1638 -615 270 -328 -441 751 649 -143 445 394 -881 -623 89 -423 -690 392 73 -493 598 1033 -163
1657 -163 212 1435 145 -508 16 -33 -680 37 619 -301 -114 806 329 -800 28 19 -814 -390 97 -934
1677i34j04J289o62n58J375j96n46M20L51q75n5R89l31l88Q63L00q56J97O66q78
1697F7J08P50n51p75L29K64q09M24O76p77k92J029m40p80N79J53p60L66Q63o78
1717b54n50J037Q8p73P51N66j041K62L15o09l72P02J64p25O67O20j154L11N43
1736E48l49n55O39j24r84L93Q57m89k98J100l47l78P51j61q10J89P09j309l11
1755i29R18k84p20O72N51q51M00R50r99n59R12m61o92N58O55p99N65Q37k83j18
1775C23P67k13o74L73K23q88q0P17n99m30Q35On66M22K60o62l43M88l27q22P88
1796d02oq16Q69L03k43m1R28j89p43R13l24n64M84K86p88J84N10M5k98K23K27
1817E58m36K47m8o42j99O26l67k93M14K65j75P4O50p11j85M81J62p10M12J71o38
$$ plain form
1677 -934 -1038 251 -411 -969 406 210 -336 84 435 -440 -495 494 163 -225 638 938 82 279 945 67
1697 67 175 925 374 -401 -72 192 -617 -193 483 -294 -586 443 3 -777 -198 -45 -805 -439 424 -254
1717 -254 -804 233 321 -452 299 865 -176 86 401 -208 -580 122 286 -439 228 848 -306 5 548
1736 548 199 -356 283 159 -825 -432 425 -64 -362 738 391 13 764 603 -207 -18 691 -618 -929
1755 -929 -11 -295 -1015 -343 208 -643 -243 707 -292 -851 61 -400 -1092 -534 121 -678 -113 724 441 323
1775 323 1090 877 203 576 799 -89 -169 548 -51 -481 354 360 -206 216 476 -186 -529 -41 -368 -1190 -402
1796 -402 -408 -1224 -355 -52 -295 -336 592 403 -340 573 249 -315 169 455 -333 -149 361 406 108 331 558
1817 558 122 369 321 -321 -520 106 -261 -554 -140 125 -50 24 674 -37 -222 259 421 -289 123 294 -344
1838c44M52J94m55j61Q08m59q63P79K88q16K83J64n44K24L89J27n34N32N77o85
1858d4l4N70k78m53N64J03m73M48K21m55J1L18l87l07L25l40n08O39p6n12M86
1879a82k9%k00M83l6k84k06O03l68j47M26m4l69O65L64p41O31J12k27m24J70k80
1901h3j11L12J63p04J62O19l27j72M55j78n54L15Q1m59L3M35k97rO32J06n30N78
1923D67J19p26J69L33n46k31J50rj36M62N5j60J97L54o11o6L38k00m67M62J57
1944A11n16K52O08m30J24L13j00j71l03M76o72j43O21l2j007Q26J27n68P76r8
1964A94k27J35L04m16k04J70O8k12J77J16j65j00O54n00k72O05J67p12J34M52
1984C68n81RK30K72n77M63q7j78o0K97n47Q0P57m45m77M77K35n56K02K22n8k59
$$ plain form
1838 -344 108 302 -153 -314 494 35 -828 -49 239 -577 -294 -130 -674 -450 -61 66 -468 64 641 -44
1858 -44 -78 492 214 -239 325 428 -45 403 624 169 180 498 111 -196 129 -211 -719 -80 -156 -668 -182
1879 -182 -211 -211 -411 72 36 -248 -454 149 -219 -366 60 16 -353 312 676 -65 566 678 451 27 197 -83
1901 -83 -194 118 281 -423 -261 358 31 -141 314 136 -418 -103 -22 -481 -448 -13 -310 -319 313 419 -111 467
1923 467 586 -140 29 362 -184 -415 -265 -274 -410 52 107 -53 144 498 -113 -179 159 -41 -508 -46 111
1944 111 -405 -153 455 25 149 462 362 191 -112 364 -308 -451 170 138 -869 -43 84 -484 292 194
1964 194 -33 102 406 -10 -214 -44 24 -188 -11 105 -60 -160 494 -6 -278 327 494 -218 -84 368
1984 368 -213 -204 26 298 -279 184 97 -81 -141 156 -391 -311 446 1 -476 1 236 -320 -118 104 46 -213
2006b13L32l08n1K47J89k71K46J00k37j25M79l80j55J47J13j22o7K64j60j45K89
2027A72J64k30J3J11l86RR4j01k44M43K66n22N1N12n26K13K11l72j7L07q3n53
2049d68K02L49k00J24M40l53j31L67m9o47L43K38n21K5N55n26k79P63J12n26N40
2070C58J69j97k80J23k12n75P32J58p30K72O17p67J07O21l08L9k1Q1o64nM72k12
2092b22JL77p4j56K48J05n07M3O27j40l44j6K99m19K26k1j17K15L71k50o42O20
2114B24r8n48K94M51p04M8M27r7l89J03L75j97l1N03m74j76L59k18j07M52K2m75
2136b56L74J44m79L8N88k11k64K89K7j74J83k04j17l75P84j85m70L16K87n96J30
2157a71O21k71l49M82j81m51l1L75k27r3N37j98o02P17p7l02K54L96o08J51K44
$$ plain form
2006 -213 119 -189 -240 7 196 -75 171 271 34 -91 388 8 -147 0 113 -9 -76 188 28 -117 172
2027 172 336 106 119 230 -156 -147 -53 -154 -398 45 311 -211 -160 352 -174 39 250 -122 -139 168 85 -468
2049 -468 -266 83 -117 7 447 94 -37 330 281 -366 -23 215 -306 -281 274 -252 -531 232 344 -182 358
2070 358 527 330 50 173 -39 -614 118 276 -454 -182 435 -332 -225 396 88 127 106 187 -477 -482 -10 -222
2092 -222 -221 156 82 -74 174 279 -228 -185 442 302 -42 -58 241 -178 48 27 -90 125 496 246 -396 224
2114 224 126 -422 -128 323 -381 -333 94 -3 -392 -289 86 -111 -142 361 -113 -289 70 -148 -255 197 219 -256
2136 -256 118 262 -217 -179 409 198 -66 223 250 76 259 55 -62 -437 347 162 -308 8 295 -301 -171
2157 -171 450 179 -170 312 131 -320 -351 24 -203 -296 241 43 -559 158 81 -221 33 429 -179 -28 216
2178B16l09k43N64j67o50P48L51n58j78L85L4m16N82J82r30J80L62l10R2K56o4
2199A27m61N87K43o74l0M55j98m84M82O9o23L51J0l98K73P02m51k36N12Ml84K48
2221A24M22r02K03M64K6m95L28J29l19L88N3n44J77M21k83n40O45k38n15L26L20
2242A90q76M15N58l26k64L70P4o10L08M35o17o5Q50n13l74N46L48m23k2N73m82
2263I5j47M70N8j078O06K57n06N8P00l18l74L97J18m80R5N51o83j60Q56n35k88
2284c08L46L57j022N61M99n33j84O81m97k23L89K19p33p7O68n42J15M60q2o64
2304e70O16M24m37j41N42l85l79N82K9n88J84N93n13p2P13l49m42M22p8n46J14
2325b81M47l60%P07n09m88O33J2l07K10K56m97j52O87l61k39K59K45n55L25M38
$$ plain form
2178 216 -93 -336 228 61 -589 159 510 -48 -226 159 193 -223 359 541 -389 -209 153 -157 -65 191 127
2199 127 -334 253 496 -178 -208 247 49 -435 47 116 -507 -156 -146 -544 -271 431 -20 -256 256 260 -124 124
2221 124 546 -356 -153 311 337 -158 170 299 -20 368 421 -123 54 475 192 -348 297 59 -456 -130 190
2242 190 -686 -271 287 -39 -303 67 141 -469 -161 274 -343 -408 442 -71 -445 101 449 26 4 577 95
2263 95 -52 418 476 -602 4 261 -245 -187 513 195 -179 218 336 -144 -49 502 -181 -341 515 -20 -308
2284 -308 38 395 -627 -66 433 -100 -284 397 -100 -323 66 285 -448 -525 143 -399 -284 176 94 -570
2304 -570 46 470 33 -108 434 49 -330 252 281 -307 -123 470 -43 -115 598 249 -193 229 151 -395 -281
2325 -281 166 -194 -194 513 4 -484 149 161 -146 64 320 -177 -329 358 -3 -242 17 262 -293 32 470
2346D70m62j78M59j65m08K77R8k65r0Q33q18j46O40K89r33M59M87q96J21N55l09
2367A8l17N79j98k98MM49k39J7L92k43p72P06L72r39M99J39q6j46L00k19n18N33
2389C3J52p60M37N31l74j06O53l58p13P44L05p79Q3N11n47l09P93j42n98P54K84
2410E94p15j45O36m50m31O30j7o14M73K75o53K24O66k63m35O43k56m28J04N31
2430C69q53M0O30j30l02L58L00r37P86L76q43l51Q22j56q47M37J73m81N56O46
2450E93o70r2Q34m18l98P0N42q17kQ46r26k92J123J72o28K98M79o99l73P44n73
2471a87m87P15J06q35N43N25m49k34Q57m98m58N70J14q61K44P60r81L3R85k30
2491B32p58J014P4j148M50N09n73k61O33n2q11R43J42o34J61O50m48m38Q17k32
$$ plain form
2346 470 8 -170 289 124 -284 -7 91 -174 -264 569 -249 -395 245 534 -399 60 547 -349 -228 327 18
2367 18 -299 280 82 -216 -212 237 -2 15 407 164 -608 98 470 -469 30 169 83 -63 237 18 -500 33
2389 33 185 -575 -138 393 19 -87 566 208 -505 239 544 -235 -152 359 -188 -497 296 154 -444 310 594
2410 594 -121 -266 370 -80 -511 119 102 -512 -39 236 -417 -193 473 210 -225 418 162 -266 -162 369
2430 369 -484 -444 186 56 -246 112 412 -525 261 637 -206 -557 265 109 -738 -301 -128 -609 -53 593
2450 593 -77 -169 665 247 -151 -81 461 -356 -358 488 -438 -730 393 565 -63 235 714 15 -358 386 -187
2471 -187 -674 41 147 -688 -145 380 -69 -303 554 56 -402 168 282 -579 -335 425 -556 -523 462 232
2491 232 -526 488 562 -586 -136 373 -200 -461 172 120 -691 252 394 -240 -79 571 123 -315 502 270
2511B70q53M93M56j065L20Q21n20n26J016j71r34P68O46r90jO76k99p63Q48M58
2531F50j039L21Q16j021k74R00k35o32Q72N5r21N32M66n43m47J137m05p38L92
2550a14M49p24K68M44m51n39R64P1p00M32N54j113K00R15o54p34O86L68p57M71
2570C6M36n49j68R37p21n82Q13J16r72L22Q62q30j23J197k34p66P50Q8q68j30
2590c86O24q07J37P70m55l08O49J85o14K17N88n88l54P86m38r12K17R26o20L29
2610e4O72n42l14R59m25o79K94N18q78k80R19j84p17Q65M66q16M82N47p54m44
2630c65P88l49n52M46K87o97o9J108n19j65O47q7p24L01N30j213m7J015p32j16
2650e13Q32L17r97M43N29j023M1N72l82n86R63n2n99M32N67o15J23P27q24j88
$$ plain form
2511 270 -583 -90 366 -699 -379 442 -78 -604 412 241 -693 75 721 -269 -270 406 107 -656 192 650
2531 650 -389 -68 748 -273 -547 353 118 -514 358 413 -508 24 490 -53 -500 637 232 -506 -114
2550 -114 335 -389 -121 323 -128 -667 297 368 -332 100 654 -459 -259 656 2 -732 -46 322 -435 36
2570 36 472 -77 -245 692 -29 -611 202 318 -654 -332 530 -300 -423 774 540 -226 524 612 -256 -386
2590 -386 238 -569 -432 338 -117 -425 224 409 -205 12 600 12 -342 444 6 -906 -689 237 -383 -54
2610 -54 618 76 -238 721 296 -383 -89 429 -449 -729 190 6 -711 154 620 -196 286 833 79 -365
2630 -365 423 74 -478 -32 255 -442 -511 597 78 -87 560 473 -251 50 580 -633 -680 335 -397 -513
2650 -513 319 636 -361 82 611 -412 -371 201 -181 -767 196 144 -455 -23 544 -71 52 779 -45 -233
2670b33N05J03j013M73N27n56l8R09l07q79Q47K07j033N55J13l90m51P62R2o22
2690d29P26L35p47J75L87p89KP97l40r87Q57M13p60J76P48n07n52J023l4j009
2710e15L65M48q20LQ66l56k84O84J79p14L98M69r25l78P06m77l83M97N24p34L72
2731g5R51p14m62R68m64o75M58O9o50k2P52k85j58Q29J58p30N91J90j012J5N98
2752C32n27o58Q49J37l81L58O93o24k96O22m94m97O01J81q77J98M74m10q2P94
2772C93J14n59M06K10r48J31N23o61j28N21J2o94P58L64q02K18P96o97k89O27
2792B95j68q17K99N69l12k06J160n17l79M65J23p98J70M62p72k52O75L01p79M56
2812b5O72n41M7K27l62l18O76n41k94K49L78p74L21J002o93k3L66O6q62L88J17
$$ plain form
2670 -233 272 375 -638 -165 362 -194 -232 677 370 -509 338 545 -488 67 180 -210 -661 101 193 -429
2690 -429 297 632 -115 60 447 -342 -340 457 117 -870 -13 400 -360 -184 564 57 -495 528 494 -515
2710 -515 -150 298 -522 -519 347 -9 -293 391 570 -144 254 723 -202 -580 126 -351 -734 -237 287 -447 -75
2731 -75 876 162 -300 668 204 -471 -13 56 -594 -616 136 -149 -307 522 680 -50 541 731 -281 -266 332
2752 332 -195 -853 -4 133 -248 110 803 179 -117 505 11 -486 115 296 -581 -383 91 -319 -401 393
2772 393 507 -52 354 564 -384 -253 270 -391 -519 2 14 -680 78 442 -360 -142 654 -43 -332 295
2792 295 127 -690 -391 178 -134 -340 820 303 -76 389 512 -286 -116 346 -426 -678 -3 298 -481 -25
2812 -25 647 106 153 380 18 -300 376 -165 -459 -210 168 -606 -285 717 24 1 367 433 -429 -41 76
2833G6n12l2O86j73m21P70j33o02N93O20j146l37J028n42o70Q52K01o67O31N37
2853G59q66p3N05o8q13N87r2o38M78P27p20N4O52J92j009O19J75r03K77M23q38
2874e72qN96K72n07L74N83n48k59P33o24o04N08J85p98K86O82n55L15N75m3n85
2895FN53l7q79L39R8m28l83Q41j77l01N37L06n38K25N72p95l69N36k6q31N79N74
2917D02o81L32O66m30l65N37n9r24M06M53p99qN37j11k51N57K36l90J45L11q65
2938c01l0P70o92m96N93L09n64M17P41o05j37O28l71o31L50M04j043O4R07l40
2958b7j27N64J08p29J94L73n71j40N68p33l61Q28M5m77N65P13p40p6L45l68n91
2979f37Q37L8r43N81L54k24j40O06j10o88M74K38p14P7L24m32p3M91M7m46P78
$$ plain form
2833 76 -436 -468 218 45 -376 394 261 -341 252 872 -274 -611 417 -125 -795 57 258 -409 222 759
2853 759 -107 -180 325 257 -556 31 -61 -699 -221 506 -214 -160 492 684 -325 294 469 -434 -157 266 -572
2874 -572 -580 16 288 -219 155 738 190 -69 664 40 -564 -56 129 -669 -383 299 -256 59 634 591 6
2895 6 559 522 -357 -18 80 -348 -731 110 -67 -368 169 475 -63 162 734 -61 -430 106 80 -751 -172 402
2917 402 -279 53 719 289 -76 461 402 -522 -116 337 -462 -470 67 -44 -295 262 498 108 253 564 -301
2938 -301 -331 439 -253 -749 -156 153 -411 6 747 142 5 633 262 -369 -19 385 -658 -594 313 -27
2958 -27 -154 410 518 -211 -17 356 -215 -355 213 -520 -881 -53 -8 -485 80 793 53 -23 322 -46 -637
2979 -637 200 238 -705 -124 230 6 -134 472 362 -326 148 386 -328 -251 73 -359 -432 59 106 -340 438
3000D38J46o33j60P38m14o09O44k03n15O84L00o60M18O68n30m17L65M8q76K31
3020c37M97o42j81R42r9l78K79O13q59K07M68q23J10L42m52m28R47Q6k38j1Q29
3041H72o45l71O19k05r67M67J28n58Q0Q78k93k61O40J47n19N0N00r69jM56l47
3062b99n11R06J98m59K57P16o64q8M60k45o92K98J3n82K25P98l38j63O70J6o47
3083a31L09L4o68J25N51n66m82R70J2n38Q11L70n48j65L35n55l19K92J41o93M02
3104c13Q38o33P8M15q0k22L06j10p81J44K66l45j37R53j39o86O37K45n60j96P85
3125D65p31k44Q33m25n91N73L64p52N04R06o10m27M33m4r15M88K60o15Q4Q83j40
3146B99n17P77j86p45L33M60n80l40N25k97l71P42l9k09L29O52j025R0O37k29
$$ plain form
3000 438 584 -49 -209 529 115 -494 150 -53 -568 116 416 -244 174 842 312 -105 260 308 -568 -337
3020 -337 160 -482 -663 279 180 -198 81 694 -165 42 510 -313 -203 139 -313 -741 206 292 54 43 872
3041 872 227 -144 475 270 -697 -230 -102 -660 -580 298 5 -256 384 531 12 62 562 -407 -408 48 -299
3062 -299 -810 96 294 -165 92 808 144 56 516 271 -421 -123 -110 -692 -467 331 -7 -170 500 516 -131
3083 -131 178 212 -456 -331 220 -346 -828 142 154 -384 427 797 249 84 419 -136 -455 -163 -22 -715 -313
3104 -313 525 -108 -30 385 305 83 389 279 -502 -358 -92 -437 -574 379 240 -446 191 436 -124 -320 465
3125 465 -266 -510 323 -102 -693 -120 244 -508 -4 902 292 -135 298 254 -661 -173 87 -528 -444 439 299
3146 299 -218 559 373 -372 -39 421 -159 -499 26 -271 -642 100 61 -148 181 833 -192 -102 535 306
3166C06r97M23L52n03K14N57n22R0Q07l03o99K61L26p14P4O25p50OM82K16m96
3187b45O51L90p90l9N00n08l57J68K76r34O91P34m50lN39j23o00L25n9o55K5P09
3209B45q28j84Q14K7k15N12N20j039J94N42q64m68Q73l21l82M11M80n26P1P42
3229F04l85m77P20k23p71L31K95o26J52O78o2m94Q87j70p24J95N85p96l4N01r0
3250I6n46M24N16n46K78O69o15m85N76L0j166N93J41q24N19O73l99k36O52m8m12
3271a10K5N72q80N2M69k05n11Q60P2p07N86L62n21k82P38n54p96N78K63o17M61
3292a45M88k33j86O21k04p65N27L84r34J37M76k76l70Q55l68l4M46N33j137R5
3312i0N69p99l97O83O6m88L79P00m40o9L88r7o78P63j89r46J84O20o14Q8N89Q4
$$ plain form
3166 306 -691 -268 84 -419 -205 352 -170 -80 727 424 -275 -14 312 -402 -328 297 -453 -447 35 251 -245
3187 -245 406 796 6 -33 467 -41 -398 -230 46 -888 -197 537 87 84 623 500 -100 225 166 -489 -464 245
3209 245 -583 -767 47 74 -141 371 891 -148 46 588 -276 -744 129 -192 -574 -163 317 -209 -138 604
3229 604 219 -258 462 239 -532 -201 94 -532 -380 298 236 -258 629 459 -265 -70 515 -281 -315 186 96
3250 96 -450 -26 490 -56 222 891 276 -209 367 397 -769 -176 -35 -859 -340 333 -66 -302 350 302 -110
3271 -110 -85 487 -393 -341 128 -77 -588 272 344 -363 223 585 64 -218 520 -34 -830 -252 11 -606 -145
3292 -145 343 110 -76 545 341 -424 103 487 -447 -310 166 -110 -480 375 7 -27 419 952 -185 -90
3312 -90 479 -320 -717 -34 32 -456 -77 623 183 114 502 405 -273 490 301 -645 -461 159 -455 -367 222 306
3334C06m88O81L55j079J37M13m52m00N96j70m99M64O18n96M37M60p16k07L74j19
3354A15o53K77K54m58R0Q90l33m02P66N2q86K69L32q34K6N94l55k30N14N44n82
3375a0L10N63q37k20M44m65n83N60K31n49M40M15k46k26J019k69p00L72j47k97
3395a95k52N78m39r2O46M5q34Q97K4l40l80O51m85n68N80N5j43K38O35o94l9O28
3417E16j50r12N76l8n24K84K78o70L90O82j26m86M05J08n12L88L29r23n5M09p4
3438a05m93O31N94o96K8O29n26m46M23K48q72K53O57p47M4R56n95k61O10K12r38
3459c94K48L97n34m05P36l59j32M78O54p76K15M46p71L3M89l45o61M46M52m01
3479a84J16Q48p33PN32j90n87L16R0n69k11R08o45l20R89q0o22O66K68o83j98
$$ plain form
3334 306 -182 499 854 -225 -88 325 -127 -527 69 -101 -600 -136 482 -114 323 783 67 -140 234 115
3354 115 -538 -261 -7 -465 -375 515 182 -220 546 598 -288 -19 313 -521 -495 99 -256 -486 28 572 -10
3375 -10 300 863 26 -194 250 -215 -798 -238 -7 -556 -116 299 53 -173 846 577 -123 249 102 -195
3395 -195 -447 131 -308 -400 246 291 -543 354 378 38 -342 309 -176 -744 -164 -109 -252 -14 621 -73 -112 516
3417 516 366 -546 30 -8 -532 -248 30 -640 -250 432 306 -180 225 333 -179 209 538 -385 -440 -31 -105
3438 -105 -598 33 627 -69 -41 588 62 -384 39 287 -585 -332 325 -422 -378 578 -17 -278 332 544 -394
3459 -394 -146 251 -283 -688 48 -311 -443 35 689 -87 128 574 -197 -164 325 -20 -681 -235 217 -184
3479 -184 -68 780 47 54 586 396 -191 125 215 -354 -565 343 -302 -622 367 287 -335 331 599 -84 -282
3500b82N22k74o41N83J43m76L6O90l81j2Q43j07j017O49J8p49q1O66l79k90Q33
3521B94J0m16L18M31q97J50O94j002j02M17R2m31N74N10n46k20R48n31p76M45
3541c8J34q65K20P47n15K6O59j4p15O84N7m47k51P83n15m58N07o7n17N08M91o15
3563b01L31M84n43n70Q68n65n39O28L49p74K16Q30m88k90N11K1l08J31L95j063
3583e77K55M38k19l34R12K3q45O07J85n82j08N33k07p58Q33K87p96L40P74o48
3603A13k94P97l54n66K37N58j157K26P97n71q7O32J07n32M21J08p84J70N90p23
3623c12n89Q15K00n67M78O88o42m13R70k30q13M85O4o20K99N44q61j15J025j17
3643B89n25P73O9p13k00N56m70k27N26J44p83O91M88p24J07O64l95m89P10m54
$$ plain form
3500 -282 240 -34 -675 -92 51 -425 -389 301 -80 -92 751 644 -373 276 294 -455 -536 130 -249 -539 294
3521 294 304 -112 206 637 -260 -110 584 -418 -520 -103 -11 -442 132 642 96 -124 824 293 -483 -38
3541 -38 96 -769 -549 198 -317 -291 368 354 -361 323 380 -67 -318 465 -50 -508 -1 -68 -585 -77 414 -201
3563 -201 130 614 71 -499 369 -196 -735 -107 242 -532 -316 514 26 -264 247 268 -40 91 486 -577
3583 -577 -322 116 -103 -437 475 498 -347 260 445 -137 -245 288 81 -677 156 443 -353 -13 761 113
3603 113 -181 616 262 -304 -67 491 -666 -440 357 -214 -301 331 438 -94 327 435 -349 -179 411 -312
3623 -312 -901 -86 114 -453 25 713 71 -342 628 398 -415 70 134 -486 -187 357 -504 -619 406 289
3643 289 -236 537 606 -107 -307 249 -221 -448 78 222 -561 130 618 -106 1 665 270 -219 491 37
3663C7q03O22L72n13J21P61k37m55O86j5q87L83P7n58k05R11n25k12O44K87m96
3684eP1P94j151j20P57l31n44N50l8n55J60J233q68k50Q27M8j075N39K18o06j55
3705e01Q01m09l62P45Q7p43N80M54j147M95M70n83o25P69P3m93M81N21p25L52
3725B40L89k99p05O02j12o12J89Q50p20k20P27J6q35P49K16o74J9L54k73n17Q12
3746A96j04n82O86L20o26J87M33m43n81J033k59q93M14Q83j204K00R21l90m43
3765b52N58j30m68Q8N77q52R1M36J51p57P94L09q72N09M47n64m47O64l95l32L87
3786e8K28n76L12O75l89k93N52q8n90J65L57n18l97J053o28N2N24Q8n64M41K04
3807E50q84J15N16j67o27L17N52p83M31M01n63K15N07m91n75O12m9p82L72P00
$$ plain form
3663 37 -766 -144 228 -285 -164 597 360 -95 591 576 -311 72 149 -409 -614 297 -228 -440 204 491 -5
3684 -5 66 860 -291 -411 346 15 -529 21 -17 -572 -412 821 -47 -297 530 578 -497 42 260 -346 -501
3705 -501 300 -109 -471 274 361 -382 198 652 -495 0 470 -113 -738 31 104 -389 92 613 -112 240
3725 240 629 330 -375 227 115 -497 -308 542 -178 -398 329 345 -490 259 475 -199 -180 174 -99 -616 196
3746 196 92 -490 196 516 -110 77 510 67 -514 519 260 -633 -219 664 -540 -340 581 191 -252
3765 -252 306 176 -292 -204 373 -479 -388 48 199 -558 236 545 -327 182 629 65 -382 282 -113 -445 -58
3786 -58 170 -406 -94 581 192 -101 451 363 -227 -62 295 -223 -620 433 -195 -143 381 469 -95 346 550
3807 550 -334 -219 297 130 -497 -180 372 -411 20 421 -142 73 580 89 -486 126 77 -705 -333 367
3827C67o26j03Q65j45o73O94L78q99R0M82p36P2L71j24m87N50M46q64K69P77n99
3848A05m70N19k29n92N79M16o61M9Q88o30l33O61k07m88L84K93n49k86P83m05
3868a73m72J063J80q52K5R70p09k26P05q13j29L67L47n12J30N41n49n04J182j97
3888C74r49N15L14p42J20P77m82j10M83L09q70L85N59j114K18N75m75m43P47l5
3908A56n47M89R39j271o4Q37n62o15P42N9q18M58N55o39R3Q34k93l84L25K04p49
3929b51j09M54j21l40K40L82o12M57M9l30J74M04m14k91M73J45p75K54N39n49
3949b21J73O47l73o42O60L1q55J54P32n91l49J015j76m67O61j03m51K29L61o15
3969a80j87M13j59l41O12R9o46N71K08k57l18N79j07q89N03N22n97l68R04j48
$$ plain form
3827 367 -259 -362 503 358 -315 379 757 -142 -52 430 -306 -234 137 13 -474 76 522 -342 -73 704 105
3848 105 -365 154 -75 -667 -88 328 -333 -284 604 -26 -359 302 95 -393 -9 284 -265 -551 232 -173
3868 -173 -645 418 598 -254 -229 741 32 -194 511 -302 -431 -64 283 -229 -99 442 -107 -611 571 374
3888 374 -575 -60 254 -488 -368 409 -73 -183 300 609 -261 124 683 -431 -213 362 -113 -556 191 156
3908 156 -391 98 1037 -234 -298 539 -23 -638 104 163 -655 -197 358 -281 -188 646 353 -31 294 498 -251
3929 -251 -360 94 -27 -367 -127 255 -357 100 149 -181 -7 397 -17 -308 165 310 -465 -211 328 -221
3949 -221 -48 599 226 -416 244 275 -580 -426 306 -285 -634 381 205 -262 399 296 -155 74 435 -180
3969 -180 -367 46 -113 -454 158 257 -389 182 390 133 -185 394 287 -602 -99 423 -174 -542 362 214
3989B14n50N71rk48K07L94p71k12Q00n04m85P44Jm16K38P72q55j55R00n54m48
4010c66J01M12o09K93M91m57k26P14k32m71N69K31p18K02O03o42k3L30j28n44
4030d70N95K78o36J83L25m93mN86k34p64N05L42o12K44O39m03k61N50k49o00L18
4051a61M21o16R8O98l74j17K26L51q71R1O61m74m40P26l30m42N55L88q47K42O63
4072D48m62l47N10Q9n98O03L05o77j61M06j01m80M27M24o71L39K81n61j3O25l89
4093ck87M11J45n59M79L39n39m22P84k97n48M47K79n76L27N99q96p1P85l66k39
4114b08M31J1k73j47M71m31j63P66k28m49L80L21o55J10O07n25l02L81l2n10L08
4135a37O91p73J57N50o00j73M38J10o55L05K30m97m2O92l32k55N89J13p15J32
$$ plain form
3989 214 -336 235 226 -22 185 579 -192 -404 396 -108 -593 151 152 -264 -26 746 -109 -264 636 82 -366
4010 -366 -265 147 -462 -169 322 -135 -361 353 121 -350 219 450 -268 -66 537 -105 -128 202 74 -470
4030 -470 125 403 -233 -50 275 -218 -222 364 130 -634 -129 213 -399 -155 484 81 -180 370 121 -479 -161
4051 -161 260 -356 -258 440 66 -51 175 526 -345 -254 407 -67 -507 219 -111 -553 2 390 -457 -215 448
4072 448 -14 -361 149 238 -360 243 548 -129 -290 116 15 -465 -38 386 -285 54 335 -226 -239 386 -3
4093 -3 -290 121 266 -293 186 525 -14 -436 348 51 -497 -50 229 -347 -20 579 -317 -388 397 31 -208
4114 -208 223 234 -39 -186 285 -146 -309 457 229 -220 160 481 -174 -64 543 18 -284 97 65 -445 -137
4135 -137 554 -219 -62 488 -112 -285 153 263 -392 -87 143 -354 -396 296 -36 -291 298 411 -304 -172
4155a72O35o21j61M49j50m05L09L91q12L84M63k00l39N72M8p96M19J58p17Q1J017
4176E53o83k11P00k19m21J68N60p13OO71l48k27Q9N44r38M88O04m99m61N96l14
4197e5j18L18j80l26L21K71m02pO05l39m75O93M5n43j24M72l97o1M90K41p76K57
4219i0L78n99K91L48m11l84O91k3n35L04K03k78mM85l46k73K96K85p93K13O27
4240C85l78m56J033l20p10O47K25n97O1L86n06j90P28k87o20O87K89m58j32N76
4260C63k73j76K53J37p07N55k87k27N1L76j37L2L14k67j14N2L33o80Q3M64qn02
4282c65N60J33l85m0L91k86l20P50l00o18O12K8j07k33L81j42l81N33j79l91M70
4303A11N9m18J42L95m32k45O61j29k18J28J88k35r5L34m73j83P68j23m75K99K45
$$ plain form
4155 -172 463 -158 -319 130 -20 -425 -116 275 -537 -153 310 110 -229 343 391 -405 14 172 -545 -464 553
4176 553 -130 -341 359 140 -281 -113 447 -266 -260 411 63 -164 -75 469 -469 19 623 124 -337 259 -55
4197 -55 -173 145 -35 -361 -40 231 -171 -178 427 88 -387 306 351 -192 -316 156 -241 -302 188 429 -347 -90
4219 -90 288 -311 -20 328 -83 -467 224 201 -334 -30 173 -105 -109 376 30 -243 53 338 -455 -242 385
4240 385 7 -449 584 264 -446 201 426 -171 -110 276 -230 -420 308 21 -599 88 377 -81 -213 363
4260 363 90 -86 167 304 -403 152 -135 -362 -311 65 -72 -40 274 7 -107 -55 278 -402 -319 145 137 -365
4282 -365 195 328 -57 -97 294 8 -312 438 138 -480 132 160 53 -180 201 59 -322 211 32 -359 111
4303 111 170 -248 -106 289 -143 -388 273 144 -74 54 242 7 -88 246 -227 -410 358 235 -240 59 304
4324C04m12N4J60k58j44L28o9m26M54L27n97J83L19j37k88N39j78n53L83M64n30
4345g7k45O34j62m98M54j15k71J90N62l39j77J66O3l76K01K35l44J28K52J05n32
4366a46M16Q8n18K93J91o27K86K45j06l65N93k7n25K43M0k93j78P70m78o2J97
4387C7J34n12K20K79n7j97N0K52m80L27l0l14kN51m73LL50j87L1L7Q4j71N6N17
4411E05n87l01M35j99p0L87K03n67J32M35j06m02L48j03j81J25J68l34j6K12q1
4432Cj67K92J69o37M23K00l51O1n3K43m55L05L7k10J45P7n8oK54o6n03M03Q2l26
4456a38J40M20m34r4K62n5k89J30K57n19K05L44k01l57P1L05J02j15L13p77L51
4477g9K76k01k46M95l0n14K26K14k91k12O11r2j16K15l8j08k99M18m94K04K11
$$ plain form
4324 304 -108 -54 106 -152 -296 32 -37 -463 -9 318 -279 -96 223 86 -202 337 159 -394 -11 453 -77
4345 -77 -322 312 150 -348 106 -9 -280 -90 472 133 -44 122 185 -191 10 245 -99 29 281 386 -146
4366 -146 270 358 -160 133 324 -303 -17 228 122 -243 350 323 -202 41 81 -212 -390 380 -98 -160 37
4387 37 171 -341 -121 158 101 -96 -46 206 -274 53 23 -291 -293 258 -215 -212 138 -49 -18 19 103 -68 -12 505
4411 505 -82 -383 52 -147 -217 170 373 -194 -62 373 267 -135 213 110 -71 54 222 -112 -128 84 3
4432 3 -164 128 297 -340 83 283 -68 -7 -60 183 -272 33 70 -140 5 82 24 18 272 206 -297 106 188 -138
4456 -138 2 422 -12 -106 156 101 -188 -58 199 -320 -115 229 28 -329 -258 47 149 34 347 -430 -79
4477 -79 197 -4 -250 245 215 -299 -73 141 -150 -362 249 157 41 256 218 110 -189 229 -265 -61 150
4498A50j08j16l5J18k27J04J32j57l24N02J42l57L31k03j14J21L42l20k16L37
4518A02M8m98L68J84j20J87j32J76m77K77qj62J7L58k42l14L86M9l35K78L1l88
4540b15J16L13m08j88N32O3n88K98P4k42K63J56l07j16M76k26k48K17J44k35R3
4561b8K32N1m62O4K44l85J18K69l51K48J52k71OOL93l00k16L5J90k7K67l85j07
4584b57M95j96m87M00K43l01k58L47K60o12L31K40l00L25j73p4k85L49m0m19N21
4605A09J74o14J10N48k35l88K54K24k70R9J79k54J68J93n54M2M28j55j65J25J82
4626B00m66O0M02j01r8j72J45p6R6O6k68m0L19J42m23J46L18m07O5K66l01j01
4648b28K32P2l86K31J33r6n5K96j55j69J52P4j30PJ04j00k07M73q7k27J89J73
$$ plain form
4498 150 42 -74 -109 9 -218 -114 18 -139 -463 39 181 -176 155 -48 -162 -41 301 -19 -235 102
4518 102 150 -348 20 204 84 271 139 315 -162 115 107 -55 -38 320 78 -236 150 199 -136 142 173 -215
4540 -215 -99 214 -194 -382 150 213 -375 -77 -3 -245 18 174 -133 -249 227 1 -247 -30 114 -121 -28
4561 -28 204 255 -207 -143 101 -284 -166 103 -248 0 152 -119 -113 -107 286 -14 -230 -195 -5 -32 235 -150 -257
4584 -257 238 42 -445 -45 198 -103 -361 -14 246 -366 -35 205 -95 230 57 -17 -302 47 7 -412 109
4605 109 283 -331 -221 327 92 -296 -42 182 -88 11 190 -64 104 297 -257 -215 213 58 -107 18 200
4626 200 -266 -206 196 95 -3 -175 -30 -106 -10 56 -212 -252 67 209 -214 -68 250 -157 -92 174 -127 -228
4648 -228 4 76 -310 -79 54 -42 -97 199 44 -125 27 101 -29 -22 82 -18 -225 248 161 -66 123 296
4670B96k86j99K07j7m49P58l43l10K59Q5o8P6K51l14J3J5j15L9K05J90m57J00
4692f4J31J76m97M90J98o66K66K80k42l18M28l31J88J63j33j42K46J29j87k05
4712i0L67j99l60K29K07k45J70n0r2L0J11K0q4p2Q9n63M62K71j98k25K93K8k78
4735a79L88j89j82L32N0j10j09J4j3j44K80k34L00j54o2q1M8K57j70j00j24K55
4757G3l73L80p0J7k05K95j49k13L25Nr7j98L12Pl24M29j11m6R6n0j23j38K42k40
4781a56k11K00K05k41rM65k20k29N00k99J85l56K72l74J54J29%j73O0P1K5J41
4803A39J45k70L4J14k36O7j52J18P1O2K7j54r1M32j78j73J34j58m5o9K90Pl6J50
4827B28n0k14p3K88k35O0K3p8l9K68l81O8K28n4j54K10J57k4l20J92k97Q2J8J75
$$ plain form
4670 296 10 -189 18 1 -448 310 -33 -343 -84 1 -67 9 260 -54 -41 -26 -141 -102 103 293 -164 -64
4692 -64 67 243 -254 236 434 -232 34 314 72 -246 182 -149 39 202 69 -73 173 302 115 -90
4712 -90 277 78 -282 -53 154 -91 79 29 -63 -33 78 98 14 -58 31 -532 -70 201 3 -222 71 99 -179
4735 -179 209 20 -162 170 220 110 1 15 2 -142 138 -96 204 50 -12 -93 -45 212 42 -58 -182 73
4757 73 -300 80 10 27 -178 117 -32 -245 80 85 -12 -210 102 109 -215 214 103 57 153 103 -20 -158 84 -156
4781 -156 -367 -167 38 -203 -212 253 33 -196 304 5 190 -166 106 -268 -114 15 15 -158 -98 -27 -2 139
4803 139 284 14 48 162 -74 -7 -159 -41 30 92 119 -35 -126 306 128 -45 89 -69 -114 -183 107 114 78 228
4827 228 178 -36 -109 179 -56 4 27 -51 -90 178 -203 -135 93 39 -115 95 252 228 -92 100 -197 -115 -97 78
4851G8j32j37L44l47R0m1K05R9k1K54m65m8K36j95J40j46L44l40R2J30l0k85L55
4874A80k30k41P80k96m95L22J66l43K78j71J26K3O6O4l26P8j38J23j35K03q0J20
4896G4J9R7j65n7L3qn3K24q1j25j8O8l5J36Mk08l36L08J7j91K46j71J96J98p4
4921I8k0n7K79l40j89K54J73j83j34R2KM5JL04k23k4K6Jl15K80p8K7l01K45J33
4946I6k39J36N2J45j50o3n9J67o3l38L39J34k55M5j2k4J88o7q8J89m73K93O3k27
4970b11M03j62p7K1P1o8j45P6J30q5k5K05k88m0L86k16j40J89lqK3M5l54K53p8
4995i8l2j1J77K33l02J92l0j08R6M2k55j25N29m90N2R5K81k75J38N7k36n6LK42
5019A19l17K32J76l37J88j9j13r0J85k8j68K6L86m19%J62N0j0P4j9l16J99l9O
$$ plain form
4851 78 -54 -191 153 -194 -104 -145 60 159 138 392 -73 -121 115 -80 60 -86 258 -82 10 140 110 -175 180
4874 180 -50 -291 489 193 -302 20 186 -157 121 -50 76 99 165 229 -97 -19 -157 -34 -169 34 -46 74
4896 74 93 190 25 -32 1 -7 -60 164 83 -42 -60 8 -27 109 113 -95 -431 -123 -106 -297 -51 -222 -26 172 98
4921 98 78 21 300 -40 -229 25 198 15 -119 -27 -25 20 21 325 102 78 104 105 -210 70 -8 19 -282 -37 96
4946 96 -143 -7 45 190 40 -23 -82 85 22 -316 23 157 -98 -53 -65 -89 99 32 -56 133 -340 -47 16 -211
4970 -211 192 30 -47 -26 45 -23 -168 -92 38 -47 -72 133 -155 -195 191 -25 -165 24 21 13 36 81 -273 -20 -98
4995 -98 -130 -141 36 269 -33 159 129 21 117 159 -96 -221 308 -182 -130 -35 246 -29 109 166 -70 -126 -123 119
5019 119 -198 34 210 -127 61 42 -71 -161 24 -4 -172 -146 240 -179 -179 -17 33 23 97 78 -238 -39 -78 -72
5043g2J08j92K94j72J6J23J06k22m7Q2M6J08Q4m00K56j14m75K73K01k3m9K1J98
5066A50j62r2L36j56k89L19k6q4K25k11Jj0J1j2o9O0K00l92M50k01q4K5m3j42
5090a96K40k6r7r0k7J44j58M04p4o0j98M8n1M7L19j15j13N8Q1k64K28q3m4n9J67
5115H1r3J47l68L13P1n21N06k9J18l55k8J75L4K36k83j70Q0O1j33R1J34m1n9J85
5139A52k13J95j64N4J7j5J39k35k9R4N7R9j34K03k38L8r6M3m5J68M0l94K74j45
5163a35r1N07l34J70k59R1J26l15N7L02k02n4K75j41r0Q8j13N0K0N3k19K62j38
5186i0k5k2K62j36R9j64N9M1j05L02k52j70j1L78k58R8J56j19j27J01j73K23J12
5209A79j16l38K42J85j25J34R2o6m1rl50j19L30o9Jj4q1J05k28N86k60P5j59k20
$$ plain form
5043 -72 36 -156 138 -34 -18 105 211 -11 -58 24 70 178 262 -138 118 4 -471 -198 3 -20 -69 -48 150
5066 150 -12 -104 232 76 -213 106 80 -4 221 10 11 1 12 0 -69 -9 191 -201 249 48 -36 -11 -54 -196
5090 -196 44 18 -79 -169 -196 -52 -210 194 120 60 -138 -90 -141 -94 225 110 -3 55 136 -128 100 17 -27 -86 81
5115 81 -12 135 -233 80 151 -370 136 107 225 -130 -158 17 51 287 4 -166 -86 -25 -158 -67 67 26 -33 152
5139 152 -61 134 -30 24 41 26 165 -70 -99 -5 52 151 17 220 -18 20 -76 -33 -78 90 130 -264 10 -135
5163 -135 -226 281 -53 117 -142 -51 75 -240 -183 119 -83 -137 138 -3 -93 -5 -118 -68 -48 5 -214 48 -90
5186 -90 -115 -137 125 -11 88 -76 -17 24 -81 221 -31 -201 -212 166 -92 6 162 43 -84 17 -156 67 179
5209 179 63 -275 -33 152 27 161 253 187 146 137 -213 -332 -2 -71 -70 -84 -165 -60 -288 298 38 113 -46 -266
5233b66N4Q9K62j19J21l5J25l07K73j93P6k2J91m55J5J62n3J91J06m03O1J29m8
5256d6M2J50j93J98N6k80j30K32J18k19J7o9p4M53l01P5J95m75J21MJ04m7r1N6
5280a04k8K06J75k16j99K64j01J82l58J83N7k16k08L15J20j6m1K2j77K36j97J01
5302@o8J07k5j8p6J29r7j01J64k32K42j69K9N10m53J5l04J73K63J6J01k14l07
5325c15N7M05r8m1p2q2Q6R3K11k63L8M4P1j53J09pj80N6K29k88L9j22K98l06J04
5350h7J28k71K68K6j73J7L05k44j71J28r7roK34k65L04o7k14J11K1N7k31K25j8
5374b9J50l24R7k8K00j7J24j53j57J26j44K24k39J78j32J22K49k72q5J73r0j04
5396a31Q8l8k74K53K51k11O7j48K84q5k28K66j83k4J78qj02r8K19j32Q6N5k9j12
$$ plain form
5233 -266 -212 -123 139 20 141 106 231 -76 197 4 80 58 249 -206 -191 -29 -82 109 215 -188 -127 2 -46
5256 -46 -4 146 -47 151 207 -73 -203 29 147 -72 -55 -124 -198 255 -46 29 224 -251 -130 -126 -22 -69 -160 -104
5280 -104 -132 74 249 33 -166 98 -3 179 -179 4 61 -155 -363 -48 72 56 15 37 -140 96 -101 0
5302 0 -68 39 14 -4 -80 49 -48 -149 15 -217 25 -144 -115 395 -58 -43 -347 -174 89 105 206 -8 -315
5325 -315 -258 147 49 8 -64 -146 -60 33 244 -19 19 63 134 -19 90 83 -97 -41 188 -100 -61 -183 115 -191 -87
5350 -87 41 -230 38 64 -109 -92 213 -31 -202 -74 -171 -180 -186 48 -217 87 20 -194 -83 -62 -5 -236 -11 -29
5374 -29 121 -203 -106 -134 66 49 173 20 -137 -11 -155 69 -170 8 -124 -2 247 -25 -110 63 -27 -131
5396 -131 -43 -81 -355 -102 149 -62 5 -143 141 56 -172 94 -89 -113 65 57 -45 -143 76 -56 30 85 56 -56
5420e6J07k14m2M03q0m24K15N8k33J25L93k19m6J77m4m7R6j00j95kL0J90j98r6
5444b02K73p0l4p7J01l31K59O1J22j29J17R8j73k9J10l15K18Kj80K28K20k49j27
5467a07J93K50m80L58j74m8k75M41j70J00K19j48K0k17j87O3K07J28j73j04J36
5488C2j08J37j5q8n0J16nK7j94J15R9q3Q1l66L23n2k5O5j39K78k4k7k76J77Q1
5513G9l7N4J12l58J7R0J34p2J72k78o5K33j8j43K93j38j52J8j83K97J12k13j89
5536b35M15j68j26J33K23j23j55J61j26N5k24L10k03N7j44L40l00N6m0P4q0J43
5558D3j62j4J21K60j90p2k3K28Jm16K05k4n0J81k10P2K8K8k52q6L56J67j40J09
5582A60j64o8J57j71J71j81Om0k1L06j4l11K56r4jo0m4m0J72j38J65J6R9j30L2
$$ plain form
5420 -56 51 -163 -205 198 118 -306 -91 -33 -266 -141 252 33 -13 164 120 73 169 69 -126 -128 -98 92 -106 -202
5444 -202 71 1 -33 -110 -9 -340 -81 -20 102 -27 90 188 15 -14 96 -219 -1 1 -179 49 269 20 -107
5467 -107 86 336 -144 214 40 -8 -283 158 -12 88 307 159 179 -38 -225 -162 45 173 0 -104 32
5488 32 -76 61 46 -42 -92 24 19 46 -148 -33 66 -17 64 -302 21 -31 -56 9 -130 148 124 97 -179 -2 79
5513 79 42 96 208 -150 -133 -43 91 19 191 -87 -152 81 63 -80 213 75 -77 -59 -242 55 167 -46 -235
5536 -235 180 12 -114 19 242 119 -36 125 -1 54 -170 140 -63 -6 -150 190 -110 -54 -94 -20 -100 43
5558 43 -119 -133 -12 248 58 -14 -37 191 192 -224 -19 -43 -93 88 -122 -50 -22 6 -246 -332 24 191 51 160
5582 160 -4 -72 85 -86 85 -96 -90 -130 -151 155 141 -170 86 -8 -9 -69 -113 -153 19 -119 46 62 161 31 63
5607F3R8k36J84k20K11K95l37j29j99K4L93j79Q1j42j24QL57j05J3k14J05K59
5629B06j19j73q3r6N33j92n8qR9j02m3J0L07l75n0J31n3m2k0K11l53K69l82K83
5653a00n4M2K74k46l0J22o0k04K58q3l9j89N05j93J23P6j99J79o8%j10n8R6J25
5677A67k44o9P4j45K7J96k21L10j50K26n7r2k15J00J23Pj59J7J42N1j7n5J35l06
5701a55J30%j11K01r9n9j23J39j38J42pJ95j10K9M1K2j76N3k39K60n5O7j54k05
5725c52L48O2m3J47q4R7o5k71K65K8j63J86k70R3%R5l09K30J94k18J38N2l46K37
5749E1j07oK11j21J59j87J35j79J2Q7P6j92N9j2J67j71k27J90j53K47j58K37N9
5772A77R1k56J63k10N0l03L1L30l26J08L87j01j50J46p4q4P6O4k04M0Q9n9o1K59
$$ plain form
5607 63 161 -75 109 -111 100 395 58 -71 -270 -246 147 -32 49 -93 -217 -209 148 43 56 -158 -53 206
5629 206 87 -86 -169 -265 268 76 18 10 109 7 -36 -26 281 -94 -144 -13 -66 -108 -128 83 -270 -1 -383 -100
5653 -100 -154 -112 162 -84 -114 8 -52 -256 2 -81 -120 -309 196 3 126 202 3 182 114 114 4 -54 42 167
5677 167 -77 -146 -72 -217 -190 6 -215 95 -55 171 114 22 -193 -93 30 37 -122 -105 37 88 71 16 151 -155
5701 -155 -25 -25 -136 65 -34 -93 -216 -77 -215 -73 -80 115 5 34 75 97 -79 -26 -265 -5 -60 7 -147 -352
5725 -352 -4 58 15 162 78 175 110 -161 104 132 -31 155 -115 -22 -22 73 -236 -6 188 -30 108 160 -186 51
5749 51 -56 -62 149 28 187 0 135 -44 -32 55 131 -61 -2 -14 153 -18 -245 -55 -208 39 -119 118 177
5772 177 268 12 175 -35 15 -288 -257 73 -253 -145 242 141 -9 137 63 -21 55 119 -85 -45 44 -15 -76 183
5796A83m42K99J4j28L13k12Q6J80j66j54Q7k51M01m13K32j04J8M52l58K1j4M18
5818D62m78k37M15k02J80j4j21J11J8j59K42l4j97p8K47k00J53j59kK00r3j60
5840a06o0J60j16j01J60M1J8J41n5O3p8K5R7k07q4J25j38oK02M7j38k4L1N3m8
5865Bk8j5j11K58q4j86J14J2M2J33k77L8J38j13J20j94j07J87n6J43J22m45L76
5888F9k62J15K25j29J23l0J6Jj95J88k66J77l48K88p5k28M31j44K5L62k82j39
5910g8J96j92R1q8J42K9n5J1PR6k61J70k18K27k67K20p4L69m47j00K60J39j56
5933B1r8P9J76k7j22r4k1j08J25R6j98o8L19J68j71rj8%P4l54j63N44k28J4J27
5958F4O0j11j78J00K78n55K15K23j46J21j74J32j8O2j48J11j00j26J57K6n5J0
$$ plain form
5796 183 -259 40 54 -74 239 27 113 293 127 -27 60 -191 210 -203 29 -75 -57 395 37 58 44 462
5818 462 -16 -253 162 -40 140 126 5 116 134 -25 217 183 -14 -92 155 -45 108 -51 -53 147 54 -106
5840 -106 -166 -6 -122 -223 -63 -22 -4 137 82 145 67 92 189 -18 -102 23 -115 -121 81 128 -10 -34 -3 50 2
5865 2 -26 -41 -152 106 22 -164 -50 -38 4 137 -140 -102 36 -77 43 -151 -258 -71 -127 16 138 -307 69
5888 69 -193 -78 147 18 141 111 127 128 -67 121 -145 32 -316 -28 -103 -331 100 -44 -19 343 61 -78
5910 -78 118 -74 17 -71 71 100 45 56 63 159 -102 68 -150 77 -190 30 -44 325 -122 -222 38 177 21
5933 21 -77 2 178 151 29 -65 -86 -194 -69 27 -171 -239 80 248 77 68 50 50 124 -230 -393 151 -77 -63 64
5958 64 124 13 -165 -65 213 -342 -127 96 -50 71 -103 29 11 73 -75 36 -64 -190 -33 -7 -62 -52
5980e2Jj69K97k85L24K12k28j91M3J77N2k15k9j77K76L3L5P7n1q0K21m03K26q3
6004A1j33J50j27j05K40Q2k28L5J88m0j80O2M0l9O6l6J10Q0p3k85P9L46k15K21
6028B49k50k3O4n5j62q9J25Q1J26J51j61j32O0J36q5j51J50P2k47J4L10m35N12
6051B60l04K53l7m5R1m5k79K88j54L8k82L52l83K84k27N0M6K07p2p5jJ03j09N7
6075A6j56J36j36K90o5l7K84l10M4k34J54J46k39q7M26k25J14j13P3k61L80k06
6097fQ3k71M0K52k46J1J26NK3L1l84M20q2J91j44J66k24m1j5k6l1J49o1J52lr5
6123B0p3k27K86j01Q7j58O5J93k50K48J20p6k33n7P2Q3m6j92L26j16K03k14p9
6146a19L19l2k0j27j28J49j64J23nM2l4K8p6J7m8J61j20J14r6j10J25o9j10K68
$$ plain form
5980 -52 -51 -220 77 -208 116 328 100 -91 -48 129 181 -34 -63 -240 36 69 104 181 130 50 271 -132 94 11
6004 11 -122 28 -99 -204 36 118 -110 -75 113 73 -107 -45 -5 -44 22 -14 96 176 103 -182 -103 243 28 249
6028 249 -1 -24 40 -15 -177 -266 -141 -60 66 217 56 -76 -16 120 35 -116 34 106 -141 -127 183 -252 260
6051 260 -44 209 172 127 218 173 -106 182 28 66 -216 136 -247 37 -190 -140 -94 113 41 -34 -35 68 -41 16
6075 16 -140 -4 -140 150 85 48 332 22 66 -168 -14 132 -107 -194 232 7 121 8 81 -180 200 -6
6097 -6 77 -194 -154 98 -148 -137 -11 -6 17 48 -336 84 2 193 49 215 -9 -50 -65 -91 -122 27 -34 118 115 20
6123 20 -53 -280 6 -95 -8 -166 -101 92 -158 90 210 134 -99 -156 -84 -1 -47 -239 87 -29 174 -40 -119
6146 -119 200 168 148 21 -107 42 -122 1 -4 38 4 32 -44 -27 -75 86 -34 80 -16 -126 -1 -70 -180 88
6170H8j71n3J02J03K31k00k1k00K44K3n0l14Q8j3M2l8J92%j43K4M6n5j3K12o2
6195F2Qj0k06n5L40k1L6j21j93K35p9k91J99j5K53k03j10O3L43p0l90M27j40k4
6219C8j40M4L6N9n0L8J1J35Oj09k2k2J50n9mj19j95L36k34p9K13r9J84j11Q0j08
6245b1r1J95p3j94N5j29L76j55L9J72j76J07O8j88Q8p3l88K63J9K2p0J27K08k54
6269g3J94m1O1j20%Q4k37k78K16K87k9L32k16R3l12K61j83k62L98l84J83K00r4
6292H0k78J48KL67m37L63j82q8O6p9j4Q7Qk12J79OO0k88L37l7N5k10K05R8k75
6317c9k74J38L77P8j48j87j5k1p3r8o1J06J31j4M43l84KL06q8l63K89o6q7j6j18
6342a82K30k03o1L68m89M30R9k00j66J84k0J9J67k56q6L85k8j24r4N9L4j81L18
$$ plain form
6170 88 -83 -136 -34 69 300 100 79 -121 123 146 96 -218 -130 -143 -101 -139 53 53 -90 -66 -20 -75 -88 124 62
6195 62 70 60 -146 -201 139 118 154 33 -160 75 -4 -295 -96 -111 142 -61 -171 -108 235 165 -225 202 62 38
6219 38 -102 -58 -22 37 -13 25 36 171 177 68 46 24 174 115 111 -8 -203 133 -101 -180 33 -66 118 7 87 -21
6245 -21 -112 83 10 -184 -129 -258 118 -37 2 174 -2 105 173 -15 73 0 -388 -125 -106 -84 -154 -27 181 -73
6269 -73 121 80 141 21 21 105 -132 -410 -194 93 64 396 180 273 -39 222 39 -223 175 -209 -26 174 80
6292 80 -198 -50 -48 319 -118 245 63 -25 41 -38 -52 35 43 -169 10 16 76 -212 125 88 143 -67 138 236 -39
6317 -39 -313 -175 202 280 132 -55 -70 -91 -164 -262 -323 -217 -86 -100 343 -41 -39 267 179 -184 105 39 -48 -64 -182
6342 -182 48 -155 -216 152 -337 93 192 -8 -174 10 -10 9 176 -80 -166 219 191 67 -27 32 66 -115 203
6365B03j44j51k08K93l33K54P3m6L2K54k76J75n4J3m5k33K09j71n1K79j10m6K94
6388B11p5l28J47J38j40r6k3J42j10L1J80n5j20L22j42J2K31j28o0j02k3O1j35
6411f2J69k56N6K13j72M8K86m46L70k25n0J03%k17K66k04K29j59J4LJ47r1j49
6434a27J53k83k1J37Q4mj13J58L11k46o5j41j6J22M2k50K28p7J59N0P4q3j21k1
6458e0j37J95p9J21r9J60k85O8L9L02l12J55l38K15n0K38o8q2q4J68j86J25Q8
6481A04j73K93m61K95K65j78k49O2m0R6n2K07j85K30k29J81j68m9J52j12q5op9
6504a81J17J99o3j19K22o5j93J39k96L95k30j2J4K7k18L57j07L7K3R5k03J37j11
6527c6J93n9m91L79k0o3J21l75N52j06j15J69q6J40j12k69K23j29J35l2q3O8P3
$$ plain form
6365 203 59 -92 -300 -7 -340 -86 -13 -59 -27 227 -49 126 72 85 40 -193 16 -155 -206 73 -37 -83 211
6388 211 136 -192 -45 93 -47 -143 -166 -24 -134 -103 77 22 -98 224 82 94 325 197 137 35 12 73 -62
6411 -62 107 -149 -93 120 -52 -4 282 -164 206 -19 -69 34 34 -183 83 -121 108 -51 -37 -34 113 22 -127
6434 -127 26 -257 -278 -141 -57 -61 -174 -16 295 49 -16 -157 -173 -51 -9 -259 -31 -108 51 101 175 92 -29 -50
6458 -50 -187 8 -71 50 -49 111 -174 -106 -67 235 -77 78 -260 -45 -95 143 75 -7 -91 77 -109 16 104
6481 104 -69 224 -237 58 323 145 -104 -42 -82 14 -38 169 -16 214 -15 166 -2 -51 101 -11 -96 -102 -181
6504 -181 -64 135 72 -47 175 110 -83 56 -240 155 -75 -87 -73 -46 -264 93 -14 23 46 141 -62 75 -36
6527 -36 157 98 -393 -14 -34 -97 24 -351 201 95 -20 149 63 203 91 -178 45 -84 51 19 -64 4 77
6550G7J03j86K2K5j26j77K41l7K2k28L44j84K95j66r7K02j63J2j05o1j6M3j07
6573b67J69L02l79M47m37K27k08j03K24j67J28r1j88J1K02J25K83l26K39k04m1
6594e4l8N3k0j15K70N5k84K89O9l1k71J56K8n9j10k27K62j72K38l2q3N4J7l31
6618c36K51r4K43p5N5j02m7J4K16q5o8J4K27j47J25n16J99J52O6k31P1r3L86k56
6642c1p7K87m10J04J11J1k02J69r0O1P2K59k36k25K52L9L3j38L00l43R8l40L58
6665F2l9K5K33m18K00l1J04p8Q2j47j92J06Q6r7J09q4r2k2J63J21O0N7j62M8l58
6690b64N05k09k2q9P2j21Q6n0J51OL9j82j69L30k43l1J69J45P9k03j21J12R7K19
6714C06l58N0o6J59p2j48J50j05K76j7k45K47j53j27J02k87K72j01J59m2o8l7
$$ plain form
6550 77 180 -6 16 41 -85 -262 -21 -58 -36 -264 80 -104 191 25 -72 130 -33 -21 -126 -187 -203 -160 -267
6573 -267 -98 204 -175 272 -165 62 -146 -249 -25 -192 -64 -155 -343 -332 -130 -5 278 -48 191 -13 -54
6594 -54 -92 -39 -59 -174 96 151 -133 156 225 194 -77 79 107 48 -62 -289 -27 -199 39 7 -76 -22 -5 -336
6618 -336 -85 -179 64 -11 44 -58 -105 -91 125 40 -28 -14 213 66 191 -325 -126 26 92 -139 -68 -161 225 -31
6642 -31 -108 179 -231 -127 -16 -5 -207 -38 -128 -67 5 264 28 -197 55 94 127 -11 289 -54 44 -296 62
6665 62 23 48 281 -137 63 32 136 58 140 -7 -199 -93 -7 -104 5 -79 -171 -193 -30 91 151 208 46 94 -264
6690 -264 241 32 10 -79 -7 -128 -42 -92 59 65 104 -78 -247 83 -160 -191 -22 123 202 -1 -122 -10 87 306
6714 306 -52 -2 -68 91 19 -129 21 -84 192 175 -70 177 24 -103 -1 -288 -16 -117 42 0 -68 -105
6736a05K40l08L32k97K93j95%j99K36r5m9K40N8k09J85R2j99j02M1l7O3P3j52
6759i4j66K80m3P1J7n5j28J04K1J20Q7o2p9j02M2N4p0QL66m51P4nkl5J81lk78
6786a48j27P9J14LJ95j40j46NK98j26Qj37K08k56j6J98M0Ok7j63K9NQ9J6j33R0
6812c6j90L6J97KpK98k56k20K79O3k13k0M6n2k43K66J81j42J14j07j41J98p6j07
6836a30J40r9Q6j75J33N4L5j74J0L41j89q0J81o0k87L80l3o21N70j80j0J88j05
6859b5M70l61j59J44k5o8k40N1P6K08J35j37Q7k18Q4O8J58n16K90k8R4m17K69
6882f0P5J30Q9l17K5K24j36L1k09J17k5j2L64l45O9o6M0p3n9M91m41J90q7j36
6906a21M9r6J57O6k7m5J56R9j17j14J74j81j8j76J3K5K35j39K74J0k17j14J82
$$ plain form
6736 -105 135 -173 159 -138 155 -40 -40 -239 -3 -98 -147 93 151 -58 127 219 20 -82 -41 -78 -15 58 -94
6759 -94 -260 20 -23 48 65 10 -118 -14 7 127 214 152 73 -29 13 67 -3 5 371 -80 -6 -11 -13 -48 133 130 -148
6786 -148 -275 -196 -82 -79 116 -24 -170 -165 133 7 15 -122 86 -170 -186 12 52 58 31 -132 -103 -98 -9 7 -126 -36
6812 -36 -226 -190 7 9 2 300 44 -176 103 166 -47 -67 -21 -73 -316 -50 131 -11 103 -4 -145 53 -23 -130
6836 -130 10 -89 -3 -178 -45 9 44 -130 -120 221 32 -48 133 73 -214 166 133 -488 82 -98 -108 80 -25
6859 -25 445 84 -75 69 44 -24 -264 -213 -137 71 206 69 156 -62 22 90 248 -268 22 -6 88 -329 -60
6882 -60 15 145 234 -83 -58 166 30 61 -148 -31 -56 -68 296 -49 20 -46 -6 -79 -138 353 -88 102 15 -121
6906 -121 -72 -168 -11 55 28 -17 139 238 121 7 181 0 -18 -194 -181 -156 79 -60 214 224 7 -107 75
6929G5j91q1J91r6q2J51K25p5k10M16l96K33j23j18l10L66n4J37KJ77j90q0J49
6952A16l05Q5K43j15k64J97L6O0k0J58l93J10J83j1j27l0J57J12j30j45J50j46
6974g9p6M51k13qOk3j78j84K52j24O9K04J07k42K20J18j70j68J27Jk14L24q1j48
6998b9K52j00j29R8k47K05J55k18Q5q3J52j90q6q9J15j51K29J09JJ03O3k10K1
7021E6j99K54m2Q1q4J83k30j01j00P6oN0PR8J14r2K9l5j35m4k8J65P4J19j64l2
7047A4K7l3L9k38K3J56J1lj15N4k8j31J31Q9j13m8K21P3n9j51J1n2Q0P3Q3J05
7073B19k78J84j03p8K4m5J62j04j5j09O2p9K92l41M92l65k5Lp2K42j98J05j20
7096a47J88k6m5J66j50J92l60K96k76Q4K1j88K88O0Q4k98K46j56K04j82j98R0
$$ plain form
6929 75 -116 -197 -6 -102 -184 -33 192 117 -93 323 -73 160 37 -81 -391 -25 -79 58 60 237 47 -33 116
6952 116 -189 -104 139 24 -240 -43 -7 53 33 191 -202 -92 91 80 -47 -77 80 192 62 -83 67 -79
6974 -79 -155 296 83 75 81 58 -120 -304 -52 -176 -107 97 204 -38 182 300 130 -38 89 90 -124 200 119 -29
6998 -29 223 123 -6 92 -155 50 205 -13 72 -11 141 -49 -135 -224 -109 -260 -31 78 79 182 245 35 56
7021 56 -143 111 69 150 66 249 19 -82 -182 -106 -112 -62 -55 43 157 65 94 59 -76 -120 -148 17 91 210 46 14
7047 14 41 8 47 -191 -168 -12 -1 -4 -119 -65 -93 -224 -93 -4 -117 -165 56 129 70 -81 -70 -122 -42 31 114 219
7073 219 -59 125 22 -56 -32 -77 85 -19 -34 -143 -81 -160 132 -209 283 -82 -107 -104 -176 66 -132 -27 -147
7096 -147 41 15 -30 136 -14 178 -182 114 -162 -78 -57 -245 43 103 187 -111 135 -21 183 1 -197 -107
7118a07J34P7j65J15k09J38j60L60N0j82l3j4J6M0M4j59L8P6j04J79j63N0P3l5
7142E9j96L35O3m48J26j76J33L57R1m33K23l23J84P9J63k06j51J97j79j38J95
7163d5L9K00o0p0K48n36L47m0Q9q4j64j0p5J29K80k81Q6n5k12J04K98k04p7J7
7187g6j63M36lj55O0k45N3J38k27L3K75j34j28O2N2l42M16j98R9m2L19k83q7L08
7211A68l66kJ65k9p6K11k80L11J5%j23j4K2K27m66J55N41l31k80K74m6r0N6J74
7235B16m0j48r1M6M9q7j00J83n7o6K15k88J37j3J24r0O0k73J66J41J62n40K95
7258AK16l42R6J09l1j27J7J35j63J65m0mk3k65K93k28K33J40j23O6j59j21J61
7281Fj76L45m41J86k1K0L4J01j99J6J13j56K6K08n5k30M47r9j63J39j96m3J05
$$ plain form
7118 -107 27 104 -61 54 -155 -17 -177 183 233 51 18 4 20 60 104 -55 -17 59 -45 134 -29 21 94 59
7142 59 -137 198 261 -187 -61 -237 -104 253 344 -89 134 -189 -5 74 237 31 -120 77 -102 -240 -45
7163 -45 -6 194 134 64 312 -224 123 83 172 88 -76 -86 -161 -32 248 -33 53 -2 -214 -110 188 -16 -93 -76
7187 -76 -239 197 194 39 99 -146 -93 45 -182 -149 126 -8 -136 -74 -22 -364 52 -146 -47 -89 230 -53 -140 168
7211 168 -198 -200 -35 -64 -140 71 -209 102 117 117 -6 -20 2 229 -237 -82 459 128 -152 122 76 -14 42 216
7235 216 176 28 -63 -17 32 -55 -155 28 -29 -95 120 -168 -31 -44 80 -10 50 -223 -57 84 246 -294 1
7258 1 217 -125 -29 80 49 -78 -61 74 -89 76 36 32 9 -256 37 -191 42 182 59 125 -34 -155 6
7281 6 -170 175 -266 -80 -101 -81 -47 54 -145 -129 -16 -172 -146 62 7 -223 224 125 -38 101 -95 -138 -33
7304c3J2Jj30J26L4j54J22q8L8J37J20l72J08k27L40j1J07j33M6j42j2L20l00
7327i1K60k14J50m02L98Lk28q8M49k25P4r6J14n2L0j18L6N0R6q1l56L58j40k57
7351c30J93K57k19m4L24l17p7Q3K46j64O8n3l2J27K8o2r9K94k00j52Q0J26k79
7374b02L40J11k51j43K2N7J18p8O9k6j5J16j53k71L34J39k00r9K24l01R2L41m80
7397b56J55J37j2J6M3n0j27Pk3J21Pk04R8L1P0q5N3j36K65j99K65m08K27K63o2
7422A96q3J6j06M6j71N6q8R4l0R9Nk78M29p1j16p1m0J46O4j79l2J43j47K37j79
7447f0K39K4k48O9Q2j26JJ30j75j30J14j02K20j08j27K98M2j03J43o6l32K66L3
7470H4J59k07j5J44p0j37K23k18K28j5l89O7K76k82m6l5J15K84k35K79k17l0p2
$$ plain form
7304 -33 -21 -20 -150 -24 10 -144 -22 -110 -72 65 185 -187 -79 -306 34 23 130 -3 43 -99 -111 209 -91
7327 -91 169 -45 105 -297 101 104 -124 -212 237 12 86 -10 104 52 82 -36 0 50 146 65 -291 67 -73 -330
7351 -330 -137 120 -99 -143 181 -136 -213 -130 116 -48 20 -33 -65 62 90 28 -71 223 23 -129 -49 77 -202
7374 -202 138 249 -2 -145 -123 -66 52 -26 43 17 2 118 -35 -306 28 167 -33 -132 92 -209 -117 224 -256
7397 -256 -101 36 24 40 83 33 -94 -87 -110 11 18 -186 -88 -57 13 -72 -19 -155 110 -89 176 -232 -5 258 196
7422 196 113 129 23 69 -102 -46 -134 -40 -70 29 34 -244 185 114 -2 -73 -113 33 97 -82 -114 29 -118 119 -60
7447 -60 179 203 -45 24 106 -20 -19 111 -64 -194 -80 -182 38 -70 -197 101 143 40 183 117 -215 51 84
7470 84 243 36 21 165 95 -42 181 -37 191 176 -213 -146 130 -152 -198 -233 -118 166 -69 210 -7 -37 -109
7493a09J24j27K2J54k0n6K06j3k68J71j8k17R0k1J25j30K47j58q6J00J13k12K9
7516e4Pm4j06J49K2j54k1J15p9R8q8P0N8J69p4J11j97J03k80K22m6r7n9L35k53
7541i3L05k96J18J05j61j09K86pk43o9K42o4P2j55m8q1K56o0o0R2k16Q3Q8O3q1
7566c3J13k02Q9j70L02k8J90k40m3Q0j12L92m19J87Nn6r1K42l09k26J78J41j10
7589a20L13k52RJ80j24pj22L48j75mJ21n5P3l74J10K34l6M9J08j54k8j39j07o4
7613b16M28l36K43j40L6Q6j83r6L48j48k29M78l45J87k61J29r3n4L18l32J36L35
7635B91m08N7J16k00J87J47j24r5J51k39J73Q7k27J49j31L46k36j34p3K24k87
7656b26M00j73j06L0K26R1j98K7J7j08m9j14K94k31K23k02k49K44n5K94m57J95
$$ plain form
7493 -109 15 -112 -90 64 44 -12 194 181 -87 84 66 -151 -61 -82 43 -87 160 2 -84 16 129 -83 -54
7516 -54 -47 -91 -197 -48 -26 -180 -201 -86 -165 -67 -155 -85 -27 142 68 179 -18 85 -195 27 -19 -116 -175 160 -93
7541 -93 212 -84 34 139 -22 -131 155 148 -95 -164 78 14 86 -69 -117 -198 58 -2 -62 30 -186 -103 -15 48 -33
7566 -33 80 -122 -33 -203 99 71 261 21 -22 58 -54 338 -81 106 111 55 -36 206 -103 -329 -151 -10 -120
7589 -120 193 -59 -50 130 6 -1 -123 225 50 46 167 112 185 -189 -79 155 119 168 276 122 94 -45 -152 -216
7613 -216 212 -124 119 -21 15 101 -82 -178 170 22 -207 271 -74 113 -148 -19 -112 -166 152 -180 -44 291
7635 291 -117 -60 56 -144 43 190 66 -29 122 -117 56 143 -84 65 -66 280 44 -90 -163 61 -226
7656 -226 174 1 -105 -75 151 242 44 71 88 -20 -69 -183 111 -120 103 -99 -348 -104 -159 135 -322 -127
7678a27Q9q6N9K7%pJ51k68K45j33K81l59L58j10mPJ3j12j87J30K5P2n5j2J77l71
7704a97J62o8N1J40k04K23M3k50L13k67R9k54K02j80L14j19J48k40j0K29n7j28
7726e0R7J16l22L0M7O2p9j16K92l1J48j63J25L8j24J07m43K27P1l5L2m5j92L56
7750A48j7k26J49K7N8j16j74J85r7J11r6j7J6o6L31j93l2L2L4Lk01J04J69l13
7774a81j2L3K86Rk45K05J0ln6j23L92k68N6p4j84K26l53J58mQ4Q4j73P1J40o6
7799A2j73J09O8j33J24Q7jll4J09p2J15m14J74o6K27k51j8M6K29K5j26l9r0k0
7824a15L38j9k66M6M8J21j83K8Q0R4n2j30K76p0j89J65jj04N0q5j25J07m4l1K6
7849c5J35m12K16l1J82J93k91M9j10J82j38R5O2O4l01K02o6O1j13J26r1R5qkj55
$$ plain form
7678 -127 -38 -124 -65 -38 -38 -45 106 -162 83 -50 231 -128 230 120 116 123 136 24 -163 -33 -8 64 9 -3 174 -197
7704 -197 -35 -103 -52 88 -116 107 150 -100 213 -54 45 -209 -7 -187 127 8 156 -84 -94 135 78 -50
7726 -50 47 163 -159 -129 -82 -20 -99 -215 77 46 194 31 156 194 70 177 -266 -39 32 -3 29 -16 -208 148
7750 148 131 -95 54 81 139 23 -151 34 -63 48 -48 -65 -49 -115 216 23 -9 23 57 60 -141 -37 132 -181
7774 -181 -193 -160 126 135 -110 95 105 102 46 -77 315 47 103 29 -155 71 -282 -124 -128 -44 40 -133 -62 78 12
7799 12 -161 -52 16 -117 7 94 93 90 56 165 93 208 -206 -32 -98 129 -122 -140 -94 135 160 34 -5 -95 -115
7824 -115 223 204 -62 -16 32 153 -30 -2 78 172 120 -10 266 196 7 172 171 67 117 32 -93 14 -30 -61 -35
7849 -35 100 -312 -96 -127 55 248 -43 6 -104 78 -60 35 97 161 -140 62 -4 57 -56 70 -21 74 66 64 -91
7874i1J30R7k29L6j34L42m4k73K25Qk79J42P1N2n8m1K52qk38J31r3j65J17J27
7898G7J31l6j63j15K4j84J13J10J67J84l26J82o1J27l06J80L2k69Rj24oK73n2
7921c3o8L66l39N8K0J69j45m3O8j84K26k47R9P0k3J78o9m5r5J95r7m8k33J67J70
7946A17k01M4o7K77l4o4k81M61l00J41k27L98j10p5k51K09%r9J88l00K78j83K6
7969e3J50k78J91k8KjM4K10r8k15j35K37N4K14k11J33k89K1J6j71p7L03K2L2l69
7994b96M40k78J43n3J99j35n3l7N0rK12l6j15q4j93L16J41j55P7j97k30L09J43
8017A59k37R4P8l6M6K20n20L50k86r8K38M1k2m6l7N3j41n8M9J38j8R6J43k39j07
8042a40J71J07k8J15j67l4j81J40J40r7j52J74j14oR5K21j90k17J78K89n72K37
$$ plain form
7874 -91 39 136 -93 -57 -191 151 107 -166 59 67 -212 -70 1 53 -5 -46 206 198 -40 91 -2 -167 -50 77
7898 77 208 172 9 -106 -82 -266 -153 -43 124 308 -18 164 103 230 -76 104 136 -133 -124 -248 -254 19 -33
7921 -33 -101 265 -74 -16 4 173 28 -15 53 -131 95 -152 -53 17 -6 172 103 58 -37 158 61 13 -220 -53 117
7946 117 -84 -40 -107 170 136 72 -209 252 -48 93 -134 264 154 79 -172 37 37 -62 126 -174 104 -79 -53
7969 -53 97 -181 10 -18 -16 -17 27 237 139 -76 -211 26 80 294 83 216 -73 -52 -36 -207 -284 19 41 73 -296
7994 -296 144 -134 9 -44 155 20 -33 -70 -20 -29 183 147 32 -52 -245 71 212 57 134 -63 -293 16 159
8017 159 -78 16 94 58 104 324 -196 154 -132 -230 8 49 27 -19 -56 -3 -144 -202 -153 -15 -33 63 206 -33 -140
8042 -140 31 138 110 225 58 24 -157 -17 123 26 -126 48 -66 -72 23 244 54 -163 15 304 -268 -31
8064c1k9kM1j6O6j24k1P6JK76k01p7J73k03j34J56j9L21o3k97K61o7k3k64J99
8089ap8K14qj60j08K33j28lJ03J2o7N3k89J40k7Q7J64Mk02J6J73nJ09k39J91k21
8115c7n7K52j73J0k87K33ML85l11j8m1N9j73J97j02L33j85Kj79j08O1P5K89O8
8139B97l91r8K51j20R2Q7j55R0o5j18J49n0m6J14j73Q0K73l98J92Q9j71P7j9o5
8163g8M8L8J66l45L32k04K22l58L32j27j34J68k71j0J83J45j37j1O2jj0J5j71
8186a46j37M12k0OR9
$$ plain form
8064 -31 -60 -62 -21 -37 29 -95 -116 -40 -39 237 36 -41 132 -71 -205 -49 -68 253 190 -107 154 87 64 -200 -1
8089 -1 -79 135 127 -33 -141 92 -36 -39 64 76 9 62 -227 -87 -114 -27 137 141 -61 -45 128 123 232 -7 184 -37
8115 -37 -94 158 -15 -5 -292 -59 -55 330 19 1 -40 19 -154 43 -59 274 89 91 -88 -196 -135 -60 229 297
8139 297 -94 -192 59 -61 31 118 -37 53 -12 -130 19 -31 -77 37 -136 -56 217 -181 11 100 -71 6 -13 -78
8163 -78 -30 8 174 -171 161 -43 179 -179 153 26 -108 60 -211 -221 -38 107 -30 -41 21 20 10 25 -146
8186 -146 -283 129 109 115 214
8191B14
$$ Imaginary data points
##PAGE= N=2
##DATA TABLE= (X++(I..I)), XYDATA
0@%%%%%%%%%%%%%%%%%qJ6j6J6j6J6j7K5l2L2l9M7m9N7o5P3q4R3j06J22j38J53
39H0j69J86k05K28k52K79l09L40l75M13m54N01n53O09o71P42q23R15j021J145
59F06j291J467j685J966k338K847l598M812p076J2627m9425m7773J55762k4307
73D2594j06335R1414N6630j13890L0057R8126q4619m8811J06538k6598r9192P3898
85A9812N1836j06513O59R0325o0388n9659Q9921M892r1758M1747N6486q4671j1551
98e8862R4255l4882o3597Q0619K1356q8738L6647P4221p2115k2638Q8726l4327
110B0665p9401O8568L0871q4926K4207P3115o3193k8766Q0071k3429o7389O4655
122A5048L0761q3501J2238P0045n3557l5851P6645L82o0050M6194L5053o7017
$$ plain form
0 0 0 0 0 0 0 0 0 0 0 0 0 0 0 0 0 0 0 -8 8 -8 8 -8 8 -9 16 -16 16 -23 24 -25 32 -33 40 -44 49 -57 65 -73 80
39 80 -89 97 -108 120 -132 147 -162 178 -197 216 -238 263 -290 319 -352 390 -433 482 -539 606
59 606 -685 782 -903 1063 -1275 1572 -2026 2786 -4290 8337 -41088 -88861 66901 42594
73 42594 -63741 27673 84303 -29587 470 98596 13977 -34834 71704 45106 -54086 19812
85 19812 71648 -34865 -34206 56119 -4269 -63928 25993 30885 -60873 -19126 37360 -47311 -58862
98 -58862 35393 511 -63086 17533 38889 -49849 -13202 61019 -11096 -33734 54992 20665
110 20665 -58736 9832 40703 -44223 -20016 53099 -10094 -38860 41211 17782 -49607 15048
122 15048 45809 -37692 -25454 44591 -8966 -44817 31828 32210 -27840 18354 53407 -13610
134a3610J781N8028m6147m0596O3720j517o8218L4649M5234n8909q037O2182k8684
147a24m3263N2761N297o3289K9058M5586n2815q526O5989j8542m2110N2544J6253
160C8819n7677K1935M4969m9234j8352N5150j8624m7136M3453J9384n3560J4143
172f730M4452m3214k3714N0291j3563m8495L7513K3720n2523P226M9330l2738
184h445k4759N1639j259m4832L1773K5613m9784J728M7742l0219k8855M9146L961
197B3449m6446K5021L0257m3800m705M3689k5525l2053M0975O119m5145K1394
209f770L4923l7329q023M4985j6988l5611L4999J1015m4084J3578L5024l3729
221h010j3462M4465j1097l7032L3263J6774m3736N835L5719l2371j9946M2343
$$ plain form
134 -13610 -11829 46199 52 -40544 23176 21659 -46559 -11910 33324 -25585 -33622 28560 -124
147 -124 -43387 9374 14671 -48618 -19560 26026 -26789 -35315 30674 12132 -29978 22566 38819
160 38819 -18858 3077 48046 -1188 -19540 35610 16986 -30150 13303 32687 -20873 -6730
172 -6730 37722 -5492 -29206 21085 7522 -40973 -3460 20260 -32263 -25037 24293 -8445
184 -8445 -33204 18435 17176 -27656 4117 29730 -20054 -18326 29416 -803 -29658 19488 23449
197 23449 -22997 2024 32281 -11519 -16224 27465 1940 -30113 10862 16981 -28164 -6770
209 -6770 28153 -9176 -17199 27786 10798 -24813 10186 21201 -22883 -9305 25719 -8010
221 -8010 -21472 22993 11896 -25136 8127 24901 -18835 -13000 22719 -9652 -29598 12745
233A2745n588l7187L1176K3502m0524L799L8801k6669k3676L9099j378l9129K3961
246a068K5564l6928j214L9916j9734k5263L6111L249m0092J6569K6045l5340q422
259b0607L7575j4877k7990L2579J0400l6759J3312L0648k9962j3250L6015j0850
271F234l1644K7688J3808l5806R093L3889k4788j5822L6711m366l2804K2722J6426
284B1341l6060J703L2062k2137j9981L5076J412l2045K0669K1790l2779l029L2593
297B0615j9141k5346K9393N249l2900J5471K5425k7057n297L4160j2446k5924
309a7798K6317Q284l3804Q582K5843k5082j0496L3124n991k5818K3920J3296l0827
322a0450M449K5533k2498j6085K9312l154k8083K0055J7508k7513J256K7968j7061
$$ plain form
233 12745 7157 -30030 1146 24648 -15876 -12077 26724 55 -23621 15478 14100 -25029 -1068
246 -1068 24496 -12432 -13646 26270 6536 -18727 17384 20633 -19459 -2890 23155 -12185 -20607
259 -20607 16968 2091 -25899 6680 17080 -19679 -6367 24281 -5681 -18931 17084 6234
271 6234 -25410 2278 16086 -19720 -10627 23262 -1526 -17348 19363 14997 -17807 4915 21341
284 21341 -14719 -13016 19046 -3091 -23072 12004 13416 -18629 2040 23830 -8949 -11978 20615
297 20615 1474 -23872 5521 10770 -22130 -6659 18766 -8291 -13588 20572 8126 -17798
309 -17798 8519 16803 -17001 -8419 17424 -7658 -18154 14970 8979 -16839 7081 20377 -10450
322 -10450 -6001 19532 -2966 -19051 10261 7107 -20976 -921 16587 -10926 -9670 18298 1237
335A237j7714K6818J61k9218J4896J9084k6476k251K9282j2485j9542K6208N385
348A5385k8780J0602K0855k4548p859K6979r457k1309K3486R131k7394Q062K4104
361A9257k1114j1808K5776n593k3510J8601J1560k5772M655K4879j6611j2943
373a2623K5037j482k4600J4346J3010k4845n74K3876j3567j5074K3834K849k3219
386a3032J2059J6519k2283m413K2656j1078j8018K0865N119k1827J0884J9485
398A6936j9324n871K4191p824k0300J6561P701k2937N007J8668j6900p875K4130
411A2163m197k0024J6171J0939k4061O69J9238j4741j2626K0868j69j9244J4454
424e60J2692j9741N47K1308j2533j4512J9482J995k2077R156J4844j7281j883
$$ plain form
335 1237 -16477 10341 10502 -18716 -3820 15264 -11212 -13463 15819 3334 -16208 10000 15385
348 15385 -13395 -2793 18062 -6486 -14345 12634 3177 -18132 5354 14485 -12909 -4847 19257
361 19257 -1857 -13665 12111 6518 -16992 1609 13169 -12603 -7948 16931 320 -12623
373 -12623 12414 10932 -13668 678 13688 -11157 -11731 12145 -1422 -16496 7338 10187 -13032
386 -13032 -973 15546 -6737 -11150 11506 428 -17590 3275 8394 -13433 -2549 16936
398 16936 -2388 -8259 15932 8108 -12192 4369 12070 -10867 -5860 12808 -4092 -11967 12163
411 12163 7966 -12058 4113 15052 -9009 -8340 10898 -3843 -16469 4399 4230 -15014 -560
424 -560 12132 -7609 -7062 14246 1713 -12799 6683 8678 -13399 -4243 10601 -6680 -8563
437h563K0728q175j3740J8414M062k1561O371J5840j6739p270J8970n908j6101
450a3672J6592P913j9086N389J8303j5091r599J8207m152j7865J2485Q906j8631
463a0301K833J8294j2740r765K0066k74j9198J0964J1558j9432k623J7282q546
476a882j0984J7422K126j6151J0918J2496j8269l107J9804p678j5498J4016N575
489H788j7165N499J3991j2832l911J8234o051j6014J3196N696j8870K281J6144
502H986j2070q261J7504k296j5340J1488Q854j6193J091J5402j1770j0413J6238
515C220M29j4772J0637J1270j5193R5J6497j0237j1972J5940K912j6781O510J2025
529A0580j3308l187J5518o434j0339J4657K757j8163M846J2699j4248o906J6920
$$ plain form
437 -8563 12165 3990 -9750 8664 12726 -8835 -2464 13376 -3363 -10633 8337 2429 -13672
450 -13672 2920 10833 -8253 -2864 15439 348 -9251 8956 4804 -13061 -576 8330 -10301
463 -10301 -7468 10826 -1914 -11679 8387 8113 -11085 -121 11437 -7995 -10618 6664 -1882
476 -1882 -12866 4556 6682 -9469 1449 13945 -4324 -7431 12373 4695 -10803 3213 8788
489 8788 -8377 -2878 11113 -1719 -5630 12604 6553 -9461 3735 9431 -9439 -7158 8986
502 8986 -3084 -11345 6159 3863 -11477 11 8865 -7328 -6237 9165 -2605 -13018 3220
515 3220 3649 -11123 -486 10784 -4409 -4314 12183 1946 -10026 5914 8826 -7955 -1445 10580
529 10580 -2728 -5915 9603 3169 -7170 7487 10244 -7919 -3073 9626 -4622 -11528 5392
542E392k123j3062J1045O800j4796K788J2951j1523o200J5379m162j5576J0947
555b140Q590j4424J534J6144p210q696J3232j035j4305Q526Q392j4572m59J4735
569H312p280j0378J4353K989j3487P314J0644j4297l887J3847p155j1910J2242
582A307M843j3490N064J1243j1470l930J4263m521j2317J0743M229j5499J823
595g712J2825r039o183J5177l47j1133Q648N940j3205J511J2414r511p756J4173
609E802m32j3559P824R725j1226J14J2416p457q813J0716q7j3749O663Q873j1221
624d411k316J3005n167r814J1142L772j2160L938Q878j0443m495J2001m021r728
638i819J1132N861j2141K922J0517r120n442J1940k203j1016Q771N617j2678J256
$$ plain form
542 5392 3269 -9793 1252 8052 -6744 -3956 8995 -2528 -8728 6651 2489 -13087 -2140
555 -2140 6450 -7974 -6440 9704 2494 -6202 7030 5995 -8310 216 8608 -5964 -6423 8312
569 8312 1032 -9346 5007 7996 -5491 1823 12467 -1830 -5717 8130 975 -10935 1307
582 1307 6150 -7340 -2276 8967 -2503 -6433 7830 3309 -9008 1735 5964 -9535 -7712
595 -7712 5113 -3926 -10109 5068 4721 -6412 2236 8176 -5029 -3518 8896 -615 -8371 5802
609 5802 5370 -8189 -365 9360 -1866 -1752 10664 3207 -5606 5110 5023 -8726 -2063 6810 -4411
624 -4411 -6727 6278 1111 -8703 2439 6211 -5949 -2011 6867 -3576 -8071 3930 -91 -9819
638 -9819 1313 7174 -4967 -2045 8472 -648 -6090 5850 3647 -7369 1402 7019 -5659 -4403
652d403J1565o703o064J1763r23j1081O558N981j2045j81J1580n987p245J0820
666C635J343j1036N642P824j0222k018J0580n509q201R267K210j0478N209R108
680G354q741l357J0920l840q982P752L513j0570L095R064q234l590J1323j767
694C940r068P718M431j0499N77Q437p492n080J0206m56q681O930N770r725L48
709b644R363o066o642Q840M0j0037M874O541q398P4J0224m259o748R079J019r799
725d539L273O207q271j804R183l474o611Q375K972q511L373O864p901l259Q139
740D016l272p719O694L534p946K200P894n644l217Q178j723p734N236L609q525
755d419L79P566m784l680Q237K63p316N200N077q055j303P443m578n258O889N97
$$ plain form
652 -4403 7162 459 -5605 6158 5235 -5846 712 6693 -5352 -5533 6047 60 -7185 3635
666 3635 4978 -6058 -416 7408 -2814 -4832 5748 239 -7962 1305 3515 -6963 -1754 7354
680 7354 -1387 -4744 6176 2336 -6646 1106 4619 -5951 -2856 6208 -2026 -5616 5707 3940
694 3940 -5128 2590 7021 -3478 -2901 5536 -1956 -7036 3170 2714 -5967 963 6733 -2992 -2644
709 -2644 6719 653 -5989 2851 2891 -7146 -2272 4269 -4129 -4055 6169 1910 -4838 4241 5260 -4539
725 -4539 -1266 4941 -3330 -5134 4049 575 -6036 2339 5311 -3200 173 7037 -864 -4123 4016
740 4016 744 -6975 -281 3253 -4693 -2493 5401 -243 -3460 4718 2995 -4739 497 4106 -4419
755 -4419 -4040 3526 -1258 -4938 3299 3562 -3754 1446 6523 -1532 -2835 4608 30 -5228 1661 2258
771B258p519M388O081o828j206P776l536n590O107O34p496K849N606o056j530
786d062P647k107n108N516K463p465K047N535n731k865O937j213n730N049L149
801D062o498J245O032m385l847O228o10o547M091L702o228K07O786l968l745N871
817B396J36o110L306L422n858jN761l110m052N975J191n755K529M049n095j309
833b525N166k827l764M708J665m940J867M669m305j415N152j564m668L247J925
848B391n266J150M001l100j580N339p67m603L417K511n388j94L969l188k739M730
864F83j26m033L530L523m613j8M042k581l172L664M8m477K817K721l743m6M999
881C218j771k952L808K57m423R66K689l413q41L217q08k488L595J181l825J748
$$ plain form
771 2258 -5261 -873 5208 -1620 -2826 4950 1414 -4176 1931 2565 -4931 -2082 3524 -2532 -4062
786 -4062 3585 1478 -3630 1886 4349 -3116 -1069 4466 -1265 -4130 2807 1594 -4136 913 4062
801 4062 -2436 -1191 4841 456 -3391 2837 2227 -4320 -229 3473 -2755 -2548 4238 270 -3475 2396
817 2396 2532 -3578 -272 3150 -2708 -2709 3052 -58 -4110 1865 3056 -2699 -170 3879 -1216 -2525
833 -2525 2641 -186 -3950 758 2423 -2517 -650 4019 -286 -1701 3451 1887 -2781 466 2391
848 2391 -2875 -1725 2276 -824 -2404 2935 2168 -2435 982 3493 -1895 -2089 1880 -1308 -4047 683
864 683 557 -3476 54 3577 -1036 -1054 2988 407 -2765 899 947 -3530 -713 2008 -1735 -1781 3218
881 3218 1447 -1505 2303 2560 -1863 -897 1792 -1621 -2462 755 -53 -2541 1054 2235 -1590 158
897A58L530l307k296L089r14l052K417J198l098J458L113k342j500L777m85l701
913a955J571K281l921K10K996k085j049L110M21k585J970J721l181n69K973j585
929C23k105K067M42k552J612J987k501l15L398j203l074K359O76k860O83J842
945G79j589l72K919j144k093K423Q95k688J94K145j318j547J879l22j617J540
961H4R54j971N25K107k284j237K367N5k168J291J473j557k12J537j186j84J599
978A193r2k093J121J026j710l19J503m68o25J645r9j607K59J033j423l82J113
995G5l16j085R99J59q32M57J510r57k10J228o90j645Q73P96j150J55J272j54o17
1014a32Q60k58l47Q66L44j554j49Q32j020j477J330P51l89N67Q26p46j14M46o06
$$ plain form
897 158 3688 381 -1915 1174 260 -2792 -375 823 -2275 -817 2296 -46 -1546 2231 1746 -1955
913 -1955 -384 1897 -2024 -1814 1182 -903 -1952 1158 1579 -1006 964 2685 -496 -1065 1908 323
929 323 -1782 285 727 -1825 -213 1774 -727 -1042 2356 1153 -1921 438 1114 -1746 -1063 779
945 779 -810 -1182 1737 593 -1500 923 1818 -870 -676 1469 151 -1396 483 161 -1456 84
961 84 1038 -933 -408 1699 -585 -1822 545 600 -1568 -277 1196 -361 -573 964 -222 -406 1193
978 1193 1101 -992 129 1155 -555 -874 629 161 -464 1181 1082 -525 -266 767 -656 -1038 75
995 75 -241 -1326 -327 -168 -1000 -543 967 10 -200 1028 338 -1307 -434 362 -788 -633 639 485 -132
1014 -132 728 470 123 989 1333 -221 -370 462 -558 -2035 -705 46 -343 224 1050 304 190 636 30
1033C0m37P08j44p45K4M31l34Q8J232L27n38L8o2r02l59L60o76Q5J049k24o68
1054g17L72N71m37M93R16p06m27L03k31r48j12Q63J98J69L83M3k63J4j55l35J55
1075A49N02p46o38L9R8j53L72M58P1p3Qp8j63l37K05K37L03m1j63l01nL81l58
1098b33Q05N7K81o92l28J73m86N97J31p2k19J48k30m48O6M25k44L92J53q5o78
1119d87L86k47J58K16J54M9k79K10j73n79K83Q72l81Q9K36m82J90j97m7l47K48
1140a28O86n42k22qJ1j95N33L09q6k25J86n19k42M5L47l92N49K08n48j15O83k55
1162H0O8L38K48p50j45L06j030L34M82J4l02N04j50k27J80L38k02j03M86l35n64
1183d30n0M35n88M01P21l59O4N72l14m91J8M28o12k6M91o16o40R79j53m66Q02
$$ plain form
1033 30 -407 301 157 -588 -564 -133 -467 -379 853 1180 642 680 618 -284 -643 -283 -959 -874 175 -49 -717
1054 -717 -345 226 -211 282 1198 492 65 368 137 -811 -923 -60 138 307 690 733 470 484 329 -6 149
1075 149 651 -95 -733 -694 -596 -749 -377 81 152 79 87 9 -154 -491 -286 -49 254 213 50 -251 -256 125 -233
1098 -233 572 629 910 218 -110 63 -423 174 305 233 14 162 -68 -516 -450 -25 -269 123 276 191 -487
1119 -487 -101 -348 -190 26 180 229 -50 160 -13 -592 -309 563 182 271 507 25 215 18 -29 -376 -128
1140 -128 558 16 -206 -214 -203 -398 135 444 358 133 319 -200 -442 -397 -50 -442 107 315 -233 -348 335 80
1162 80 148 486 734 -16 -161 145 -885 -551 -69 -55 -357 147 -3 -230 -50 288 86 -17 469 134 -430
1183 -430 -480 -45 -633 -232 489 130 194 766 452 -39 -21 407 -205 -231 260 -356 -996 -17 -170 -636 166
1204A66O85p62K96j32n43k25P69q2p57O90M40k14l04O31r5k52N38J89q58k23L47
1225C04m56m08O21l86l75O32J90q34q2J259r04j9M09l48k97L76L31r27M17J237
1245G40m24m70P14p6n85Q64L14j025N2N90l37q48N61R5p84N75L60m95k26P42j99
1266A38p86N67K11p45Q7N08p13q2J108j13m82M91M15n34l7M97n75o01J260p03
1286h9q02M50N64p51K61O88k24m15O60J52n60mL96l52l62R63m33l79R30K14j007
1307a00M35M13m23k45M59q46m91M97L92r37pR93o28k90P25K5m98M65L86p48J65
1328b58O58n03m35J024R4n17L86N56o90j31P80m58l61N60l01q48K58O28q73n09
1348i40R99jn37K99J46m87L57P17r80j27R06k67q68P12M55n49J57O23m65l24J005
$$ plain form
1204 166 851 89 385 253 -290 -515 254 172 -585 105 545 331 27 658 563 311 849 1038 180 -43 304
1225 304 -152 -560 61 -325 -700 -68 122 -712 -794 465 -439 -458 -49 -397 -694 -318 13 -914 -497 740
1245 740 316 -154 560 484 -101 763 1077 52 104 694 357 -491 70 165 -619 -44 316 -179 -405 337 138
1266 138 -648 -81 130 -615 -528 -20 -733 -815 293 180 -302 189 604 70 33 530 -45 -646 614 -89
1286 -89 -891 -441 123 -628 -367 321 97 -318 342 494 -66 -70 326 -26 -388 575 142 -237 693 907 -100
1307 -100 335 748 325 80 539 -307 -798 -301 91 -846 -853 140 -488 -778 -53 -28 -526 -61 325 -423 -258
1328 -258 400 -103 -538 486 580 63 449 1005 315 184 964 506 145 705 404 -444 -186 442 -431 -940
1348 -940 59 58 -479 -180 -34 -521 -164 553 -427 -554 352 85 -783 -71 384 -165 -8 615 150 -174 831
1369H31l96p97M78N18j099J6N04m5q11R13J57o92L49O27o21OP90m56q36N82M39
1390D57r67L64M54j18M4N94l21m10L92M4q76j11O65q54j11P45r6o32O78N55n78
1411h2j99Q51m90l03P95l24q47L69N33l77P0P43k60m56N40L41j186N35K84o98
1431a61o34P83j1r02Q48K48m26J27R34r31m15Q48k06p26M10L59m93k7O73l03l96
1452d01Q61J82p74N39M04r17k35N46o01j06N24M47q53K22O37p85j6R03l39p49
1472e11M45M56p80k7P63m37kQ39k22q84L87O78j220L35Q08l74p05R65l69q18O00
1493g3M34p67j89J081o63o66Q06M40r17P15O13p76j97M96m04l18O55J29j046P13
1513F6Q05j057l43J038J52p32M32O9p34k05Q65p90j39Q99k61n05P67L07r28j18
$$ plain form
1369 831 435 -362 116 634 -465 -449 55 10 -801 112 269 -423 -74 553 -68 -62 728 272 -564 18 457
1390 457 -510 -146 308 190 234 828 507 97 489 533 -343 -454 211 -643 -754 -9 -105 -737 -59 496 -82
1411 -82 -281 570 80 -223 572 248 -599 -230 303 -74 -4 739 479 23 563 904 -282 253 537 -161
1431 -161 -795 -12 -23 -925 -77 171 -255 -128 806 -125 -540 308 102 -624 -214 145 -348 -375 298 -5 -401
1452 -401 460 642 -132 407 811 -106 -341 205 -396 -502 22 469 -384 -162 475 -310 -326 577 238 -511
1472 -511 -66 390 -390 -417 346 -91 -93 746 524 -360 27 705 -515 -180 628 254 -451 514 145 -673 -73
1493 -73 361 -406 -595 486 -177 -843 -37 403 -514 201 814 38 -159 337 -67 -385 270 399 -647 66
1513 66 871 -186 -529 509 661 -71 361 430 -304 -509 356 -434 -573 326 65 -440 327 634 -294 -412
1533d12R41n71n16Q56k60q54O49M78p79L09J209m82p49N15n2q47N30O99j071j12
1553e19R02n53o07J200L83r59M13O11q72n70O36p80l24J004M28j029L96R34p50
1572e6m77J458m00r00O61J13j133j04R38n08K13R47R7j352J191K27j062l18J131
1591F66p06q86Q93J02q75N34P31n93l5J056n86r34P75k8j139N67J088r08k12P35
1611B45k26m74P70M78j020J82J099j318o13J049k79n37J114K67j259M81O43q06
1629b04m28R52q0o41O02J44r44R2R82m44q54J483n6j329O87J32j009L38J156n50
1649B9o27Q78j18m54QQ47j039K6J108n25r43P91M34m43K69P51q94J1P48n20j021
1670f84O44N71p70L89M73q32k08J071l09p92P76p1j191J29N06o89j99J387k46
$$ plain form
1533 -412 529 -42 -558 298 38 -816 -167 311 -468 -159 1050 568 -181 334 282 -565 -35 664 -407 -519
1553 -519 383 -170 -777 423 806 -153 260 871 -1 -571 65 -715 -1039 -35 393 -636 -240 694 -56
1572 -56 -533 925 525 -375 286 399 -734 -838 100 -408 -195 752 849 -503 688 915 -147 -465 666
1591 666 -40 -926 -33 69 -806 -272 459 -134 -169 887 301 -633 142 114 -1025 -458 630 -278 -490 245
1611 245 19 -455 315 793 -227 -45 1054 -264 -877 172 -107 -644 470 737 -522 -41 602 -204
1629 -204 -632 320 240 -401 201 345 -599 -507 475 31 -823 660 604 -725 -38 94 -915 -577 579 29
1649 29 -598 280 162 -292 -284 563 -476 -450 658 133 -810 -19 415 -28 241 992 98 109 857 337 -684
1670 -684 -40 531 -239 150 623 -209 -417 654 345 -447 329 258 -933 -804 -298 -987 -1186 201 -45
1689d5m46M18O84q40K87N39l05o09P66j63q68N56P12o48K63R22n84p38R46o8j466
1710f87N03N33q87m82J085m77k72P63K99q79M95N60j047n5P68o87n12O08P91q33
1730d13N14P00n62p12J013n61m36O86K29j468M46O90o89J73Q34m9n34O20M16j008
1750a11J07N62l82l99Q52j17q21O39J53m41q7R95p83o77M48j38o27L91K75m88
1770f49o3N84q6n70P90no01L60N24n63j5R19l12m17O37M36p92L27N24n75m56O73
1792F70n58n70M68L58q21J59P12q69j41N31j11p65N54J13o10L42O29k75K0P88
1812F24l52o27O01J69o32J87L21j87l78N66L7m82N64K30n26l08R17q60l75P21
1832B10m63l90O59J45j22r0P07l38k61N89j17q70K16L16n12k76O35k22O4M40p1
$$ plain form
1689 -45 -491 -73 611 -229 58 597 292 -317 449 286 -582 -26 686 38 301 1223 639 -99 847 779 -687
1710 -687 -184 349 -538 -1020 65 -412 -684 79 378 -501 -6 554 -493 -548 220 -467 -979 -371 420 -413
1730 -413 101 801 239 -473 540 -21 -457 229 458 -1010 -564 126 -563 -390 444 395 -139 481 897 -111
1750 -111 -4 558 176 -223 629 512 -309 330 483 42 -45 950 167 -510 -62 -200 -827 -436 -161 -649
1770 -649 -712 -128 -214 -784 6 1 -600 -240 284 -279 -294 625 313 -104 533 969 177 504 1028 453 -3 670
1792 670 112 -458 10 368 -453 -294 418 -451 -592 -61 -172 -937 -383 -270 -880 -538 91 -184 -164 624
1812 624 272 -355 246 415 -217 -30 291 104 -274 292 329 -153 411 641 115 -193 724 -136 -511 210
1832 210 -253 -643 16 161 39 -51 656 318 57 646 529 -341 -125 191 -321 -597 38 -184 -120 320 249
1853B49m09l5M66j064n6Q28k70n19P02J65k62L74M88k36j42O11l87p51M57l8p15
1874e44M86N98m07j38L34J58l51K61J00r00K9L37m97j37K18L69o93P53L75m56
1894a05J0P92n23m79N51j29n09K83N35n79K11M06Kl58L42k12n04L60K39p86P2
1915c81L59j80j00L62L41o06M22K60n29j01M47n60k12O50k07j48K22K82n24K0
1935a83O57m86p5J50J04o20K38L36m09J03N85k67l54M50r5n64L03J94q8n7L38
1956B60Q0k22Q1K29m08J06J87m33l30M82n4m21K53L78l89J45L61l11j07N19o11
1977b05m95N97K93n18q3J32J49J16L88J87o16J31K12o03K05K5j50j22N24J16n31
1998b48L13N41m93n4M03m64l18L42j79p55Q16L79n07K11N47n10j85L45j1m50J75
$$ plain form
1853 249 -160 -195 271 -793 -849 -21 -291 -810 -108 57 -205 169 657 421 279 890 503 -248 209 171 -544
1874 -544 -58 540 133 -5 329 487 136 397 497 -403 -374 -37 -534 -671 -453 -84 -777 -24 351 -105
1894 -105 -95 697 174 -305 246 117 -392 -109 426 -153 58 464 466 108 450 238 -266 94 333 -453 -381
1915 -381 -22 -202 -302 60 401 -205 217 477 -52 -153 294 -266 -478 172 -35 -183 39 321 -203 -183
1935 -183 474 -12 -87 63 167 -453 -215 121 -288 -185 400 133 -221 229 134 -430 -127 67 -21 -78 260
1956 260 340 118 199 428 20 126 313 -120 -450 32 -22 -443 -190 188 -201 -56 305 -6 -113 406 -205
1977 -205 -700 -103 190 -328 -411 -279 -130 -14 374 561 -55 76 288 -315 -110 -85 -235 -357 167 283 -248
1998 -248 65 606 113 59 462 -2 -320 22 -157 -912 -96 283 -224 -13 534 24 -161 184 173 -277 -102
2019a02K99l93r1L45k20j37N12J09l01K82J32l01k19m9q5q9K57J19l95J28N82
2040C83m34k14M95M4m95L65l12m09k9P91l51J15M78n2p87M21P7m40M56J33j87
2061D8m50N36j73l18N57L3l20K27K55n85N3K5l8j30L88K08l28L2L08k13j94J70
2083I1K98m51L75P1m29M5J39j5l33N33jp36L83L3n39K06M07j39l27K40L58l88
2105a79L3P13l82l16M58j77n08L6L09k27K49N94m45j46K67l54k84M63J43m16O8
2126a01L0m02k95P46m0j29O25J0n42j10J94j33k76M25j83j61J94L69l94J27N53
2147E07j09l32L66l63l57p0L67j50lN14k30l98M26K05n68N49O2k70l11K70j43
2168c8p74R28k3m88L22M93k74k83L70k06m99L77K36o30K36M88m51j52M27P0l18
$$ plain form
2019 -102 197 -196 -287 58 -162 -299 213 322 21 303 435 134 -85 -134 -219 -308 -51 68 -327 -199 383
2040 383 -51 -265 230 274 -221 144 -168 -577 -606 185 -166 -51 427 375 -412 9 86 -354 102 235 48
2061 48 -402 134 -39 -357 200 233 -87 140 395 -190 -137 -112 -150 -280 108 316 -12 20 328 115 -79 91
2083 91 389 -62 313 384 -45 0 139 124 -209 324 323 -413 -30 3 -536 -330 77 -62 -389 -149 209 -179
2105 -179 -146 567 185 -131 327 150 -358 -322 -13 -240 9 603 158 12 279 -75 -359 104 247 -169 -101
2126 -101 -71 -473 -768 -22 -62 -191 434 444 -98 -208 -14 -147 -423 2 -181 -342 -148 221 -173 -46 507
2147 507 398 66 432 69 -288 -358 9 -141 -144 370 140 -258 168 373 -195 354 416 146 -165 105 -38
2168 -38 -812 116 93 -395 -73 420 146 -137 233 27 -472 -95 141 -489 -253 235 -216 -368 59 129 -189
2189a89N17J54o37j45P17m76p4L43O2m05K85K87n51j5P56k31l13J81J89j022L18
2210b49K77l26o1N11L31r52O24N2l76j10M86n23k8O15j94l96J89K45n32N26M60
2231E69n72j52P55l7o60J60N57n96N2L06m12k21L84Q9l56P8L51k77j48K94p0k79
2253a85L24J80q72N73L08q19J79N17k18l99O85Q0m96L64K91o88j94O48o4l12J36
2274C8Jqj13N02m51l73P30k71l23L85J26o36n1Q38l85l23O16j03m74K31M46p27
2296c25K10M71l58m02K93O9n12L03L94l72j80O67j64m23O99q4p42M51L86o61J57
2317a23N42l61m51N90J47l62K72K75n19m43P87q2p02K16N66m25j43M94m58j89
2337c69M94N4p02L87N71p87K49M52m69k99N73J1o27M73L92l92j82P48n06n02O91
$$ plain form
2189 -189 328 482 -155 -300 417 -59 -133 210 272 -133 152 439 -112 -127 629 398 85 266 455 -567 -249
2210 -249 28 -298 -359 152 483 -469 155 207 -169 -279 207 -316 -344 271 77 -319 -130 115 -417 109 569
2231 569 -3 -155 600 563 -97 63 620 24 76 382 -30 -251 133 222 -134 -56 295 18 -130 164 94 -185
2253 -185 139 319 -553 20 328 -491 -312 205 -13 -412 273 353 -143 221 512 -176 -370 278 214 -98 38
2274 38 39 31 -82 420 -31 -404 326 55 -268 117 243 -393 -444 394 9 -314 302 199 -275 -44 402 -325
2296 -325 -115 356 -2 -404 -111 -42 -554 -251 143 -229 -409 258 94 -329 370 286 -456 -5 381 -280 -123
2317 -123 419 58 -393 197 344 -18 254 529 10 -433 354 272 -430 -214 352 -73 -216 278 -180 -369
2337 -369 125 179 -523 -136 435 -352 -103 349 -120 -419 154 165 -462 11 403 11 -171 577 71 -431 260
2358B60n7l36p6M35l87M5K81Q1o87Q96k43m99J54O51n41m00P34k13q05Q71P6o76
2380d36o0J021n87l44N60j31n53O09L23o81j10Q46n40n17Q20K13o93L65K46n52
2400b01J59J01j17m25N73K32p03M61M66o44k61R23l49o53O95J98p67R6O14o45
2420b47J70O66l63o24L97L76p64J73P20n02k35O08j64p18N98L17p22J97O94n74
2440Cm33Q05p6q81N85M02n62J3M64l52o09Q77L88r76J97M86n37j72O99k02n91
2461d72Q11J19q87L44M76n39j55O84k62o75P81L0n31L8R37p38m57O18O3o75M36
2482e4K67n78K72N44l64m89Q44j55o45K57L15r03K68P68l81n13O32M29q16N24
2502B22O63q48l24N49j48o83O88K56n51J61O88m94n41O79J9n72J68L82m41l25
$$ plain form
2358 260 203 -133 -209 226 -161 -116 165 246 -441 455 212 -287 -133 518 -23 -423 311 98 -707 164 240 -436
2380 -436 -496 525 -62 -406 154 23 -530 79 402 -279 -389 457 -83 -600 220 433 -260 105 351 -201
2400 -201 -42 59 -58 -483 90 322 -381 80 546 -98 -359 564 215 -438 257 455 -312 -216 398 -247
2420 -247 -77 589 226 -398 -1 375 -389 -216 504 2 -233 375 211 -507 91 408 -314 -117 577 3
2440 3 -430 375 299 -582 3 405 -157 -144 320 -32 -641 236 624 -352 -155 331 -206 -378 321 119 -472
2461 -472 339 458 -429 -85 391 -148 -303 381 119 -556 225 255 -276 -238 699 -39 -496 122 185 -490 -54
2482 -54 213 -365 -93 451 87 -402 442 287 -358 -101 214 -689 -421 347 -34 -547 85 514 -302 222
2502 222 885 37 -287 262 114 -569 119 375 -176 -15 673 179 -362 317 336 -236 -68 314 -127 -452
2522d52N84m77l77R48J34q04P47K95p84o0M88l96m59R63n20k70L84M11m99o2R63
2543G57m19n32P95m38n75O8O54p94PJ072o03n19P88R1o24J33P66q19j51Q53p30
2564b20m13O23P32j006K43P28o29l87P19k44q65R20j27m99O1O97n09n35J255k
2584E42q73N56M74j010N7P47p23m11R05P4o03M53J86l78k03Q77o26o83R13o0r29
2605g15K58J048p35j2Q29l96n25L71L81j210L83P31m87n78J020q3n67L24N39j001
2625d25M51O48o65n95P93j09n63O21J99m73J05O21n42m92P09J08q55K86L37m71
2645c12k86Q90j37k86N45L61j245K57O04q81o9O20rp98Q72L64o76J44N75m78m85
2666d30J009o37o76P72J99r97L51J019l56n99J034K7j030N71K41r37l37J031m69
$$ plain form
2522 -452 132 -345 -722 226 360 -444 303 598 -186 -246 242 -154 -613 350 -170 -440 -56 355 -144 -206 757
2543 757 338 -194 601 163 -412 -344 310 -484 -477 595 -8 -527 261 352 -272 -139 627 -192 -343 510 -220
2564 -220 -633 -10 722 -284 -41 687 58 -329 390 146 -719 201 74 -425 -364 333 -176 -711 544 542
2584 542 -331 225 699 -311 -254 493 -230 -641 264 338 -265 188 374 -4 -207 670 44 -639 274 214 -715
2605 -715 -457 591 -144 -156 673 277 -248 123 504 -706 -323 408 -79 -657 363 280 -287 37 576 -425
2625 -425 26 674 9 -586 207 98 -465 156 355 -118 -13 608 66 -426 283 391 -464 -178 159 -312
2645 -312 -598 292 155 -131 414 775 -470 -213 391 -490 -559 61 52 -746 126 490 -186 -42 533 55 -430
2666 -430 579 -58 -734 38 237 -760 -409 610 254 -345 689 716 -314 257 498 -439 -776 255 -214
2685b14l01P95kk59J86O52r68j14P60p70l71N52J80o06L92M47n24J17O07j01q65
2706d07P80r1q58K23O36p04l31J085k03m99N54N06q40J89N49n00m94M64J75q66
2726f32P39L13l45K6L28j37p81P79K1r48R4N72m87j0R27k80m42O29M3l72P2L13
2748D22o05n19Q88k57m69N97L78n48N4N10n28k73N54J73j101N95M68q49K38R61
2768F89p46j73Q65Kr40J8M49n44q7M91l17j00P40Ko46M84K72m60n84Q79k94p56
2790g56P48J68o38K52O50j88k48O44k47p56M98L73j127K69N91m43q8O79P2n02
2810d9L48j07l32k05N80l00o71P17qo44P77M32n75j87R09o30l55M86on65PN63
2832A85p36J97R26k32m16O02m5p61K47L84p46R2M42l63l65O70M50n94NQ47q25
$$ plain form
2685 -214 -515 280 278 19 205 857 -111 -225 535 -235 -606 -54 126 -480 -88 359 -165 -48 559 458 -407
2706 -407 373 282 -576 -353 283 -421 -752 333 130 -369 185 691 -149 40 589 89 -405 59 234 -632
2726 -632 107 420 75 101 429 292 -489 290 311 -637 -543 29 -458 -468 459 179 -263 366 409 37 109 422
2748 422 -183 -702 186 -71 -540 57 435 -113 -59 451 -77 -350 204 377 -724 -129 339 -510 -272 689
2768 689 -57 -230 635 637 -303 -285 164 -380 -467 24 -293 -393 347 349 -297 187 459 -1 -585 294 0 -756
2790 -756 -8 160 -478 -226 424 236 -12 632 385 -371 127 500 -627 -358 233 -210 -298 381 453 -49
2810 -49 299 192 -140 -345 235 -65 -736 -19 -27 -671 106 538 -37 -224 685 55 -300 186 180 -385 -378 185
2832 185 -551 -354 572 340 -76 526 481 -280 -33 351 -395 -303 139 -224 -589 81 531 -63 -58 789 -36
2853c6m01R70k19p11K69K79r08M67Q22l26j19M57r1o68K74Pk68m12R25l18p90
2874g97R85P6m54L38O07q03m6K71k02o68N49K64p17M86N70k91m21O80m25k13L43
2895A32Q8p66J58O87m02j62N87L55p34L03K99r23K55M48l87m67N41J87o10M00
2915a1O30q12l4R44n66m22M72m2r57N40M78m44R5P89k81o72N99J23o24oL07l97
2937b91k40N27N1m79O59K90l59k23Q06n42o57M50M0q79N29N13l86pR13l19o14
2958b18N90J70p46k8M72p31l0O57j93j85O09J38o46K97N03p10m17O20l35n97M24
2979c56M39n94L12P49j51j50L25j75r92P64kq04j87P23m9k08P34k4m19K97N55
3000G87q34k54M37l31n64M94K74o87O09P46n74m1R20n41q10L05P0o16M47M74o08
$$ plain form
2853 -36 -437 533 314 -397 -128 151 -757 -290 532 206 87 544 453 -215 59 66 -202 -614 311 -7 -797
2874 -797 188 264 -190 148 755 -48 -94 177 -25 -693 -144 120 -597 -111 459 168 -253 427 2 -211 132
2895 132 220 -546 -388 299 -103 -265 322 677 -57 246 545 -378 -123 325 -62 -529 12 199 -411 -11
2915 -11 619 -193 -227 717 151 -271 201 159 -798 -258 220 -224 -129 660 379 -293 306 429 -195 -201 106 -291
2937 -291 -531 -4 47 -432 227 517 158 -65 741 199 -458 -8 32 -847 -318 195 -191 -198 715 396 -218
2958 -218 372 542 -204 -232 240 -491 -521 136 -57 -242 367 505 -141 156 659 -51 -468 152 -183 -780 -356
2979 -356 83 -511 -199 550 399 249 574 399 -593 171 169 -635 -822 -99 -148 -356 378 354 -65 232 787
3000 787 -47 -301 136 -195 -759 -265 9 -678 -69 677 103 62 982 441 -369 -64 6 -610 -163 311 -297
3021b97j63R13m0m33L10L00q00p3O82r50l72P83J71m67N43M15k68j91L86p7r04
3042e32O55L7q48O02M94o03p7Q29p6p11O61K31j044J66L31o67p3R49n68j51N50
3063A55M27o51p2P76l95n72N77l22o83K91Q94n71m9R83n68l73P33j17j004L03
3083b38K79l44j9N47k06k39N43K81p74M33N48q03p16O12l5o33N37P20q48K94P91
3104G30o58P9L75j15r02L67K39n61n1P36m72NP01K25p23K64L10q01k02N57m21
$$ plain form
3021 -297 -460 453 413 -20 290 590 -210 -283 399 -551 -923 -140 31 -436 107 522 254 63 449 372 -532
3042 -532 123 160 -688 -86 408 -195 -272 557 481 -230 431 662 -382 -216 115 -552 -625 324 -244 -395 155
3063 155 582 -69 -141 635 240 -332 245 -77 -760 -469 425 -146 -195 788 220 -153 580 463 -541 -238
3083 -238 41 -303 -322 225 19 -220 323 604 -170 263 811 8 -708 -96 -131 -764 -227 493 -355 -61 730
3104 730 72 151 526 411 -491 -124 115 -446 -497 239 -233 -228 473 698 -25 239 549 -252 -454 103 -318
$$ [...]
8191A57
##END NTUPLES=NMR FID
##END=
