##TITLE=1H_UK_26
 CD2Cl2
 64 sc, 
 30.11.2023
##JCAMPDX= 6.0         $$ Bruker NMR JCAMP-DX V2.0
##DATA TYPE= NMR FID
##DATA CLASS= NTUPLES
##ORIGIN= UXNMR, Bruker Analytische Messtechnik GmbH
##OWNER= root
$$ XWIN-NMR		Version 3.5
$$ Thu Nov 30 12:22:17 2023 Russian Standard Time (UT+4h)  she@DPX200
##.OBSERVE FREQUENCY= 200.1313
##.OBSERVE NUCLEUS= ^1H
##.DELAY= (6, 6)
##.ACQUISITION MODE= SIMULTANEOUS
##.ACQUISITION SCHEME= undefined
##.AVERAGES= 64
##.DIGITISER RES= 18
##SPECTROMETER/DATA SYSTEM= spect
##.PULSE SEQUENCE= zg30
##.SOLVENT NAME= D2O
##.SHIFT REFERENCE= (INTERNAL, D2O, 0, 15.7039)
##AUDIT TRAIL= $$ (NUMBER, WHEN, WHO, WHERE, WHAT)
$$ ##TITLE= Audit trail, XWIN-NMR		Version 3.5
$$ ##JCAMPDX= 5.01
$$ ##ORIGIN= Bruker BioSpin GmbH
$$ ##OWNER= she
$$ F:/spectra/data/she/nmr/H-F/1/audita.txt
$$ ##AUDIT TRAIL=  $$ (NUMBER, WHEN, WHO, WHERE, WHAT)
(   1,<2023-11-30 12:20:57.71 +0400>,<she>,<DPX200>,
      <created by zg, POWCHK disabled, PULCHK disabled
       configuration hash MD5:
       00 E9 B6 7A A2 85 ED C7 34 08 36 98 17 FE 4E 26
       data hash MD5: 16K
       01 B0 CB 44 7C CF F0 99 96 C7 DE 2B 3A 9C 82 00>)
$$ ##END=
$$ 
$$ hash MD5
$$ FD 56 99 6F 01 1A 67 78 9E 2C 22 2C 0E 3B D1 18
##$RELAX= 
##$RELAX= 
##$RELAX= 
##$RELAX= 
##$RELAX= 
##$RELAX= 
$$ Bruker specific parameters
$$ --------------------------
##$DU= <F:/spectra>
##$EXPNO= 1
##$NAME= <H-F>
##$PROCNO= 1
##$TYPE= <nmr>
##$USER= <she>
##$AMP= (0..31)
100 100 100 100 100 100 100 100 100 100 100 100 100 100 100 100 100 100 
100 100 100 100 100 100 100 100 100 100 100 100 100 100 
##$AQSEQ= 0
##$AQ_mod= 1
##$AUNM= <au_zg>
##$AUTOPOS= <>
##$BF1= 200.13
##$BF2= 200.13
##$BF3= 200.13
##$BF4= 200.13
##$BF5= 200.13
##$BF6= 200.13
##$BF7= 200.13
##$BF8= 200.13
##$BYTORDA= 1
##$CFDGTYP= 0
##$CFRGTYP= 5
##$CHEMSTR= <none>
##$CNST= (0..31)
1 1 145 1 1 1 1 1 1 1 1 1 1 1 1 1 1 1 1 1 1 1 1 1 1 1 1 1 1 1 1 1 
##$CPDPRG= <>
##$CPDPRG1= <>
##$CPDPRG2= <>
##$CPDPRG3= <>
##$CPDPRG4= <mlev>
##$CPDPRG5= <mlev>
##$CPDPRG6= <mlev>
##$CPDPRG7= <mlev>
##$CPDPRG8= <mlev>
##$CPDPRGB= <>
##$CPDPRGT= <>
##$D= (0..31)
0 1.2 0 0 0 0 0 0 0 0.06 0 0.03 0 0 0 0 0.0002 0 0 0 0 0 0 0 0 0 0 0 0 
0 0 0 
##$DATE= 1701332457
##$DBL= (0..7)
120 120 120 120 120 120 120 120 
##$DBP= (0..7)
150 150 150 150 150 150 150 150 
##$DBP07= 0
##$DBPNAM0= <>
##$DBPNAM1= <>
##$DBPNAM2= <>
##$DBPNAM3= <>
##$DBPNAM4= <>
##$DBPNAM5= <>
##$DBPNAM6= <>
##$DBPNAM7= <>
##$DBPOAL= (0..7)
0.5 0.5 0.5 0.5 0.5 0.5 0.5 0.5 
##$DBPOFFS= (0..7)
0 0 0 0 0 0 0 0 
##$DE= 6
##$DECBNUC= <off>
##$DECIM= 32
##$DECNUC= <off>
##$DECSTAT= 4
##$DIGMOD= 1
##$DIGTYP= 9
##$DL= (0..7)
0 120 120 120 120 120 120 120 
##$DP= (0..7)
150 150 150 150 150 150 150 150 
##$DP07= 0
##$DPNAME0= <>
##$DPNAME1= <>
##$DPNAME2= <>
##$DPNAME3= <>
##$DPNAME4= <>
##$DPNAME5= <>
##$DPNAME6= <>
##$DPNAME7= <>
##$DPOAL= (0..7)
0.5 0.5 0.5 0.5 0.5 0.5 0.5 0.5 
##$DPOFFS= (0..7)
0 0 0 0 0 0 0 0 
##$DQDMODE= 0
##$DR= 18
##$DS= 0
##$DSLIST= <SSSSSSSSSSSSSSS>
$$ [...]
##$SUBNAM2= <"">
##$SUBNAM3= <"">
##$SUBNAM4= <"">
##$SUBNAM5= <"">
##$SUBNAM6= <"">
##$SUBNAM7= <"">
##$SUBNAM8= <"">
##$SUBNAM9= <"">
##$SW= 18.0517328524113
##$SWIBOX= (0..15)
0 0 2 0 0 0 0 0 0 0 0 0 0 0 0 0 
##$SW_h= 3612.71676300578
##$TD= 16384
##$TD0= 1
##$TE= 0
##$TE2= 300
##$TE3= 300
##$TEG= 300
##$TL= (0..7)
0 120 120 120 120 120 120 120 
##$TP= (0..7)
150 150 150 150 150 150 150 150 
##$TP07= 0
##$TPNAME0= <>
##$TPNAME1= <>
##$TPNAME2= <>
##$TPNAME3= <>
##$TPNAME4= <>
##$TPNAME5= <>
##$TPNAME6= <>
##$TPNAME7= <>
##$TPOAL= (0..7)
0.5 0.5 0.5 0.5 0.5 0.5 0.5 0.5 
##$TPOFFS= (0..7)
0 0 0 0 0 0 0 0 
##$TUNHIN= 0
##$TUNHOUT= 0
##$TUNXOUT= 0
##$USERA1= <user>
##$USERA2= <user>
##$USERA3= <user>
##$USERA4= <user>
##$USERA5= <user>
##$V9= 5
##$VALIST= <valist>
##$VCLIST= <CCCCCCCCCCCCCCC>
##$VD= 0
##$VDLIST= <DDDDDDDDDDDDDDD>
##$VPLIST= <PPPPPPPPPPPPPPP>
##$VTLIST= <TTTTTTTTTTTTTTT>
##$WBST= 1024
##$WBSW= 4
##$XGAIN= (0..3)
0 0 0 0 
##$XL= 0
##$YL= 0
##$YMAX_a= 370815
##$YMIN_a= -408775
##$ZGOPTNS= <>
##$ZL1= 120
##$ZL2= 120
##$ZL3= 120
##$ZL4= 120
##$ABSF1= 10
##$ABSF2= 0
##$ABSG= 5
##$ABSL= 3
##$ALPHA= 0
##$AQORDER= 0
##$ASSFAC= 0
##$ASSFACI= 0
##$ASSFACX= 0
##$ASSWID= 0
##$AUNMP= <proc_1d>
##$AZFE= 0.1
##$AZFW= 0.1
##$BCFW= 1
##$BC_mod= 2
##$BYTORDP= 1
##$COROFFS= 0
##$CY= 11.3945322036743
##$DATMOD= 1
##$DC= 2
##$DFILT= <>
##$DTYPP= 0
##$F1P= 15.7292609196834
##$F2P= 12.9074282941183
##$FCOR= 0.5
##$FTSIZE= 0
##$FT_mod= 4
##$GAMMA= 1
##$GB= 0.15
##$INTBC= 1
##$INTSCL= 1
##$ISEN= 128
##$LB= 0.24
##$LEV0= 0
##$LPBIN= 0
##$MAXI= 10000
##$MC2= 0
##$MEAN= 0
##$ME_mod= 0
##$MI= 1.114404
##$NCOEF= 0
##$NC_proc= 0
##$NLEV= 6
##$NOISF1= 3.799351
##$NOISF2= 2.8
##$NSP= 1
##$NTH_PI= 0
##$NZP= 0
##$OFFSET= 15.70392
##$PC= 1
##$PHC0= -24588.13
##$PHC1= 6.252711
##$PH_mod= 1
##$PKNL= yes
##$PPARMOD= 0
##$PSCAL= 0
##$PSIGN= 0
##$REVERSE= no
##$SF= 200.130013532006
##$SI= 16384
##$SIGF1= 3
##$SIGF2= 2
##$SINO= 400
##$SIOLD= 16384
##$SREGLST= <1H.CDCl3>
##$SSB= 0
##$STSI= 0
##$STSR= 0
##$SW_p= 3612.71676300578
##$SYMM= 0
##$S_DEV= 0
##$TDeff= 0
##$TDoff= 0
##$TI= <>
##$TILT= no
##$TM1= 0
##$TM2= 0
##$TOPLEV= 0
##$USERP1= <user>
##$USERP2= <user>
##$USERP3= <user>
##$USERP4= <user>
##$USERP5= <user>
##$WDW= 1
##$XDIM= 8192
##$YMAX_p= 0
##$YMIN_p= 0
$$ End of Bruker specific parameters
$$ ---------------------------------
##NTUPLES= NMR FID
##VAR_NAME=  TIME,          FID/REAL,        FID/IMAG
##SYMBOL=    X,             R,               I
##VAR_TYPE=  INDEPENDENT,   DEPENDENT,       DEPENDENT
##VAR_FORM=  AFFN,          ASDF,            ASDF
##VAR_DIM=   8192,          8192,            8192
##UNITS=     SECONDS,       ARBITRARY UNITS, ARBITRARY UNITS
##FACTOR=    0.0002768,     1,               1
##FIRST=     0,             0,               0
##LAST=      2.2672688,     0,               0
##MIN=       0,             -408775,         0
##MAX=       2.2672688,     370815,          0
$$ Real data points
##PAGE= N=1
##DATA TABLE= (X++(R..R)), XYDATA
0@%%%%%%%%%%%%%%%%%%%%%%%oN3j11J28j28J28j28J28j40J77k19K46k62K86l28
38a76L70m09M52n02N59o19O83p50Q29r17J008j106J211j335J478j635J808k007
56a058K237k501K814l190L644m209M940n923P308r400J2873j9595L6892j48871
70a24039k84736N97036P5708n39563J96148M50261l46552k33441M22830N7023
80B70675l98655R9425K84408k38094k13593K41493L6793k79924L5476K12436j20631
91g0191j19266K01375Q2468j58809N3576J78333r3027j09486J42433J8072j90903
102f5425K5249J27336j40523r8872J76332R020j74835J09629J68072j51662o3865
113g9544K14930k3454k11286R9466J36307j96188q4502K01162k3307j94467J12231
$$ y = [0, 0, 0, 0, 0, 0, 0, 0, 0, 0, 0, 0, 0, 0, 0, 0, 0, 0, 0, 0, 0, 0, 0, 0, -6, 47, -64, 64, -64, 64, -64, 64, -76, 101, -118, 128, -134, 152, -176, 194, -215, 237, -265, 294, -325, 358, -392, 437, -480, 528, -578, 633, -702, 776, -859, 949, -1058, 1179, -1322, 1492, -1698, 1946, -2263, 2677, -3246, 4062, -5338, 7535, -12060, 24832, -124039, -408775, 188261, 263969, -275594, -79446, 370815, 24263, -209178, 213652, 270675, -127980, -28555, 255853, 17759, -195834, 45659, 82452, -197472, -161996, 50440, -70191, -189457, 11918, 94386, -64423, -10847, 167486, 74459, -35027, 107406, 125478, -65425, -40176, 87160, -53363, -152235, 24097, 33117, -141718, -32089, 135983, -15679, -79544, 135386, 111932, -99354, 112, 136419, -59769, -144271, 56891, 33584, -160883, -48652]
124d8652J60136j47698o0659K00300K561j72659P3898J29356j37044r2990J38647
135D5196O019j59710M1141J32584q7359q0628J40316M6868j28941L3985J25340
146A14811q0864q9098R9347R979j32343J8156Q8294p9763n2847J12298J8780q4635
158e7885O2411R1723p1493l0435R9092k0050j04155M0910M7797j02123l9125Q6473
170C140j8204q4590O1690P8608o6213j5932J05336o43q8786M6761O4811q7951
182a973n1595Q5932q291j04439L9058Q5049o9109m1897J06549K0173r1882L7190
194D765Q5104p4117n9639Q0816k23j02495K1437P0576o1636m3339Q6169J7612
206B5030o4455L8623P1499m5224l3413O0155q59p0881N930L8276m8536l9192M8482
$$ y = [-48652, 111484, -36214, -96873, 103427, 105988, -66671, 7227, 136583, -461, -93451, 45196, 51215, -108495, -67354, 65230, -22129, -102757, 37559, 84427, -44514, -10529, 114811, 33947, -55151, 44196, 54175, -78168, -60012, 28282, -51481, -104328, 7970, 26750, -57885, 4526, 96249, 24756, -5679, 93413, 73363, -30792, 10118, 57915, -44208, -83333, 3140, -15064, -99654, -37964, 40644, -25569, -41501, 63835, 63192, -25594, 21167, 85978, -1973, -53568, 32364, 24073, -80366, -41308, 43741, -25368, -67265, 39284, 59457, -32425, 4765, 89869, 15752, -43887, 36929, 36706, -65789, -44352, 26224, -35412, -78751, 7418, 25030, -39425, -802, 70697, 25473, -7940, 52215, 51356, -19525, -13595, 24681, -23855, -63047, -14565]
219a4565J1011m6053K6022N5279k4528j7306N5544P647n3449J2637L3911m9571
231c421l9185M1218k759n7537K3401N1012l3512j5765O8374J0352m9108K6109
243A9179M4317m7679l5421M4430q301o3076J5089M1763m1023k1105N8531J2296
255A9000m2222K7298M8779l2184k6897M1052m34n4926L319L0534l5926k8945L8721
268a2831J2585l3345J8446M5948j4850j7915L7642Q509m0625O79K3947l2857l1819
281c6486K5990K631l5560J2225L7293j3023j1393L9481J5341l0254J0435K6324
293D3004k9245k7243K4024n003m2856P856K8252k2423j2377M0561J3772k5858
305g536J7454L2959k2011k1687K5830k246m2057P41K0806k3575j9190K9126J1415
$$ y = [-14565, -3554, -49607, -23585, 31694, 7166, -10140, 45404, 53051, -398, 12239, 46150, -3421, -42606, -1388, -4147, -61684, -38283, 12729, -20783, -36548, 31826, 42178, -6930, 19179, 63496, 15817, -19604, 24826, 16525, -46551, -31462, 10301, -30722, -51827, 6704, 19000, -23222, 4076, 52855, 20671, -6226, 34826, 34392, -20534, -17215, 13319, -22607, -51552, -12831, -246, -33591, -15145, 30803, 15953, -1962, 35680, 44189, 3564, 4243, 28190, -4667, -36486, -10496, -7865, -43425, -31200, 6093, -6930, -18323, 21158, 36499, 6245, 16680, 43004, 13759, -13484, 10540, 5537, -37319, -29463, -1211, -23634, -36011, 4550, 18322, -7536, 9918, 42877, 20866, -821, 25009, 22763, -19294, -18553, 2253, -21322, -40512, -11386, 29]
318B9j9959J4237L1286p695j2813K3865N317l0908l325J4213k2393k2807J5541
331a5412M919k1280P341K7845l927n864K6373J1670j9424J934J5869j8284k3119
344a1359R925p86k6166M21K0964q494p489K5701J4195j4796R051K1764j2548j7868
358B515J1347j495k6157o107J1687j0485j2182J9030J2240j0103Q887K4058l812
371A9423j0612J3237L514k3204n759Q001j2743j8854R533Q221j3434N414K2821
384E558Q96o605J6087J1348j4168l444Q916j1910j8778L336N92j4812j630J5815
398h799J199l697J5738J4389n964L53J1706n193j4465j233J02j6318q377O666
412a3893k298q025J0772J3066p41K565J6805K234p826L249K872j3995r567K920
$$ y = [29, -19930, -5693, 25593, 17898, 5085, 28950, 34267, 3359, 34, 14247, -8146, -30953, -15412, -10493, -31773, -24432, 3413, -514, -6378, 19995, 31665, 12241, 14175, 30044, 11760, -11359, -1434, -2220, -28386, -27965, -7001, -15495, -22984, 2717, 16912, 2116, 11167, 32931, 20383, 2515, 13862, 12367, -13790, -19897, -8210, -18695, -30877, -11847, 393, -9710, -823, 23235, 19423, 8811, 22048, 25562, 2358, -3401, 4600, -8143, -26997, -17464, -9243, -22677, -17263, 5558, 6454, -151, 15936, 27284, 13116, 9672, 18588, 6678, -12100, -8764, -8172, -22984, -24614, -8799, -7600, -11297, 4441, 18830, 12866, 13219, 24925, 19732, 5267, 4034, 4136, -12182, -20559, -13893, -16191, -24216, -13444, -378, -1119, 1446, 18251, 20485, 12659, 15908, 18780, 4785, -4782, -1862]
426a862o198j3790M530R383m660J363J5688P417n447P188Q536r002q477L659n162
441C166j6524j840N871q243m609J3483P865l003P169J5067j455n830O800J532
455A9449j6251o374M398j0671j2965O509O198o218M284J4311M674k746J0181O822
469B1601r591m254M731q751j3995J85J351r627j305J1961K669j791J1165J1661
483A6010m065m37Q643l999j3110p20J131j3915p933P449j43q382Q545J3591k549
498A16J627J4003J010j0055L977M588j4327q743O764n845j1267M123R347o014
512a0696L126J4726M001n387Q964N649r929o808L886r046j1903J217K847p699
526a7052l84J2653L383l125Q571J3658m828m886Q977r93j6291j219L528j2523
$$ y = [-1862, -8060, -21850, -17320, -7937, -12597, -11234, 4454, 11871, 6424, 13612, 22148, 13146, 4669, 8328, 3166, -13358, -15198, -9327, -17570, -22179, -8696, -831, -3834, 3335, 18402, 16947, 11117, 17917, 19449, 3198, -3176, 1222, -9449, -22414, -15905, -9707, -15925, -11641, 2670, 7344, 4598, 14779, 21601, 12010, 7756, 12487, 3736, -10259, -10074, -8723, -18350, -19655, -7694, -5025, -6816, 4349, 16010, 11945, 11508, 20151, 16152, 3042, 2322, 3453, -10462, -18395, -10946, -11089, -19471, -10926, 2665, 116, 1743, 15746, 16756, 6701, 10678, 15266, 939, -7804, -1040, -6885, -18152, -14029, -4682, -10696, -7570, 7156, 11157, 5770, 14734, 20383, 10454, 3646, 7532, -1514, -13417, -12200, -9353, -17052, -17436, -4783, -1400, -4525, 4046, 17704, 12876, 7990, 16967, 15974, -317, -1536, 1992, -10531]
540a0531q574R760K904j0089R327J4659l633l460J6051J264j3438K473N797j4949
554b439j0454R205k963j4146Q314J2777p403K86J7751K746r823P623Q681j3266
568F889p366Q765p320j6319M018O963j0526k223J4689N158o925R017J3076p247
582A0649o053R105l272j5960n42P251j1573q729J2351M117r883Q421J6652n690
596F844m635J4664J231j7467K582P350j5332j1180J1572m74j5057Q223J4438p812
610e053j102J7893J890j2132Q288Q433j4445q703J0057n773j4975N125R035r892
624a1354j947J6150K271q069R331J1873j1359n319J1027m356j6890K703O108j3185
638a3016n318J4854J597r633J1204J4695r285l022J4354j760j6026L250O517j4807
$$ y = [-10531, -19105, -9345, -6441, -16530, -7203, 7456, 3823, 363, 16414, 17678, 4240, 6713, 12510, -2439, -12893, -3688, -6651, -20797, -12483, 294, -7109, -6823, 10928, 13674, 3851, 11474, 20155, 6889, -477, 8288, 968, -15351, -11333, -4370, -14896, -17119, -2430, 2728, -4197, 4820, 17896, 10649, 4596, 13701, 10429, -5531, -6073, 1178, -10395, -19124, -6773, -2656, -12539, -4118, 12534, 6844, 2209, 16873, 18104, 637, 3219, 10569, -4763, -15943, -4371, -4845, -19902, -11679, 2759, -5053, -6155, 11738, 13628, 1496, 9784, 18217, 3772, -4931, 5126, -647, -15622, -10497, -1462, -11354, -13301, 2849, 5120, -2949, 6382, 18255, 6896, 1577, 12604, 8248, -8642, -5939, 169, -13016, -18334, -3480, -1883, -11516, -312, 14383, 5098, 2076, 16430, 14670, -1356, 1894, 8411, -6396]
652f396r281J2284j501j2391Q586J3614p777o76J5630J871j3020N083R276j4085
666A217r212J0186l045j5792N591J2249r520m112J8890K373j1540R121J2182j2841
680E747p735J3297m899j8283M962R175j3877m735J6229O07j1309J2019J2882j0361
694C719k520J3922l747j5078M678N243j4820n202J1172j911r045P318J3176p001
708i6j427J3900J132j1925L609P449j3052q816Q700k125j3156N766J1716p901
722f226k476J6173J532j0831Q110J0807j3645o580J0863m324j5561N495Q323j2215
736a0555k319J4525L9r216J0866R522j0262j865J1666n181j2564M113O540j2029
750f720m878J0012j593p644P218R756o422o3J1692o45j0496M067M872j0931o335
$$ y = [-6396, -15677, -3393, -4894, -17285, -8699, 4915, -2862, -3538, 12092, 13963, 943, 6026, 15302, 1217, -7995, 2191, -854, -16646, -11055, 1194, -8326, -12438, 6452, 8825, -2715, 6406, 18588, 5747, -1988, 11309, 6410, -11873, -6911, 2264, -11613, -16348, -119, 488, -10821, 1198, 14080, 3719, 1199, 15121, 11374, -3704, 974, 6217, -8603, -13805, -2633, -4544, -13589, -6271, 6905, -96, -1523, 12377, 13509, 1584, 5193, 12642, -410, -9226, -526, -2651, -15807, -10041, 1675, -6226, -8702, 7471, 9003, -1828, 6282, 17089, 3444, -3136, 7727, 3403, -12158, -6663, 1660, -10555, -12874, 1651, 1690, -7526, 3340, 12862, 2600, 735, 12401, 7220, -5344, -1231, 5309, -6720, -11598, -1586, -3179, -10823, -3605, 6151, -271, -334, 11358, 10713, 217, 4284, 9156, -1775, -8110]
765h110P998l214j0466O722R193p544l64J4182K94r052O474O726j1009m885Q228
780E173m011j2301N104O440q944k131J3652p27o360Q477P407q876k223Q132l819
795D993j1539M533M423j0205l597J0878j314o530P839Q007o183j189J0517k258
809H375r157M010L422j1005l902Q435k727q936O215P019o171N60J1288o89o703
824C4N091N398q926m733O504l036r632L696N793p024KR425J329n716N605O041
840I851o774l004N601k430r117K415M461p734k063Q176M70n501O483O323m421
855B736k299Q365k553q449L121L193q204l050O299j583n666N500N238m641J88
870a805Q470o90n364L182L384o725l516M980l415n926L410K474l240L19O583P53
$$ y = [-8110, -112, -3326, -13792, -7070, 2123, -5421, -5785, 8397, 8691, -361, 6113, 12839, 1830, -3055, 5173, 1162, -11139, -6035, 405, -8539, -10670, 2982, 2255, -4105, 4372, 11779, 2903, 680, 8812, 4993, -6546, -2013, 2410, -7795, -11392, -514, -1828, -8358, -519, 7488, 1305, 116, 10633, 8375, -782, 3228, 6650, -4355, -8257, 178, -2549, -11485, -5270, 1749, -4422, -3862, 7426, 6737, 34, 5125, 10523, 1597, -3136, 3368, 332, -9300, -5604, 189, -6835, -6833, 2592, 3921, -1795, 3810, 9851, 3077, 73, 5674, 3244, -5873, -3458, 1003, -6731, -8794, -618, -148, -5649, 834, 7157, 2736, 437, 8802, 6249, -2200, 921, 4114, -4090, -7140, -841, -2424, -8090, -2590, 2648, -1993, -1805, 6665, 5975, 611, 3793, 7177, 452, -3064, 1916, -1499, -7425, -4015, -1541, -4781, -4462, 2121, 2874]
886B874m432N063N443n744k868M251k085p034J425K966n105j893N781J618k924
901b664L267N276k651l302N976o04p316K200K155n482k099N111j393m573M718
916a381M460l280m24O222J2n201J606J887m388l748L931j952m642K438M580k984
932b864l80O198J86k542J745L720l155l677L877j240n559N92K729l498k611N232
948a247J712l201K259N248j661k076K727j71m025r28L008l836l214L700J234l419
964c890J719M875j638q20K760J465l826J3K422l506k560J618J406l309m42L991
980B78q50j953M601J781l252P12L041k298l341J962Q05l678r99L107j622k200
996c906L394K163k875J408M187j996l126L757M8l725r27J573j883k298K364J791
$$ y = [2874, -1558, 3505, 8948, 3204, 336, 4587, 2502, -4532, -3107, -141, -5246, -7139, -1358, 260, -2664, 603, 5879, 3228, -74, 5902, 5298, -2018, 182, 2337, -3145, -5244, -133, -1526, -6099, -1381, 3079, -201, -625, 5597, 5609, 408, 2014, 3901, -487, -4235, -304, -2256, -6898, -4460, 120, -2864, -3244, 2954, 3140, 598, 2343, 6063, 2908, -769, 3108, 1868, -3691, -3099, -370, -3868, -6479, -1247, 465, -2736, -477, 4771, 3110, 1034, 3761, 3590, -435, -1363, 1645, -2191, -5405, -1705, -471, -3890, -2171, 2704, 1066, 246, 3006, 4471, 645, 658, 3080, -426, -2986, -1368, 38, -3271, -3713, 278, -572, -2525, 2076, 3857, 605, 1317, 4358, 2060, -1281, 681, 1486, -2192, -3191, -84, -1706, -3906, -512, 1651, -1224, 184, 4371, 2375, -751, 3006, 3054, -671, -1598, -25, -1908, -4206, -1842, -51]
1012e1l286J454M089m56r14J037J701k422o05O30o92l230K9K713k176j462L533
1029a08Q53k768K187L475k649j785K684J00l253M02K922l884k653M443P16l467
1045b785K351K981k271m67L109L93m364Q16K234k771j661K352N80l673J676K644
1061A144j433j132K958N24j617K39J790j091k564J726j30k850k18L192j150j699
1077b311K169J381k201P20K738J1k988J901O84l528OK618j530k836K269K209k582
1094a270m93L591n11k116J585J875k698n43K809k019k690J889J402k676L56L815
1110B306j961j411K074J291l205N47K625j682k839K470J555l641j05L131j157
1125bk103K171K219m041P33L211n91k658J845Q44k373j213L939j798k002J549
$$ y = [-51, -3337, -1883, 2206, 1750, 836, 1873, 3574, 1152, 547, 1177, 485, -2745, -2716, -3, -2179, -3641, -108, 745, -2023, 164, 3639, 990, -795, 1889, 1989, -1264, -862, 2060, -1824, -4477, -34, 682, -2785, -434, 2547, 276, -191, 2918, 3311, -1053, -237, 1997, -774, -2435, -83, 497, -3176, -1500, 1144, -289, -1421, 1537, 2061, 444, 683, 2473, 1382, -1182, 544, 414, -2436, -2654, 538, -612, -2311, -142, 1239, -962, -242, 2496, 2507, -481, 1420, 2104, -1424, -1418, 1200, -330, -3166, -897, 1312, -1270, -1763, 1828, 1317, -799, 786, 2661, -37, -580, 2229, 210, -2480, -591, 811, -1865, -1509, 2306, 345, -1066, 1008, 2299, -906, -359, 2266, 584, -2255, 215, 1770, -1871, -1976, 1155, -2, -2105, 66, 2285, -1756, -1023, 2188, 1597, -1061, 784, 1628, -745, -1958, 1981, 183, -1819, -270]
1141b70K083k643j789M152o2k873K133J748l588n02L379j43m273K422K278l159
1157a107j249M713j469l634K288L254l994p68M727j201m438L270J588l771K39
1172a552L923k314k334K832J409l108p75M072j011k821K115K113l555m12K412
1187I94R5m783M198K080l565j345L609L52l730J813L232l133j655L540M00m016
1203a914J709K549l538j404N416j124n086L304K342m317p19M627j291l923L722
1218C53K504l627p53M013j522l740L153K222m076j59L567j662k955K707K585m022
1234a412J69L580j276l097L053J185m126N16L158n52l576K408K743m016q46M755
1250B666j373l738K564J937k993q87L585j231l907L197K390l828l38M052j089
$$ y = [-270, 1813, -830, -2619, 1533, 1471, -1402, 731, 2479, -1109, -1611, 1768, 1625, -2648, -226, 2052, -1107, -2356, 2357, 888, -2746, -458, 2796, -1198, -1966, 2761, 1560, -2878, 392, 1980, -1791, -1552, 2371, 57, -2277, 555, 1964, -1144, -1919, 2153, 1142, -1679, 436, 2549, -1006, -1418, 994, 1089, -3694, 504, 2584, -981, -2326, 1283, 1635, -2095, -282, 2950, -183, -1838, 1702, 2102, -1914, -205, 2344, -1194, -2598, 2818, 1694, -3392, -88, 2254, -2063, -2782, 1845, 554, -3369, 353, 2857, -770, -1523, 2490, 968, -2772, 381, 2603, -1473, -1632, 1935, 273, -2682, 25, 2610, -1412, -1243, 2337, 1061, -2036, 1017, 2202, -1924, -1408, 1750, 1198, -2378, 30, 2773, -1243, -2089, 2666, 1293, -2445, 119, 2056, -937, -1824, 1761, 530, -3377, -180, 2210, -1618, -1956, 2096, 1007]
1265A007k758K125K301k967q95L745j889l483L161J065l651j008M864r31l385
1280b699K984L870n130m52M636j611l308K852Q93m538P32M076k062m538M709J372
1296A786m456J522L462j188l083L653R08l698k55K695j154k212K386K044l917
1311a507O84K643n59k567J867J727k635m3K618j813l358J549K409l090m05L870
1327A390p96k275K208K840l605k56L674j380l892L226J199m610o90M174j970k494
1343c257L132K116l121N1M160j577l283K731J900m209k11K900j575l011K829J025
1359F00l069R84L982j547j920K488J254l337K40K064j162l666K867J143k733j9
1375a831L981j582k112K368J929k344j144L392j467l264J156K202l131j127L524
$$ y = [1007, -1751, 374, 2675, -292, -1187, 2558, 669, -2814, 347, 1412, -2239, -3247, 1617, 686, -2699, 285, 4155, -975, -1427, 3209, 1598, -1710, 1142, 2035, -2503, -1771, 2305, 243, -4295, 414, 1786, -2670, -1148, 2314, 1126, -1957, 1696, 2604, -1094, -1349, 1346, 192, -2020, 366, 2410, -1507, -823, 1820, 1261, -1306, 561, 2288, -347, -390, 2228, 415, -2943, -1394, 1015, -2075, -2480, 1390, 594, -1681, 527, 3367, -238, -494, 3180, 1800, -2092, 1134, 2333, -2277, -2967, 1207, -763, -3257, -125, 1991, -1130, -1079, 3081, 1504, -1779, 952, 2852, -1357, -1568, 1332, -243, -3254, -425, 600, -2469, -1485, 2497, 950, -970, 1518, 2772, -565, -325, 1739, 577, -3089, -222, 921, -1812, -1831, 2150, 568, -1544, 824, 2753, 409, -735, 2657, 1190, -2074, -918, 1284, -1847, -2974, 550]
1390E50r95k593K994K299k600j36L955j782k241J423J152k878j137K566k102k287
1406c812K227K250k465R43K899o65k583K758P75k080R4J467j257l089K245O28
1422C35j669j470L742q23j025K061R85k622j87K879j740k388J332J398k630j084
1438b906L049k49j487K322J693k249J88K455r21k791J420J156k933r71K591j859
1454a492j836K158J667j371o0K560j81j421J440O99k226o11Q64l26k686J178J583
1471f1j879M07K474n36r54J888J355k110n78J874j274k171P91N46k385J042R92
1488e79L65j238K061J521k001K98J681j327j097Q64l34j470q43K166j249q41J522
1505e01J320j145o51J999O28j586R72R68k154j281J244m18j776O97J414r21j120
$$ y = [550, -445, -3038, -44, 2255, -345, -481, 3474, 1692, -549, 874, 2026, -852, -1989, 577, -1525, -3812, -1585, 665, -1800, -857, 2042, 1377, -1206, 1552, 2327, 247, 341, 1808, 551, -2538, -293, 335, -1334, -2804, 938, 115, -910, 1151, 2136, -486, -673, 2206, 466, -1922, -590, 808, -1822, -2906, 143, -106, -1593, 729, 2422, 173, 361, 2816, 1895, -896, 524, 1680, -1253, -2224, 367, -1492, -3328, -1170, 497, -874, -934, 1626, 1445, 24, 1464, 2163, -63, -674, 190, -136, -2822, -1644, -61, -1940, -1533, 941, 405, -549, 1339, 2694, 584, 6, 1880, 606, -1565, -774, -228, -2613, -1571, -579, -214, -1452, 609, 2130, 129, 427, 2108, 781, -316, 548, 214, -1256, -2099, 67, -1182, -2023, -501, 819, -326, -977, 1022, 1650, 64, 1036, 2004, -150, -1431, -187, -605, -2381, -1684, -270, -1191, -2311]
1522b311L415L2n61J98J638j296r28J014m73k547R7J029j091k78J883N16j118
1539g81L87K121r15L13J097j34j934o09P92j493r97J440l47j85N83J105k43k8
1557A72K020k79j023Q7N4k579Q36J33m25j927R43J285K63o83J762J243j027J42
1575I97R24n56r17K61J30k034k59K73p03J75J359L52m30J011Q55N30j004K5Q36
1594A825j903j131J548r91j697R58J322j578R14J343M12m69J554Q5r33n51J27
1611H35j158j331N83M03j135O07J040j15o28K155N47p14k3R32o06j312k87N8j453
1630a602M04J400j334K64l49J552K7N67Q73J55j156o3J231k867K0P74j290j048
1648b442J280J247j375R54J094J159n56K22M45r81q81L23m44j857P19J1m99J02
$$ y = [-2311, 1104, 1136, 575, 773, 2411, 1115, 187, 1201, 728, -1819, -1722, -693, -1784, -2062, -179, 337, -781, -394, 1727, 812, 1125, 2222, 2088, 154, -455, 337, -1156, -2153, -713, -1060, -1245, -662, 443, 200, 172, 2192, 1913, 890, 977, 1031, -1548, -712, -579, -1004, -2931, -1988, -703, -440, -1123, 639, 1882, 855, 997, 1921, 1365, 448, 709, 839, -1195, -1454, -1181, -1884, -1709, -350, 2, -428, 583, 1438, 1968, 964, 989, 1825, -78, -1209, 339, -652, -2349, -1391, -69, -1647, -733, 610, 1022, 553, 2107, 2192, 1259, 708, 835, -323, -1654, -1071, -668, -1803, -1196, -156, -271, -899, 1256, 1803, 1089, 1066, 1998, 1392, 80, -207, -149, -1602, -1198, 202, -1132, -868, -1217, 335, 362, 929, 1802, 1957, 801, 738, 1969, -898, -878, -104, -1394, -2442, -1162, 85, -1290, -336, 758, 1917, 1361, 1583, 2028, 1047, 166, 489, 45, -1812, -1093, -1082, -1581, -1479]
1666a479J419M55k45J387N02q67n01M03k35j884L51K88j480o4J075N53q64M83
1684g03R45J312n14L74M56j978O74j24k78j323O50L04j754j28K380j353P62J103
1702H05J564j639P2J123j364j202J001o76j448m36J637r55K98J685R7j097J899
1719A364J100p37j136P55L07k943J50N49k22k95K03K15l04P90J948q58l11J298
1737A873J8j275q3J61r92j478J439k46j208P74J263Q28j066J402M52j582O98J060
1755B038j451p06n40J79j585k7J543j485M27J675J957j625J223R79j336k052J484
1772F98o8j526o72J712j946o23K128N49q79P32J353l25j205J559k51j191M52m39
1790E8q77n09J057Rj193k06K262N77j461J552J109j703K0N53q83j572P54K58j879
$$ y = [-1479, -60, 395, 150, 1537, 2039, 1172, 671, 1074, 839, -1045, -694, -406, -1886, -1950, -875, -322, -1186, -703, 242, 1554, 1040, 1414, 1870, -108, 566, 442, 164, -1159, -509, -205, -1959, -2087, 293, -1060, -298, 805, 2369, 730, 802, 1925, 561, -641, 360, -316, -1764, -2200, -563, -1518, -1220, 465, 562, -535, 1364, 2464, 1727, 591, 1346, 1653, -1290, -1140, -591, -813, -1108, -905, -690, -994, -204, 1744, 886, 575, 1873, 1891, 616, 533, 694, -298, -1776, -337, -583, -1791, -1017, 246, 1074, 8, 1410, 1862, 280, 978, 2038, 587, -119, -659, -480, -2065, -2092, -549, -2034, -1607, 68, 2025, 400, 1623, 2602, 1266, -786, 698, 630, -896, -1568, 144, -1802, -2425, -297, 252, -627, 105, 1458, 1133, -72, 1487, 1236, 45, 497, 58, -819, -1328, -271, -262, -1455, -1661, 601, 1178, -283, 1269, 2378, 675, 695, 1248, 365, -1207, -453, -195, -2074]
1809b074l77K600l76j125K220M45q10K92J519j666j552R17L64k263M19J689j630
1826a408k54J621N17j708M91L016q95j431J660m55j232k25P19k124q18J651M64
1843d11q80L13J365j53j60J692M8k230K49K503j456k471Q84L64j320K64J052K66
1861h1o92J513J135j376m45J122k39r46J145j123j344l42J483j434o98K052J264
1878I94j310J044J425m65p16J91p22k89m44J12o84j094J979j51j558M05K529m08
1896H38n56R62Q91j895m91Q13m82j539N9J393j847O67J274K78j004J292R27r83
1914E97O30N40j651n50Q38o86j492N68P37q46M4J015J432j880J257N45Q36k033
1932i9O34P01j825j99J086j080j553J054J188k7k4J625q55l43J104M82j617m75
$$ y = [-2074, -2451, 149, -227, -1352, 868, 1313, 503, 795, 2314, 648, -904, 13, 377, -1886, -1467, 222, -1408, -1662, -41, 476, -1232, -741, 2275, 1380, -51, 1609, 1154, -78, -303, 416, -1708, -2526, -875, -411, -1291, -978, 387, 234, 74, 1766, 1814, -416, -167, 2336, 880, -1591, -707, -343, -1663, -1399, -347, -81, -773, 740, 1875, 499, 54, 1176, 937, -9, 1136, 13, -1331, -1673, -190, -1624, -2322, -270, 994, -316, 728, 2153, 1688, 972, 1163, 441, 152, -292, -180, -864, -1958, 21, -130, -1688, -1283, 1246, 838, 282, 1244, 2135, 240, -251, 562, 80, -1459, -1400, -7, -1854, -1187, 87, 365, -639, 653, 1580, 597, 1227, 1767, 116, -434, 404, -282, -1774, -1206, -469, -1315, -1271, -256, 1176, -704, 553, 1098, 1934, -99, 535, 1236, -589, -788, 298, -782, -2335, -1281, -93, -120, -144, 1481, 626, 283, 1387, 1869, 252, -223]
1950b23Q39j590o05R25R9j653J430J109J31r68J835l01m97L47M12j856k11J174
1968C97n18j279o1J052j98r91K132O87r18R4R52j031K32k7l72j068k2M33J10p97
1988a193O55J236j558N59J739q41p16J278O7j187k12K17O67k059N01L12p32Q51
2006d16M61M24n29J033Qr28l60Q50m42m38J03j59r23P29O25L95j302P01Q89j118
2026c97J213r60L87r81J377r41p61k4J096m61r63J261M40L52p03J381l72j52j58
2045F34Q27j651j28J185q97j136M73N51k23L0J321n85j025J135O30o91R1N87j041
2064H7p18P30m22n74N49N70j75J99j30L13K41j172J780j50r54O50p04r23J23O93
2084A3M63q95M54R62q79l63J363m42p40P09l80K28o73L07l99n40Q71k04k59j43
$$ y = [-223, 616, -974, -1579, -654, -555, -2208, -778, 331, 462, -506, 1329, 1028, 531, 878, 1290, -566, -777, 397, -121, -1400, -1461, -409, -607, -1598, 534, 1221, 303, 397, 1349, 318, 550, 523, 151, -917, -939, -506, -396, -1193, -538, 698, -860, -301, 1438, 597, -119, 1159, 1226, 39, -173, 44, 711, -1348, -847, -535, -1267, -416, 45, 469, -60, 973, 981, 53, -307, 543, 101, -337, -234, -393, -1316, -587, 38, 433, -869, -168, 721, -397, 816, -144, 243, -738, 639, -302, -1063, -1087, 9, -452, -1415, -154, 286, 638, -65, 1316, 944, 792, 634, 1461, -190, -318, 867, -30, -1166, -693, -142, -365, -335, 986, 401, -624, 511, 1141, 450, 541, 1128, 87, -631, 99, -323, -897, -348, 222, 47, 246, 116, 429, 670, -502, 1278, 1128, 174, 824, 120, -803, -680, 13, 476, -419, 35, 997, 118, -245, 1118, 676, -64, 645, 265, 493, -180, 127, -272, -812, 59, -145, -404, -547]
2104e47J399n84n60J155n39J3PK56o68o71J248p30l18K54Q85j235P87oO08J34
2124H88o45M88r75K23k61J68r0j90N8J80p02J098K00m00k09N62N78j117M54m91
2144a83o17k70J095l02n69J005n5l41Q76m3p14KJ82O69o26j66P59l80p43j52K53
2165c20k26O4O09K05p97J041o43m99Q40p5M00Q7m36Lr59P52m49M67o63l4J504
2186H71o87r88J213l46j25N37p27o31M39P04l93q8m76O36L18l53M18N57o34M02
2206F47j065M84j53L23k18k42O63q9p79j34J377m32j032K44M24M87n64N7m50k91
2226g43R04l95m66K99N48m61K75o5J203j602P08m14J639j662K91K51o68L94o04
2245e68J334k66r90J361o10n72O35j11j18n99P98n59J60o58R42l67K42N12q79
$$ y = [-547, 852, 268, -292, 863, 324, 337, 344, 600, -68, -739, 509, -221, -539, -285, 600, -635, 152, 146, 754, 888, 243, 731, -244, -21, -282, -114, -204, -394, -336, -156, -858, 240, 440, 40, -169, 393, 971, -146, 308, -183, -800, -1070, 25, -277, -846, 159, 104, -237, 639, 596, -118, -116, 66, 735, 109, -57, 702, 322, -421, -573, -320, -546, -482, 127, 332, -465, 576, -67, -566, 274, 199, 599, 686, 250, 253, -706, 46, -403, 64, -599, -633, 871, 184, -804, 409, 63, -62, 475, -252, -883, -444, 260, -133, -221, -697, -61, 257, -96, 322, 879, 245, 647, -418, 66, -87, 236, 18, -224, 439, 350, -429, -563, 814, 382, -650, -406, 18, 505, -59, -2, -452, -743, 161, -234, -700, -401, 147, -314, -39, -104, 1099, -503, 205, -209, 1430, -232, 59, 310, -358, 36, -568, 766, 500, -490, 871, 261, -311, 324, 213, 95, -504, 294, -265, -105, -763, 179, -188, 54, 566, -313]
2264c13j02M96M05k93l87J097j149J96k23K01n94O10k53J00k75J71O66j101M17
2283c31J02L20j49J6J24r2J47l94L79j6k24O09r86J93Q11l56m07O39l4m04m52
2304e05R46j274J294k06K27n11j62K1J84j79n2N15j13K7n62K21l8K8n05N16p2
2325b00L16k65Q23o51j42m96L43J41j4j57l5m03K33k55J120L10r61J282p29o0
2345B00n76L6Q30j061Q77L9m90l57J295jr53N86j37L72r28R80l55j636J449p1
2365I9J89n10K11K84j159O25J028j044K51J082q01m86M96K34q80p06R98L18l1
2384A98j86L28k27l26P97J12p7o59J23L61m98m62l40l73J141m90K17n9Q84m86
2404b2L44q9O5j88n12L43m74L1M10K58o0n76P09k39N12j50l86L47o69R61l48r68
$$ y = [-313, -415, 81, 486, 193, -194, 903, -246, -50, -273, -72, -666, -56, -309, -209, -484, -313, 353, -748, -331, -229, 91, -58, -42, 82, -10, 137, -257, 122, 106, -118, 491, -495, -302, 509, 153, -254, 385, 351, -53, -505, 441, -833, 461, 255, 482, -29, -191, -170, 14, -165, -217, 298, 185, 212, -350, -129, -167, -139, -644, -128, -200, 116, -149, 674, 23, -119, -615, -272, -131, -145, -302, -337, -740, -507, -762, 358, 668, -293, 989, 260, 200, -376, -340, 490, -571, 306, 345, -145, -502, 793, 792, -161, 425, 288, 660, -268, 712, 357, -1279, 170, 99, 288, -222, -11, 273, -886, -261, 767, -277, -26, 1056, 255, -231, 265, 499, -381, -1087, -89, 229, 198, 12, 340, 113, -213, 584, 696, 619, -40, 83, 444, -54, -516, -856, -1229, -88, -578, -361, -420, 464, -22, 322, 233, 298, 110, -402, -59, -533, -502, -92, 166, 106, -470, 239, 0, 512, 362, -24, 323, -346, 615, 267, -701]
2426g01P71j17n89N08j42M39n66L05N37m42k84R28p7n26K32M75j65r97j29M45
2446i5p34J288q51L51l77R77K31q42K26q7M51j74R09j343j66P12n30m11K34k24
2466d55Q76o26M86N70J70l02o64O65j185O31k33j08m96J99M8K04j06N6J613j971
2486f28J633j33j459Q16Q60j362J4K49j36l40n98P14l05R17k86P23k25L97o40
2505B11O66j285J080j42q05m56L34K76j093J063L08o02P31M73n00j60J142j018
2523B23j113P75L58m58l95L93j81K49R36n31L0M9N28k35k17J70j56j371O12Oo56
2544i84l51J029J84j71k0J551q94o8L20j87o15j10P74r43Q6n27L79K12r29J178
2564h6k83J140p32J385o35p83M15k99J28m18L1k4m41j410J736n48J150N71n2j10
$$ y = [-701, 70, -47, -636, -128, -270, 169, -397, -92, 445, 3, -281, 647, 570, 44, 276, 751, 586, -411, -540, -95, -829, 459, -392, -41, -418, 559, 790, -52, 174, 87, 538, 364, 1273, -70, -236, 476, -54, -465, -231, -455, 421, -205, 281, 851, 1021, 719, 55, 720, -465, 166, -67, -175, -671, -472, -424, -220, -326, -270, 1343, -628, 1005, 872, -587, 229, 1089, -273, -259, -10, -146, -486, -1084, -370, -675, 242, -44, 679, 454, 851, 211, 877, -408, 672, 530, -275, -731, -397, -121, -1214, -151, 157, -445, 286, 759, 259, 99, 1241, 223, -890, -115, 243, -215, -610, -217, -398, -149, 787, 256, 286, 335, 863, 628, 411, 581, 425, -946, -334, -328, -984, -1335, -306, -122, -293, -313, 1238, 344, 276, 596, 409, -206, -316, 458, -485, -399, -926, -547, -335, -1264, -86, -369, 771, 39, 1424, 789, 6, 421, 122, 250, -168, -137, -161, -602, -2012, -276, -824, 326, 897, 845, 735]
2584G35J89l53Q4j038L42N0p62J94L0l02O61j09J75l20J490J48m69k01J12m30
2604B26r16M63j3r05Q49j203J062k41J196L88j013M65K85QM20m98o20k46L7j60
2624d16n23J2M63N14o43M61P58N8M95O6q72J90J20r99o26j3O92r90N34K82J47
2645b90L3P90Q91k75n64K58l13m32O2Lo36m27M76R08j167J137O06j247J148m54
2665E07M03k47m95L81l08o39Nnq41M58M7J4M24Q26M3M56N64p61P4n75q95M06p15
2688h73J26k23L77K23j033J481K77K36n7P15Q3n26J56j114p04O80n77l67O48K40
2708b32k44J466o81J1J22j24N70p38R1n44m83o49N67k65K30r47J189j50J057M63
2728G09K73mK91r01J30n63n88N74j065M5L61N82k21j82O30L09J53O26j71k25n22
$$ y = [735, 924, 571, 655, -383, -41, 9, -753, -559, -529, -831, -170, -279, -104, -424, 1066, 1214, 745, 544, 656, 226, -690, -227, -240, -1145, -296, -1499, -437, -678, 518, 906, -107, 358, 643, 651, 1071, 573, -47, -293, -256, -416, -939, -927, -464, 50, -593, -132, 626, 684, 1179, 1245, 373, 563, 683, -316, -942, -955, -263, -1253, -719, -437, -290, -257, 533, 1424, 1149, 585, 843, 530, 98, 160, 163, -473, -900, -424, 484, -683, 454, 1060, -187, 961, 507, 910, 663, 168, 549, 241, -398, -393, -398, -1239, -781, -734, -720, -296, 530, 573, 1029, 1593, 832, 906, 331, -564, -158, -873, -747, -970, -593, -370, -1403, 78, 355, 591, 534, 1249, 1332, 806, 962, -152, -856, -176, -753, -1120, -472, -232, -476, 990, 309, 320, 442, 318, 888, 150, 241, -303, -786, -1435, -868, -1133, -903, -1850, -661, -811, 246, 709, 982, 978, 1269, 368, 498, -65, -653, -79, -1144, -1099, -738, -156, -377, -559, 71, 380, 533, 1159, 988, 763, 241]
2749B41o22M23j046J89O03m99P3j25R5P06M17L48j4J18j88k92N2p81m47j07M57
2770c99j05j27J51Q59j040J416l22Q12L19m02o36o55j214J138k10j069K66k91
2788a509O94P14j26J313k73RR54o56N4r79k61O0r79O6L04Q0MO4J263o27J222m91
2810I00M27j132o4J230j506k85M91r98O28j244Q64j09N62P07N66n52M38L21l48
2829H96j50r38Q0r50J08l03L25N25M10q12J504L50l98Q41j77K36j320J48q33k33
2849f91o90P96k14J85J6M25M73P31J64p56O00j28l21j70j290O19R7j802J277j32
2869h11O9R12L82K28k07j60P26m57m48O43j070m65ln85L19K0m28J556q08O12Q55
2890H80k7m91J213j859R51J97j355q57N62k22N27L06j71L29J86R32m71J03J02
$$ y = [241, -381, 42, -1004, -815, -212, -711, -638, -763, -668, 38, 455, 803, 789, 907, 719, 427, 479, -302, -749, -856, -399, -504, -631, -480, 379, -661, 755, 433, 1245, 1564, 1162, 526, -129, -1343, -205, -415, -1484, -1218, -1509, -815, -101, -227, 1086, 813, 822, 1776, 1120, 1174, 195, -66, -6, -985, -919, -615, -535, -531, -467, 796, 169, 1391, 900, 1327, 195, 131, 1361, -145, -430, 61, -937, -309, -1553, -689, -798, -236, 471, 1037, 485, 923, 1244, 896, 746, -192, -112, -1062, -954, -1257, -932, -407, 3, -809, 695, 1045, 647, 1488, 1311, 1547, 227, 375, -458, -691, -1381, -585, -799, -614, -598, -173, 300, 1031, 1195, 439, 1039, 911, 590, 420, -870, -251, -154, -1956, -679, -811, -742, 170, 552, 780, 573, 413, 1139, 682, 234, 877, -193, -658, -661, -1246, -927, -907, -1335, 221, -587, 25, 880, 853, 362, 1575, -284, 667, 864, -491, -1348, -786, -1008, -481, -175, -346, -17, 169, 1101, 630, 733, 835]
2909H35o58l83P72j266N71m06l76l19J013n32M69N64j45L37P46l01J17n95n85
2928a42qm23l48l46J256j411J850o66K66P86L47j71p34l11M61j41n57K09K83q10
2948f10n05L83j61J483q62P17R35o13k82M17l96n6j351n24Q76m64N93p09J178
2967D9L2m18P08K29m74J003n05Po11l96L75o20k97m04J173l66L87L29m37J207
2987I71K17ll24M62j011j22j124R67j551R26r94J458k76J48J479k03q08R88n29
3006F71j52L76p84m20l09J11n83M70n71J127j88M15P75r1k47k46J33n19L2m33
3026d33o1q35O66q9l78N40J36Q06K01R20p37N24J53j096j189Q00o1J84r87L73
3046e63n10j71J209J41R38M01o49m1M65j069l87O31q77l66Mk6j6L02L87J026J63
$$ y = [835, 177, -206, 566, -700, -129, -535, -911, -1230, -217, -749, -280, 284, 139, 476, 1222, 921, 1038, 443, -142, -150, -573, -921, -1267, -11, -1422, 428, -238, 28, 814, 1161, 990, 256, -55, 406, 265, -292, -83, 200, -610, -1115, -732, -893, 590, -272, 445, 1380, 767, 485, 902, 506, 450, -901, -1425, -549, -1013, -420, -1129, 49, 81, -337, 371, 600, 126, 1129, 624, 631, 20, -376, -1, -621, -918, -1322, -149, -515, -128, 201, -236, 971, 1188, 1185, 861, 1323, 312, 190, -934, 33, -1518, -592, -1586, -128, -404, -256, 1223, 1020, 212, 1200, 671, 519, 895, 111, -309, -618, -507, -1090, -620, -1191, -64, -252, 163, 938, 847, 600, 354, 487, -32, 0, -433, -494, -1329, -663, -752, -1130, -590, -454, 352, 553, 1473, 736, 1260, 1413, 317, -872, -72, -133, 51, -936, -563, -1073, -1244, -35, 106, 1044, 1445, 796, 755, 1220, 151, -236, 395, -482, -848, -844, -870, -886, -584, -197, 829, 992]
3067I92j61o5j42j17Kn73Q28j396J80o33j96N79N69r00O19Q82M20k54P82K50j217
3088D49n49P07j126J21n51R7KK63M32K68O71J70J18l27k38M06o58qk0r06o89K66
3110a102K10J43M3L69J45Q94p9K56m26K72J45k60k24j511O22m96J52K46L08N2
3130b41M78L13Q23J9p57J73n53r6q8j098j09l84L10Q97k02K44jR11O55k08l83
3151G03j48l80l81J78q22l68L96p00M65P03P5N59O12j02k66Q35m62m5r93J30m06
3172d17j57j03Kj59L80M14l05P05L80L54K05j177j96J045o67p45m0p86M14L08
3192e45m30J48M72L92Q90m80J025k03q76k65o90O29j424J91k51P15n85R06M69
3211H8J01M05K48j93L66n11n58K51l82N6o24k61K91j9r6R74N23j340J110M33K08
$$ y = [992, 831, 766, 624, 507, 509, -64, 764, -632, -452, -1085, -1281, -702, -133, -1033, -414, 468, 888, 634, 1416, 1666, 449, -100, 607, -519, -398, -949, -852, -850, -587, -155, 113, 784, 954, 1072, 745, 507, 913, 255, 247, 227, -679, -1368, -1102, -892, -749, -706, -337, -192, 702, 623, 879, 453, 725, 870, 610, 386, -1125, -503, -999, -847, -601, -293, -241, 237, 550, 1373, 1392, 635, 808, 255, 159, 71, -1027, -1136, -1520, -1210, -313, -515, -271, -272, 639, 1294, 1086, 703, 555, 175, -206, -28, -850, -1218, -822, -1522, -1057, -354, -279, 280, 892, 790, 524, 1359, 897, 852, -141, -11, -417, -574, -677, -675, -834, -454, -40, -345, 360, 740, 1094, 1299, 122, -74, 971, 304, -441, -481, -1267, -853, -545, -975, -827, -355, 37, 927, 447, 1472, 1269, 393, 128, -562, 67, -1357, -1166, -1417, -702, -1287, -381, 88, 189, 594, 842, 649, 1015, 504, -54, 197, -185, -129, -753, -1014, -723, -742, -838, 136, 659, -681, 429, 862, 1070]
3232A070l28p2q36N38r51j144Q59p7M52J81l26O42O40q7J90L51o57k15q1p01m1
3253e93L98J7n94M59L44L9N6R69j48k25J46N10j174M40r66J00j160J005p51L7
3273a091j0J380k26J19L3N15N68k02o35q82q2j27M69k45r54P14o15J165P7K31
3293B02Q9j55N23j22M31o60p25o7o91l83J305m18M1jj6O58N00P64n32M5k93q46
3315c51m8K1L10n63J46j103J335o23J406p83L49N51J90M1m31Q69r37r53O37o82
3335f19o21L87K37K63K35J134k39n8J52m93L1M2J49o12q20q1q6K73O3J62J02r1
3357d90J448l77J74l49J9J07r33L47M95j036l43M16l04Q53k07L16j98M91K98L98
3377A125o05l02m9J37p20j51K00m30J7J73N85j82R19n93L18N28K39k47q05M45
$$ y = [1070, 742, 670, -166, 372, -579, -1723, -864, -941, -489, -308, -634, 8, 648, 561, 751, 1102, 445, 230, 149, -552, -593, -195, -178, -772, -313, 31, 70, 126, 1095, 947, 722, 868, 1378, 204, 644, -322, -222, -1382, -377, -1128, -1091, -1101, 279, 53, 172, 205, 720, 1288, 1086, 451, -431, -513, -640, -171, -416, -1370, -656, -1271, -106, -29, 202, 291, 136, 659, 537, 968, 308, -417, -484, -1175, -1558, -253, -671, -630, -631, -647, 11, 511, 1275, 743, 788, 495, -351, -399, -378, -68, -631, -485, -1588, -253, -876, 530, -253, 96, 647, 837, 878, 447, 1316, 379, -574, 63, -619, -1240, -853, -616, -353, -118, 1016, 777, 719, 871, 378, 409, 451, 600, -12, -832, -913, -999, -726, -663, -501, -399, -490, 958, 581, 755, 406, 425, 532, -401, -54, 441, -595, -938, -522, -826, 27, -180, 136, -62, 429, 727, 1125, 520, 218, 169, 306, -414, -565, -365, -795, -778, -605, -20, -202, 717, 124, 442, 970, 1209, 962, 157, 602]
3397F02m14J64q33K10m58q13J356R3Q23j20K70K83j119J415r22j048K4k4K22m82
3417g71j68O5J099l10j96Q14M06K60p83P7l24m12M06m21j60k30p16J240j26O08
3437C58r4o90J620j43r89P49l63n49l28m12R46j108K32L56J37r0P28l31m41J369
3457I57n38M83m97l62M65j365L55J53k79n2J33R4J108m68K50N15q17p4K1K25j38
3478A69p23M0j67M63m16o15O94M88P35m80L89j7jN7l18M81r83m50M90j5q8j1k22
3501e00J24J462p71O77k46O49r97l88M23j209M47M24n40M71o16N53K82P38m46
3520E37j65k86M86K57m08j42q41l41K57Q35n94J09n6R73q65R22q1K45k54M09l82
3541F15q02M5o07R7j36j27J53J183j40p9M91L29k10k38L24p71J92n97O73j131
$$ y = [602, 188, 352, -481, -271, -729, -1542, -186, -93, 730, 610, 880, 1163, 44, 1459, 537, -511, -487, -511, -289, -771, -939, -874, 225, -85, -281, 533, 939, 1199, 416, 493, 169, -243, 163, -258, -418, -648, -1364, -124, -250, 358, 264, -426, 1194, 1051, 62, 811, 448, -101, -429, -841, 105, -1003, -771, -415, -278, -368, 360, 29, -412, 957, 419, 902, 405, 43, 508, -857, -502, -349, -628, -680, -547, -453, 655, 187, 437, 952, 135, 61, 82, 307, 169, -554, -514, -681, -218, -634, -1249, -555, -67, 668, 188, 577, 560, 559, 616, 298, 779, -204, -654, -164, -179, -267, -278, -500, -376, 1086, 315, 992, 746, 1395, 398, 10, 433, -776, -329, 95, -445, 26, -590, -37, 245, 983, 537, 372, 86, 572, 829, 421, 279, -562, -903, -646, 189, -405, -296, -352, 621, -244, 678, 597, 842, 588, 997, 615, -187, -142, -749, -652, -788, -915, -762, 421, 281, 202, 693, 1022, 812, 574, 898, 127, 319, -278, 395, -736]
3561g36o5l13L93Q79l4m28L89M44K2J82Q8p46k42k83k13L74o17M52M50o29K91
3582c42O51k95k14J076l77K47m54r24J160j134J00j20q5k87M28L31Q25l33o3n80
3602c90J466k67J58j170o4N06o55n98J05J04M21M07j30J007l62k33L51r9p76n2
3622b71k35L50J38p42kqO56k93K28R08o9q22N62K41M29j309R60n30j16m66J81
3643b10K2R8q11Q42O47k37J35o4l6K38k56n48L52J35j01m79l37m1j22K36L1M06
3665a00N45J26l39K61l50N55j065N07q79J25j05K61J03Q5j2k53O72Q8r3j09O28
3686F51q18R7n05J52l72O0m15K46Q24J32N69l5L51l29k11l23K89n11q43P86n10
3707g15L83M97j292N75J347n22O78l91k66L17k32p9k82o22M3j68R96o81p46J139
$$ y = [-736, -801, -1114, -721, 158, 124, -304, 85, 529, 551, 733, 821, 75, -167, -450, -663, -289, -906, -454, -4, -633, -342, 309, 14, -200, 876, 499, 746, 292, -632, 528, -606, -506, -626, -711, -998, -570, -239, 586, 253, 190, -390, 1076, 809, 967, -203, -267, 239, -416, -1014, -909, -805, -384, 23, -107, 900, 538, 305, 656, 557, -219, -271, -506, -156, -18, -760, -762, -770, -114, -407, -179, 729, 660, -162, 400, 641, 1070, -239, 721, 191, 75, -391, -210, -188, -90, -901, -59, 588, 351, 486, 422, 386, 624, 368, -180, 172, 307, 206, -273, -610, -651, -773, -537, -506, -100, 445, 571, 232, 493, 143, 698, -367, 140, -739, -614, -719, -458, -355, -270, -282, -535, 137, 225, 132, 23, 651, -167, -70, -575, -423, -795, -735, -1150, -904, -80, 52, 621, 586, 937, 608, 397, 74, 363, -148, -991, -205, -715, -332, 165, -1127, -552, 795, 273, 951, 560, 294, 611, 379, 300, 18, -604, -561, -729, 267, -414, -1160, -21]
3727b1r6j28Q48l15k51N08M18j078k38k25M79j17n06K25L84m33M6Q41j39K88r37
3748d47O92N27n60L56o81q03P84p84M27l20P62k32J44P06r00J311p20L62r46L77
3768E5q31M06r8%Q43p77r71J003J76l95J499n07L07j0j87n13l18J04O4L09q67
3789g08P87K3K20L09j02M6L52p98O04o77K66R19j914K96o08Q41n92K75J37J027
3809G03k54P4L33j018J154j114R5k08L92l62N02j037K61O20j00J27k14J78J83
3828C15m3L61m84l03J07N0n73O81l80k54R31o35K02L08k12j29R85k61J084j706
3848D4l23L03K12n28J01K19l80J45j99O93k16J58O0l52L18K16J66o02O1o0Q2p4
3870D4o13J020j99l90n3L56P15M08j029O82o90J42q47N13o8K47o58k73o5Q46N4
$$ y = [-21, -117, -245, 603, 288, 37, 545, 963, -115, -353, -578, -99, -216, -722, -497, -113, -546, -500, 341, 202, 490, -447, 245, 772, 212, 568, -113, -916, -132, -916, -489, -809, -47, -279, -135, 571, -329, 982, 262, 624, -322, 55, -776, -370, -468, -468, 375, -402, -1373, -370, -194, -589, 910, 403, 710, 700, 513, 0, -318, -214, -150, 159, -708, 79, 102, 322, 631, 529, 575, 927, 129, 733, 56, 322, 1241, -673, -377, -985, -144, -736, -461, -324, 703, 449, 523, 856, -162, 992, -122, -27, -235, 157, -205, 297, -740, -479, 141, 41, 168, -46, 132, 315, 272, 633, 149, -154, -47, 3, -570, 111, -269, -523, 408, -227, -25, 283, 71, -58, 927, 666, 1750, 44, -279, 24, 236, -292, -191, 28, -352, -207, -406, 287, 71, 229, 289, -63, 255, 471, 637, 35, 96, 36, 118, 44, -569, 451, 252, -138, -191, 165, 880, 1288, 259, 941, 251, 393, -454, 59, -9, 238, -420, -693, -758, 88, 142]
3891A42L15K08p87k35J118k09o98l21M12n74L11l0m67J83R37M78q38L14O01r11
3911e1K44N43k80j424O65j0K27j72k3n68K72M73M51m74N38j79M76J01r47M47q5
3932B24m81n21O19m65J215j40n54J159j031j25L5R61j217P73m47K33k29l45j81
3951e17Q4J83m03N70M82j95P57q30k36Q97l26k43p94n8P20N3m63l19N77Q4K9P38
3973G90q69L06J26l64O26J48r22M4J53l09M20r06P12n74J110k15K78k11L03p56
3993a10K78l97M34k71n66M42J18Mn06L45o9J487j451O58J72o13l17K31J96L2m16
4014c19R11j282J325k92J37K33j45j22o2j84j49J19o5j24j04M78l61n93L88K98
4034H7o76J148r60J32N22l93J20P4J52L05q97l94R89l47q9M56l75L28n94O48m91
$$ y = [142, 457, 665, -122, -357, 761, 552, -146, -467, -55, -629, -318, -348, -815, -632, 305, 783, -55, 259, 860, -51, 193, 736, 456, -968, -303, -313, -86, -258, -281, -849, -577, -104, 347, -127, 411, 232, 708, 809, -138, 309, 224, -257, -778, -159, -624, 591, 451, -103, 1056, 25, -100, -65, 896, -321, 452, 5, 238, 9, -336, -517, -433, -250, -653, -83, 399, 204, 961, 131, -105, 792, 466, 223, -571, -629, 91, 144, -319, -638, -61, 23, 52, 790, -79, 227, 353, -11, 615, 763, -159, -115, 38, -271, 149, -757, -45, -619, 491, 276, 554, 343, 646, -110, 168, -229, 205, -66, -632, -190, -72, -68, -574, -229, -298, 1189, -262, 396, 568, -45, -362, -131, 65, 97, -319, 592, -690, 635, 343, 480, 713, 568, 446, 384, 200, 51, 170, 105, -19, -123, 355, -6, -599, -211, 87, -589, 559, -401, -269, 253, -140, -20, 54, 206, 511, -386, -780, 209, -138, -227, 229, -146, 182, -412, 236, -255]
4055b55k38N70K97l30k07M48j090M66N40o32P77p5L36k25m32K32j73M11n35p0
4075a85O16j02m21J130j104O51p12M69j128J512o63j80O94o58L27m74K79k92o1
4094c02l07P35p75J38N77L82j74l36L98o89P57L81l96o89J82J96M06n00q21O94
4114a43j01RO55n44M20J69j42m27N87j37L12k99m43K48m72K22M16O4n18O81n87
4135c0k40L24L42r14M68O50m01m57m95J036q05L71M38p07O87L4N63o82K85k59
4155B08r53R13l81m3p19Q33Q5l90mL69m15j08O43M82M09j561J258p11L21m06K79
4176A09M78m69l67J6L10R1K44o4m01j12M74l17N6k60J70o6j87K27n4k72N47P03
4198H56j158J94k52N83m7Q88j334K77m5l13M35k43L76K85m63l29P32n41L39q2
$$ y = [-255, -493, 77, 374, 44, -163, 285, -805, -339, 201, -431, 346, 271, 607, 382, -50, 182, 9, 420, -115, -185, 431, 329, -92, 1038, -66, 585, -127, 342, -786, 726, 63, -117, 577, -81, 246, -228, 51, -241, -302, -609, 126, -649, -511, 66, 448, 274, -62, 336, -353, 404, 785, 389, -300, -118, 78, 484, -16, -837, -143, -244, -235, 420, -124, 296, 465, 323, -104, 483, 346, 658, 359, -84, 164, -308, -86, 330, 394, -124, 557, -30, -270, 54, 396, -518, -50, 600, 199, -258, -753, 283, -522, -151, 287, -420, 267, 301, 864, 182, 467, 208, -745, 168, -213, -256, -975, -142, -57, -447, -451, -82, -497, -605, 38, 520, 929, -632, 626, -85, 236, -170, 109, 587, 118, -249, -233, 77, 168, 412, 348, -53, -165, 309, -8, 48, -212, -42, -108, -295, -68, -122, -394, 153, 856, -302, -108, -360, 223, 176, 1064, -270, 7, -38, -351, 84, -159, 217, 502, 39, -290, 442, -99, 240, 158]
4218A58L64n8k99m77J030m89m33P38m01K77r48N09p4L96J43l03p58P01P22k86
4238E12p50p03O04M05m35R4n15J40L11M61J48p3Q6l47M81k68L20m07l48Q57k14
4259C59k38k64j53O28K50K44q14K95l20o63O45k65N52m81K48kJ57k4L12n84K02
4280H4R2j19M79p34P67k39p22m75L32P54Q0j27L6o48L25m6P47p03J084j272N47
4301B42N9l45k43P64j8k77j23Q29q45r3l36K32q3L90J93l99P19p99O87l82k26
4322e4j22J40O5k26n66P98k21Q01m99j59l5J18M58O7J97l40on00L86J78o57P94
4344F17j39k7j13J06l71k2K25o11O17n66M13j6m34J16L59n09L70K46j6m06J77
4365A6l59M87j77q8Q1l91m89J190l21k39j56N34p84J006J43j368N84K64J01K42
$$ y = [158, 522, 464, 165, -312, 718, 229, -204, 534, 133, 410, -538, -29, -103, 293, 436, 133, -625, 76, 798, 512, -238, -941, -337, 68, -367, -273, -788, -648, -337, 124, 272, 199, 285, -62, 419, 151, 471, 64, -284, 573, 359, 121, -143, -296, 332, 582, 826, 12, 307, -13, -676, -31, -296, 256, -225, 23, 21, 178, 154, 466, -118, 84, 176, 57, 536, -198, 569, 330, -392, -867, -535, 219, 299, 172, 208, -440, -115, -161, 586, -117, 967, -305, 242, 301, -44, -287, 477, 459, 182, 59, 888, 43, -50, -386, -154, -237, 153, 346, -53, 666, -133, 554, 172, -54, -176, -36, 29, -197, -763, 35, -186, 615, 116, -43, -78, 40, 498, 565, 762, 422, 416, -84, 302, 480, -177, 617, 478, 451, 338, 444, 73, 51, 276, -335, 282, -284, 129, 113, -321, -205, 154, -355, 15, 261, 245, -161, 16, -343, 144, -33, -121, -40, -431, -920, 270, -51, -290, -446, 88, -696, 310, 453, -915, -331, -67, 34, 276]
4385B76m17J7K89m23P77n41K62m58R46o4q55k7J81l06R82n08j003Q32k06L99m4
4406A09K94o09L48m44K7n8K95j94J49j62j95M25l80K76Q5J17n2M9L20L77r05O25
4428D97o15K50j58L28j12q35P51N5L20j51o1j121N84J94K75oj0k09l60L88L88
4449C92J15l87J22Q5m50L09k0J21j099L57K10J439j139O12l20n5J81n23P2M8j24
4470e4j96L68k7n61J168p12j08J62N1j91O1l39N71j489J471j35m11L20k02p1o07
4491i31M75j42J208q82N41k45J77N1R9o88P78m11K77m55k49o98J465K72L19j192
4511b31M28J92j20M7K33r3j124J198j146J137k52o14O00l47k69J129r55m75Q41
4530A79j170Q00Q8N6l01N13j38J56J69l80K44m7J7L4n43L29O73j047N71R0l10
$$ y = [276, -141, -124, 165, -258, 519, -22, 240, -218, 728, 664, -191, -218, -37, -343, 639, 131, -872, -40, -246, 153, 109, 403, -206, 142, -302, -275, -333, -38, -232, -83, -245, -440, -15, -395, -119, -34, 83, 31, 80, 400, 777, -128, 497, -118, 132, -26, 302, 190, -645, 106, 161, 481, 330, 269, -852, -268, -74, 201, 195, 185, -24, -384, 4, 392, 507, 120, 242, 327, -123, 186, 166, 287, -812, -455, -245, 1194, 55, 667, 347, 292, 473, -50, 22, 70, -54, -250, 118, 91, -470, 698, -14, -122, 40, 91, -100, -39, -378, 193, -1296, 175, 40, -371, -51, -253, -324, -931, -456, -598, 610, -272, 269, 24, 201, 252, 351, -337, 441, 30, 307, -148, -397, -1095, 370, 642, 961, -231, 197, 389, 269, 316, 549, 456, -668, 530, -616, 521, 269, -345, 255, -92, -361, 768, -187, -662, 179, -991, -191, -103, -47, -348, 165, 27, 183, 352, -28, 216, 169, 186, 220, -323, 6, 679, -368, 203, 293, -17]
4551a7O50r89O24j73k08n08O88k30n43N93k60j02l45R19o47O37l18l34M78K94
4571B09o01K05m70N63k39O80k91m53P79N3m12k22N3o21N95L60l09O75o11o1O41
4592E23j095Q58p86J261m06J62n43j93K66j58k06P24R1o43p0M79K89j350P36J47
4612H6M98J30m10o55k84j0J112j111R80o38N26m85K09P82j131M13L64m13n71R12
4632C04j20l70p19J307p28N08m28j28M13J20o21Q74j61p55L4JL91M25j84n30L11
4653e6r75P38J29M92r72O02k45O06q16N21j29OM05L74p12l40J35K12J52qk07J137
4675A049j159J335j865N61N59n03l39k18L69K24m49N85l08K6J18L68R00j017L19
4694E55k25j83o39O23j83n99Q97L49j137P56m14K58k82J10N56m62N98n79l62L90
$$ y = [-17, 633, -356, 268, 95, -113, -621, 67, -163, -706, -113, -373, -475, -820, 99, -548, 89, -229, -563, -85, 209, -392, -187, -657, -94, -333, 347, 56, -397, 382, 435, 23, -199, -146, -767, -172, 188, -121, 554, -57, -118, 523, -572, 286, -500, 761, 355, 517, -26, -219, 47, -111, -317, 407, 498, -145, -215, 264, 553, -797, -61, 86, 584, 714, 304, -351, -635, -645, 467, -644, 336, -302, 224, -261, -52, 730, -401, 12, 376, -37, -608, 304, 184, -186, -905, 402, -326, 182, -246, -374, 39, 159, -462, 412, 251, -504, -470, -469, -78, 347, 163, -367, -56, -1031, -293, -164, 328, -644, -42, -287, 319, -497, 24, -105, -99, 306, 680, -32, -372, -237, -25, 127, 119, -88, 1049, -110, 1225, -640, -79, 480, -23, -362, -580, -211, 13, -436, 149, -159, -133, -15, 353, 1253, 236, 555, 330, 147, -492, 131, -52, -651, 246, 595, -542, 214, -200, 58, -224, -114, 442, -20, 578, -1, -363, 27]
4714B7l96O4L1L16N7M03k60l42M05l94O31p15M29m93L07L54q76O86k83l5j09O49
4736D56n44m25J102o26m9l0m27P48j81l32m98M40o85O10N51p82J64N84N4k8j032
4757i30J004J71m61M41o25L17lQ5N65o75j43N60k85M6J74l2J42k75K36n90L28
4778E0l82L34j149J261P7r0m58M78P5p82R40k83O9j19m16j43O79J70P6q38M4O03
4800A96n55L36O9P13j53q30k8K93n56P31O0k10j66j74M58M13p40J00L86M08p02
4821D9l4N26q48K60j57J10L34j4l28o5P3L6M95q12m99R91j4J59l80J63J124j058
4843A11n69Q07n71J44o79J026k07j80K49R5n89O00J88p10Q46r05n9j32J19k74
4863f90M20J40n7O71m22r75J064K16l66j93P30q7l75k27K53n20N68J04m92k16
$$ y = [27, -369, -305, -274, 42, 99, 502, 242, -100, 305, -89, 542, -173, 256, -237, 70, 424, -452, 234, -49, -84, -193, 456, -88, -513, 589, -37, -86, -116, -543, 205, 24, -308, -806, -366, -1051, -441, 110, -672, -508, 76, 130, 102, -930, 74, 245, -216, 225, -400, -83, -86, -1, 564, -111, -254, 306, 21, 67, 241, 209, 351, 76, 312, -278, 50, -332, 2, -1147, 114, 191, 101, -357, 121, 196, -586, 354, 71, 140, 21, -395, -538, 141, 311, 387, -451, -407, 196, -359, -23, 46, 759, 606, -224, -252, 41, -515, 216, 276, 66, -100, -274, 184, 597, -143, -43, 343, 751, 49, 15, 541, -307, -47, -204, -94, 240, 226, -102, -167, -94, -58, 437, -375, -874, 117, 103, 262, -118, 45, 1169, 111, -458, 349, -222, -78, -757, 269, 62, -118, 131, 226, -363, 237, 425, -285, 561, -344, -403, -535, -416, -690, -270, -130, -187, 484, 62, -913, 151, 367, 1, -192, 538, 451, 76, -151, 102, -418, 150, 254, -238, -454]
4883d54K26K00K14L35m27j78J08m64M7r8O28M0K10p72P9N93l09J4k22K88l03R37
4905F92n28o66M14M10l71J52k20K9n8q2K33l48L91j05L90J75m61J74q2m93O25
4926B71o84K2N33J71m40l2J77O96p63J74L04M64o95m07k25K05l25N80N18q97N03
4947A50k79Q02o98O79j049P1M72K20p4l1o16K0L64M08m2l80p8k63O47n56Q43n40
4969G0J74j58j84Q78L27j395L79o81M04k93N79r07J086j21K33N24j423J102j416
4988h22N28N24N2n75N66r66N35j37P77l49l34J51n03P94R0k53j75K11K79l55M99
5009E37p07k72J021q95J84p3q3L60M28n22j41N8o1M57q21R85n95N5M29p9N15l87
5031C93k00J43o50J037j015J072j031O23m41j11P31r09J18p9O79r30P14j99L97
$$ y = [-454, -228, -28, 186, 521, 94, -84, 24, -440, -393, -491, 137, 177, 387, -385, -306, 287, -22, -8, -230, 58, -245, 692, 164, -502, -88, 322, -49, 103, -117, -88, -146, -228, 5, -343, 48, -57, 333, 508, 47, 221, 139, -354, 271, -413, -391, 142, 313, -127, -159, 18, 714, -49, 125, 429, 893, 198, -209, -434, -229, -554, 26, 544, -353, 150, -129, 673, -25, 654, -395, -324, 148, 368, 294, 263, -353, -333, 31, 439, 397, 17, -61, -324, 323, -233, 610, 70, 244, 86, -98, 780, 1107, -288, 91, -590, -186, -479, 100, -807, 279, 158, 391, 915, -508, 594, -822, -294, 230, 282, -293, 273, -693, -158, -295, 482, 133, -201, -50, -553, 241, 331, 78, -97, 114, 393, 38, 537, -170, -442, 579, -316, -132, -205, -288, 72, 500, -22, -163, -105, -166, 291, -530, 455, -140, -85, 344, 265, 780, 393, 193, 336, -314, 723, -292, 780, -251, 372, -69, -180, 551, -358, -240, -319, 360, -570, 144, -55, 342]
5050C42j37k9L87j106Q5N31K16m34O13j156N88o71J059K8n2n75O01k00J8l12R3
5071a11j29k18N7J029r54N6j05L94J93l42M49J57O0p12L89l83O3K00K5q87J04
5092f65J77N02J91L56m09Pl24n2k64N82j69o4J70J95m49N2l87R08l28N3J28J099
5114A309j579J021p05n71k76P99n81j38J75K16L16j92M28l62O17n18Q2j52J82
5133G1Q22j442K64M08%p09L55N32m12L94M54o78p22R48N2j81k27p04L54J188n51
5154B16j48q47P72m15M06J13k35N37r27R26q15O48j163O53N75k1l77n88Q98k67
5174e9J58K15m36J52M38j33r43J535j149L25J42m6L1J03o03K6L02l1j24L76l22
5195d3K48L48n79L96j048K94J085k28j510Q79n55J280l93j61J61n6k08L0N11o32
$$ y = [342, 205, 176, 563, -543, -458, 73, 289, -145, 468, -688, -100, -771, 288, 316, 264, -311, 290, 90, 108, -204, -111, -240, -458, -401, 628, -326, -270, -375, 19, 212, -130, 319, 476, 536, -176, 213, -170, -107, 93, 118, -769, -665, -488, 14, 205, 561, 152, 159, -165, -217, -481, 101, -68, -132, 38, 233, -216, -164, -551, 357, 29, 82, 210, 1309, -270, 751, 46, -525, -801, -2, -583, -721, -546, -330, -14, -206, 222, -140, 477, -41, 41, -111, 71, 893, -549, -285, 123, 123, -586, -231, 301, -111, 283, 737, 59, -663, 285, 337, 156, -71, -775, -421, 767, 216, 68, -779, -7, -422, -16, 97, -138, 399, -528, 398, -417, 231, -932, -279, 296, 275, -102, -690, 208, -59, 99, 314, -122, 30, 468, 335, -608, 927, -222, 103, 245, 199, 230, 333, -270, -244, 58, 27, -97, 279, -43, 205, 553, -26, 370, -678, -384, 701, 473, -1037, -158, -713, 567, 174, 13, 174, 118, -90, -60, 451, -181]
5215a81L28L70q89J323r00j1R07j027J5L6k4j60M21J86l08m25N65K38r6q2q23
5236e37Q24K45k68r7N0N41J59j788R21M30n73j17J81L9M03m40K35m31L0O58k5
5257D40o08N17m1L40j036N02R07p57q77O92J47j49n8j65mJ69q4J89K78o34K71
5278C9m28M58l9l58M2N18j97j51j92J52k17N19O1o8OM30k43l61n2p5m32n49J90
5301i47O55M20L33k57O49q39L43P8m80Q35p89n57Q56l96K77l99J28q26J135n6
5321A63N39q57J83q1m0J397j604K70l63k41N75p89J238m77J09r28Q45M65n03K9
5341g0n40N80j12J94J92p21K69K89O5p27O64L00j14K95l45j81k49P01p40N92m9
5362B93r5m2N83p12N1L81P2r14P43p36L87l14Q92k27L0o44j37K07K85K5j47K34
$$ y = [-181, 147, 517, -372, 951, 51, 40, 947, -80, -65, -29, -53, -213, 208, 394, 86, -339, 226, 464, 368, 286, -537, 287, 532, 264, 167, 217, 758, 917, -871, 50, 480, -93, -210, -29, 10, 413, -27, 208, -223, -193, 465, 440, -168, 349, 308, 648, -388, 114, 1021, 264, -613, 79, 226, 77, 19, -146, -150, 19, -65, 124, 402, -232, 39, -389, 69, 30, -328, -286, 232, 35, -116, -308, -156, -373, 146, 207, 139, 145, 575, 332, -29, -81, -156, -588, -1137, -947, -292, 128, 461, 204, 853, 14, 357, 435, -45, 790, 1, -556, 300, -96, 181, -218, -90, -916, 219, 163, 702, -155, 28, -53, -93, 1304, -300, -30, -393, -634, -59, -848, 390, -87, 22, -906, -61, 404, -99, -70, -610, -30, -142, 52, 244, -477, -208, 81, 146, -581, 83, 383, 269, 564, 219, 38, -211, 490, -250, 342, 293, 198, 156, 739, 27, 78, 459, 531, -383, 360, -376, 11, -303, 589, 362, 392, -252, -389, -182, 103, 128, -19, 215]
5384B15m12J052l84J54j199N15m79K69N11L11o49O57l39p53M97l5j67n99J138
5403C03K8j71k58K37l10J05M93j184J312m0K02l08k32j21j98L6k17J26j81K47
5423a31l27N9J73L19L90o6k77O1j14P48j137K59K27K04p62p0N89L43k07K23o51
5444a47m1l71O91j57L27j68j097J141J89j92L11n70M2o8k22M54k22N21j249K77
5464e51m45O54J15K47J8k21j85m60L66Q16K25o82m85Q72j34K77n63J53M02n60
5484a41J648j819K50j68j49L60J42m02J40J04m52O04j17k88M88qm37jJ147j037
5504a36N20j332N66M84l80J51k14j38K50L7L87o08p3O46K45j167M64N52p37j26
5524f09R49qj227M63j53Q56m54L22J3K27q07L55J56n4M40n12L87j0J82l75n6k41
$$ y = [215, -197, 855, 471, 625, -574, -59, -538, -269, 242, 553, -96, 561, 222, -531, -34, -69, -236, -835, 303, 331, 160, -98, 139, -171, -66, 427, -757, 555, 515, 717, 409, 177, 56, -142, -106, -323, -197, -378, -131, -458, -399, -226, 93, 483, 417, 140, 201, 87, 835, -302, -43, 184, 388, -374, -444, 145, 488, 281, 504, -147, -188, -559, 132, -25, 302, 134, -963, 178, 367, 175, 486, -84, -42, -110, -332, 122, -100, 421, -828, -551, -996, -342, -227, 20, 38, -183, -368, -828, -462, 354, 579, -103, -588, 284, 150, 427, -136, 17, 419, -141, 1507, -312, -62, -230, -379, -19, 123, -279, -139, -35, -487, 117, 0, -288, 200, 192, -245, -246, 901, -136, 384, -948, -382, 102, -278, -127, -341, -479, -229, -192, 195, -413, -486, 160, 405, -762, -298, 254, -483, -609, 340, 332, -895, -432, -585, 271, -183, 139, 152, 379, -428, -73, 83, 29, 469, -43, 344, 334, 516, 141, 85, -156]
5546a56j72K4K34K01p45N14k04K39N37o04R25j41k16j356O67k76J061l52l46l01
5566d67P83m99L12J61M02p77L23l46m34N71l5m41J03O68Pj37L60n57m34O42O3
5587B68K42J50m48n46n61O63P34R5j024P65J06n30m39Q73j31n12J103k68p32n64
5607g56P17N32o52j94L85o3O1L7m38J289j367L71m7K28m63P14l89k51n3m7L07
5628g9k32m12M97n09J84M97M22o24R32o17J81J59o19M65q7N54p29M0l07J59J18
5649gK09M7q14L05J099p41m22m79J94O00k28j02M40j33l16K49l50J2J403o17k14
5670A35l01P0l09J77l50R48n14L05k58M52K71k87n07m91L6P91K67J64o99J75L06
5691C81j76k38m42m29Q75k68n54J139K16p18j39o09J094m83L87K41k88l74m36
$$ y = [-156, -328, -304, -70, 131, -614, -100, -304, -65, 472, -132, 793, 652, 436, -920, -253, -529, 532, 180, -166, -467, 316, -183, 129, 290, 692, -85, 238, -108, -542, 29, -6, -447, -344, 324, 331, 194, 554, -3, -437, 205, 268, 510, 660, 212, -334, -895, -232, 502, 597, -427, 338, 444, -86, -525, 348, 217, -295, 808, 540, -192, -756, -39, 493, -159, -353, 32, -31, 30, 67, -371, 918, -449, -78, -125, 103, -360, 354, -35, -286, -339, -386, -79, -311, -723, -226, -735, -551, -54, 368, -256, 676, 59, 240, 399, -220, 245, 158, 712, -17, 23, -284, -125, -7, 202, 249, -565, -260, 839, 98, -324, -803, -609, -9, -237, -339, 101, -32, -348, -99, -449, -437, 966, 349, 135, -166, -96, -405, -228, -578, 370, -144, 161, -97, 355, 626, 339, -168, -659, -623, 168, 435, 599, -100, 75, 381, 205, -33, -475, -904, -29, -297, -851, 288, 504, -214, -353, -962, 132, -351, 36, 277, -11, -385, -821]
5710h21J144k57j149N81j15N56j06M56N79n50J68l47K79j47k56L60o91l24K83
5729c57j50L40k34O86n91m7J14j77J383r74r2k90N00L90o01N85l82L38k68q9L9
5750A23R42j468L94J14J77o43m60J9O40N1L68n79L72J47l31K20o27J124m20K73
5770D36m55JL98k22%P04j208J83K68o25O46M12q47L12L12J79k17K63r02J50L94
5791A82l93N72l52K05j07l40J93J64j18N90p1j097N99j37N38N7j082J50P51j72
5811A32r06J000K93l67o2k0n9k9J52j74k43M73j127M00Q02q00P53m86N02k95n09
5832e70J057p54M10k49N2j5K08j29q47N81J16K55k05J96K81l80J17L9O79j047
5852b05L7j84Q01l0o44m59J307r36j77O05J4K38j80k96N9K3KL6O0L16o76M81L18
$$ y = [-821, 323, 66, -1083, -502, -617, -61, -167, 289, 868, 318, 486, 139, 418, 271, 15, 375, -316, -640, -357, -507, -167, -401, 285, -306, -353, -239, -416, 967, -7, -99, -389, 111, 501, -100, 485, 103, 441, 173, 84, 123, 1065, -403, -9, 105, 282, -361, -821, -802, -162, -111, 257, -322, 50, 197, -134, 86, -541, 583, 163, 436, -19, -18, 380, 158, 158, 862, -346, -163, 105, -520, 126, 538, -309, 3, 315, 494, 277, 540, -362, -212, 182, -211, 361, 9, 214, 107, -233, -40, 124, 6, 596, 525, -572, 27, -110, 428, 485, -597, -447, 304, 132, -774, 226, 519, 152, 90, 70, 11, -18, 134, -40, -283, 190, -937, -537, 265, -535, 218, -268, 234, -61, -570, 487, -267, 143, -106, -54, -69, 139, 10, -837, -256, -140, 115, -90, 106, 387, 7, 124, 163, 842, -205, -168, -352, 449, 419, -225, -684, 623, -313, -490, 115, 129, 367, 187, -109, -50, -27, -25, 11, 71, 387, -289, 192, 510]
5875E10p42P59n70l79M05K76p09J82Q19m95j01k93L51l71K99l77j94J57L64J297
5895A188j313K56k13K00Q38p95k03L63l70l88r2M6J17j10O09l44Q8l18P62k11
5915A10o05N71m25L51r9J36j05J58k76L68j12q3J44J99n09m0n88N13k42M11M22
5936B99p01m20Q31N4L92l06M2n63M78R5l84K74P68q28k01K4L05N4J55r02O98k10
5958d6j05QM98J67o91j6L72J05n14l04j87O50o7n16O21Q0n6N66r84R85q51L50
5980F5k68N10m13l42J61J55k56P91n78k38J72M73P5n46Q10o8k47J33k50k47j47
6001b55m1M74k29j97O86m29P78r61K99P95j634J251o9n4m21L65n30J29j11J66
6021A2K22R66j054j13r2l38J342r45L5l85K73m79J95j10O89p56K76J279q95K1
$$ y = [510, -232, 527, -43, -422, -17, 259, -450, -268, 551, 56, -45, -338, 13, -358, -59, -436, -630, -473, -109, 1188, -125, 131, -82, 118, 956, 161, -42, 321, -49, -437, -529, -483, -366, -476, 133, -211, -123, -441, 321, 110, -495, 76, -349, 2, -97, 39, -66, 92, -184, 184, 72, -11, 133, 332, -177, -217, -805, -292, -534, -123, 299, -402, -822, 9, 63, 455, 149, 191, -372, 106, 201, -183, 91, 859, 31, -170, -146, 159, 213, 368, -534, 164, -46, -151, -143, 355, 522, -169, -185, 187, 292, -222, -526, -713, -63, -130, -646, -25, 55, -1, 565, -419, 566, -285, 65, -203, 307, -106, -448, -287, -132, -388, 403, -175, -413, -241, 232, 307, -239, 571, 503, 256, 389, 139, -108, -255, -296, 178, -51, -248, 438, 9, 787, -174, 125, 920, -714, 537, 468, 414, -7, 358, -172, -43, -154, 12, 234, 1200, 146, 33, -59, -397, 945, 0, 35, -350, -77, -556, -361, -471, 218, -538, -262, 1017, 122, 143]
6041A43M59j083J071o58n17J25J5L45k61J62K95l78N42q93M74O75p10N83l85k9
6061b5M20j17n44m8j98Q40P1o85M55k38n3L55q8l7L08m39L38o37J50K92M89j041
6083d32J36K53J72M53q56j82P03m68O55n40k71N7Q56r52k08O95M2K73l53n02O45
6104A76l70M00L2l76j05K05j3p6o84L61M52L3J2n64O02j18P23p20J305j892L37
6125b80m2n2O90L70j051L94m71L42j90K28j03J21K96j50N81j008L02l18j14J124
6145F69K4q57J57j5j68m33M33O62K49q18P89p92J52l69l73P52k84k40N34l53N32
6166B51m12M52L02n48M20j55p76M95l19L87m45o32J247l8j93jJ10Q17q64j77J01
6187B2J14m62Q44n44m48J91O96J16p18L73N65l80O06j307Q50j118Q98L9K1n20
$$ y = [143, 602, -481, 590, -68, -585, -460, -445, -100, -361, -199, 96, -282, 260, -633, -159, 516, -194, 389, 4, -25, 395, 278, -266, -314, -512, 328, 399, -286, 169, -69, -122, 233, 145, 108, 416, -23, 315, -322, -172, 120, 609, -432, -296, -43, 129, 582, -274, -456, 247, -221, 434, -106, -377, -320, 536, -416, -624, 71, 113, 386, 33, -469, 176, -194, 206, 238, -138, -243, -38, -51, -127, -811, -450, 2, 35, 47, -517, 85, -33, 690, -30, 1275, -617, -280, -322, -374, 316, 686, -365, 29, -442, -100, -290, -62, -165, -44, 252, 102, 683, -325, -23, -341, -455, 669, 693, -164, -7, -22, -190, -623, -190, 472, 721, -97, 692, -100, 52, -317, -690, 62, -222, -462, 72, -281, 251, -161, 291, 593, 45, 465, 310, -466, 29, -290, 97, -348, -980, 267, 229, 36, 35, 145, 962, 98, -79, 22, 136, -326, 518, -26, -474, -283, 413, 529, -189, 184, 749, 369, 975, -332, 518, -600, 298, 337, 358, -162]
6207a62l15K45L23k00K68J77o63j39r0N10L43l38P46r64M98j30K67n54n70O17
6227a31k54K42l63L12n25P57j88J99M93K33j186J87M02Q0Jp27m8L61n0M72K18
6248D85N77j131Q95m05p62L25M97j088O89l7n26o6J62M42o76K41M77P2j12l3O3
6269H9j72K97l66J247j279N81j258J215m13M1k31l37J096k94L19k38n64j55P00
6288B78n39L68J14p73Q45J81o17m01L03N59o40O66J67k56m94K61K42k54J49p11
6308e52N53J4M53j311J058K90j621J824J84l31m06L3m48K8l49J023o69Q12j89
6327C96j57K0o54O97O95j085k36o7O60K0l00n57N74l02P10n81J00O92k56n21m14
6348e66K92O9j04R9N01p12J020n42r96R77n23l43J201j075O71O56k72O0n47J15
$$ y = [-162, -477, -232, 91, -109, 159, 336, -327, -466, -556, -46, 297, -41, 705, -259, 239, 109, 376, -178, -748, -131, -385, -143, -506, -194, -719, 38, -150, 49, 542, 775, -411, -224, 178, 258, 259, -468, -516, -155, -205, 267, 485, 1062, -69, 826, 421, -341, -16, 481, -607, 82, 45, -481, -547, -385, 57, -619, -378, 99, 171, 59, 26, 89, -83, 214, -152, 1095, -184, 397, -861, 354, -59, -18, -249, -586, 510, 216, 535, 297, -267, -422, 278, -261, 107, 221, -552, 293, 474, -143, -544, -241, 318, -322, 344, 511, 255, -239, 22, 264, 10, 159, -552, 1, 15, 468, -843, 215, 505, -1116, 708, 892, 561, 155, 188, -260, -232, -581, 442, -227, 585, 396, 239, 259, -395, 302, 997, -88, -324, -391, 269, 289, -11, -568, 6, -296, 414, -167, -67, 625, 369, -152, -566, -274, -205, -309, -210, 291, -421, 599, 57, -939, 38, -485, -828, 373, -702, -31, 625, 353, 413, -134, -19]
6368a9M95o01j76J45p3J1j63Qj0Q30J30j3j114M47j87P94r35J43k36RP16l13L97
6391B85m86J34j01M2r6J62O41j218O40K31l69l21R18n36j01L47m12M79k63K81
6411B57o56J282p09l11J25M90j236M33K31m25L00M67k01O11n34O9l71M55j79l46
6431b48Q83q42o68O87Q23o35l94L67o26P46J33n03O82l96j62J36K48l64K40l19
6451b12N0K86O25o55k06N40l81l40N2m3L55M59l66M73j387P71m49N94j91l4K07
6472A48j158J106q13J156l40m47N75j21n2N03p36l59N64j63Q17j214R47q18J099
6491F94l50m08O18L56q77J79Ol83J93l82J45Q7L68k55J68J32l50J84r4M33j91
6512B73j89k00n08n5O88m11j95K03O37M8k37k18O24r0k13n97J07N62o28J043k70
$$ y = [-19, 476, -125, -301, -156, -229, -218, -381, -373, -383, 447, 577, 564, -550, -103, -290, 504, -431, -288, -524, -515, 201, -112, 285, -201, -67, -168, -126, -222, -60, 581, -637, 3, 234, -135, -456, 462, -74, -175, 172, -240, 239, -24, 257, -399, 883, 174, -137, -12, 478, -758, -325, -94, -519, -219, 248, 47, 658, 124, 193, -178, 277, 98, -248, 635, -207, -875, -188, 635, 0, -394, -27, -653, 93, 226, -277, 405, 9, -153, -17, 231, -133, 107, -212, -162, 124, 749, 94, -112, 428, 47, -293, -241, -284, 71, 530, 164, 637, -750, 21, -428, 166, -25, -59, 148, -1010, 96, -717, 439, 99, -348, 227, 106, 54, 557, -179, -538, 26, -137, 680, -534, 413, -405, 694, 344, -64, 554, 910, 33, 212, 218, -165, 28, -354, -209, -122, 246, -9, 159, 291, -59, 125, 31, 464, 273, 84, -116, -624, -679, 9, -402, -597, -394, 243, 291, 54, -164, 460, 370, 157, -440, -333, 229, -399, 644, 374]
6533C74m66n7k77L28q5l28O18J78n32O84Jn86K86m36M98L14q72j37L38kr63P36
6555c86O5L26J99n84K78o02O19J92p38N83l16O32o24K68M43r07M81N20J27l66
6575B10O30o22k6m8j13j14j85m29L27K12L36k64r42J108P20m50l52m05j64K42
6595c29O69l38k22k55j6LL06J07NK81mL1L52L08q48n41N14q37J125l98l73P92
6617C32j116P14l3K76k65L64r18L81P37K19p85m62J010l98j63L12j55j99P26K60
6637H37r76m9P61m26K0J23k7l26q7N10q39J12J37J51N41m52P16j188M70Kl47K72
6659f5m48M93N05j18j068Q9P76l77L62J98l97L14p1j04K74r32L57L71o46N41p0
6680a6j11k62K27K30Jo49L34Q0o7K49l66O64l2k42k12k75L46K46P6k64L19l89
$$ y = [374, -92, -149, -426, -98, -183, -511, 107, 285, -247, 437, 438, -148, 138, -298, 200, 514, -358, -495, -157, -159, -1122, -386, -321, 5, 204, -380, -102, -704, -85, 107, -631, -48, -364, 268, -356, -88, 355, -552, -71, 449, 576, 210, 840, 218, 192, 144, 31, -83, -268, -697, -370, -158, 178, -86, -1028, 80, 800, 350, -2, -407, -571, -329, 340, 2, -220, -475, -491, -488, -182, -75, -70, 211, 207, 238, 590, 898, 50, -491, 23, -814, 311, -87, -460, 332, -784, -70, -103, 173, -92, 272, -646, -265, 472, 691, -94, -556, 454, 56, -107, 205, 50, -149, 577, 837, -139, -188, 573, 147, 167, 290, 263, -63, -150, 360, -479, -367, -230, -79, 462, 10, 726, -462, 8, 10, -337, -65, -513, -20, 485, 367, -701, -612, 164, -213, 149, 347, -50, 264, 193, 89, 363, -569, -212, 159, -487, 54, -16, -127, -389, -162, 68, 69, -580, -246, -166, -233, 16, -350, 314, 282, 40, -172, -447, -101, 145, 221, -43, 276, -113]
6702a13P27qn71m11Q25R9r47J78LJ85k80N35j94n03nP96N6k92J81n05Q92q88J196
6725I56p43q84N16R9l04l72O70P32j230O73m02J653j881K94j60q0N13N69o74n41
6745e96n0m63J159j002J304K73j030L9L92L30r72P06n34O76l13p24J256L9m26
6764F4n41Q86K10m80K00m91O94q27J04L15L00j7l08r4O70r59J40L02k77K47k77
6785a39P84l86p80M76K43q72N16m76Q19l63N41l38N49r78O89j81L29K95j025Q57
6805E60q52l46M76O35n98M40j86n2K50q4o60O4L17o40O05j07J97k27n65J84P31
6826A42l26r29J479j25K28m85k16N90l33o3J88o94k44L72Q26j016J69R0L40p29
6846g36R31N03j171N58M55j376R77kl14P91q44j050N84L01P62L5o4k99N58l15
$$ y = [-113, 614, 606, 35, -376, 449, 548, -399, -221, -218, -33, -313, 222, 28, -475, -480, 316, 372, 80, 261, -244, 648, -240, 956, 213, -671, -155, -56, -360, -732, -62, 670, -560, 113, -289, 1364, -517, -223, -383, -463, 50, 619, -55, -596, -646, -1109, 50, -952, 352, 625, -405, -366, 26, 356, -616, 90, -444, 232, -81, -805, 451, 490, 64, -477, 409, 619, 139, 339, -152, 542, -285, -181, 134, 434, 417, 109, 15, 685, -274, -134, 168, -109, 138, -139, 645, 259, -521, -45, 198, -674, -158, -634, 185, -178, 363, 25, 574, -404, 285, 104, 433, 728, -297, 560, -292, -638, -162, 473, -125, 315, 129, 77, 327, 243, -417, -353, -36, -676, -71, -178, 19, -208, -773, -589, 142, -184, -1113, 366, 241, 469, -16, -232, 358, 25, -38, 150, -544, -788, -416, 410, -606, -437, -347, -7, -736, 195, 698, -473, 85, 540, -836, 141, 139, -175, 616, -228, -1278, -694, -393, 369, 404, 340, 41, 599, 284]
6866B84J33k26n04Q3N53l05j246N92r9R53o57j51J218j256Q73K83l55m0K32p04
6886c39JQ13j030N76n77M21J84k44K89J43Q55j336k47P56k14mj95M84j117P63
6906a8K13n9Q0o87K82N51n87P12j80Ll47L64L86o42K87m22N04j051N03k13M27
6927A06k58M12j16r2j28l5p8m01m40N30n60J75J101o4p28Q72o90N23p95O79m02
6948c89M19K15k11J006j501ll2J00Q53r95L87O56q19Q46j027O85k15m04K60K59
6968I0m41Q11o77J51J095m38m25o37p8R11r22L56Q45o52k55J202j341K51P42j137
6988e49P08n80K60J81J88M16n59j17J36n49L78J94m6J05K67K56p62j05k92M23
7008d7j64M31n38L32Pl76K58J94J74j068J148q5L1j221L44M18N85j299J547r45
$$ y = [284, 417, 191, -313, -230, 323, 18, -1228, -636, -735, 218, -439, -590, 628, -628, 245, 528, 173, 133, 365, -339, -338, 475, -555, 21, -556, -135, 49, -195, 94, 237, 1092, -244, -491, 265, 51, 47, -148, 336, -781, -18, 195, 136, 216, -471, -189, 362, -225, 487, 307, 310, -37, 327, 713, 71, 358, -64, 440, -611, -108, -321, 106, -152, 260, 144, 52, -76, -111, -189, -590, -1030, -500, -1060, -885, 216, 152, -576, 296, -394, 129, -666, 13, -389, 30, 245, 34, 1040, -461, -464, -496, -396, 457, -538, -151, 505, -314, 532, -495, 190, -25, -429, -169, 90, -351, 460, -217, -66, 1029, 591, 166, -471, -549, 362, -560, -204, 641, -11, -266, 936, -405, -154, 588, -549, 159, -421, -161, 20, 208, 624, 65, -52, 84, -465, -87, 107, 61, 166, 433, 689, -73, -178, -470, -47, -211, 220, -318, 14, 21, -355, -97, 97, 271, -797, 351, 266, 297, -924, -580, -162, 423, -876, 671, -274]
7028b74J194k42j37j202P19N43l46n25P8k73K57M75o86M78l80J51M20m65N64p21
7048c72O80n78r0P52J31K50p99J86o5O8N11o46L02J40m14K17p41R11l56j01l27
7069c41Q48o71o5M17k47J40M78l80j02q53Q75q76J23M40O82j04p12M18N82n71
7089H1l10K2Q17o26k42P69j131M78k43N52j52n80J78K72l8L87J86q03M60l91K62
7110e2M68r19R96n95L20m56k6k38N1M74k83K2M86j13M5l82L78j97K54l75O42p86
7132b86R05r63O84o83M36k64L3P21m01K61m76M7k92k53R09k02j82M08m87M69n09
7153a25M04o56L33N98j174P21j54l72j98P51l83K86N6L21n29K52l84Q91o59P64
7173G43j046O35o38K11N40n65O85j002m56O45Q10p49M40K28l91N71j172N76J91
$$ y = [-274, 920, 678, 541, -661, 58, 601, 255, -270, -192, -465, -208, 267, -419, 59, -321, -170, 250, -215, 349, -372, 308, -270, -360, 392, 523, 773, -26, 160, 95, 163, 674, 28, 330, 470, 56, 273, -468, 443, 87, -14, -341, 507, -164, -229, 188, -59, 81, 559, 179, 77, -776, 99, -777, -654, -214, 468, 364, -348, 70, 652, 81, -229, -207, 610, -16, -258, 511, -620, -142, -385, 167, 15, -565, -387, -115, -153, 234, 420, -383, 77, -314, -52, 416, -503, 493, -102, 218, -238, -264, -502, -451, 23, -260, -238, 248, 135, 180, -202, 176, -21, 233, -142, 500, -286, 619, -344, 340, -343, 93, -171, -138, 583, 182, 443, -33, 14, -278, -531, 378, 176, -6, 402, -85, 384, -125, 279, -377, -44, 554, -620, 101, -53, -425, -623, 128, -255, 31, 87, 408, -121, 131, -253, 638, -21, 743, -303, 332, -306, -95, 445, -120, 565, -437, -893, -248, 562, -187, 253, 481, 90, 661, -511, 65, 256]
7192B56k74R6o86L00M74m36j09R68l07k91p4O59r87R43l87j001N04o4O32r99O64
7213a19Q8J37J00k64k73N7R5m25Q1J074k88J57k57N6o03P40J64j83m85k14J96
7234a66NK10j14J49l87k12O4J065l08n89n60O63K94j53N96n34m7j38m3L74n27
7255c58K27K83q11L99N5m54P61k83J0K01J48q0m73K07J82j73J96L23N1N27q07
7276A31l07N9k13m49N98j19N53n04L99o32Q29q26L54o97L45O3L98K8l08J471j333
7297a60k4R05o29M74j92p34N30n61N67K37j93o64N26L50j08o17J051p78m78L11
7317a87k58K44P63q76J486j071j54l78Q40l27J06J37r9O3k29K42l24J6J89m96
7337c13J41O8o8L77q84R68q65J047m43j79J91O26j52j216O39K63j16k87L2K85
$$ y = [256, -18, 78, -608, -308, 166, -270, -379, 589, 282, -9, -83, 576, -411, 532, 145, -856, -352, -416, 216, -783, -119, -31, 106, 206, -58, -331, -274, -179, -604, -523, 551, 263, 420, 163, 219, -384, 356, 520, 337, -148, -362, -166, -161, 49, -65, 84, -303, -515, -451, 614, 306, -283, -843, -180, 114, -39, 557, 23, -24, -162, -205, 169, -358, -131, 152, -659, -260, -205, -659, 102, -181, -171, 30, 178, 98, -375, -168, 14, -159, 37, 360, 411, 938, 131, -176, -117, -330, -779, -181, -300, 253, -251, 148, -484, 345, -481, -127, -824, -479, -416, -18, 10, -298, 1173, -160, -184, 721, 92, 566, 374, -360, 170, -391, 176, 413, 220, -444, 82, 432, 324, -293, 758, -20, -498, -187, -445, -201, 562, -314, 1172, 101, -53, -431, 409, 82, 188, 325, 226, 289, 60, 302, -22, -6, 183, -313, -172, -104, -172, 205, -679, 289, -576, 471, 28, -151, 40, 666, 514, -702, -63, 200, 84, -203, -171, 114]
7357A14j78Q02l48J97j077K15j04O03n5K13l20l03J150j218J056j026P6Q19j61
7376D55m3k63j74k29k49O81m2n01q3P49p24L03M59o51M14R9N4L51j006N2m4Q10
7398D18l87M04K11r21m1K54L68K59k4p63N31n31j27N54p38K17Q0J40q0l3J01p64
7420h72R23Ql37M24K99m14L3P5J67p85J49Q1r0O65P2m79M21J8j0j72j57R5k02
7443h8p1N36n25j13K6Q74l79j6m79N3K34j69o56R29m38N80n39J97l09M0K08k6
7465a31J60J66j54p1j47k00K31L2k27J93q6K74k39J57O66m98o94N64m72Q14J39
7486D77n20l18Q47j09l05j62o3M51o77P25l31k9j81m37L95k39N37L90j48l6J02
7507C69Q7k37K90r54O41r9K04m27m4J58j57J16l22L28L26k1M79j355J119n64p24
$$ y = [114, -64, 738, 390, 587, -490, -275, -379, 224, 169, 382, 62, -241, 909, -309, 747, -279, -203, 616, 455, 412, 149, -25, -254, -503, 178, 136, -365, -448, 301, -423, -120, 339, -312, 102, 201, 255, 606, -400, -348, -392, 418, 31, 435, 646, -275, -316, -62, 306, 565, 541, -222, 309, -222, -349, 205, -533, -316, -236, -96, -176, -209, -108, -872, 51, 59, -278, 146, 445, 31, 64, 139, 306, -479, -330, -249, -339, 326, 398, -81, 340, 358, 348, 176, 19, 114, -88, -159, 377, -148, -261, -235, 639, 260, 244, -235, -182, 52, -117, -773, 156, -282, 298, -241, -44, -353, -313, -105, -131, 29, 195, 41, -30, -177, -377, -146, -114, -341, -148, -234, 40, -199, -42, 624, 126, -568, -4, -476, 338, 477, -43, -361, 486, 377, 72, -90, -153, 298, -379, 346, 15, -14, -195, -632, -237, -476, 61, 451, 303, 267, 369, 456, 219, 509, -445, 196, 97, 301, -126, -170, -12, -169, -53, -375, -47, 279, 258, 737, -618, 501, -63, -787]
7528g87O77J02K72l96K64j83o73K52M14K84R1j54M90m28O5J8m49J20o08J151m39
7549H3K05N5n29L62n83o87R62K00N4K73n4J28r96M30j45l3O4m8L17J04J02l44
7571h0K22K22k7j304P77J16M17q73N51P40j515k67J472q68J06R43j23j061Q56
7590C04n62l30M08k67m62L79P73k12j78j59O89K16q11P64k19j61M47j31p06k99
7610e17J74RL04k13k69K27N32J39j14m03J48k79K30K04l67O55J10j041P29o15
7630c57M1M64J29L34l52l41JP65l04J9j232N07L49k88K44Jj9k22O43j44p97K54
7652c05j85N03j32R2N27l98k83M25l51j08K69k08L49q33N66K3o0J25K7J95P6m
7674C10k54j02k06N10k98J24Q60r09J40l17l79Q35l91l82J24O64l78lp80J272
$$ y = [-787, -110, -8, 264, -132, 132, -51, -724, -472, -58, 226, 317, 163, 653, 225, 290, 308, -141, -21, -629, 522, 83, 288, 343, -186, 176, -407, -1094, -132, 68, 122, 395, 341, 469, -527, -97, -242, -275, -211, -259, 58, 162, 264, -80, 142, 364, 337, -967, -190, -74, 343, -530, 21, 761, -754, -1021, 451, -417, -311, 632, 509, -552, 304, -258, -588, -180, -447, -909, -530, 243, 31, -147, -306, 383, 599, -212, 552, 333, 172, 619, 488, -218, -517, -343, -334, -30, -243, -512, -285, 247, 386, 272, -131, 17, -262, -32, 172, -195, 460, 570, -471, 258, -357, -316, 148, 277, 611, 259, -82, -81, 684, 380, 399, -833, -326, 23, -265, -21, -20, -39, -261, 382, 238, -559, -305, -490, 13, -119, -27, 500, 102, -181, 244, -107, -215, 54, -154, 195, -638, -72, -49, -109, 16, 43, 238, 314, 310, 56, -46, -252, 258, -40, 84, 944, 35, 175, -142, -521, 314, -77, -459, -335, 329, -49, -52, -832, 440]
7694D40j245J269k79m76O72r92M32P22n16J14k54l00L83j12N32j042O55m15M60
7713D8K45o23O62m63m53N02m67P53M99o74J8K06j04o0m53K45lK12l80J13M73j49
7735A47L9r35J046j44J44J35k77k09L98m12o98P09o72P57Q85j669R31o08N28q02
7755g07R88R5M20r97j96R86k45o98j16M37m12N70R1q59O98j56P38r38R01j59J0
7776D51m85l10J73L92k75l6N6o55R06J50M28o44o27P70m95L04O14r23k40O05p07
7797e48p8K95m16J107j125N99N65R0p74N37q11P71m79k7k43R47J65l39R88j325
7817a01k54J4n62J132k83j44M96k89l23P06l07L4J9o14M79k72j9J27j80J080j254
7838e15Q66j94k3m64K07M81Jo6k59k99k82Q52o01QK11l6P38j094L14p8J47m7M44
$$ y = [440, -805, 464, 185, -291, 381, -611, -179, 543, 27, 141, -113, -413, -30, -142, 390, -652, 3, -412, 48, 293, -330, 332, -131, -584, -82, -549, 204, 703, 29, 47, 253, 149, 89, -364, -119, -122, 90, -290, -177, 296, 147, 186, -749, 297, 153, 297, 432, 155, -54, 344, -68, -766, -57, -729, 28, 913, -756, 175, -433, 95, -707, 281, 376, 796, -201, -397, 589, 344, -354, -470, -33, -445, 125, 216, -643, 55, -101, 637, -301, 600, 441, 451, -34, -344, -171, 221, -54, -90, -34, -689, 217, 367, 795, 151, -476, 294, -201, 103, 717, -206, -446, 159, -548, -626, -331, -747, 360, -765, -166, 399, 489, -285, 252, -559, 212, -267, -294, -537, 410, 575, 236, 1224, -101, -355, -341, -903, 229, -54, -198, 298, 9, -314, 392, 85, 119, 138, -476, 3, -269, -288, -161, -341, 739, -515, 351, 157, 134, -330, -123, 358, 359, 293, 34, -265, -547, 305, -296, -288, -77, -113, 625, -469, -155, -233, -86, -133, 311]
7861C11n12M62M1o24L38o0Q37n73j00l07l10J160o7p15K43Q1l00K93r2l5J22q93
7883g00P60J15n87K47K03L6J91j61n94Q50k87N14p99j70P30k29j93J45J97q13
7903e45J31O11l01k85k8Q50j2j75j63o8l00J28O02m87L42O98j163J15N3q63J122
7924B62k55Q17q50M50j15m39K98J35j60K43m81j36N26J04j26m63L85q7k19K76
7944A65J39O2n4m09M38M98j108j1L48N2m1o57l23J217q6r47L16Q51m03M9q6l26
7966c16O85j118J127k19l90Q04p85k24O03p06P91M43j164L55J69J61n19Q7N54
7985C38o34M46p09J87O87n1l20L08L13n05L98l92n6j50J72M92k98j87m47P33O12
8006I37r12j07K93J4j53j24p93L05R22o48L8P16j68K0l4p13R8O27J3l82R5m21
$$ y = [311, -201, 261, 302, -322, 16, -44, 793, 220, 120, -187, -497, 663, 596, -119, 124, 205, -95, 198, 106, 71, 193, -700, 60, 175, -412, -165, 38, 74, 265, 104, -490, 360, 73, 587, -212, -382, 348, 119, -74, 71, 268, -545, -414, 197, -104, -389, -417, 433, 421, 246, 83, 15, -285, -157, 445, -42, 300, 998, -165, -50, 3, -860, 262, 7, 824, -26, 424, 309, -130, 168, 303, 143, 386, -95, -231, 295, 399, 273, -190, 195, 108, -111, 165, 304, 366, 312, -97, 341, 839, -269, -280, 68, 120, 79, -578, -901, 316, 230, -717, -401, 450, 47, 96, 10, -316, 369, -749, 378, 159, -231, 573, -212, -436, 167, -539, 252, 695, -469, -114, 55, 216, -303, -216, 338, -296, 150, -559, -372, 315, 264, -56, 252, 565, 60, 458, 66, 10, -140, 32, 524, 226, 39, -408, 325, 937, 25, -82, 211, 225, 72, -52, -845, -540, 382, -266, -228, 488, 320, 340, 306, -407, -309, 318, 331, -51, 44, -377]
8028c77L01R4J4j55J28L97q55L51J91r7n0K32J49Q3k18p67M03J15K63m9j83k03
8050b33m7M47K6O03o00o52m79J058j013Q64L90m20J56r9Q62j223m09Q93j20J92
8070A96Jl54P2J14j05p7M88O64j190k60J771j025K42m91K0K8l21L63k3p44L77
8091b54L94J09q8j263Q58k43K26o2P95l91J04n10R03p79p7K07j8L99n16l23P69
8112B40J97m03l93Q9m0M25m35j61M16QP07q53j83M98Nj19L92r79j94J123M7m70
8134h3j07L21l05P6q0nL69n39P38q35N33j44L16l57m1M3%M0j1J89N50j051M8P98
8158D63p39P1oj02M75j49M6n3K27Kn38j03K48J65K34n72J63R0K1J11l30R4N53
8181C71%p79k12j20R12N56n33J17o03O04
$$ y = [-377, -76, 18, 32, -123, 5, 402, -453, -102, 89, -8, -58, 174, 323, 406, 188, -579, -176, -61, 202, 153, -30, -233, -280, 167, 193, 796, 196, -456, -935, 123, -890, -26, 364, -56, 100, 1, 863, -360, -769, 124, 4, 196, 197, -157, -85, 29, -76, -153, 335, 999, -191, -451, 1320, 295, 537, 46, 66, 94, -227, 136, 113, -631, -254, 140, 249, 161, -1102, -244, -487, -261, -323, 472, 81, 185, -325, 578, -201, -278, -71, -89, 310, -206, -529, 240, 437, 34, -359, -270, -310, 115, -320, -481, -65, -57, 650, -203, -386, 112, 117, -2, 390, -589, -783, 340, 387, -83, -190, 131, -174, -98, -178, -183, 186, -353, 385, -450, 83, -61, 255, -102, -143, -100, -100, -60, -71, 118, 668, -383, -335, 463, -276, -205, -211, -313, 162, 13, 59, 6, 233, 235, -303, -406, -158, 7, 241, -331, -168, -78, -57, 54, -276, -182, 371, 371, -408, -620, -740, 172, 728, 195, 312, -291, 313]
8191C13
$$ Imaginary data points
##PAGE= N=2
##DATA TABLE= (X++(I..I)), XYDATA
0@%%%%%%%%%%%%%%%%O4j28J28j28J28j34J98k56K58l22L84m48N14n78O98p84Q63
33D57r78J111j265J439j610J800k015K243k495K770l067L392l752M145m574N039
49B640n549O114o735P419q182R036r996J1081j2315J3746j5423J7418j9836K2830
63A2248k6673L1807l9035N0103o9286J11951m13122K11893L64167o11986J66629
74b11304N07685k14979l44325M42623J34145m02490J546L47042k03789k54852
84a98698K25979J24097k82062O081K44082p5673j73410J69504R2635j83782k1413
95g2660J71636q2425j48090J18125O8842j67731J1144J71034p3076j06492J73205
106F3512O3209j73420M8858J75239j41610j29533J76964J0025k29475N4972J72764
$$ y = [0, 0, 0, 0, 0, 0, 0, 0, 0, 0, 0, 0, 0, 0, 0, 0, 0, 64, -64, 64, -64, 64, -70, 128, -128, 130, -192, 192, -256, 258, -320, 378, -406, 457, -521, 590, -675, 764, -846, 954, -1061, 1182, -1313, 1457, -1610, 1782, -1970, 2175, -2399, 2640, -2909, 3205, -3530, 3889, -4293, 4743, -5253, 5828, -6487, 7259, -8164, 9254, -10582, 12248, -14425, 17382, -21653, 28450, -40836, 71115, -342007, -130114, 234053, -377933, -211304, 296381, 81402, -262923, 179700, 313845, -88645, -87099, 259943, 56154, -198698, 27281, 151378, -130684, -124603, 119479, 43806, -129604, 39900, 132535, -51247, -72660, 98976, 16551, -131539, -13414, 55428, -112303, -101159, 69875, -3201, -109693, 63512, 126721, -46699, 2159, 177398, 35788, -93745, 83219, 93244, -136231, -81259, 91505]
117I1505j53910j10922K08744L8107j90484Q2789J91182j25535j07107J77363
127A01732K6556j99689K5429J40971j21193j22559J36836N1287j47464K8317J62713
138H2936n2641r5828J27083P0788j37140j0754J22120o8406j21033Q1844M0939
149C9908j26118J035J13984m8920o6463J05465M4816r4335K6799R4237o8770o5247
161d3609Q4581J218j07629K8116P6418p2236m2461J01433J5781q1872M5366Q4646
173H9752o5178n2044Q3222R40j08858J5598P1759p3567o2340R0318K6474q9898
185g3822L3750J08292m4319n6371R5746L2465j04399L265Q1316o7687q3728P0327
197e165K4388r6164J2185R4374l6926m8909Q3724L6775p3624J2326O8554m7400
$$ y = [91505, -62405, -173327, 35417, 73524, -116960, -34171, 157011, 31476, -75631, 101732, 128288, -71401, -45972, 94999, -26194, -148753, -11917, 39370, -108094, -79777, 82936, 30295, -65533, 61550, 132338, -4802, -15556, 106564, 38158, -82875, -1031, 39908, -86210, -85175, 28809, -20111, -86574, 18891, 63707, -30628, -3829, 90408, 21638, -43609, 40972, 42190, -65439, -37323, 39095, -33141, -75602, 25831, 41612, -40260, 5106, 89752, 24574, -27470, 55752, 56692, -52166, -36568, 35191, -38376, -100716, -10398, 16076, -73822, -40072, 68220, 23901, -32470, 63276, 95741, -8658, -5393, 75923, 8236, -75492, -5165, 19223, -76941, -64756, 29618, -7308, -56217, 27507, 64282, -9342, 2984, 71538, 24138]
209B4138n7207M7441J0200p2545Q03N3766k6221l4772N3600L0704m1496J2748
221A159N5402k4630l8052L6910Q737o1170m345L8915l5613l8405M8508K0620m6491
234c8455J9465O2168k5345l0819N4250J2793o2806L076M3705m4585m7297M4510
246i340J1473n5433J5209N8466k2337k5130N8405K1994m9739P792M2541l5843
258A8058m5636L0595O831n3975p24M4383j7690k4994M4409K7947l0847O488M2704
271D7549j6188l4063K1614R070m6395r461K8873j9446k8549L1526K2612k7560
283b0418J0990M1631q640k2598K7407J0482l9825o690K3208k4535l1748K4658
295a6078J1054l1081J0032M0737r907j4901L5511J5793l2305Q92K6497k5026l4299
$$ y = [24138, -33069, 14372, 24572, -47973, -47170, 6596, -19625, -54397, -797, 29907, -11589, 1159, 56561, 31931, -6121, 30789, 39526, -21644, -25989, 12926, -22687, -61092, -12584, 8036, -38455, -18990, 43178, 17833, -12986, 41264, 54057, -8749, -5673, 38032, -6553, -53850, -9340, 2133, -53300, -38091, 20375, -1962, -27092, 31313, 53307, 3568, 11360, 53901, 18058, -27578, 3017, 9848, -44127, -44851, -468, -18158, -43152, 1257, 29204, -1643, 4845, 47549, 31361, -2702, 18912, 27982, -18413, -27874, 999, -18447, -46996, -15470, 7142, -20418, -9428, 32203, 23563, 965, 28372, 38854, -971, -7661, 15547, -8988, -40736, -16078, -5024, -36105, -26073, 14664, 4757, -10144, 25367, 41160, 8855, 9747, 36244, 11218, -23081]
308b3081J9764M710l8763L09L3761r286j6006L2492K2028j9493M355K7420j3043
321B5167k5046J2154L192l3228p339J9200j0114j9138K2844J8149j4294O176K8739
334B6462m307j6425J5574O197k7574r740J4609j5327k2138J3800J1927j5702M240
347a8404K9535J363j0615K0070J3254k1979o032J4407j5388k5983P613N847k0975
360b7287j750K2517j6q578K0494J6743j0605k22J8049r025k0747M521K218k2578
374a6266q269J3013l395j0887J4875J8069o450K121K2090O71j5686N606N603k0876
388B19j1901O580o146j6140O757J2046n725K300K0079N301o008R028R902j2535
402A3757q513M983p677j7097kN775r692l346J5838N578l098R869J4260m570n334
$$ y = [-23081, -3317, 1393, -37370, -37061, -3300, -12586, -28592, 3900, 25928, 6435, 10790, 38210, 25167, 121, 12275, 15467, -17761, -25100, -5900, -16014, -35152, -12308, 5841, -8453, -2277, 26462, 22155, 5730, 21304, 27501, -73, -9813, 4796, -10531, -32669, -18869, -6942, -22644, -18404, 11131, 12494, 1879, 21949, 35203, 13224, 7192, 21599, 6211, -19772, -12159, -6312, -27287, -29037, -6520, -6536, -15114, 5380, 22123, 11518, 11296, 29345, 20320, -427, 4094, 6312, -16266, -24535, -11522, -14917, -25804, -10929, 7140, 690, 2811, 24901, 25572, 9886, 15492, 21095, 219, -11682, -5102, -11248, -27388, -20631, -8585, -14310, -12010, 8069, 13370, 7362, 16390, 26292, 13757, 5244, 10227, 2550, -14547, -14549, -8774, -18466, -21812, -5974, -396, -3494, 6375, 20635, 16065, 10731]
417A0731O602k559j6578l691K059j0878q519Q102K921n145Q264J6402Q16j044
431G483J3373M017j1247k755L679j3076j4379K870j859j0710K064J3103L07k23
445g353J4425R878n865M15R220o837j3630Q82l79j4255o153R204r76n864J0508
460f780J3157l310K202J3358O32r879K592J251j3737q913L555n273j0642N221
474a6566R342k950K693J4429N987m839N515O355r188q258L084n127j4357q51O768
489g963n579m287J3162P251l916P372J3469m086p183P372k715j7465k031M272
503b327j2171p953J0186L989o051R446J3108j315j23J1269J231j1406O47K814
517A1344j3728q535M195k648q874N372R608k679J483J3432M130o218K882P520
$$ y = [10731, 17333, 14774, -1804, -5495, -3436, -14314, -22833, -14731, -11810, -16955, -8691, 7711, 8527, 7483, 20856, 24873, 13626, 10871, 14550, 1474, -12905, -10035, -11894, -22604, -20540, -7437, -7130, -7353, 7072, 16950, 11085, 11500, 20720, 13883, 253, 1135, 756, -13499, -19652, -10448, -11424, -17288, -6780, 6377, 3067, 5269, 18627, 19259, 9380, 11972, 13223, -514, -9427, -5872, -11145, -21787, -16566, -7224, -10174, -7481, 6948, 12935, 8096, 13611, 19966, 10778, 2520, 5604, 477, -13880, -14731, -7963, -13542, -17829, -4667, 2584, -1332, 6040, 19509, 15423, 8240, 15612, 12897, -4568, -6599, -2327, -14498, -22451, -12265, -8276, -14327, -4881, 8227, 6912, 6789, 18058, 19289, 7883, 8530, 11344, -2384, -10919, -6724, -9372, -18246, -12874, -3266, -5945, -4462, 8970, 13100, 6882, 9764, 17284]
531A7284r329j0435M651k605j3882j787R658n306m382J5073Q943o810N934J4073
545B1080p116j0095Q069j072j6889l293P526j0702r820J3433N180r238Q386J7637
559A3086m527n407J5140L58j6859J670N076j3517j0372R967j042j1633O843J3894
573B677l836l037J5609N171j0811K625P940j1383j1025M529P6j4707Q74J0848
587d450m259n315J3816J0002q820L550J4341o335j1102Q498r6j8783k002J0366
601e89r798r875J5287O886j1004O459J8183o904o574J3333O32j7415N03P480j3667
616g063j0910J0838J964j1799P686J4504l828l006J4524L462j1927K184Q247j3340
630A536j0499Q227j581j3828K756J2557o352l610J5723O085j1032O375J1486j0681
$$ y = [17284, 7955, -2480, 2171, -434, -14316, -16103, -6445, -11751, -16133, -1060, 7883, 1073, 7007, 21080, 13964, 3869, 11938, 10866, -6023, -9316, -1790, -12492, -22312, -8879, -3699, -12937, -4551, 13086, 8559, 3152, 18292, 18650, 1791, 3461, 8537, -4980, -15352, -5385, -6427, -18060, -11217, 2677, -1159, -4196, 11413, 16584, 5773, 8398, 16338, 4955, -6070, -1541, -1465, -16172, -15298, -4450, -8709, -14024, -208, 9794, 974, 4524, 18865, 12530, 1428, 9926, 9830, -8953, -10955, -589, -10387, -20262, -4975, 1911, -9093, -2634, 15549, 8645, 2071, 15404, 16036, -1379, -876, 6604, -7063, -17973, -7135, -5171, -16970, -9284, 5220, 1392, -1614, 12910, 16372, 4445, 6629, 14876, 1536, -8963, -736, -2317, -16145, -13389, -832, -7184, -10794, 4929, 11014, -18, 6357, 17843, 7162]
644G162r185R656j627j7110J075J0440j0537p369J5157N195j0113P772J4567o913
658H170o353J1860j93j6409m30P351j0655j0782J1641L492j2716O674J6137m622
672C165o530J5832M786j5711J312J0533j3234j2567J0440N11j6059N256J5648
685C382q460m586J8626L806j2611N853J1168j2921q177J0066k798j6872L749R466
699c09r877m351J5587L016q712O805J2411o994o685R011j53j3391j030Q328r889
714f233q781J0109M586j0926N527J4300m960n396J2903M261j5824J590R135j2131
728a840j1233J1293O76j4003N671J3838q285k614J4925L118j1643O660Q927j2453
742C037q425J0091l334j4301L660P903p149k558J3499K481p068O348R510q304
$$ y = [7162, -2023, 7633, 6006, -11104, -10029, 411, -10126, -17495, -2338, 2857, -7256, 516, 15083, 8170, 1817, 13677, 13484, -2925, -3355, 3996, -6659, -17441, -5800, -2308, -15024, -8350, 7787, 3165, -3365, 12467, 17253, 1542, 2854, 13387, 153, -12414, -1974, -1463, -17522, -12266, 3382, -5078, -9664, 8962, 12768, 157, 6010, 17178, 4257, -3920, 6146, 3348, -13524, -9775, -309, -10186, -14537, 1050, 4066, -4646, 2159, 14570, 7576, 891, 9902, 9749, -3642, -4672, 3656, -6233, -15014, -4905, -319, -11245, -5718, 8582, 3622, -1774, 11129, 15390, -434, 1156, 10291, -1840, -13073, -1780, -1104, -15107, -9436, 4402, -3883, -6497, 8428, 11546, -97, 6563, 15490, 3037, -5388, 4703, 1369, -12932, -9272, -1369, -8518, -11076, 2423, 4904, -2164, 4184, 13694, 5390]
756E390n553R574k887j3165J092P056q269n750J0329K213q205N747J2425o414
770C583m499J1826Q7j2624K007O697j0338p058Q485L60j1347O895R623o080r44
785c327J1774J253q890M724N889r777o617P519k720j0645L282O923m949l619J2520
800C340K557q341O413Q502p590o297Q011k264j1685K549N340p462l865J0964O81
815H53q003O977R426n097m318P632j61j0467K647M643q172m964P097L84p273N015
831c781Q384m222k815R406J772p731J595N918p942n499N734j410q589K158O361
846f61l613k622R960K144n052K861O600n643m432N685j506j0603J975M415n376
861e868k905Q216J760n064N014O064m476k337O715j312p420J059K120n498l924
$$ y = [5390, -163, 9411, 6524, -6641, -5549, 1507, -6762, -12512, -2183, 30, -8175, -2428, 9997, 3583, -916, 10910, 10997, -1627, 380, 7077, -3261, -10319, -1834, -1474, -12821, -5926, 3697, -2383, -3327, 8447, 9700, 810, 5534, 11423, 1646, -4971, 2548, -172, -10817, -7535, -612, -5561, -9180, 3340, 5897, -2444, 3969, 12471, 4881, -1416, 6595, 4331, -7354, -4805, 535, -6927, -10792, 172, 853, -7150, -173, 9253, 4156, -162, 7470, 7309, -3158, -511, 4132, -4040, -9004, -1907, -1523, -8796, -3781, 4603, 381, -2434, 6972, 8744, 1013, 2608, 8526, 584, -4915, 819, -591, -9180, -7022, -661, -4274, -6896, 3064, 5208, 156, 3017, 9617, 3974, -458, 5227, 3721, -6882, -4907, -492, -5868, -8773, -557, 1203, -3861, 1153, 7217, 2741, 404, 7119, 5807, -1613, -554, 1566, -3932, -7856]
876g856N421M15m448L963N990j478k089O150l34n646R22L966n675m471M697r00
892a373n423K261N421l014r77O162J845m554K312M928n303m452M740j441n954
907d822k35M415l662k183O439J632m083L291N834l055k842M575o15n965J29K419
923A272m428k677L486R03l576K960N489k010k245N231Q79n146q19L929l088m436
939d276K329J818m720O79N775r17k553M409K570m220M15L713l391m716L330m1
955B04n134Q37L546j852j608M168K355l207J453L444n16l458K779N48n247r85
971b673J797j704k639K801K489k253K02M768K1k412K272J723l613m72J501j908
987a00l314R67L147l375q55L878R76j878K473K354l353m04K675j386l219J032
$$ y = [-7856, -2435, -2020, -6468, -2505, 3485, 2007, -82, 6068, 5734, 88, 1010, 4976, -699, -5170, -473, -1373, -6796, -4535, 886, -2128, -3105, 3057, 4902, 348, 2660, 7588, 2285, -2167, 2573, 1132, -4822, -5057, -642, -4304, -6487, -48, 1584, -2499, 792, 6626, 3571, 729, 5304, 4689, -1276, -1147, 1272, -3156, -5833, -2347, -1444, -5020, -2060, 3429, 1419, -826, 4405, 5284, 138, -681, 3248, 160, -4276, -1947, -129, -4849, -4170, 1605, 688, -1865, 2544, 5114, 894, 1309, 5022, 1631, -3085, 245, 204, -4930, -4093, -547, -2399, -4007, 161, 2516, -691, 762, 4206, 3690, 232, 3011, 3559, -1688, -2673, -876, -2580, -5219, -2418, 71, -2182, -1980, 2788, 2809, 397, 2669, 4392, 779, 307, 1808, -100, -3414, -2447, 700, -2675, -3530, 348, 1324, -554, 1919, 4273, 920, 516, 3191, 1805, -1414, -382]
1003c82O16k256q13K598n41j076J348L278k191K48J661j52l308K163O49l754j77
1020b089J852l99k307N92K662n44n85K549J973k539l5K400k145k612J144L04k721
1037b500o61L048j911j842M621M99k457J973K763j693k595L441p58m043P14J400
1053aj008j804K087J030j949J335K664j084j982K655N13k946P0J625j079k798
1069b672J834J665k923j89M399j302k443K071K515k964o02J834K02k857L29J718
1085F15j808j523L299q61j658J603L000k821n61L321k45l289Q92J679k563m51
1101a371J837o6l581L361J768l526J12M025m64l927J978K546k881j596L168n54
1117H29l818J974L089l295j052L691l83k760K360J954k935k08K121q76k150Q45
$$ y = [-382, 234, -2022, -2835, -237, -778, -1854, -506, 2772, 581, 829, 2490, 2338, -970, 1193, 1842, -1912, -2089, -237, -636, -2943, -2351, 311, -233, -818, 1731, 3704, 1165, 1130, 3530, 1385, -1227, -83, 221, -2500, -3161, -113, -2024, -3866, 755, 1254, -1203, 770, 3533, 1840, -755, 2686, 1928, -2115, -1401, -1, -1009, -2813, -726, 304, -1645, -310, 2354, 1270, -712, 1943, 2456, -490, -420, 1205, 126, -2672, -838, 827, -2096, -2285, 2114, 812, -1631, 440, 2955, -9, -611, 1223, 1425, -1432, -1103, 615, -1193, -2716, 583, -278, -1936, -333, 2667, -154, -715, 2606, 2361, -928, -36, 1643, -920, -1371, 466, 400, -3181, 180, 1948, -1578, -1466, 2559, 2095, -1832, 146, 2692, -189, -1785, 1383, 829, -2989, -1015, 2074, -1221, -2273, 1418, 1035, -1725, 635, 2589, -346, -554, 1567, 691, -1459, -614]
1133f14J386j552j312L855j154k019P16K355j773j041K311N01l147M79L705l452
1149g56j734L723O10m656J185M228k982k394M545N3l609J641L303l466k304M647
1165B034m13m911K365L383l409j738N111j236m382L341K532m020k63L536k10m373
1181b653J924L580l547q34L047J95l039N09K798k351k260L816rl427J586L407
1197B742l193j795M172R78m716J194L270l556j627L994Q51n257K475L005k489
1212D8j859L293K86n141L049L532m046j520M524m93n072L222K705l590j149M314
1228B103J10m358K565K904l930j676M698o78m860K259L019l786o45L688r7l367
1244b051K403K352l074r55M082j167l407J818K746k823k671L254O08m230J404
$$ y = [-614, 772, -780, -2092, 1763, 609, -1410, -694, 1661, -112, -1153, 1158, 1659, -1488, -1009, 2696, -756, -2490, 1233, 1843, -2813, -1628, 2600, -382, -2776, 1769, 1822, -1787, -146, 3157, -309, -2613, 2034, 1621, -3290, -925, 2458, -951, -2689, 2422, 1186, -3196, 145, 2677, -1343, -1606, 1930, 1720, -2653, -729, 2851, -696, -1530, 1517, 1712, -1327, -818, 1980, -371, -2631, 1185, 1176, -2251, -665, 2742, -451, -2246, 1926, 2904, -1812, -618, 2652, -904, -2531, 1463, 2314, -2943, -468, 2537, 48, -1811, 1482, 1768, -3373, -324, 3208, -838, -2358, 2166, 1673, -3399, -177, 2528, -1062, -2211, 2103, 2213, -2145, 420, 3324, -606, -2282, 2416, 1738, -3122, -863, 2156, -1630, -2275, 1413, 1316, -2051, 352, 2704, -370, -1325, 2757, 1590, -1817, 1, 2747, -76, -2747, 507, 1115, -3115, -1711]
1259a711M214k862j606L849P32m685J558K809l126j610L857M3m605K724L112m299
1275a606o00M430m47m629K948L266l977j778M532p36m623L050K135l473j326M298
1291A464L37m012K991K548l545j347L830j274k952J672J225k486k080M402j022
1306b49k620J944L649k770j300M077m84k950J322J827k471k386L656q26l147N61
1322b167L509k350j013M432P34m253J744K771l767j490L830j344l697K244K607
1337A790l036j241L861l0l587L549J748l361l96L996j435l779J735K244l451j242
1353b635L979j100k568J997K236j705n12K823p90k491R66J773k805j082K058n13
1369c69k872J795K071j797L7L119k16k174R74L002l436j178K557j096k934N41
$$ y = [-1711, 2503, -359, -1965, 1884, 2616, -2069, -511, 2298, -828, -2438, 1419, 1462, -3143, -419, 2693, -1606, -2206, 2224, 1777, -2852, 96, 3362, -615, -2393, 2139, 1403, -3220, -170, 1965, -1508, -2834, 1464, 1801, -2211, 780, 3328, -217, -1564, 2266, 992, -1960, -288, 937, -1549, -3629, 773, -249, -2869, -925, 2724, -46, -1346, 2731, 2247, -703, 619, 2446, -25, -2411, 1245, 419, -2728, -2167, 1342, -1008, -2021, 2411, 3145, -1108, 636, 3407, -360, -1850, 1980, 636, -3061, -817, 1790, -1246, -2487, 1374, 1344, -2243, 1306, 3054, -307, -703, 3293, 1858, -1921, -186, 2058, -1393, -2635, 1344, 244, -2324, -327, 1909, 204, -308, 2515, 1725, -766, 200, 1973, -832, -1914, 144, -369, -3241, -1446, 625, -1172, -1135, 1984, 1768, -406, 568, 3570, 134, -1044, 1513, 417, -2517, -1976]
1385a976L034l183o10M016M00l330K248K632k648k286L808o58l756J347K488l696
1401b170j6L201j120j930K169K439l245Q25J902m47k492M18J693k103k245K893
1417b28R7k461J369K872k205l33K856L4k308J351Q72j711j379J369m4l048J036
1434a861J855j823o30L053J066k335J976J962k755o49J370j32k803K28J516j830
1450a792j244L091P93k722K451K003k325m06K277j81k905R74J081k374p55K244
1466B10J87j942O76J795j467M46K173j45k160Q68J029j424j932J574q33r69J56
1483a758J807r54j39K620M68j968J983P06k068o31P60L58k736L45P93j457l15
1500b186J294P53o07J852J142j550j19J702K06l107O34M8j357r95J604l0j466
$$ y = [-1976, 1058, -2125, -2735, 1281, 1681, -1649, 599, 3231, 583, -1703, 2105, 1447, -2309, -962, 1526, -2170, -2186, 1015, -105, -2035, 134, 2573, -672, 153, 2055, 1608, -884, -466, 1227, -876, -3121, -228, -131, -2592, -1223, 1649, -556, -889, 1967, 2001, -307, 1044, 1916, 205, -1174, 195, 151, -2897, -1861, -6, -1829, -2459, 594, 1660, -675, 1301, 3263, 508, -141, 1229, 1097, -1706, -1478, 38, -1792, -3036, 55, 848, -1874, 577, 2580, 255, -151, 2126, 1945, -960, 14, 1095, -1279, -2034, 210, 397, -1545, -869, 926, -541, -95, 2078, 1933, -227, 641, 1670, 246, -1686, -112, -945, -1914, -1758, 49, -905, -1044, 1576, 2044, 76, 2059, 2765, 697, 66, 826, 1184, -1552, -1207, -414, -1871, -2186, -892, -139, -746, 1106, 2248, 698, 579, 2281, 2487, -620, 14, 62, -1295, -2290, -686, -716, -2182]
1517b182K804J128j570pJ470J75j821J84J175j283j339R97P0k244J052J289l47
1534d49n06J900J331k045J048J184j201j085R22j051j455p36J138O3j625K994
1550D27M98j195J331J441o81j418J418l57j650l83k45l71r73R95Q21j387R45K253
1568A469J74l49L6L57o62m79J39k64l004J025O87q53k41J761M01L9N61M23j14
1587A106n9J95q16p45r1m15k118J212J301j025j36J244J184p34M40J414J24j651
1605D30J66P50j807q01N01o55j246K026R08j402K34K430l73j67R32l55p13q42
1623A6j34q23p82nN76n15l07J980J82Q38l13K050j495m28P73l90j858m43O42r01
1643a337k16R97Po18J439J119J01j86K4n4j158p04Q18o14j347O59K03j348J321
$$ y = [-2182, 622, 1750, 180, 173, 1643, 1818, -3, 181, 1356, 73, -1266, -269, -199, -2443, -1391, -102, -449, -955, 945, 2276, 231, 1279, 2463, 1262, 177, 1099, 48, -1407, -2143, -1005, -942, -2567, 427, 925, -270, 1061, 2502, 1821, 403, 1821, 1464, -186, -569, -814, -1185, -2158, -1163, -342, -1729, -784, 1469, 1643, 1294, 1330, 1687, 1025, 546, 685, 421, -2583, -1558, -871, -1724, -1965, -204, 197, 236, 797, 1220, 1106, 1047, 1242, 426, -319, -410, -825, -2943, -1731, -430, -1455, -1591, -347, 837, 103, 543, 1957, 2081, 430, 596, 1346, -461, -1262, -761, -1416, -2662, -636, 272, -1130, -896, 1534, 1161, 994, 1926, 1571, 858, 16, -118, -941, -1723, -1728, -1152, -1667, -1974, 6, 188, 1026, 713, 2763, 1268, 840, 1613, 1223, -635, -1078, -436, -1337, -1553, -556, -549, -1167, 272, 1391, 1492, 1306, 1330, 1276, 118, -586, 232, -382, -1729, -1070, -867, -2215, -894]
1662h94J312k59o17J562N28o13N72k10j289N8r8q03r34M82R99j061K11J143M0
1681A29n18J292R96j46q86K76r96r46l57O16l41n70k57J597p57N34J410P64j070
1700G70N30R33k134n94J631k037n46P55R37k221J073J484j01o45J566J234j750
1717H85l74R56j731j023J085q50j226L93J212L58o04J238J239r19J07J027o06
1734A167r50m99O52j636k30J352r67p78R07K081j510J039N43P60j375J191K82
1751B029j560o61L89q57j535R83J565n80m49J923k70j227J625N44j684J52Q84
1768A271o32k264R55N68j143p54K090K50j228J730J113p71o9R40j279p20J27L27
1786E11j742k86Q41j304Q14O55J466p87P40Q27L62j208M4R44j047k415J102j65
$$ y = [-894, 418, 159, -458, 1104, 1632, 1019, 1591, 1381, 92, 150, 52, -751, -1685, -1203, -204, -1265, -1054, 89, 129, -389, 903, 1899, 1753, 867, 1143, 147, -799, -1156, -540, -881, -1451, -1708, -111, -868, -334, 1076, 1840, 770, 1300, 2233, 99, -495, 1136, -901, -1447, -692, 245, -1976, -903, 581, 480, -165, 1401, 2635, 885, 511, 1467, -264, -1287, -202, -1052, -2278, -1885, -673, -315, -919, 319, 1558, 639, 746, 1773, 1167, 217, -282, 370, -1266, -1496, -144, -1111, -1889, -982, 1099, -411, 628, 1171, 1931, 556, 1747, 2029, 469, -192, 197, -660, -2195, -1212, 353, -227, -676, 1247, 977, -250, 1375, 1919, 235, 387, 1271, 639, -1625, -670, -102, -1245, -1999, 91, 341, -887, 843, 1956, 1185, 1116, 2056, 777, 57, 184, 511, -1231, -1517, -676, -1980, -1166, -511, 955, 168, 908, 1735, 2097, 889, 933, 1877, 830, -1585, -483, -648]
1804f48j817O87J356k36k2K452q2j856J370J052j505m79J454r51k620R98R21j239
1822a165k84J789m78o62J563J074q87j78J355l55k557J430m32k197j15J797k53
1839e55j262J574J283j006j7K004k73j888J303j68j809r82J424p89n12J34Q98
1856f41J53n51K448J73j219J314J38j688k74K27l31k048J674J8j074P3J319J214
1874I25j258R08J861r97j687K117o39k730J491J42j496m45J900o77q82J461R24
1891I18o86k65K281j157j230J396m60j246j197J319p25n73Q08J105j186N34J057
1908F93J57n14N30Q13j720m50J398k71j853r6J075j334J11J048O36n37J671P3
1926A430j346R82m97J92j607K82O23q10j204K273o43j088J514R12P9m35J185p83
$$ y = [-648, -2465, -1778, -422, -658, -680, 1772, 1690, -166, 1204, 2256, 751, 272, 1726, 775, -1845, -847, 74, -1165, -1449, 340, -138, -800, 763, 1837, 950, 772, 2127, 1772, -785, 645, 213, -1984, -2099, -302, -555, -1817, -243, 1040, 34, 17, 2021, 1748, -140, 1163, 995, -814, -1796, -372, -1161, -1673, -1539, -641, -488, -1039, 1409, 1582, 363, 1677, 1815, 127, -147, 80, -251, -2299, -625, -607, -1681, -1608, -289, 925, -333, 575, 2436, 1439, -248, 1869, 1230, -1500, -9, 133, -1363, -1808, 92, -585, -1467, -6, 918, 232, -33, 2248, 1091, -139, 1257, 797, -449, -1646, -327, -1052, -1625, -817, 288, -898, -364, 693, 850, 336, 866, 1679, -41, -491, 907, 636, -1217, -1313, -238, -1572, -1461, -413, 223, -314, 1357, 1430, 84, 1066, 569, 761, -846, -564, 59, -751, -1955, 318, -325, -1413, 101, 1013, 1092, 657, 1842, 1059]
1944A059j106R56o31j320q8J477n23j864J528J181r97O75J149j6j270J557o63
1961A104r55o28Q74j022q84J059N68j125k03K814j092l82Q47L03j124J02R8K96
1979F50k210R01J091j652o3P87Q94j309R33R16j315J053P59p88m44l73P88q50
1997b32j581K713r63n94O44O3l25K88J338p6j250P77l49j161K07O89j206p1J201
2016A12m77k66O37R75l91j267J573L28p17N38j39j223o25j2Q68m20j345J320j44
2035f75M24N70Q26p79J34N54q82LL93pj014n48J437j217n25J140O14q79M60K089
2055B118j525r37J085J0r21q83Q73np13P30lp91O16O10R63n35j55l2j193N64R77
2076H53j557m79J067P0l93J05J053j173J87R06N46j019m56P81J98j868O24J43
$$ y = [1059, -47, 909, 278, -1042, -1130, 347, -176, -2040, -512, 669, -328, 347, 1496, 1480, 210, 1767, 1104, 149, -479, 395, -627, -1511, -452, 116, -1009, -1212, 1602, 510, 128, 975, 1278, 154, 256, 354, 650, -1560, -659, 432, -1220, -1283, -496, 398, -911, 22, 938, -377, 676, 1435, 647, 203, -170, 618, -232, -1813, 900, -63, -657, -13, 50, -275, 13, 1351, 1275, 25, 802, 453, -708, -501, 188, -1018, -1089, 112, -365, -631, 6, 981, 590, -677, 896, 1224, 507, 1045, 906, -317, -942, -954, -86, -506, -1851, -531, -675, -251, 319, 1145, 366, 500, 1054, 172, 175, 568, 561, -453, -1001, 436, -781, -1306, -166, 448, -431, 29, 2118, 593, -344, 741, 751, -170, -1053, -180, -185, -898, -168, -171, -962, -346, 264, 1227, 692, 537, 505, -688, -124, 853, -704, -1183, -116, -46, -439, -334, 719, -454, -267, 639, 1185, 166, -290, 491, 689, -1179, -555, -412]
2094d12M53q42J37k88J74R48P26k90NK7J13o92P55l21r64K37k11L90J04J24p55
2115e82j94J17M78j26J682n11n37k61l28M13m60j19J38P6k04K23J038q05k14J9
2135a57R30q95l63O37o31R9RM12k02n26J890j685o92J275p8J15m80J187k56n32
2155E7j01K20k56J29j66K44l43R3j26K36l95Q51M02r43Q84p52J10n19J88J31Q3
2176B7n79L50M94m38R12m12m35K94O09n49n50O64l17P82j188K77l90K42K98J18
$$ y = [-412, 41, -801, -664, -952, -778, 170, 896, 606, 611, 638, 751, 59, 814, 493, -471, -234, -445, -55, 49, 173, -582, -776, -659, -181, -307, 1375, 864, 327, 66, -262, 151, -309, -428, -290, -214, -418, -195, 843, 38, -176, -157, 773, -122, -485, 152, -479, -380, -371, 41, -161, -687, 1203, -482, -1174, 101, 23, 138, -342, 845, 589, 57, -44, 176, -80, 49, -117, 127, -216, -123, -249, -13, -408, 443, 845, -98, 786, 34, 144, -375, -187, -56, 27, -552, -202, 292, -146, 766, 354, -81, 213, 822, 273, -277, 387, 70, 852, -336, -59, -449, -207, 91, 209]
$$ [...]
8191A80
##END NTUPLES=NMR FID
##END=
