##TITLE=1H_UK_26_2_4
 CD2Cl2
 8 sc, 
 7.04.2022
##JCAMPDX= 6.0         $$ Bruker NMR JCAMP-DX V2.0
##DATA TYPE= NMR FID
##DATA CLASS= NTUPLES
##ORIGIN= UXNMR, Bruker Analytische Messtechnik GmbH
##OWNER= root
$$ XWIN-NMR		Version 3.5
$$ Thu Apr  7 10:41:30 2022 Russian Standard Time (UT+4h)  she@DPX200
##.OBSERVE FREQUENCY= 200.131346
##.OBSERVE NUCLEUS= ^1H
##.DELAY= (6, 6)
##.ACQUISITION MODE= SIMULTANEOUS
##.ACQUISITION SCHEME= undefined
##.AVERAGES= 8
##.DIGITISER RES= 18
##SPECTROMETER/DATA SYSTEM= spect
##.PULSE SEQUENCE= zg30
##.SOLVENT NAME= CDCl3
##.SHIFT REFERENCE= (INTERNAL, CDCl3, 0, 15.7039)
##AUDIT TRAIL= $$ (NUMBER, WHEN, WHO, WHERE, WHAT)
$$ ##TITLE= Audit trail, XWIN-NMR		Version 3.5
$$ ##JCAMPDX= 5.01
$$ ##ORIGIN= Bruker BioSpin GmbH
$$ ##OWNER= she
$$ F:/spectra/data/she/nmr/H-F/1/audita.txt
$$ ##AUDIT TRAIL=  $$ (NUMBER, WHEN, WHO, WHERE, WHAT)
(   1,<2022-04-07 10:40:33.35 +0400>,<she>,<DPX200>,
      <created by zg, POWCHK disabled, PULCHK disabled
       configuration hash MD5:
       00 E9 B6 7A A2 85 ED C7 34 08 36 98 17 FE 4E 26
       data hash MD5: 16K
       0A 0C F8 D8 6F 02 BD 46 03 C8 01 41 8F 28 93 C3>)
$$ ##END=
$$ 
$$ hash MD5
$$ EB 1C 42 56 3B 04 78 BB 3A 0F 74 00 CC 9F 6B FC
##$RELAX= 
##$RELAX= 
##$RELAX= 
##$RELAX= 
##$RELAX= 
##$RELAX= 
$$ Bruker specific parameters
$$ --------------------------
##$DU= <F:/spectra>
##$EXPNO= 1
##$NAME= <H-F>
##$PROCNO= 1
##$TYPE= <nmr>
##$USER= <she>
##$AMP= (0..31)
100 100 100 100 100 100 100 100 100 100 100 100 100 100 100 100 100 100 
100 100 100 100 100 100 100 100 100 100 100 100 100 100 
##$AQSEQ= 0
##$AQ_mod= 1
##$AUNM= <au_zg>
##$AUTOPOS= <>
##$BF1= 200.13
##$BF2= 200.13
##$BF3= 200.13
##$BF4= 200.13
##$BF5= 200.13
##$BF6= 200.13
##$BF7= 200.13
##$BF8= 200.13
##$BYTORDA= 1
##$CFDGTYP= 0
##$CFRGTYP= 5
##$CHEMSTR= <none>
##$CNST= (0..31)
1 1 145 1 1 1 1 1 1 1 1 1 1 1 1 1 1 1 1 1 1 1 1 1 1 1 1 1 1 1 1 1 
##$CPDPRG= <>
##$CPDPRG1= <>
##$CPDPRG2= <>
##$CPDPRG3= <>
##$CPDPRG4= <mlev>
##$CPDPRG5= <mlev>
##$CPDPRG6= <mlev>
##$CPDPRG7= <mlev>
##$CPDPRG8= <mlev>
##$CPDPRGB= <>
##$CPDPRGT= <>
##$D= (0..31)
0 1.2 0 0 0 0 0 0 0 0.06 0 0.03 0 0 0 0 0.0002 0 0 0 0 0 0 0 0 0 0 0 0 
0 0 0 
##$DATE= 1649313632
##$DBL= (0..7)
120 120 120 120 120 120 120 120 
##$DBP= (0..7)
150 150 150 150 150 150 150 150 
##$DBP07= 0
##$DBPNAM0= <>
##$DBPNAM1= <>
##$DBPNAM2= <>
##$DBPNAM3= <>
##$DBPNAM4= <>
##$DBPNAM5= <>
##$DBPNAM6= <>
##$DBPNAM7= <>
##$DBPOAL= (0..7)
0.5 0.5 0.5 0.5 0.5 0.5 0.5 0.5 
##$DBPOFFS= (0..7)
0 0 0 0 0 0 0 0 
##$DE= 6
##$DECBNUC= <off>
##$DECIM= 32
##$DECNUC= <off>
##$DECSTAT= 4
##$DIGMOD= 1
##$DIGTYP= 9
##$DL= (0..7)
0 120 120 120 120 120 120 120 
##$DP= (0..7)
150 150 150 150 150 150 150 150 
##$DP07= 0
##$DPNAME0= <>
##$DPNAME1= <>
##$DPNAME2= <>
##$DPNAME3= <>
##$DPNAME4= <>
##$DPNAME5= <>
##$DPNAME6= <>
##$DPNAME7= <>
##$DPOAL= (0..7)
0.5 0.5 0.5 0.5 0.5 0.5 0.5 0.5 
##$DPOFFS= (0..7)
0 0 0 0 0 0 0 0 
##$DQDMODE= 0
##$DR= 18
##$DS= 0
##$DSLIST= <SSSSSSSSSSSSSSS>
$$ [...]
##$SUBNAM2= <"">
##$SUBNAM3= <"">
##$SUBNAM4= <"">
##$SUBNAM5= <"">
##$SUBNAM6= <"">
##$SUBNAM7= <"">
##$SUBNAM8= <"">
##$SUBNAM9= <"">
##$SW= 18.0517287032376
##$SWIBOX= (0..15)
0 0 2 0 0 0 0 0 0 0 0 0 0 0 0 0 
##$SW_h= 3612.71676300578
##$TD= 16384
##$TD0= 1
##$TE= 0
##$TE2= 300
##$TE3= 300
##$TEG= 300
##$TL= (0..7)
0 120 120 120 120 120 120 120 
##$TP= (0..7)
150 150 150 150 150 150 150 150 
##$TP07= 0
##$TPNAME0= <>
##$TPNAME1= <>
##$TPNAME2= <>
##$TPNAME3= <>
##$TPNAME4= <>
##$TPNAME5= <>
##$TPNAME6= <>
##$TPNAME7= <>
##$TPOAL= (0..7)
0.5 0.5 0.5 0.5 0.5 0.5 0.5 0.5 
##$TPOFFS= (0..7)
0 0 0 0 0 0 0 0 
##$TUNHIN= 0
##$TUNHOUT= 0
##$TUNXOUT= 0
##$USERA1= <user>
##$USERA2= <user>
##$USERA3= <user>
##$USERA4= <user>
##$USERA5= <user>
##$V9= 5
##$VALIST= <valist>
##$VCLIST= <CCCCCCCCCCCCCCC>
##$VD= 0
##$VDLIST= <DDDDDDDDDDDDDDD>
##$VPLIST= <PPPPPPPPPPPPPPP>
##$VTLIST= <TTTTTTTTTTTTTTT>
##$WBST= 1024
##$WBSW= 4
##$XGAIN= (0..3)
0 0 0 0 
##$XL= 0
##$YL= 0
##$YMAX_a= 510218
##$YMIN_a= -525926
##$ZGOPTNS= <>
##$ZL1= 120
##$ZL2= 120
##$ZL3= 120
##$ZL4= 120
##$ABSF1= 10
##$ABSF2= 0
##$ABSG= 5
##$ABSL= 3
##$ALPHA= 0
##$AQORDER= 0
##$ASSFAC= 0
##$ASSFACI= 0
##$ASSFACX= 0
##$ASSWID= 0
##$AUNMP= <proc_1d>
##$AZFE= 0.1
##$AZFW= 0.1
##$BCFW= 1
##$BC_mod= 2
##$BYTORDP= 1
##$COROFFS= 0
##$CY= 11.3945322036743
##$DATMOD= 1
##$DC= 2
##$DFILT= <>
##$DTYPP= 0
##$F1P= 2.36226072786647
##$F2P= -0.459571619588291
##$FCOR= 0.5
##$FTSIZE= 0
##$FT_mod= 4
##$GAMMA= 1
##$GB= 0.15
##$INTBC= 1
##$INTSCL= 1
##$ISEN= 128
##$LB= 0.24
##$LEV0= 0
##$LPBIN= 0
##$MAXI= 10000
##$MC2= 0
##$MEAN= 0
##$ME_mod= 0
##$MI= 1.114404
##$NCOEF= 0
##$NC_proc= 0
##$NLEV= 6
##$NOISF1= 3.799351
##$NOISF2= 2.8
##$NSP= 1
##$NTH_PI= 0
##$NZP= 0
##$OFFSET= 15.70392
##$PC= 1
##$PHC0= -18030.25
##$PHC1= 11.20078
##$PH_mod= 1
##$PKNL= yes
##$PPARMOD= 0
##$PSCAL= 0
##$PSIGN= 0
##$REVERSE= no
##$SF= 200.130013532006
##$SI= 16384
##$SIGF1= 3
##$SIGF2= 2
##$SINO= 400
##$SIOLD= 16384
##$SREGLST= <1H.CDCl3>
##$SSB= 0
##$STSI= 0
##$STSR= 0
##$SW_p= 3612.71676300578
##$SYMM= 0
##$S_DEV= 0
##$TDeff= 0
##$TDoff= 0
##$TI= <>
##$TILT= no
##$TM1= 0
##$TM2= 0
##$TOPLEV= 0
##$USERP1= <user>
##$USERP2= <user>
##$USERP3= <user>
##$USERP4= <user>
##$USERP5= <user>
##$WDW= 1
##$XDIM= 8192
##$YMAX_p= 0
##$YMIN_p= 0
$$ End of Bruker specific parameters
$$ ---------------------------------
##NTUPLES= NMR FID
##VAR_NAME=  TIME,          FID/REAL,        FID/IMAG
##SYMBOL=    X,             R,               I
##VAR_TYPE=  INDEPENDENT,   DEPENDENT,       DEPENDENT
##VAR_FORM=  AFFN,          ASDF,            ASDF
##VAR_DIM=   8192,          8192,            8192
##UNITS=     SECONDS,       ARBITRARY UNITS, ARBITRARY UNITS
##FACTOR=    0.0002768,     1,               1
##FIRST=     0,             0,               0
##LAST=      2.2672688,     0,               0
##MIN=       0,             -525926,         0
##MAX=       2.2672688,     510218,          0
$$ Real data points
##PAGE= N=1
##DATA TABLE= (X++(R..R)), XYDATA
$$ plain form
0 0 0 0 0 0 0 0 0 0 -8 8 -8 8 -16 16 -24 24 -32 40 -51 64 -72 88 -104 123 -144 169 -198 227 -263 303 -345
31 -345 392 -448 508 -575 647 -726 814 -910 1016 -1131 1258 -1395 1546 -1708 1889 -2084
47 -2084 2299 -2533 2789 -3076 3388 -3732 4117 -4549 5032 -5584 6215 -6947 7806 -8833
61 -8833 10087 -11658 13686 -16423 20337 -26420 37215 -62080 241269 -137994 -392859 399223
73 399223 111664 -192010 128651 -22976 -243604 308830 112513 -476282 43264 449674
83 449674 -223666 -275790 211175 40869 -89997 106932 -162250 -145443 324132 45880
93 45880 -389398 69519 280239 -128918 -113178 60736 -56420 79229 95597 -247811 -51577
104 -51577 323181 -48542 -265137 124529 143720 -61789 38011 -53771 -112537 220248 92824
$$ packed form
0@%%%%%%%%qJ6j6J6k4L2m0M8n6P2r1J15j36J60j92K27k67L13l67M25m90N66o48
31c45P37q40R56j083J222j373J540j724J926k147K389k653K941l254L597l973
47b084M383m832N322n865O464p120P849q666R581j0616J1799j3162J4753j6639
61h833J8920k1745K5344l0109L6760m6757O3635r9295L03349l79263k54865P92082
73C99223k87559l03674L20661j51627k20628N52434j96317n88795N19546M06410
83D49674o73340n2124M86965j70306j30866J96929k69182J6807M69575k78252
93D5880m35278M58917K10720m09157J5740J73914j17156J35649J6368l43408J96234
104e1577L74758l71723k16595L89666J9191k05509R9800r1782n8766L32785j27424
$$ plain form
115 92824 -321420 4771 297017 -107955 -168411 129294 819 -30911 132078 -127738
125 -127738 -152769 271726 64676 -331872 44914 247310 -123331 -78741 106487 -77829
135 -77829 29056 184603 -165629 -148509 272190 38677 -276962 61338 150450 -124871
145 -124871 -10178 55346 -129089 63974 168331 -189731 -116768 242714 12921 -200429
155 -200429 64829 74773 -79360 58604 17053 -131054 100266 145510 -164493 -62691 188206
166 188206 -8354 -115915 51670 7322 -33786 80131 -38814 -115498 110449 87816 -136546
177 -136546 -24994 102170 -29132 -34263 20439 -56331 9069 81300 -80268 -74274 113472
188 113472 28300 -92018 25250 37798 -30690 40384 930 -87951 53150 84256 -97768
$$ packed form
115I2824m14244L26191K92246m04972o0456K97705j28475l1730J62989k59816
125a27738k5031M24495k07050l96548L76786K02396l70641M4590J85228j84316
135g7829J06885J55547l50232J7120M20699k33513l15639L38300Q9112k75321
145a24871J14693O5524j84435J93063J04357l58062P2963L59482k29793k13350
155b00429K65258R944j54133J37964m1551j48107K31320M5244l10003J01802K50897
166A88206j96560j07561J67585m4348m1108J13917j18945p6684K25947k2633k24362
177a36546J11552J27164j31302n131N4702p6770O5400P2231j61568N994J87746
188A13472q5172j20318J17268J2548o8488P1074l9454q8881J41101L1106j82024
$$ plain form
199 -97768 -35784 108314 -12588 -54782 55857 -6004 -37961 71479 -10781 -99805 60001
210 60001 68142 -100125 -21061 85927 -29524 -33427 55730 -24956 -34826 71962 -10521 -85200
222 -85200 46727 48332 -74628 -10703 55621 -25004 -11910 40182 -23892 -15981 54117 -11573
234 -11573 -52800 30772 23590 -41219 -1754 21026 -14947 6620 17650 -20163 4101 31445
246 31445 -15388 -19821 18718 521 -15005 7242 -2523 -6270 19219 1556 -16585 16799 14801
259 14801 -17318 -1201 9274 -14472 -3726 8365 -15538 -5162 19043 -6515 -12577 18161
271 18161 4828 -15749 6437 4713 -16748 2130 8917 -15032 -1898 17725 -4596 -6443 17485
284 17485 4054 -10443 8094 4208 -13813 351 7102 -11200 -3466 12440 -1546 -6008 11942
$$ packed form
199i7768O1984J44098j20902m2194J10639o1861l1957J09440q2260q9024J59806
210F0001Q141j68267P9064J06988j15451l903Q9157q0686r870J06788q2483p4679
222h5200J31927J605j22960O3925O6324q0625J3094N2092o4074P911P0098o5690
234a1573m1227Q3572p182o4809L9465K2780l5973K1567J1030l7813K4264K7344
246C1445m6833m433L8539j8197j5526K2247r765l747K5489j7663j8141L3384j998
259A4801l2119J6117J0475k3746J0746J2091k3903J0376K4205k5558o062L0738
271A8161j3333k0577K2186j724k1461J8878O787k3949J3134J9623k2321j847K3928
284A7485j3431j4497J8537l886j8021J4164O751j8302P734J5906j3986m462J7950
$$ plain form
297 11942 6282 -7874 2256 5697 -9290 -6770 4368 -5107 -9488 4658 4194 -6101 3357 10391
311 10391 -2442 -4516 6783 -412 -10235 678 3895 -8536 -2885 9536 714 -3081 11016
324 11016 7204 -6049 2983 8108 -7220 -6700 6480 -2112 -10829 4374 6742 -7468 235 11628
338 11628 -4028 -8362 8408 646 -15475 114 6955 -12344 -5728 12589 -2054 -8422 12816
351 12816 5931 -12466 5725 10420 -13581 -4604 13851 -6430 -10262 13840 5680 -8284 9827
364 9827 9615 -8225 3245 8552 -10828 -5863 7567 -6086 -9358 4278 1483 -1659 3797 -1934
378 -1934 -1842 7230 -3055 -9703 2443 -1107 -7896 2788 -2366 -7031 14811 7670 -16201 8247
392 8247 21258 -13814 -8521 15509 -9273 -10623 16599 -10531 -18851 29202 8967 -33825 14811
$$ packed form
297A1942n660j4156J0130L441j4987K520J1138r475m381J4146m64j0295R458P034
311A0391j2833k074J1299p195r823J0913L217j2431N651J2421q822l795J4097
324A1016l812j3253R032N125j5328N20J3180q592q717J5203K368j4210P703J1393
338A1628j5656m334J6770p762j6121J5589O841j9299O616J8317j4643o368K1238
351A2816o885j8397J8191M695k4001Q977J8455k0281l832K4102q160j3964J8111
364I827k12j7840J1470N307j9380M965J3430j3653l272J3636k795l142N456n731
378a934R2R072j0285o648J2146l550o789J0684n154m665K1842p141k3871K4448
392H247J3011l5072N293K4030k4782j350K7222k7130q320M8053k0235m2792M8636
$$ plain form
405 14811 30975 -24745 -7452 24234 -17955 -8586 27718 -22213 -25318 43799 5333 -46347
417 -46347 21495 31432 -31440 -326 21501 -29520 2212 34170 -38814 -24680 56085 -1841
429 -1841 -48712 28040 24087 -29384 13170 9571 -39252 21437 35663 -55718 -17357 62060 -10474
442 -10474 -40973 30097 8830 -17241 30077 -10364 -43083 46081 30150 -66577 -2853 57886
454 57886 -19049 -20681 24748 -16544 4141 45317 -42342 -44994 67227 11688 -75329 12816
466 12816 37204 -29825 9317 11425 -48430 32753 61654 -73058 -37846 88823 -4627 -68961
478 -68961 31481 12860 -30641 45294 -4393 -74631 61770 72018 -94934 -28774 95251
489 95251 -17272 -52568 37571 -15560 -21353 71317 -26125 -88087 81322 68095 -101532 -17910
$$ packed form
405A4811J6164n5720J7293L1686m2189R369L6304m9931l105O9117l8466n1680
417d6347O7842R937o2872L1114K1827n1021L1732L1958p2984J4134Q0765n7926
429a841m6871P6752l953n3471M2554l599m8823O0689J4226r1381L8361P9417p2534
442a0474l0499P1070k1267k6071M7318m0441l2719Q9164j5931r6727O3724O0739
454E7886p6935j632M5429m1292K0685M1176q7659k652J12221n5539q7017Q8145
466A2816K4388o7029L9142K108n9855Q1183K8901j34712L5212J26669r3450o4334
478f8961J00442j8621m3501P5935m9687p0238J36401J0248j66952O6160J24025
489I5251j12523l5296R0139n3131n793R2670r7442o1962J69409j3227j69627Q3622
$$ plain form
501 -17910 79828 -24331 -23393 28615 -48098 -275 88157 -52495 -87407 92783 50274 -90794
513 -90794 -574 46027 -27280 19327 11234 -80646 30060 97423 -77628 -70906 96272 23525
525 23525 -64558 20069 966 -25598 65787 -11154 -106504 60300 95709 -93618 -45867 87962
537 87962 -2497 -27232 34142 -43604 -14915 102165 -35176 -117262 79600 79219 -96156 -21821
549 -21821 60582 -24030 11797 32697 -83906 944 119809 -56673 -111575 85661 54046
560 54046 -79633 3488 23228 -34399 55057 25673 -109978 22537 124557 -68450 -87407
571 -87407 81871 24284 -48629 27384 -18212 -36756 90633 10236 -122362 40772 108559
582 108559 -73186 -55494 61011 -7853 -11730 38852 -58682 -29300 110543 -10700 -116303
$$ packed form
501a7910R7738j04159R38N2008p6713M7823Q8432j40652l4912J80190m2509j41068
513i0794R0220M6601p3307M6607q093r1880J10706O7363j75051O722J67178p2747
525B3525q8083Q4627j9103k6564R1385p6941r5350J66804L5409j89327M7751J33829
537H7962r0459k4735O1374p7746K8689J17080j37341q2086J96862l81j75375P4335
549b1821Q2403q4612L5827K0900j16603Q4850J18865j76482n4902J97236l1615
560E4046j33679Q3121J9740n7627Q9456k9384j35651J32515J02020j93007j8957
571h7407J69278n7587p2913P6013m5596j8544J27389q0397j32598J63134O7787
582A08559j81745J7692J16505o8864l877N0582r7534K9382J39843j21243j05603
$$ plain form
593 -116303 52395 77909 -64497 -19908 29314 -29999 28941 38292 -88836 -10510 116354
604 116354 -29137 -93209 57058 41535 -44449 13291 -5532 -44007 63989 31332 -106316
615 -106316 7287 107420 -41444 -63301 53049 6981 -21214 38326 -36010 -50115 85408
626 85408 21016 -107622 19583 86503 -45315 -31171 40688 -20667 2184 50865 -56332
637 -56332 -44771 89994 7660 -92214 26607 55300 -38370 -2442 18155 -37033 26030 47270
649 47270 -67858 -28317 80878 -7582 -64765 27688 22286 -21821 22420 -6066 -41234 47042
661 47042 35840 -69862 -8655 64182 -19137 -33699 25473 -7750 -6393 38698 -25680 -40543
673 -40543 56840 21542 -64978 6331 43070 -26735 -8287 19756 -28014 5622 44693 -35839
$$ packed form
593a16303J68698K5514j42406M4589M9222n9313N8940R351j27128P8326J26864
604A16354j45491o4072J50267j5523q5984N7740j8823l8475J07996l2657j37648
615a06316J13603J00133j48864k1857J16350m6068k8195N9540p4336j4105J35523
626H5408o4392j28638J27205O6920j31818J4144P1859o1355K2851M8681j07197
637e6332J1561J34765q2334r9874J18821K8693r3670L5928K0597n5188O3063K1240
649D7270j15128L9541J09195q8460n7183R2453n402m4107M4241k8486l5168Q8276
661D7042j1202j05702O1207P2837q3319j4562N9172l3223J357M5091o4378j4863
673d0543R7383l5298q6520P1309L6739o9805J8448K8043m7770L3636L9071q0532
$$ plain form
685 -35839 -33600 56772 8948 -50951 15643 22466 -26228 9929 11020 -35951 15190 40116 -37831
698 -37831 -21214 47631 -886 -32236 18053 4685 -18443 19908 39 -33808 20630 27942
710 27942 -33396 -8538 32773 -7178 -14555 14931 -8145 -8946 21970 -8230 -25846 20978 15176
723 15176 -24567 965 17737 -8877 -453 9404 -14163 -643 18417 -12936 -15434 17757 3900
736 3900 -14491 6905 5496 -7822 8838 3472 -15251 6210 12885 -14797 -5694 13746 -4316
749 -4316 -6560 10313 -2783 -5991 13263 -981 -14530 9164 7934 -14839 -693 10664 -8230
762 -8230 -2926 10869 -5734 -5495 12829 -670 -11811 7476 6039 -11592 -31 7842 -6394
775 -6394 -2795 8630 -2688 -4656 8146 1647 -7518 3059 4730 -6032 -2428 4412 -1990 -3387
$$ packed form
685c5839K239R0372m7824n9899O6594O823m8694L6157J091m6971N1141K4926p7947
698c7831J6617O8845m8517l1350N0289j3368k3128L8351j9869l3847N4438P312
710B7942o1338K4858M1311l9951p377K9486k3076q01L0916l0200j7616M6824n802
723A5176l9743K5532J6772k6614Q424R857k3567J3520J9060l1353k498L3191j3857
736C900j8391K1396j409j3318J6660n366j8723K1461O675k7682R103J9440j8062
749d316k244J6873j3096l208J9254j4244j3549K3694j230k2773J4146J1357j8894
762h230N304J3795j6603K39J8324j3499j1141J9287j437j7631J1561P873j4236
775f394L599J1425j1318j968J2802o499r165J0577J671j0762L604O840o402j397
$$ plain form
789 -3387 3427 1667 -2295 2005 2893 -1823 -1304 2265 -637 -3758 -18 1617 -2250 -1815 3077 784
805 784 -1972 1976 2555 -2584 -751 3068 -1931 -3600 2536 663 -3477 1445 3637 -1998 -243 4361
821 4361 -587 -2844 2902 830 -4458 671 2610 -3012 -920 4187 -636 -2679 3395 1547 -3495
836 -3495 639 2153 -3635 -1691 2745 -1942 -2398 3318 787 -3266 2091 2451 -2765 -215 2290 -2297
852 -2297 -1587 2270 -1211 -1456 2933 885 -1612 2168 1732 -1870 544 529 -1975 159 -34 -2336 573
869 573 1686 -1204 343 1654 -387 1474 1547 -3563 119 3530 -3954 -3262 4728 -875 -3399 4534
885 4534 -281 -4464 6573 1950 -9736 2884 8128 -9205 -4180 9225 -4339 -5085 9477 -3091
899 -3091 -8239 12671 3153 -16064 6245 12768 -13261 -3639 12614 -7218 -4530 13361 -6857
$$ packed form
789c387O814j760l962M300Q88m716N19L569k902l121L740J635l867M35M892k293
805G84k756L948N79n139J833L819m999j669O136j873m140M922K192n635J755M604
821D361m948k257N746k072n288N129J939n622K092N107m823k043O074j848n042
836c495M134J514n788J944M436m687m56N716k531m053N357L60n216K550K505m587
852b297P10L857l481k45M389k048k497L780m36l602K414j5k504K134j93k302K909
869E73J113k890J547J311k041J861P3n110L682L411p484O92P990n603k524P933
885D534m815m183J1037m623j1686J2620N244j7333N025J3405j3564p46J4562j2568
899c091n148K0910r518j9217K2309O523k6029R622J6253j9832K688J7891k0218
$$ plain form
912 -6857 -10081 18328 2410 -19759 8674 13416 -14346 -1671 10584 -9880 455 13699 -13434
925 -13434 -7986 21355 -2521 -19395 10666 8090 -12279 3673 1981 -12771 10888 10487 -21217
938 -21217 -505 23623 -8948 -13189 13110 -1324 -5806 13109 -9240 -14708 24055 5894 -29114
951 -29114 8128 22630 -15794 -4525 12815 -13155 1849 20820 -22637 -16659 35045 230
963 230 -34165 14905 18121 -19073 5688 8788 -22994 12809 25965 -34276 -14633 41782 -5236
976 -5236 -31945 18789 8534 -16184 16989 -934 -30133 25826 25729 -43090 -8224 41427 -11644
989 -11644 -22728 18880 -5612 -7804 28120 -14762 -32775 37826 20183 -46025 961 33737
1001 33737 -15284 -7034 13787 -20380 5183 35579 -29417 -30349 45124 11041 -42202 8223
$$ packed form
912f857l224K8409j5918k2169K8433M742k7762J2675J2255k0464J0335J3244k7133
925a3434N448K9341k3876j6874L0061k576k0369J5952j692j4752K3659m01l1704
938b1217K0712K4128l2571m241K6299j4434m482J8915k2349n468L8763j8161l5008
951b9114L7242J4502l8424J1269J7340k5970J5004J8971m3457N978N1704l4815
963B30l4395M9070L216l7194K4761L100l1782L5803J3156o0241J9643N6415m7018
976e236k6709N0734j0255k4718L3173j7923k9199N5959r7o8819L4866M9651n3071
989a1644j1084M1608k4492k192L5924m2882j8013P0601j7643o6208M6986L2776
1001C3737m9021Q250K0821l4167K5563L0396o4996r32P5473l4083n3243N0425
$$ plain form
1013 8223 18742 -15672 11336 3866 -34348 19734 38674 -41352 -23216 47072 389 -31230
1025 -31230 14498 -285 -12214 30103 -8327 -43980 35109 36870 -49276 -12077 43008 -10140
1037 -10140 -14797 18123 -20751 -5215 45084 -21854 -48153 45762 29504 -50063 -1148 31200
1049 31200 -17327 3613 15549 -37779 4629 52555 -32338 -44221 47617 19027 -40853 7420
1061 7420 13202 -17908 22439 7555 -47690 16046 50823 -37654 -32830 41790 6063 -23952
1073 -23952 12704 -8007 -13315 38327 -4463 -51820 26798 41635 -39285 -17129 31045 -6873
1085 -6873 -3678 16359 -28638 -5725 49937 -16629 -49541 35302 28486 -36679 -917 16624
1097 16624 -17116 16215 16275 -43943 2735 54410 -25405 -41301 36658 13922 -27427 11082
$$ packed form
1013H223J0519l4414K7008p470l8214N4082J8940q0026J8136P0288m6683l1619
1025c1230M5728j4783j1929M2317l8430l5653P9089J761q6146L7199N5085n3148
1037a0140m657L2920l8874J5536N0299o6938k6299R3915j6258p9567M8915L2348
1049C1200m8527K0940J1936n3328M2408M7926q4893j1883R1838k8590n9880M8273
1061G420N782l1110M0347j4884n5245O3736L4777q8477M824P4620l5727l0015
1073b3952L6656k0711n308N1642m2790m7357P8618J4837q0920K2156M8174l7918
1085f873L195K0037m4997K2913N5662o6566l2912Q4843o816o5165L5762J7541
1097A6624l3740L3331O0o0218M6678N1675p9815j5896P7959k2736m1349L8509
$$ plain form
1109 11082 -237 -21405 31305 11252 -50928 10326 48986 -28639 -28081 30729 193 -13619
1121 -13619 18319 -15190 -19045 40682 3684 -49087 16547 37336 -27018 -12677 20466 -10521
1133 -10521 1692 20488 -27384 -12934 43047 -4771 -40792 20088 22143 -21997 1626 7713
1145 7713 -17313 15568 17751 -35170 -4467 40487 -12053 -28351 20557 7127 -13864 12257
1157 12257 -4988 -19736 25618 12063 -36761 3447 32037 -16330 -14347 16916 -5815 -4117
1169 -4117 18592 -15225 -17470 30033 4952 -32727 9379 21310 -16734 -2168 11168 -14345
1181 -14345 4089 19693 -20817 -12983 29495 -752 -25405 12242 10471 -13965 6485 4973
1193 4973 -16764 9518 17016 -21500 -7492 24496 -4190 -16018 10946 2488 -8506 10066
$$ packed form
1109A1082j1319k1168N2710k0053o2180O1254L8660p7625N58N8810l0536j3812
1121a3619L1938l3509l855N9727l6998n2771O5634K0789o4354J4341L3143l0987
1133a0521J2213J8796m7872J4450N5981m7818l6021O0880K055m4140K3623O087
1145G713k5026L2881K183n2921L0703M4954n2540j6298M8908j3430k0991K6121
1157A2257j7245j4748M5354j3555m8824M0208K8590m8367J983L1263k2731J698
1169d117K2709l3817k245M7503k5081l7679M2106J1931l8044J4566J3336k5513
1181a4345J8434J5604m0510P834M2478l0247k4653L7647j771k4436K0450j512
1193D973k1737K6282P498l8516J4008L1988k8686j1828K6964q458j0994J8572
$$ plain form
1205 10066 -1077 -14639 12495 10494 -18759 -1425 15983 -6505 -6550 7919 -4419 -2445 10707
1218 10707 -6712 -10371 12900 3766 -13668 3520 7540 -6881 1592 4278 -8684 2522 10303
1231 10303 -9632 -5668 12105 -1116 -8820 6361 1357 -6367 6319 1801 -9487 5000 8119
1244 8119 -10191 -2722 9838 -3455 -5639 6176 -917 -5274 6539 232 -7917 5463 5751 -7649
1258 -7649 -656 7017 -3576 -2908 4856 -1654 -3246 5120 -284 -5036 3675 2866 -4635 148 3175
1273 3175 -2609 -930 2309 -2182 -1167 3036 -867 -2382 2170 1070 -2009 708 1056 -766 601
1288 601 642 -1133 358 1327 -541 -42 1064 -159 -129 520 -487 7 500 -784 -599 1082 -109 -1012
1306 -1012 765 363 -955 800 353 -1359 -110 1191 -1315 -652 1398 -343 -1146 1543 732 -1331
$$ packed form
1205A0066j1143j3562K7134k001k9253J7334J7408k2488m5J4469j2338J974J3152
1218A0707j7419l659K3271r134j7434J7188M020j4421Q473K686j2962J1206P781
1231A0303j9935L964J7773j3221p704J5181n004p724J2686m518j1288J4487L119
1244H119j8310P469J2560j3293k184J1815p093m357J1813o307q149J3380K88j3400
1258g649O993P673j0593O68P764o510j592Q366n404m752Q711q09p501M783L027
1273C175n784J679L239m491J015M203l903j515M552j100l079K717L48j822J367
1288F01M1j775J491R69j868M99J106j223L0O49j007M94M93j284J85J681j191r03
1306a012J777m02j318J755m47j712J249J301k506O63K050j741q03K689q11k063
$$ plain form
1322 -1331 1230 1627 -1427 -303 1682 -642 -1121 1500 172 -1671 897 1074 -1516 -37 1712 -930
1338 -930 -1196 1462 -462 -1988 917 895 -1589 -95 1516 -666 -511 1409 31 -854 521 227 -594
1355 -594 26 175 -293 44 80 264 -425 -269 395 687 -1253 -509 1491 -839 -1459 1507 322 -1782
1373 -1782 1708 1239 -2920 850 3335 -2998 -1648 4377 -761 -3229 3445 781 -3562 3208 2705
1388 2705 -5111 1112 5484 -4323 -2769 5130 -1311 -4242 3807 -385 -4356 4608 2020 -6658 2619
1403 2619 5862 -5787 -1811 5338 -2551 -2342 4485 -2933 -3059 7086 -648 -6958 5175 4380 -6093
1418 -6093 709 3778 -4359 1369 4111 -7156 -971 9305 -4369 -6866 7389 1334 -5868 3996
1432 3996 -72 -6007 6839 3025 -11762 2771 11030 -7863 -4631 8932 -2660 -3146 7775
$$ packed form
1322a331K561L97l054J124J985k324m79K621j328j843K568J77k590J479J749k642
1338i30k66K658j924j526K905k2k484J494J611k182J55J920j378q85J375k94q21
1355e94O20J49m68L37L6J84o89J56O64K92j940P44K000k330o20K966j185k104
1373a782L490m69m159L770K485o333J350O025n138k468O674k664m343O770n03
1388B705p816O223M372r807J554P899o441k931Q049m192l971Q964k588q678R277
1403B619L243j1649L976P149p889K09O827p418j26J0145p734o310J2133p95j0473
1418f093O802L069q137N728K742j1267O185J0276j3674k497J4255o055p202R864
1432C996m068n935J2846l814j4787J4533Q259j8893L232J3563j1592m86J0921
$$ plain form
1445 7775 -5293 -6810 12920 520 -15352 7020 10352 -10961 -1116 8195 -7123 813 10413
1458 10413 -11632 -6349 17541 -3035 -16755 10332 8096 -11603 3618 5336 -10680 6810
1470 6810 10956 -17184 -3604 20448 -6237 -15390 11573 3559 -9058 7953 -817 -12488 13364
1483 13364 8977 -20947 366 19499 -8818 -10025 10194 -3333 -3374 12034 -8870 -12088 20106
1496 20106 4552 -22117 5629 14612 -10966 -1443 6467 -11086 4987 14966 -18067 -9479 25013
1509 25013 -1310 -20555 10379 7638 -10593 7572 803 -17376 13293 15928 -24702 -5556
1521 -5556 26559 -6367 -16177 12312 -840 -7830 15308 -6039 -20548 20480 13966 -28089 -1334
1534 -1334 23623 -9290 -8299 11071 -8858 -1688 20040 -13310 -20228 24956 9695 -26624 3656
$$ packed form
1445G775j3068j517J9730j2400j5872K2372L332k1313R845R311j5318P936R600
1458A0413k2045N283K3890k0576j3720K7087k236j9699J5221J718j6016J7490
1470F810M146k8140J3580K4052k6685r153K6963q014j2617J7011q770j1671K5852
1483A3364m387k9924K1313J9133k8317j207K0219j3527m1J5408k0904l218L2194
1496B0106j5554k6669K7746Q983k5578R523P910j7553J6073R979l3033Q588L4492
1509B5013k6323j9245L0934k741j8231J8165o769j8179L0669K635m0630J9146
1521e556L2115l2926r810K8489j3152o990K3138k1347j4509M1028o514m2055K6755
1534a334K4957l2913R91J9370j9929P170K1728l3350o918M5184j5261l6319L0280
$$ plain form
1547 3656 16125 -10217 1953 6884 -16882 5930 22061 -20112 -16485 26140 3256 -21171
1559 -21171 7615 5514 -8840 12303 485 -22115 14099 20952 -24483 -10111 24031 -3168
1571 -3168 -12166 9749 -5432 -5107 20500 -6772 -23751 20143 16516 -25263 -3370 17957 -7847
1584 -7847 -2286 9048 -14572 46 24645 -13433 -22181 22861 10106 -21902 2999 9717 -10366
1597 -10366 7359 6225 -21423 5901 25390 -17649 -17223 22771 3175 -16095 7870 196 -10190
1610 -10190 16148 2088 -24919 10821 22621 -19408 -10379 19103 -2626 -7677 9847 -8784
1622 -8784 -7092 20760 -3510 -23689 14055 16269 -17729 -3275 12078 -6570 1418 8503 -15258
1635 -15258 -2302 21815 -8328 -18970 15287 8456 -13630 3295 3804 -8834 9145 6132 -19322
$$ packed form
1547C656J2469k6342J2170M931k3766K2812J6131m2173L627M2625k2884k4427
1559b1171K8786k101j4354K1143j1818k2600L6214O853m5435J4372L4142k7199
1571c168q998K1915j5181L25K5607k7272j6979M3894l627m1779K1893K1327k5804
1584g847N561J1334k3620J4618K4599l8078q748M5042j2755l2008K4901O718k0083
1597a0366J7725j134k7648K7324J9489m3039M26L9994j9596j9270K3965p674j0386
1610a0190K6338j4060k7007L5740J1800m2029R029K9482k1729n051J7524j8631
1622h784J692K7852k4270k0179L7744K214l3998J4454J5353j8648P988P085k3761
1635a5258J2956K4117l0143j0642L4257o831k2086J6925N09j2638J7979l013k5454
$$ plain form
1648 -19322 2453 20025 -11637 -12509 14183 541 -8281 7942 -3379 -9132 14774 2922 -20277
1661 -20277 6407 15946 -12951 -6083 11286 -4251 -2499 10330 -8570 -7333 17371 -153 -17862
1674 -17862 8196 10464 -11577 -652 6866 -7367 2428 9096 -11355 -3983 15759 -3443 -12985
1687 -12985 8219 4623 -8236 3459 1708 -7732 6470 6273 -11635 -53 12624 -5020 -6851
1700 -6851 7176 -347 -4218 5630 -2693 -6520 8559 2981 -10704 2597 8108 -5867 -2241 5200
1714 5200 -3794 -644 5860 -5698 -4965 9303 408 -8422 4496 4245 -5390 1571 2982 -5304 1729
1729 1729 5554 -6546 -2496 7918 -1566 -5608 4845 1444 -4074 3372 1173 -5273 3131 3977
1743 3977 -6338 -1021 5755 -2345 -3206 3899 -540 -2236 3558 -162 -4404 3096 2520 -4800 54
$$ packed form
1648a9322K1775J7572l1662q72K6692j3642q822J6223j1321n753K3906j1852k3199
1661b0277K6684R539k8897O868J7369j5537J752J2829j8900J237K4704j7524j7709
1674a7862K6058K268k2041J0925P518j4233R795O668k0451P372J9742j9202r542
1687a2985K1204l596j2859J1695j751r440J4202j97j7908J1582J2677j7644j831
1700f851J4027p523l871R848q323l827J5079n578j3685J3301N511j3975L626P441
1714E200q994L150O504j1558P33J4268q895q830J2918k51r635O961J411q286P033
1729A729L825j2100M050J0414r484m042J0453l401n518P446k199o446Q404Q46
1743C977j0315N317O776q100q61P105m439j696N794l720m242P500n76p320M854
$$ plain form
1758 54 3628 -2160 -1217 2621 -979 -920 2753 -924 -2288 2335 602 -2786 602 1207 -1466 183
1774 183 1082 -1282 231 1433 -1375 -702 1423 -593 -1011 730 -363 -828 1109 86 -1187 1409
1790 1409 635 -1461 527 1376 -1387 -311 1298 -1118 -805 1544 -485 -1421 1590 779 -1595 329
1806 329 874 -1300 -566 823 -1131 -1086 1289 158 -1010 807 946 -1052 417 1228 -516 -782 736
1823 736 -335 -1098 546 438 -1069 28 993 -694 -92 792 -67 -789 180 135 -657 50 484 -211 13
1842 13 332 326 -52 -157 330 60 -140 -42 -76 -204 -310 552 -189 -579 838 519 -813 233 837 -1100
1862 -1100 -413 1153 -976 -817 1314 -1 -1479 1281 1095 -1441 548 1344 -1528 -422 1718 -1131
1878 -1131 -1285 2365 -61 -2143 1398 925 -1939 1053 1226 -2035 423 2228 -2027 -1439 2681 -449
$$ packed form
1758E4L574n788R43L838l600N9L673l677j364M623j733l388L388O05k673J649
1774A83Q99k364J513J202k808O73K125k016m18J741j093m65J937j023j273K596
1790A409p74k096J988Q49k763J076J609k416L13K349k029r36L011q11k374J924
1806C29N45k174P34J389j954M5K375j131j168J817J39j998J469Q11j744k66J518
1823G36j071p63J644j08j507J097R65j687O02Q84q59p22R69m5p92P07M34o95K24
1842A3L19ol78j05M87k70k00R8l4j28j06Q62p41l90J417l19j332J046O04j937
1862a100O87J566k129J59K131j315j478K760j86k536J989P96k872J106K140k849
1878a131j54L650k426k082L541m73k864K992J73l261K458J805m255N88M120l130
$$ plain form
1894 -449 -1756 1931 315 -1473 1999 874 -2553 1155 1742 -2828 -391 2164 -1510 -594 2109 -1143
1910 -1143 -519 2999 -1122 -2650 3036 664 -3408 1364 1214 -2404 1694 1518 -3763 1398 4400 -3456
1926 -3456 -2162 4596 -938 -3077 2968 -439 -3237 4089 719 -6332 3000 5222 -5723 -1067 5351
1941 5351 -2761 -2369 4471 -2720 -3485 6914 -526 -7512 5010 5202 -6454 -201 5033 -4009 -234
1956 -234 4833 -5157 -2479 8214 -2483 -7576 6106 3391 -6349 1812 2849 -4889 3348 3593 -7806
1971 -7806 200 8839 -4936 -5837 6761 529 -4157 4055 -1140 -4727 7123 1478 -10072 3125
1985 3125 8461 -7176 -2864 6221 -3122 -993 6037 -5908 -4348 10566 -802 -11147 6194
1998 6194 6387 -7550 626 4212 -6112 2922 7082 -9789 -2677 13302 -3739 -10494 8021 3286
$$ packed form
1894d49j307L687j616j788L472j125l427L708N87m570K437K555l674R16K703l252
1910a143O24L518m121j528N686k372m072M772j50l618M098j76n281N161L002p856
1926c456J294O758n534k139O045l407k798P326l370p051R332K222j0945M656O418
1941E351q112L92O840p191p65J0399p440o986J2522J92j1656O253N234r042L775
1956b34N067r990K678J0693j0697n093J3682k715r740Q161J037p738Q237K45j1399
1971g806Q006Q639j3775r01J2598o232m686Q212n195l587J1850n645j1550J3197
1985C125N336j5637M312R085r343K129P030j1945J560J4914j1368j0345J7341
1998F194J93j3937Q176L586j0324R034M160j6871P112J5979j7041o755J8515m735
$$ plain form
2012 3286 -7070 4182 1063 -8205 7160 6268 -13189 -10 13357 -6064 -7795 8379 -786
2025 -786 -4574 7342 -3431 -8407 11004 4526 -14498 2473 11370 -6995 -3647 6353 -4734
2038 -4734 -532 8673 -7540 -7218 13389 1235 -13307 4751 7589 -6890 1125 3049 -7694
2051 -7694 4211 8870 -11473 -4396 14016 -2038 -10100 6329 2221 -4923 5802 -1285 -9948
2064 -9948 9146 7518 -14219 -910 13152 -4870 -5723 6823 -3303 -2516 9834 -5679 -10557
2077 -10557 12895 5301 -14966 2161 9988 -6788 -994 5826 -7473 807 12012 -9003 -9261
2090 -9261 14110 2387 -12938 4474 5964 -6774 3609 3130 -10248 4127 11059 -10856 -6320
2103 -6320 13164 -512 -8967 5014 814 -4756 6895 -266 -10881 7368 8791 -11270 -3021
$$ packed form
2012C286j0356J1252l119r268J5365q92j9457J3179J3367j9421j731J6174r165
2025g86l788J1916j0773m976J9411o478j9024J6971Q897j8365L348J0000j1087
2038d734M202R205j6213L22K0607j2154j4542J8058K838j4479Q015J924j0743
2051g694J1905M659k0343P077J8412j6054q062J6429m108p144J0725p087q663
2064i948J9094j628k1737J3309J4062j8022q53J2546j0126P87J2350j5513m878
2077a0557K3452p594k0267J7127P827j6776N794O820j3299Q280J1205k1015k58
2090i261K3371j1723j5325J7412J490j2738J0383m79j3378J4375O932k1915M536
2103f320J9484j3676q455J3981m200n570J1651p161j0615J8249J423k0061Q249
$$ plain form
2116 -3021 10149 -3005 -4075 4944 -4291 -1921 9508 -4035 -9680 9628 5579 -10453 1041
2129 1041 6139 -5044 1366 3898 -8272 1406 10509 -6993 -7707 10385 1827 -8393 3884 2003
2143 2003 -5344 5461 2036 -10178 3804 9572 -8511 -4956 9547 -1328 -5327 5354 -1959
2156 -1959 -4710 7938 -48 -10283 5344 7587 -8360 -1954 7199 -2884 -1564 5037 -4492 -3084
2170 -3084 8627 -2019 -8627 6212 4785 -6986 366 4111 -3832 1277 4033 -5486 -827 7616
2184 7616 -3458 -5797 5572 1470 -4518 2327 770 -3541 3582 1721 -6042 1420 5550 -4045
2198 -4045 -2521 4498 -855 -1754 3038 -2096 -2712 5173 -91 -5597 3120 3623 -4398 -252 3066 -2744
2214 -2744 174 3532 -3706 -1378 5580 -1354 -4648 3386 1946 -3782 1367 2218 -3392 1113 3304
$$ packed form
2116c021J3170j3154j070R019r235K370J1429j3543n645J9308m049j6032J1494
2129A041N098j1183O410K532j2170R678R103j7502p14J8092q558j0220J2277j881
2143B003p347J0805l425j2214J3982N768j8083L555J4503j0875l999J0681p313
2156a959k751J2648p986j0235J5627K243j5947O406R153j0083J320O601r529J408
2170c084J1711j0646o608J4839j427j1771P352L745p943N109K756r519M659Q443
2184G616j1074k339J1369m102n988O845j557m311P123j861p763P462M130r595
2198d045J524P019n353q99M792n134o16P885n264n506Q717N03q021M146L318n810
2214b744K918L358p238K328O958o934l294Q034j440n728N149Q51n610M505K191
$$ plain form
2229 3304 -4050 -1054 4434 -1581 -3297 3444 495 -2818 1795 926 -2928 1619 2291 -3306 -73
2244 -73 3499 -1818 -1748 2427 -136 -1327 1665 64 -1635 1851 851 -2348 430 1816 -1250 -218
2260 -218 1329 -538 -12 1075 -901 -748 1651 -171 -1342 983 315 -804 455 233 -924 830
2276 830 534 -1385 -65 1348 -732 -422 985 -354 -555 1220 55 -1112 926 440 -1486 459
2292 459 1064 -964 -681 1178 -585 -615 957 -31 -828 1044 368 -1401 336 976 -695 -292 782
2309 782 -366 -583 652 127 -1064 500 411 -705 14 755 -527 -84 710 61 -765 190 377 -329
2327 -329 141 422 -340 -86 279 -212 -178 296 3 -332 -57 -43 -12 -11 131 202 -33 130 277 215 -382 160
2349 160 314 -28 6 644 23 -672 537 306 -735 192 755 -903 -168 778 -418 -582 1343 -50
$$ packed form
2229C304p354K996N488o015j716O741k949l313M613q69l854M547O72n597L233
2244g3L572n317P0M175k563j191K992j601j699L486j000l199K778J386l066J032
2260b18J547j867N26J087j976J53K399j822j171K325o68j119J259k22j157J754
2276H30k96j919J320J413k080L10J407j339k01J775j165j167K038m86j926J945
2292D59O05k028K83J859j763l0J572r88p97J872o76j769J737O40j671M03J074
2309G82j148k17J235n25j191J564q9j116P19P41j282M43P94o49q26R55J87p06
2327c29M70K81p62K54L65m91L4M74k93l35K75J4L1JJ42P1k35J63J47o2n97N42
2349A60J54l42L4O38o21o95J209k31j041R27N63j658P35R46j196j64J925j393
$$ plain form
2367 -50 -1151 765 634 -1280 56 1400 -839 -206 876 -698 -583 1033 112 -988 877 575 -1132
2384 -1132 191 882 -939 1 977 -860 -512 1106 -97 -943 772 54 -863 715 1 -760 946
2401 946 250 -1102 86 823 -831 -250 631 -767 -107 1337 -991 -885 2064 -322 -1716 1044 532
2418 532 -1415 961 510 -1750 935 1961 -2022 -688 2798 -909 -1516 1954 -525 -1605 1940 -41
2434 -41 -2858 1846 2089 -3085 -64 2959 -1545 -953 2188 -1383 -1257 2792 -938 -3139 2824 1435
2450 1435 -3701 791 2471 -2251 -241 2285 -2355 -251 3354 -1987 -2753 3405 845 -3330 1568
2465 1568 1281 -2320 1725 1184 -3473 1198 3431 -3289 -1868 3699 -833 -2306 2314 -666 -1662 3599
2481 3599 -388 -4162 2938 2972 -4510 -22 3324 -2312 -378 2798 -2789 -1070 5239 -1911 -4633
$$ packed form
2367e0j101J916j31j914J336J344k239O33J082j574J15J616r21j100J865l02j707
2384a132J323O91j821R40R76j837L48J618j203q46J715p18r17J578p14p61J706
2401I46o96j352J188P37j654N81Q81j398O60J444k328J06K949k386j394K760n12
2418E32j947K376m51k260K685J026l983J334L486l707o07L470k479j080L545j981
2434d1k817M704K43n174L021L023m504N92L141l571J26M049l730k201N963j389
2450A435n136M492J680m722K010K526m640K104L605n341p66O158k560m175M898
2465A568k87l601M045n41m657M671K233o720J421N567m532j473M620k980r96N261
2481C599l987l774P100L4p482M488L346n636J934L176n587J719O309p150k722
$$ plain form
2496 -4633 4472 1902 -4860 1298 2363 -3371 1465 2600 -4940 316 5908 -3282 -3990 5232 609
2511 609 -4398 2475 514 -3537 3461 1654 -6196 1729 5848 -4230 -2865 4796 -670 -2339 3428
2526 3428 -1851 -3157 5244 70 -6399 3189 4404 -4726 -527 3777 -2613 254 3295 -4446 -1523
2541 -1523 6817 -1819 -5882 4260 2619 -4127 1548 1591 -3467 3003 2649 -6212 257 6742 -3653
2556 -3653 -4325 4973 235 -3089 3362 -996 -4244 5126 1926 -7351 1703 6113 -4696 -2495 4355
2571 4355 -1748 -1127 4278 -2913 -3619 6648 306 -7428 2917 4534 -4923 -73 3364 -3489 785
2586 785 4513 -4950 -2442 7249 -1017 -5907 3719 2131 -3879 1768 1230 -4230 3085 3818 -6094 -683
2602 -683 6790 -2464 -3899 3621 -308 -2284 3445 -1367 -4196 4764 2410 -6150 1042 5141 -3169
$$ packed form
2496d633R105k570o762O158J065n734M836J135p540N256N592r190p08R222m623
2511F09n007O873j961m051O998j807p850P925M119j0078J365P661n466j669N767
2526C428n279j306Q401n174o469R588J215r130M199M304o390K867L041p741K923
2541a523Q340q636m063J0142j641o746N675M3n058O470l54q861O469O485j0395
2556c653o72R298m738l324O451m358l248R370l200r277R054M410j0809K201O850
2571D355o103O21N405p191p06J0267o342p734J0345J617r457M850L437o853M274
2586G85L728r463K508R691q266m890R626j588o010N647n38n460P315P33r912N411
2602f83P473r254j435P520l929j976N729m812k829Q960k354q560P192M099q310
$$ plain form
2617 -3169 -1338 3057 -2539 -389 4106 -3336 -3471 5929 662 -5772 2310 2891 -3289 986 1658 -4000
2633 -4000 1424 4413 -4843 -2214 5923 -1025 -4284 3519 989 -2816 2652 300 -4600 2662 3704
2648 3704 -5442 -1267 5182 -2082 -2520 3210 -825 -1648 3650 -889 -4475 3442 2347 -5077 438
2663 438 3717 -2255 -653 2693 -2272 -433 3727 -2400 -3010 3928 746 -3788 1090 1909 -2324 1048
2679 1048 1639 -2757 978 3236 -2632 -1845 3298 -701 -2582 1936 56 -1631 2212 240 -2985
2694 -2985 1979 2477 -2924 -507 2896 -1515 -1345 2005 -1292 -1054 2863 -1214 -2653 2865 1353 -3093
2710 -3093 581 1722 -1858 -281 1326 -2098 -458 2735 -1460 -1892 2546 575 -2318 862 1044
2725 1044 -1841 514 1089 -2207 302 2255 -1288 -1109 2180 17 -1470 966 223 -1344 1118 466
$$ packed form
2617c169J831M395n596K150M495p442j35R400n267o434Q082N81o180M275O72n658
2633d000N424K989r256K629Q137o948l259P803k530l805N468k352m900P262J042
2648C704r146M175O449p264m38N730m035q23N298m539l586P917j095p424N515
2663D38L279n972J602L346m965J839M160o127o10O938l182m534M878Q19m233L372
2679A048N91m396L735K258n868P87N143l999j881M518j880j687L843j972l225
2694b985M964M98n401K417L403m411J70L350l297K38L917m077j439N518j512m446
2710c093L674J141l580J577J607l424J640L193m195m32M438j971k893L180J82
2725A044k885K355N75l296K509J953l543J79L289k163j487K436p43j567K462o52
$$ plain form
2741 466 -1796 482 1286 -1171 -448 1440 -122 -523 885 -402 -647 1088 -256 -1174 839 478 -887
2758 -887 258 818 -651 279 734 -942 143 881 -844 -980 978 -77 -861 826 210 -517 824
2775 824 240 -1077 641 754 -973 -324 718 -490 -700 681 197 -770 507 799 -850 87 448
2792 448 -790 -374 525 -158 -336 586 34 -353 645 303 -440 380 508 -685 -314 159 -377 -279 283 31
2812 31 -153 504 318 -134 273 116 -387 -367 -232 -97 -130 22 292 32 244 33 171 340 -124 45 201
2833 201 -34 -87 -35 137 -339 397 160 -248 305 242 -368 -112 426 -432 -306 469 -162 -480 494 187 -524
2854 -524 420 569 -198 -93 93 -378 -631 361 -20 -314 423 333 -436 552 317 -496 -56 368 -242 -241 238
2875 238 -325 -368 303 -191 -418 596 148 -205 178 -25 -438 277 94 -591 -127 404 -363 -86 639 -133
$$ packed form
2741D66k262K278Q04k457P23J888j562m01J408j287k45J735j344r18K013l61j365
2758h87J145N60j469R30M55j676J085P38j725j36J958j055p84J687o16p27J341
2775H24n84j317J718J13j727O49J042j208k10J381m84r67J277K92j649R37L61
2792D48j238M16Q99o83j78R22n52l87R98l42p43Q20J28j193L71M73n36R8N62k52
2812C1j84O57j86m52M07j57n03K0J35J35l3J52K70k60K12k11J38J69m64J69J56
2833B01k35n3N2J72m76P36k37m08N53o3o10K56N38q58J26P75o31l18R74l07p11
2854e24R44J49p67J05J86m71k53R92l81k94P37r0p69R88k35q13M40M24o10JM79
2875B38n63m3O71m94k27J014m48l53L83k03m13P15j83o85M64N31p67K77P25p72
$$ plain form
2895 -133 107 485 -305 -247 441 -572 -876 581 366 -752 302 364 -612 354 535 -685 -123 977 -889
2914 -889 -989 1004 69 -836 645 504 -918 1013 475 -1326 -66 1189 -934 -911 1230 -397 -799
2931 -799 751 38 -786 1212 549 -1471 626 1317 -1149 -655 1008 -645 -386 1086 -756 -709 1858
2948 1858 47 -1554 978 898 -994 21 585 -1221 220 1025 -1596 -604 2116 -271 -1241 1459
2964 1459 343 -1006 658 -175 -1772 1429 1042 -2312 390 2232 -1176 -730 1563 -533 -721 1622
2980 1622 -952 -1670 2112 340 -2824 1076 1924 -1636 111 1266 -1244 23 2207 -1968 -1712 2719
2996 2719 -176 -2711 1413 1193 -1556 1189 995 -2103 872 2159 -2883 -1221 2816 -1019 -2124
3011 -2124 1544 -88 -1276 2043 -57 -2394 2150 1881 -3370 -327 2504 -1378 -1088 1720 -1120
$$ packed form
2895a33K40L78p90N8O88j013l04J457k15j118J054O2r76R66J81j220N62J100j866
2914h89j00J993r35r05J481j41j422J931n38j801J260J255k123K3K141j627m02
2931g99J550p13q24J998o63k020K097O91k466M94J663j653K59J472j842M7K567
2948A858j811j601K532q0j892J015N64j806J441Q05k621R92K720k387r70K700
2964A459j116j349J664q33j597L201l87l354K702J842l408M46K293k096j88K343
2980A622k574p18L782j772l164L900Q48l560J747J155k510J267K184m175K56M431
2996B719k895k535M124k20k749K745j94l098K975J287n042J662M037l835j105
3011b124L668j632j188L319k100k337M544k69n251L043K831l882K90K808k840
$$ plain form
3026 -1120 -425 2508 -1388 -2393 2820 902 -3238 765 1693 -1785 275 913 -2249 446 3310 -2450
3042 -2450 -1839 3559 369 -2636 1449 568 -1983 1575 276 -3002 1647 3060 -3171 -772 3482
3057 3482 -788 -1662 1883 -922 -1242 2618 -546 -3527 2557 2508 -3441 -156 2662 -1685 -320 1830
3073 1830 -2111 -666 3233 -1325 -3218 3041 1549 -3052 852 1540 -1619 969 1731 -3023 209
3088 209 3301 -2222 -2507 2860 489 -2114 1543 274 -1417 2315 588 -3274 1371 2489 -2998
3103 -2998 -1265 2524 -754 -756 1870 -1428 -831 3139 -373 -3442 2104 1969 -2857 -267 1706 -1465
3119 -1465 163 1739 -2204 -215 3642 -1152 -2829 2455 940 -2715 661 620 -2046 1607 1590 -2988
3135 -2988 81 3504 -1588 -2030 2341 -104 -1837 1094 -328 -1946 2120 783 -2686 1139 2602
$$ packed form
3026a120O95K933l896j005N213j918m140M003R28l478K060O38l162K695K864n760
3042b450O11N398l190l005M085q81k551L558j299l278M649J413o231K399M254
3057C482m270q74L545k805l20L860l164k981O084m9n949L285K818m347J365K150
3073A830l941J445L899m558j893O259j492m601L904O88l159K588P62m754L232
3088B09L092n523k85N367k371k603L657j269j691L732j727l862M645J118n487
3103b998J733L789l278kK626l298N97L970l512l069N546j35m826K590J973l171
3119a465J628J576l943J989L857m794j677N284j515l655L376m1k666L653j7m578
3135b988L069L423n092m42M371k445j733K931j422j618M066j337l469L825J463
$$ plain form
3150 2602 -1864 -790 1774 -748 -712 1603 -1511 -1332 2636 129 -2683 1345 1837 -1652 247 1137
3166 1137 -1202 455 1396 -1940 -696 2604 -535 -1926 1610 713 -1234 946 229 -1574 1226 847
3182 847 -2285 -14 2056 -1163 -988 1746 -137 -695 1451 -523 -1571 1802 317 -2273 368 1478
3198 1478 -1321 -489 1408 -863 43 1770 -552 -1256 1808 -90 -1948 682 1021 -1169 115 638
3214 638 -1112 205 1288 -1239 -657 1391 -312 -1345 857 30 -1058 476 296 -643 872 797 -1007
3231 -1007 16 1205 -455 -801 619 -569 -483 724 -579 -670 1024 557 -614 396 776 -888 -88
3248 -88 416 -612 -322 530 -684 -369 1171 -120 -863 567 253 -743 122 298 -715 358 680 -730
3266 -730 -163 986 -113 -742 438 -173 -573 152 -374 -688 210 539 -589 -84 725 -350 -227 579
$$ packed form
3150B602m466J074K564k522L6K315l114J79L968k507k812M028M92l489J899Q90
3166A137k339J657R41l336J244L300l139j391L536q97j947K180p17j803K800l79
3182H47l132K271K070l219J75K734j883n58K146j974j048L373j485k590K641J110
3198A478k799Q32J897k271R06J727k322p04L064j898j858K630L39k190J284N23
3214F38j750J317J083k527N82K048j703j033K202q27j088J534j80r39J515p5j804
3231a007J023J189j660l46J420j188Q6J207j303r1J694m67j171J010L80j664Q00
3248h8N04j028K90Q52j214L15J540j291p43J430l14r96Q65J76j013J073L22j410
3266g30N67J149j099o29J180o11m00P25n26l14Q98L29j128N05Q09j075J23Q06
$$ plain form
3284 579 96 -212 457 -33 -650 209 156 -534 195 718 -65 -258 328 94 -196 94 -145 -395 266 -399
3304 -399 -667 115 305 27 1 118 -279 94 229 -42 -121 380 -112 -429 95 63 -331 78 229 21 209
3325 209 482 -45 -201 300 -171 -199 23 -156 124 468 69 -151 -51 11 -178 150 290 -470 -119 299 -235
3346 -235 52 235 -10 -205 309 192 -345 135 195 -249 -387 430 -189 -275 422 34 -48 372 136 -198 168
3367 168 391 -115 -9 -178 -103 74 301 -54 253 370 -31 34 327 -211 -139 27 -179 -173 194 170 -196 254
3389 254 21 -241 172 365 -334 -101 -3 -485 -359 514 -257 -218 394 232 -370 451 114 -465 -236 295 -816
3410 -816 -99 799 -567 -238 600 -107 -417 436 78 -211 98 -14 -782 139 212 -839 -441 767 -98
3429 -98 -485 566 29 -304 575 -287 -466 536 156 -943 157 631 -184 -9 609 -157 -35 685 -375
$$ packed form
3284E79m83l08O69m90o17Q59n3o90P29N23p83j93N86k34k90K90k39k50O61o65
3304c99k68P82J90k78k6J17l97L73J35k71p9N01m92l17N24l2l94M09J51k08J88
3325B09K73n27j56N01m71k8K22j79K80L44l99k20J00O2j89L28J40p60L51M18n34
3346b35K87J83k45j95N14j17n37M80O0m44j38Q17o19q6O97l88q2M20k36l34L66
3367A68K23n06J06j69P5J77K27l55L07J17m01O5K93n38P2J66k06OL67k4l66M50
3389B54k33k62M13J93o99K33R8m82J26Q73p71L9O12j62o02Q21l37n79K29N31j111
3410h16P17Q98j366L29Q38p07l10Q53l58k89L09j12p68R21P3j051L98J208q65
3429i8l87J051n37l33Q79q62j79J002l80j099J100M74q15J75O18p66J22P20j060
$$ plain form
3448 -375 -844 797 134 -642 296 344 -496 724 224 -1006 537 950 -1031 -636 957 -212 -597 435
3466 435 -297 -550 912 115 -1109 802 1091 -1145 -185 783 -740 -450 679 -590 -404 1667 -66
3483 -66 -1474 1087 819 -1334 96 556 -1056 181 635 -1650 104 1670 -537 -879 1277 298 -831
3500 -831 392 68 -726 885 157 -1761 316 1533 -1005 -553 1137 -104 -345 600 -839 -697 1606
3517 1606 -72 -2085 700 1319 -933 127 733 -642 297 1139 -1304 -735 1699 -578 -1823 1172
3533 1172 701 -886 706 657 -1350 1104 1091 -2128 -179 2058 -1123 -1796 1126 14 -780 1052 -404
3550 -404 -1202 1806 745 -2235 476 1593 -1163 -697 939 -703 -212 1442 -1050 -1262 2178 546
3566 546 -1980 801 1391 -1298 37 616 -1170 615 1297 -1465 -545 2046 109 -1443 856 506
$$ packed form
3448c75m69J641o63p76R38M8q40J220n00j230J543M13j981L95J593j169l85J032
3466D35p32k53J462p97j224J911K89k236R60R68j523K90J129j269J86K071j733
3483f6j408K561k68k153J430M60j612J237M54k285J754J566k207l42K156r79j129
3500h31J223l24p94J611p28j918K077J217k538M52J690j241k41R45j439J42K303
3517A606j678k013K785O19k252J060O06j375R39Q42k443N69K434k277j245K995
3533A172m71j587J592m9k007K454j3l219J949K237l181o73K922j112p94J832j456
3550d04p98L008j061k980K711J117k756M66J636j642M91J654k492k12L440j632
3566E46k526K781N90k689J335N79j786J785O82k762R20K591j937j552K299l50
$$ plain form
3582 506 -942 1006 -59 -1507 1079 1299 -2075 -384 1935 -438 -896 957 -246 -461 1344 -809
3598 -809 -1573 1629 766 -1878 200 1444 -597 -305 822 -949 -183 1614 -1206 -1389 1853 394
3614 394 -2026 404 1244 -575 636 382 -1584 523 1543 -1634 -1276 1917 55 -1294 625 125
3630 125 -496 845 71 -1602 1131 1244 -1809 -509 1389 -539 -766 782 -431 -126 1414 -457
3646 -457 -1315 1677 582 -1656 -24 776 -797 -147 748 -855 132 1674 -954 -989 1520 323 -1202
3663 -1202 627 476 -808 809 221 -1222 475 1761 -1272 -900 1446 126 -866 716 -138 -846
3679 -846 962 113 -1306 609 1210 -1138 -405 1310 -482 -171 543 -704 -334 1253 -320 -1145 1066
3696 1066 710 -1211 197 799 -414 285 494 -768 -105 1066 -554 -910 958 475 -535 479 132
$$ packed form
3582E06j448J948j065j448K586K20l374J691K319k373m58J853j203k15J805k153
3598h09p64L202q63k644K078J244k041K92J127j771P66J797k820j83L242j459
3614C94k420K430Q40j819J211k54j966K107J020l177L58L193j862j349J919n00
3630A25o21J341p74j673K733J13l053J300J898j928k27J548j213L05J540j871
3646d57q58K992j095k238J632Q00j573O50Q95j603R87J542k628l5K509j197j525
3663a202J829j51j284J617n88j443J697J286l033L72K346j320r92J582q54p08
3679h46J808q49j419J915O01k348P33J715j792L11P14j247L70J587j573q25K211
3696A066l56j921J408O02j213O99K09j262O63J171j620l56J868m83j010J014l47
$$ plain form
3713 132 -416 538 123 -1072 298 871 -539 -477 771 -182 -216 440 -15 -321 731 -234 -659 413 602
3732 602 -734 -333 407 -310 189 529 -643 -261 778 -117 -614 271 311 -877 -139 322 -535 212 495
3751 495 -374 -175 750 -197 -485 287 -22 -572 38 23 -517 325 303 -624 -6 447 -295 -353 288 -94 -450
3772 -450 140 -200 -209 358 197 -520 107 503 -181 -225 266 111 -190 304 -201 -185 213 99 -303 31 234
3793 234 25 239 -10 -152 54 18 -244 -52 175 -148 -208 333 184 -143 241 -32 -332 -48 11 -218 41
3814 41 310 20 -318 251 -25 -300 231 -156 -48 181 -42 -345 148 152 -423 -13 206 335 -194 249 83
3835 83 -204 385 13 -146 -45 218 -318 121 224 96 -171 323 133 -165 162 40 -345 46 -130 -209 244
3856 244 90 -364 25 203 -44 -30 166 -207 -264 56 121 8 205 -138 45 619 149 108 228 86 -207
$$ packed form
3713A32n48R54m15j195J370N73j410O2J248r53l4O56m55l06J052r65m25J072J89
3732F02j336M01P40p17M99L40j172L82J039q95m97Q85M0j188P38M61q57P47K83
3751D95q69J99R25r47k88P72l09n50O10j5n40Q42k2r27O18M53p42n8O41l82l56
3772d50N90l40rN67j61p17O27L96o84m4M91j55l01M94n05J6L98j14m02L34K03
3793B34k09K14k49j42K06l6k62J92K27l23o0N41j49l27L84k73l00K84N9k29K59
3814D1K69k90l38N69k76k75N31l87J08K29k23l03M93Mn75M10K19J29n29M43j66
3835H3k87N89l72j59J01K63n36M39J03j28k67M94j90k98L27j22l85L91j76p9M53
3856B44j54m54L89J78k47J4J96l73n7L20O5j13J97l43J83N74m70m1J20j42k93
$$ plain form
3877 -207 160 155 -309 -259 52 -158 -17 159 -62 1 314 -92 -379 132 145 -232 73 135 -329 43 403 -218
3899 -218 -87 285 -8 -323 47 97 -336 79 74 -70 67 199 -98 -58 458 -110 -15 330 -132 -143 172 0
3921 0 -161 343 17 -337 8 544 -370 13 73 -365 87 277 -318 -479 449 76 -424 203 72 -373 124
3942 124 77 -322 2 664 -608 -167 659 -350 -377 478 -2 -139 312 -96 -544 537 576 -886 76 763
3962 763 -435 -223 836 -232 160 711 -296 -570 657 392 -930 467 749 -389 263 280 -534 165
3980 165 909 -582 -626 614 118 -511 295 52 -719 478 -211 -707 591 737 -728 -239 805 -262
3998 -262 -583 221 -303 -382 970 -344 -806 705 659 -887 -232 469 -386 -136 350 -972 -85 1135 -649
4017 -649 -920 1029 664 -1117 220 603 -561 580 433 -1148 340 897 -786 -652 1136 142 -842
$$ packed form
3877b07L67nm64N0L11k10J41J76k21O3L13m06k87N11J3l77L05O2m64L72L60o21
3899b18J31L72k93l15L70N0m33M15nj44J37J32k97M0N16n68R5L45m62j1L15j72
3921@j61N04l26l54L45N36r14L83O0m38M52J90n95j61R28l73n00O27j31m45M97
3942A24m7l99L24O62j272M41Q26j009k7Q55m80j37M51m08m48J081L9j462R62O87
3962G63j198K12J059j068L92N51j007k74J227k65j322J397K82j138O52J7q14O99
3980A65P44j491m4J240m96o29Q06k43p71J197o89m96J298J46j465M89J044j067
3998b62l21Q04n24p9J352j314m62J511m6j546O55P01q55K50M86j322Q87J220j784
4017f49k71J949l65j781J337L83j164J141j47j581J488N57j683J34J788r94r84
$$ plain form
4034 -842 753 -193 -846 713 -46 -1237 661 1151 -1074 -471 1071 -62 -232 554 -692 -324 1018
4051 1018 -227 -1359 578 575 -1151 -145 891 -405 367 592 -719 -192 1241 -413 -1224 955 526
4068 526 -830 149 186 -390 896 601 -1263 114 1428 -855 -752 819 -8 -485 655 -276 -829 1020
4086 1020 363 -1517 338 1114 -764 -630 882 -490 -231 765 -625 -235 1587 -26 -1299 572
4102 572 949 -661 21 353 -375 486 629 -1364 -343 1377 -196 -998 475 431 -692 330 255 -773
4120 -773 573 637 -1329 94 1390 -552 -672 653 -34 -188 710 -285 -669 1170 370 -1376 224
4137 224 1057 -643 -299 362 -180 -50 594 -872 -628 1451 -48 -1120 592 574 -649 175 91 -746
4155 -746 492 700 -1064 -400 1171 -317 -559 516 -46 -494 632 -122 -692 912 658 -1238 176
$$ packed form
4034h42J595r46o53J559p59j191J898M90k225O03J542j133j70P86j246L68J342
4051A018j245j132J937lj726J006J036j296P72K25j311N27J433j654q11K179m29
4068E26j356R79L7n76J286k95j864J377J314k283J03J571q27m77J140r31n53J849
4086A020o57j880J855P76j878J34J512j372K59R96j390L90J822j613j273J871
4102E72L77j610O82L32p28Q61J43j993J021J720j573q02J473m4j123J022p5j028
4120g73J346O4j966J423J296j942j20J325o87j54Q98r95l84J839q00j746J600
4137B24Q33j700L44O61n42J30O44j466K44K079j499j072J712j8j223Q24q4q37
4155g46J238K08j764O64J571j488k42J075n62m48J126p54n70J604k54j896J414
$$ plain form
4172 176 925 -504 -331 473 -396 56 783 -458 -641 838 415 -963 351 628 -460 199 338 -385
4190 -385 146 755 -563 -455 801 80 -604 273 259 -497 208 141 -651 350 587 -693 -217 916 -116
4209 -116 -429 152 -193 -386 402 26 -709 411 414 -672 -74 651 -355 -122 517 -296 -102 511 -121 -578
4229 -578 610 194 -687 158 159 -383 128 163 -343 -206 453 -711 -331 681 21 -277 236 338 -49 170
4249 170 153 -491 285 508 -285 -131 462 -11 -187 252 -130 108 346 62 -469 294 287 -324 -168 -31 -138
4270 -138 -193 122 12 -130 260 33 -418 78 222 -315 -149 -10 -432 -96 -268 -217 -214 246 -215 -102 298
4291 298 -31 -216 67 64 49 218 -57 -338 132 202 -245 -43 404 16 -207 19 -109 -34 252 -54 -424 -28
4313 -28 168 -192 74 112 -183 -92 129 154 -165 -67 119 11 201 41 26 31 292 64 81 375 60 -23 58 -182
$$ packed form
4172A76P49j429J73Q04q69M52P27j241j83J479m23j378J314K77j088O59J39p23
4190c85N31O09j318J08J256p21o84Q77j4p56P05o7p92J001K37j280M76J133j032
4209a16l13N81l45j93P88l76p35J120Lj086N98P25j006K33O39q13J94O13o32m57
4229e78J188m16q81Q45Jn42N11L5n06J37O59j164L80J012o60k98N13J02l87K19
4249A70j7o44P76K23p93J54N93m73j76M39l82K38K38k84n31P63po11J56J37j07
4270a38n5L15j10j42L90k27m51M96J44n37J66J39m22L36j72N1LM60m61J13M00
4291B98l29j85K83lj5J69k75k81M70P0m47K02M47l88k23K26j28P5K86l06l70L96
4313b8J96l60K66L8k95R1K21K5l19R8J86j08J90j60j5NK61k28J7K94l15q3Q1k40
$$ plain form
4337 -182 -86 70 92 -214 171 19 -188 83 155 -140 -93 22 -104 51 37 -42 66 201 118 -82 221 169 -366
4360 -366 42 -159 -135 -123 -50 -164 106 148 2 -108 196 -127 -295 76 16 -351 92 141 -296 -14 260 -130
4382 -130 -232 245 -133 -45 185 110 -199 207 142 54 121 -125 -143 101 -46 -415 147 125 -142 -194 314 67 -215
4405 -215 67 44 -26 153 125 -291 169 53 -43 26 125 -154 -62 325 -229 -193 331 -240 -343 307 119 -173 122
4428 122 252 -287 70 119 -424 49 635 -1 -337 379 403 -129 383 150 -104 169 56 -434 81 396 -186
4449 -186 -43 423 -389 -232 285 -226 -534 524 200 -532 145 313 -476 29 448 -108 180 430 -202 -385
4469 -385 520 -60 -520 351 204 -284 140 -139 -340 297 245 -683 -96 601 -110 -245 284 -78 -154 531 -101
4490 -101 -408 613 393 -735 38 509 -533 -298 194 -284 -30 421 -399 -400 706 123 -808 268 366
$$ packed form
4337a82R6J56K2l06L85j52k07K71P2k95M7J15j26J55j4p9J08J35q3k00L03n2n35
4360c66M08k01K4J2P3j14K70M2j46j10L04l23j68L71o0l67M43M9m37K82K74l90
4382a30j02M77l78Q8K30p5l09M06o5q8O7k46j8K44j47l69N62k2k67n2N08k47k82
4405b15K82k3p0J79k8m16M60j16r6O9R9k79R2L87n54L6N24n71j03O50j88k92K95
4428A22J30n39L57M9n43M73N86o36l36P16K4n32N12k33k54K73j13m90N15L15n82
4449a86J43M66q12J57N17n11l08J058l24p32O77J68p89N05M19n56K88K50o32j83
4469c85R05n80m60Q71j47m88M24k79k01O37n2r28N87O97p11j35N29l62p6O85o32
4490a01l07J021k20j128P73M71j042K35M92m78K54M51q20jJ106n83r31J076R8
$$ plain form
4509 366 -607 119 59 -425 90 761 -565 -385 889 -159 -494 239 188 -335 401 86 -509 362 641 -732
4529 -732 -302 537 -260 -459 338 -125 -275 531 -278 -579 558 474 -831 76 683 -150 -124 433 -279 94
4549 94 889 -636 -629 713 185 -736 173 386 -250 336 44 -1015 438 996 -780 -417 1068 -31 -584
4568 -584 282 -147 -396 556 -124 -898 791 741 -705 -334 877 -139 -465 351 -249 -458 897 -580
4586 -580 -997 685 486 -927 150 399 -452 24 550 -569 80 912 -528 -585 911 235 -578 466
4604 466 63 -665 303 177 -832 158 751 -522 -403 713 131 -418 463 -363 -582 952 -187 -878
4622 -878 384 901 -736 -263 549 -161 -91 412 -310 -388 811 -284 -985 689 417 -660 291 4 -394
4641 -394 205 422 -682 37 882 -238 -605 744 221 -458 337 -52 -510 634 141 -698 209 727 -466
$$ packed form
4509C66r73P26o0m84N15O71j326J80J274j048l35P33n1n23P36l15n95Q71K79j373
4529g32M30Q39p97j99P97m63j50Q06q09l01J137q4j305R07O07q33K6N57p12L73
4549I4P95j525PJ342n28r21R09K13o36N86k92j059J453N58j776L63J485j099n53
4568e84Q66m29k49R52o80p74J689n0j446L71J211j016l26Q16o00k09J355j477
4586e80m17J682j99j413J077K49q51M76N26j119O49Q32j440n7J496o76q13J044
4604D66m03p28R68j26j009R90N93j273J19J116n82n49Q81q26k19J534j139o91
4622h78J262N17j637M73Q12p10P0N03p22p8J199j095p01J674k72j077R51k87l98
4641c94N99K17j104P19Q45j120l67J349n23o79P95l89m58J144m93q39R07N18j193
$$ plain form
4660 -466 -567 657 -325 -28 223 -546 -470 582 160 -773 215 469 -482 -163 301 -498 197 297 -626 -161
4680 -161 681 -181 -537 269 255 -311 81 292 -426 278 610 -612 -18 746 -113 -268 510 68 -296 172
4700 172 -213 -582 621 234 -918 28 587 -356 -111 213 -148 -134 256 -368 -186 614 -20 -555 383 240
4720 240 -389 -75 107 -280 108 372 -285 -196 407 104 -648 78 300 -330 108 363 -128 407 96 -367
4740 -367 -139 429 -94 -147 -97 19 -110 377 75 -366 342 319 -547 63 231 -49 162 196 -152 -78 284 109
4762 109 -277 532 86 -355 -47 143 -352 106 185 -243 -141 232 -11 -163 455 192 -487 280 51 -79
4782 -79 -59 -55 -463 157 202 -324 -227 519 -48 -77 249 95 -288 91 -56 -152 319 -84 -72 31 243 -335 -253
4805 -253 182 13 -134 502 111 -190 282 55 -114 62 -225 -198 -93 76 6 117 289 -320 -530 146 113
$$ packed form
4660d66j01J224r82K97K51p69P6J052m22r33R88K54r51L19M64p99O95J00r23M65
4680a61Q42q62l56Q06j4n66L92K11p18P04L32j222N94P64q59j55P78m42l64M68
4700A72l85l69J203l87j152R46N59r43K45L24l61J4L90o24J82Q00o34n35R38j43
4720B40o29L14J82l87L88K64o57Q9O03l03p52P26K22o30M38K55m91N35l11m63
4740c67K28N68n23n3N0J16j29M87l02m41P08k3q66O10J68k80K11L4l48P4L62j75
4762A09l86Q09m46m41L08J90m95M58P9m28J02L73k43j52O18k63o79P67k29j30
4782g9K0Mm08O20M5n26R7P46n67k9L26j54l83L79j47r6M71m03J2J03K12n78Q2
4805b53M35j69j47O36l91l01M72k27j69J76k87K7J05J69p0J11J72o09k10O76l3
$$ plain form
4826 113 10 222 403 -4 104 239 -23 -107 187 -269 -105 -24 -164 -209 148 78 -68 81 -203 -166 83 185
4848 185 -193 -256 164 18 -52 142 -128 -100 -27 -46 -165 161 -12 -98 49 45 -36 1 226 27 -292 196 86
4871 86 -87 -106 52 -272 53 228 -152 -38 -150 -156 -11 118 -5 122 -75 102 -160 126 -198 -72 125
4892 125 -26 -150 75 244 -232 158 233 -96 -14 258 -159 -173 93 -169 -169 33 -73 -207 81 75 -228 -130 271
4915 271 -93 -2 222 -132 119 147 -266 -76 307 305 -187 213 159 -309 -263 73 -76 34 143 -374 -256 -26
4937 -26 -50 -71 325 -74 -36 150 411 -303 -75 139 -43 -60 305 -197 -331 174 -450 -235 227 77 -173 152
4959 152 253 -231 83 34 57 396 306 -228 -77 277 -183 4 180 -144 -292 306 20 -192 267 152 -296
4980 -296 134 478 -290 -226 390 -90 165 112 -191 -151 622 234 -352 158 540 -383 106 302 -322 -39 336
$$ packed form
4826A13j03K12J81m07J08J35k62q4K94m56J64Q1j40m5L57p0j46J49k84L7K49J02
4848A85l78o3M20j46p0J94k70K8P3j9j19L26j73q6J47mq1L7K25j99l19M88j10
4871H6j73j9J58l24L25J75l80J14j12oJ45J29j23J27j97J77k62K86l24J26J97
4892A25j51j24K25J69m76L90P5l29Q2K72m17j4K66k62%K02j06j34K88ol03R8M01
4915B71l64R1K24l54K51K8m13J90L83km92M00n4m68M6L36j49J10J09n17J18K30
4937b6k4k1L96l99L8J86K61p14K28K14j82j7L65n02j34N05o24K15M62j50k50L25
4959A52J01m84L14m9K3L39r0n34J51L54m60J87J76l24j48N98k86k12M59j15m48
4980b96M30L44p68O4O16m80K55n3l03M0P73l88n86N10L82r23M89J96o24K83L75
$$ plain form
5001 336 -342 -314 576 -368 -753 398 114 -258 80 113 -744 287 380 -382 -36 563 -371 -293 410 -175 -186
5022 -186 259 -2 -127 487 231 -448 194 338 -333 -7 248 -209 11 320 -362 -596 741 136 -689 86
5042 86 219 -299 294 -60 -432 69 512 -490 -273 748 -96 -667 401 142 -248 267 -118 -591 373
5061 373 350 -693 32 727 -422 -468 255 -92 -287 597 -332 -504 607 379 -698 -23 598 -235 -57
5080 -57 217 -307 -21 595 -488 -486 577 -84 -629 254 162 -606 375 2 -638 356 508 -383 -134 853 -137
5101 -137 -609 525 -3 -326 500 2 -640 396 680 -628 -63 385 -366 -68 493 -147 -52 809 -83
5120 -83 -574 358 487 -636 14 524 -133 -288 235 -459 -57 506 -263 -358 486 115 -602 279 -13 -416
5140 -416 406 193 -508 345 705 -564 -337 520 -24 -441 305 -235 -163 578 100 -674 431 650 -446
$$ packed form
5001C36o78K8Q90r44l85J151k84l72L38L3q57J031R3p62L46N99r34P8P03n85j1
5022a86M45k61j25O14k56o79O42J44o71L26K55m57K20L09o82k34J337o05q25P75
5042H6J33n18N93l54l72N01M43j002K17J021q44n71J068k59l90N15l85m73R64
5061C73k3j043P25O95j149m6P23l47j95Q84r29j72J111k28j077O75O21q33J78
5080e7K74n24K86O16j083KJ063o61n45Q83r2p68R81l73o40R94J52q91K49R87r90
5101a37m72J134n28l23Q26m98o42J036K84j308N65M48p51K98N61o40R5Q61q92
5120h3m91R32J29j123O50N10o57j55N23o94M02N63p69r5Q44l71p17Q81k92m03
5140d16Q22k13p01Q53L60j269K27Q57n44m17P46n40P2P41m78p74J105K19j096
$$ plain form
5159 -446 55 255 4 -146 362 -384 -285 597 17 -489 484 423 -307 -88 247 -437 283 463 -259 -82 598
5180 598 -144 -271 509 212 -411 301 -90 -209 354 181 -316 -106 559 -244 -38 499 -192 -3 111 -171
5200 -171 -442 330 -54 -353 123 389 -257 21 28 -162 14 325 -119 -232 539 -60 -414 300 -43 -404 15
5221 15 202 -281 189 320 -122 -4 362 -85 -408 184 142 -203 -36 132 -312 329 391 -416 66 238 -236
5242 -236 97 639 -70 -65 385 -242 29 565 54 -236 17 149 -198 51 216 -52 124 213 -119 -216 372
5263 372 -104 -121 100 1 -89 260 17 -23 145 220 -51 -88 65 -229 -297 242 41 -110 246 125 -66 -70 189
5286 189 -138 -123 321 123 -224 180 -115 -35 -11 134 -239 31 -43 69 -39 181 -172 -135 222 -127 -142 -21
5308 -21 23 -179 119 104 -126 151 251 -43 -19 -222 -220 71 187 -105 -457 116 24 -300 10 105 -89 154 -122
$$ packed form
5159d46N01K00k51j50N08p46R9Q82n80n06R73o1p30K19L35o84P20J80p22J77O80
5180E98p42j27P80k97o23P12l91j19N63j73m97K10O65q03K06N37o91J89J14k82
5200a71k71P72l84k99M76K66o46K78Pj90J76L11m44j13P71n99l54P14l43l61M19
5221A5J87m83M70J31m42J18L66m47l23N92m2l45J67J68m44O41O2q07M82J72m74
5242b36L33N42p09NM50o27K71N36n11k90K53J32l47K49J65k68J76Q9l32r7N88
5263C72m76j7K21r9r0L49k43m0J68P5k71l7J53k94o8N39k01j51L56j21j91mK59
5286A89l27J5M44j98l47M04k95Q0K4J45l73K70p4J12j08K20l53L7L57l49j5J21
5308b1M4k02K98j5k30K77J00k94K4k03KK91J16k92l52N73r2l24L10R5j94K43k76
$$ plain form
5331 -122 -18 -127 -40 -278 -175 68 -133 -175 177 60 -216 5 93 -35 177 110 -96 51 182 136 26 194
5353 194 -102 -227 -43 26 -157 -2 -166 -185 33 -106 -111 66 216 -37 72 51 58 -10 317 -310 31 -1 3 -128
5377 -128 13 11 -202 -24 87 142 -115 -2 45 12 263 -432 -191 -41 -79 75 61 251 53 14 390 -112 -116
5400 -116 131 -214 -188 -13 255 -111 299 38 -114 80 270 -147 156 -72 -332 176 248 -205 34 263 -115
5421 -115 254 258 96 -41 189 60 29 306 -154 -256 157 -26 -300 -137 -40 -32 95 121 -232 -166 -36 36 -212
5444 -212 155 121 -279 46 23 -116 191 48 -79 145 368 20 -72 154 -11 46 130 -12 -87 65 102 -476
5466 -476 -110 162 -312 -300 159 -113 -160 -104 -221 -61 15 -113 -177 -187 64 -237 -110 384 67 36 451 -83
5488 -83 -90 435 126 -271 119 282 -354 406 51 -58 96 164 -267 104 511 -462 -233 226 33 18 287 74
$$ packed form
5331a22J04j09Q7k38J03K43k01m2L52j17k76K21Q8j28K12o7k06J47J31m6j10J68
5353A94k96j25J84O9j83J55j64j9K18j39nJ77J50k53J09k1Po8L27o27L41l2Mj31
5377a28J41kk13J78J11N5k57J13M7l3K51o95K41J50l8J54j4J90j98l9L76n02m
5400a16K47l45K6J75K68l66M10k61j52J94J90m17L03k28k60N08P2m53K39K29l78
5421a15L69Mj62j37K30j29l1K77m60j02M13j83k74J63R7QJ27K6l53O6J30P2k48
5444b12L67l4m00L25k3j39L07j43j27K24K23l48r2K26j65N7Q4j42p5J52L7n78
5466d76L66K72m74J2M59k72m7N6j17J60P6j28o4j0K51l01J27M94l17l1M15n34
5488h3pN25l09l97L90J63o36P60l55j09J54O8m31L71M07r73K29M59j93j5K69k13
$$ plain form
5510 74 -320 207 69 -238 99 316 -437 35 294 -52 -200 197 110 -188 163 145 -200 474 308 -197 177
5531 177 213 -128 -222 320 -273 -328 371 133 -329 509 262 -260 252 143 -357 -123 480 -331 37 279 -40
5552 -40 -244 294 30 -181 287 140 -199 322 156 -450 84 428 -435 -173 398 -441 -227 370 22 -276
5572 -276 579 -70 -589 312 234 -376 56 138 -474 76 331 -299 -121 787 -54 -469 254 147 -194 141 137
5593 137 -374 106 159 -389 -237 362 -128 -176 410 -98 54 213 -39 -457 526 490 -424 44 483 -382 -60
5614 -60 221 8 -225 269 -300 -302 581 122 -405 299 259 -329 -56 261 -324 -78 591 -123 -231 593 -245
5635 -245 -559 239 -180 -439 212 98 -425 -41 160 -450 -169 397 -271 -121 148 -211 -89 678 -129 -209
5655 -209 339 -51 -473 165 54 -580 -31 286 -150 27 588 -317 -436 272 134 -367 89 181 -318 107
$$ packed form
5510G4l94N27j38l07L37K17p53M72K59l46j48L97q7k98L51j8l45O74j66n05L74
5531A77L6l41r4N42n93n5O99k38m62Q38k47n22N12j09n00K34O03q11L68K42l19
5552d0k04N38k64k11M68j47l39N21j66o06N34L44q63K62N71q39K14N97l48k98
5572b76Q55o49n19R01p8o10M32Q2o12N50K55o30J78R08q41m15P23j07l41L35m
5593A37n11M80N3n48J52N99m90m8N86n08J52J59k52m18R83l6r14M68M39q65L22
5614f0K81k13k33M94n69kQ83m59n27P04m0n88K73L17n85K46O69p14j08Q24q38
5635b45l14P98m19k59O51j14n23L84K01o10K81N66o68J50K69l59J22P67q07q0
5655b09N48l90m22O38j11o34N49L17m36J77N61r05j19P08j38n01M56R2m99M25
$$ plain form
5675 107 52 -633 56 318 -217 -157 457 -230 -370 260 77 -291 224 27 -231 353 263 -264 -104 209 -257
5696 -257 12 134 -248 -127 289 -8 -189 49 243 -87 76 93 -4 5 299 -105 -413 237 -124 -118 504 -28
5718 -28 -146 172 232 -147 14 41 -94 -69 136 26 -47 123 74 -535 -43 -136 -186 -165 55 -39 -25 135 -141 83
5742 83 -107 -92 -111 277 -11 -44 221 -31 48 67 2 -398 77 143 103 113 222 -165 -78 185 -97 -157 -156 -173 49
5767 49 179 -1 -325 59 70 -114 6 62 156 -189 106 -4 -34 29 -105 -199 20 62 -132 13 264 2 -228
5790 -228 158 -12 95 171 -70 -129 145 -74 -38 30 121 -75 -133 16 -260 -6 225 -9 -101 220 114 -123
5812 -123 247 34 -109 156 -181 -363 -80 -19 -167 -10 133 -185 97 181 -130 17 118 -159 -22 -95 -26
5833 -26 0 -52 80 -203 -52 188 66 -79 277 66 243 150 -131 -360 16 91 -178 130 58 -20 -125 -13
$$ packed form
5675A07n5o85O89K62n35O0O14o87j40O30j83l68N15j97k58N84r0n27J60L13m66
5696b57K69J22l82J21M16k97j81K38J94l30J63J7r7RK94m04l08O50l61OO22n32
5718b8j18L18O0l79J61K7j35K5K05j10p3J70m9o09M92r3n0K1K20r4J4J60k76K24
5742H3j90J5j9L88k88l3K65k52P9J9o5m00M75O6m0J0J09l87Q7K63k82o0Jj7K22
5767D9J30j80l24L84J1j84J20N6R4l45K95j10l0O3j34r4K19M2j94J45K51k62k30
5790b28L86j70J07P6k41n9K74k19L6O8R1j96n8J49k76K54K31k34r2L21j06k37
5812a23L70k13j43K65l37j82K83O1j48J57J43l18K82Q4l11J47J01k77J37p3O9
5833b6K6n2J32k83J51K40j22j45L56k11J77r3k81k29L76P5k69L08p2p8j05J12
$$ plain form
5855 -13 4 155 8 65 -244 146 -158 102 -76 -78 94 115 83 37 70 -47 -57 -94 -95 126 -76 161 298 116
5879 116 181 -98 -16 17 -4 -251 29 131 -162 -166 246 -68 203 281 174 65 -16 -92 0 -2 5 -66 -19 -46 -114 7
5905 7 279 -254 -56 332 5 -87 -104 179 -501 107 18 -59 118 187 86 -13 257 -78 -146 245 -150 -38 -111
5928 -111 186 -285 207 377 -244 2 66 -187 101 -45 -195 -40 350 207 -155 -39 132 -128 227 44
5948 44 -306 52 -76 -269 -72 97 40 21 285 67 -310 110 -124 -196 108 133 -142 154 253 -163 35 283
5970 283 -91 59 129 134 -75 124 -49 -91 10 161 -209 41 64 -383 -48 120 -209 -298 357 159 -270 104
5992 104 -42 -154 82 91 -170 147 161 -14 -3 484 -149 -63 503 84 -219 119 -240 -204 209 -43 -18 507
6014 507 206 -360 -137 107 -338 -305 316 -197 -181 223 -234 -225 110 119 -91 -82 135 -354 -17 254 -373 72 263
$$ packed form
5855a3J7J51j47N7l09L90l04K60j78kJ72K1l2m6L3j17j0l7jK21k02K37J37j82
5879A16O5k79Q2L3k1k47K80J02k93mM12l14K71P8j07j09q1p6R2kPp1M7k7o8J21
5905GK72n33J98L88l27r2j7K83o80O08q9p7J77O9j01r9K70l35o8L91l95J12p3
5928a11K97m71M92J70o21K46O4k53K88j46j50J55L90j43l62J16J71k60L55j83
5948D4l50L58j28j93J97J69n7j9K64k18l77M20k34p2L04K5k75K96R9m16J98K48
5970B83l74J50P0Nk09J99j73m2J01J51l70K50K3m47L35J68l29q9O55j98m29L74
5992A04j46j12K36Rk61L17J4j75J1M87o33Q6N66m19l03L38l59L6M13k52K5N25
6014E07l01n66K23K44m45L3O21n13J6M04m57RL35Rk10RK17m89L37K71o27M45J91
$$ plain form
6037 263 39 -229 520 97 -301 253 -22 -56 281 115 -45 67 304 -158 -191 304 27 -199 140 135 -187
6058 -187 188 -111 -289 326 266 -164 -10 467 -303 104 356 -233 -68 423 126 -231 330 -80 -472 259
6078 259 210 -69 -181 9 -212 -70 355 -116 87 300 -118 -455 522 222 -188 154 166 -287 -15 143 -69
6099 -69 -368 263 -117 -357 501 -7 114 145 -123 -421 174 147 -510 69 427 -180 33 232 -110 -151 488
6120 488 42 -331 188 -73 -141 101 177 -332 -56 221 -421 118 236 -32 -166 176 -73 -343 289 -212 7
6141 7 152 198 -270 -150 178 -1 14 378 0 -22 292 33 -155 308 90 -274 334 215 -280 126 -83 -120
6163 -120 78 390 -128 -261 40 313 -106 244 -9 -232 310 248 -98 23 73 -409 -118 153 -97 -360 320
6184 320 -253 -162 257 3 -48 -38 175 -140 306 126 -224 -114 282 -129 -186 142 241 -257 451 -114 -258 235
$$ packed form
6037B63k24k68P49m23l98N54k75l4L37j66j60J12K37m62l3M95k77k26L39nl22
6058a87L75k99j78O15o0m30J54M77p70M07K52n89J65M91k97l57N61m10l92P31
6078B59m9k79j12J90k21J42M25m71K03K13m18l37R77l00m10L42J2m53K72J58k12
6099f9k99O31l80k40Q58n08J21L1k68k98N95k7o57N79L58o07K13J99l42m1O39
6120D88m46l73N19k61o8K42P6n09K76K77o42N39J18k68j34L42k49k70O32n01K19
6141GJ45M6m68J20L28j79J5L64l78k2L14k59j88M63k18l64O08j19m95M06k09l7
6163a20J98L12n18j33L01K73m19L50k53k23N42o2l46J21N0m82K91K71k50k63O80
6184C20n73R1M19k54n1J0K13l15M46j80l50J10L96m11n7L28R9m98P08n65j44M93
$$ plain form
6206 235 122 -371 108 147 4 -329 47 -25 -182 344 65 -114 379 -65 -148 51 86 -174 39 19 -244 -64
6228 -64 92 -85 -21 278 -277 -318 156 -304 -569 138 96 -372 -57 102 -270 98 279 -183 -187 151 242 -265
6250 -265 187 5 -327 84 265 155 -42 339 84 53 115 154 -5 119 22 -192 198 320 -48 8 52 18
6272 18 -62 22 -100 75 175 -12 -123 111 196 70 194 -254 -117 117 139 -159 87 24 -20 -395 191 118 108
6295 108 104 65 -232 36 33 -118 256 151 -98 305 171 -67 81 404 -94 -58 168 74 -382 -315 286 -140 28
6318 28 404 -145 38 0 -45 39 141 -8 -286 38 96 -225 36 102 -158 -63 72 -24 -83 200 -76 -88 289
6341 289 -155 -32 134 165 -122 198 -1 -161 192 -111 -213 168 66 -48 -19 -107 107 -194 -117 185 -69
6362 -69 352 17 -76 -271 24 26 -74 43 133 -16 221 -50 -76 150 -189 19 240 -135 -131 2 77 -191 211
$$ packed form
6206B35j13m93M79L9j43l33L76p2j57N26k79j79M93m44q3J99L5k60K13k0k63J80
6228f4J56j77O4K99n55m1M74m60k65P07m2m68L15J59l72L68J81m62mL38R1n07
6250b65M52j82l32M11J81j10j97L81k55l1O2L9j59J24r7k14L90J22l68N6M4l4
6272A8q0Q4j22J75J00j87j11K34Q5j26J24m48J37K34K2k98K46o3m4l75N86p3j0
6295A08ml9k97K68lj51L74j05k49M03j34k38J48L23m98L6K26r4m56O7O01m26J68
6318B8L76n49J83l8m5Q4J02j49k78L24N8l21K61O6k60R5J35r6n9K83k76j2L77
6341B89m44J23J66L1k87L20j99j60L53l03j02L81j02j14K9q8K14l01P7L02k54
6362f9M21l35r3j95K95Kj00J17R0j49K37k71k6K26l39K08K21l75MJ33P5k68M02
$$ plain form
6385 211 122 -115 -256 3 -123 -52 114 -121 47 -19 3 -3 89 227 -31 92 275 30 240 19 12 31 101 -10
6409 -10 174 30 210 202 -73 68 123 102 -28 15 -59 120 -97 -112 268 -79 -163 -159 -97 -137 -57 116 -110 66 170
6434 170 -123 197 -63 -252 -43 220 -36 -181 123 -159 -58 47 168 -144 92 -341 -220 8 309 128
6454 128 -232 69 -80 80 272 -65 -329 -52 -183 38 37 84 -36 -6 12 156 -142 212 229 -264 121 34
6476 34 -167 186 102 -201 84 246 -67 -123 0 153 -29 128 -125 -291 138 37 -96 75 283 -448 146
6497 146 86 -122 49 178 -296 -23 29 199 -195 182 -124 21 -32 -63 70 -42 35 -27 36 -30 -10 -250 91
6520 91 133 -13 -202 -79 -116 228 -16 -154 124 71 -69 -109 178 -137 -19 211 -175 121 272 -216 10 163
6542 163 -209 -93 112 -131 -165 -54 307 -169 165 106 25 -15 315 -108 -196 206 -125 13 48 74 -286 -72
$$ packed form
6385B11q9k37j41K59j26P1J66k35J68o6K2oR2J38k58J23J83k45K10k21pJ9P0j11
6409a0J84j44J80qk75J41N5k1j30M3p4J79k17j5L80l47q4MO2m0Q0J73k26J76J04
6434A70k93L20k60j89K09K63k56j45L04k82J01J05J21l12K36m33J21K28L01j81
6454A28l60L01j49J60J92l37k64K77j31K21jM7j20L0J8J44k98L54J7m93L85q7
6476C4k01L53q4l03K85J62l13n6J23J53j82J57k53j66M29j01j33J71K08p31N94
6497A46o0k08J71J29m74K73N2J70l94L77l06J45n3l1J33j12P7o2O3o6K0k40L41
6520I1M2j46j89J23l7L44k44j38K78n3j40m0K87l15J18K30l86K96J51m88K26J53
6542A63l72J16K05k43l4J11L61m76L34n9q1m0L30m23q8M02l31J38L5K6l60K14
$$ plain form
6564 -72 216 -61 -152 347 -41 -234 -115 35 -91 210 248 -6 238 35 -128 -25 -1 -95 64 -19 -74 -4 475
6587 475 54 -386 217 141 -263 116 257 -225 255 416 -188 -105 273 -213 -321 140 -87 -75 119 31 -249
6608 -249 254 -54 -381 -142 156 -428 -62 159 -152 115 30 -112 -207 83 118 -283 249 185 -255 6 41 21
6630 21 -70 375 -22 100 318 12 -147 121 -122 -60 154 19 -171 145 369 3 90 215 -201 -39 357
6651 357 -173 -284 147 -88 38 271 19 -153 31 75 -256 60 217 -173 14 198 -135 -150 -30 -126 -246
6672 -246 97 181 -200 -61 -11 -189 -267 0 -209 204 242 158 -131 161 337 -103 223 267 -238 -69 134 -221
6694 -221 72 36 -152 -83 335 -173 -6 167 -129 -78 197 -90 -39 18 139 -132 -78 26 66 -33 37 -145 99
6717 99 -41 -235 -45 49 87 -335 35 -37 13 -66 -154 -434 -312 98 -59 21 229 9 -155 121 -46 36 28 52
$$ packed form
6564g2K88k77r1M99l88j93J19J50j26L01L8k54K44k03j63J03K4r4J59q3n5P0M79
6587D75m21m40O03p6m04L79J41m82M80J61o04Q3L78m86j08M61k27J2J94q8k80
6608b49N03l08l27K39K98n84L66K21l11K67q5j42r5K90L5m01N32o4m40K61L5k0
6630B1r1M45l97J22K18l06j59K68k43O2K14j35j90L16K24l66Q7J25m16J62L96
6651C57n30j11M31k35J26K33k52j72J84M4l31L16J57l90J87J84l33j5J20r6j20
6672b46L43Q4l81J39N0j78p8K67k09M13L8q4k89K92J76m40L26M4n05J69K03l55
6694b21K93l6j88O9M18n08J67J73k96N1K75k87N1N7J21k71N4J04M0r9P0j82K44
6717I9j40j94J90R4L8m22L70p2N0p9q8k80J22M10j57Q0K08k20j64K76j67Q2qK4
$$ plain form
6741 52 -80 61 -106 -107 -36 0 -27 -32 123 -33 -105 287 194 25 202 -46 54 44 83 -64 -109 170 -270 -17
6765 -17 66 141 62 220 -20 -311 5 236 -131 13 -26 -73 -174 54 12 -3 35 -194 -41 -5 124 -16 45 -24
6789 -24 199 16 192 -69 -254 -32 -36 -337 103 -6 -220 165 136 -141 223 85 118 -185 -118 -104 -225 71
6811 71 -250 14 -82 -86 -101 -58 8 -261 73 106 -250 -33 155 -163 55 127 -87 36 215 -153 -325 133 137 -168
6835 -168 9 147 -297 -123 168 -205 -25 115 -58 -139 -1 82 -9 80 149 85 101 118 -152 -341 -23 -70 -157
6858 -157 2 -93 -52 -114 -124 13 -107 -30 -44 43 194 -91 -51 46 -2 -44 10 71 -70 62 -184 142 22 195
6882 195 -91 264 173 96 -64 -96 -84 -145 -16 -133 -183 28 115 -31 193 310 -89 14 -60 71 -48 36 -144
6905 -144 -94 426 -83 186 -112 -298 -52 100 -75 -7 43 -14 49 175 107 -123 -76 94 -17 13 -25 110 -92
$$ packed form
6741E2j32J41j67jP1L6k7nJ55j56p2L92r3j69J77k48J00j0L9j47m5K79m40K53
6765a7Q3P5p9J58k40k91L16K31l67J44l9m7j01K28m2j5L8k29J53L6J29j40O1o9
6789b4K23j83J76k61j85K22ml01M40j09k14L85k9k77L64j38L3l03O7J4j21K96
6811G1l21K64r6mj5M3O6k69L34L3l56K17J88l18K18P2k14J23J79l68j72M58Ml05
6835a68J77J38m44J74K91l73J80J40j73q1J38Q3r1Q9O9o4J6J7k70j89L18m7q7
6858a57J59r5M1o2j0J37j20P7j4Q7J51k85M0R7m8m2N4O1j41J32k46L26j20J73
6882A95k86L55r1p7j60l2J2o1J29j17n0K11Q7j46K24J17l99J03p4J31j19Q4j80
6905a44N0N20n09K69k98j86K46J52j75O8N0n7O3J26o8k30M7J70j11L0l8J35k02
$$ plain form
6928 -92 26 91 -175 -274 -78 -57 10 166 -102 -54 -81 -244 90 270 -197 -77 219 -109 29 -113 54 -103
6950 -103 -193 -11 -2 -28 77 -41 139 250 106 -10 -128 162 -14 -36 320 -117 -192 100 205 -85 190 12
6972 12 -227 -261 -120 -46 -49 -186 37 101 -60 -20 85 -106 -62 9 26 -2 88 -100 80 -292 -176 128 -45 28
6996 28 251 20 -177 117 -95 30 -114 -102 12 78 -79 -289 -190 169 -22 117 -196 58 -152 -74 -176 -96
7018 -96 196 -61 -133 137 158 13 86 -2 -383 64 -39 -13 101 -74 -352 -173 -52 -244 51 94 127 -3 240
7041 240 144 -382 59 260 -282 42 -112 7 176 155 -28 -62 226 71 25 -36 -41 -189 -29 -123 -92 222 20
7064 20 -118 -37 170 6 43 56 12 -317 199 63 10 237 122 209 142 -17 -168 198 285 -72 -157 -57 -275
7087 -275 192 162 180 -288 -75 -74 74 -276 264 42 92 174 -160 58 230 -251 -80 -134 32 -158 39 -24 -32
$$ packed form
6928i2J18O5k66r9J96K1O7J56k68M8k7j63L34J80m67J20K96l28J38j42J67j57
6950a03r0J82Rk6J05j18J80J11j44j16j18K90j76k2L56m37p5K92J05k90K75j78
6972A2k39l4J41P4lj37K23O4j61M0J05j91M4P1J7k8R0j88J80l72J16L04j73P3
6996B8K23k31j97K94k12J25j44J2J14O6j57k10R9L59j91J39l13K54k10P8j02Q0
7018i6K92k57p2K70K1j45P3q8l81M47j03K6J14j75k78J79J21j92K95M3L3j30K43
7041B40r6n26M41K01n42L24j54J19J69k1j83l4K88j55m6o1nj48J60r4L1L14k02
7064B0j38Q1K07j64L7J3m4l29N16j36n3K27j15Q7o7j59j51L66Q7l57q5J00k18
7087b75M67l0J8m68K13JJ48l50N40k22N0Q2l34K18J72m81J71n4J66j90J97o3q
$$ plain form
7110 -32 2 -19 -9 -74 77 128 45 138 -484 -39 131 -76 55 43 375 -77 155 54 115 -65 66 -185 -3
7133 -3 213 -53 -370 193 25 -102 70 377 -120 29 129 90 93 41 -99 -263 -13 -281 -207 47 -55 -1 75
7156 75 44 1 10 122 35 -89 204 -40 -137 223 19 -75 20 84 -248 286 -57 145 224 20 -88 -4 79 34 169
7181 169 142 -253 -273 187 106 -220 275 91 -114 9 20 -2 -17 85 -30 -71 268 411 -242 196 -107 -208
7203 -208 142 -118 6 -112 -89 -20 -171 48 14 3 142 -29 -87 73 273 -66 40 111 -81 311 -53 81
7225 81 165 1 -97 23 -101 -102 182 81 299 -154 244 95 -244 83 75 -118 -197 150 17 83 -30 -135 -22
7248 -22 223 48 -44 88 169 2 82 83 -1 182 -28 137 53 1 -26 -158 -37 -60 36 248 165 -180 286 80
7272 80 -17 -67 25 -91 -133 30 79 160 134 234 -165 135 -110 -162 -166 97 82 -46 140 117 71 -94 125 -34 -143
$$ packed form
7110c2L4k1J0o5J51N1q3R3o22M45J70k07J31j2L32m52K32j01O1j80J31k51J82
7133cK16k66l17N63j68j27J72L07m97J49J00l9Ln2j40j64K50k68P4K54j02N4P6
7156G5l1m3RJ12q7j24K93k44r7L60k04r4R5O4l32N34l43K02P9k04j08Q4Q3m5J35
7181A69k7l95k0M60q1l26M95j84k05J23J1k2j5J02j15m1L39J43o53M38l03j01
7203b08L50k60J24j18K3O9j51K19l4j1J39j71n8J60K00l39J06P1j92L92l64J34
7225H1Q4j64r8J20j24jK84j01K18m53L98j49l39L27qj93p9L47j33O6j13j05J13
7248b2K45j75r2J32Q1j67Q0Jq4J83k10J65q4n2k7j32J21k3R6K12q3l45M66k06
7272H0r7n0R2j16m2J63M9Q1k6J00l99L00k45n2mK63j5j28J86k3m6j65K19j59j09
$$ plain form
7297 -143 45 -112 94 -27 -142 178 37 5 -101 51 -291 -87 131 69 -197 -59 20 -97 -109 394 -231
7318 -231 -170 64 -198 -174 3 -199 103 60 103 -126 -17 94 -88 33 31 115 -134 -69 -46 -144 -175 155 82 131
7342 131 -96 -77 189 39 200 32 94 124 -59 -62 -35 100 -398 -65 75 165 -66 -150 86 118 -42 84 -53
7365 -53 11 57 116 -239 -8 91 133 21 105 0 -74 1 -50 -156 -119 -72 -287 88 109 -124 111 -41 -32 207 -75
7390 -75 -5 -41 174 96 81 38 199 47 -11 -107 44 -79 97 81 0 -159 20 -124 19 112 -132 -46 -191 -273
7414 -273 18 -187 -23 124 -104 -221 75 252 26 -184 9 -18 -16 -70 -85 -137 -87 63 -73 118 -153 134
7436 134 -75 12 -138 -46 22 -68 82 153 2 -37 58 69 -156 149 -72 -59 -40 -65 -115 88 121 4 88 203 285
7461 285 3 216 -107 -166 146 -76 105 205 52 13 -176 95 92 227 -147 -92 -262 -31 96 -64 143 -32
$$ packed form
7297a43J88j57K06j21j15L20j41l2j06J52l42K04K18o2k66J38P9j17j2N03o25
7318b31O1K34k62K4J77k02L02m3M3k29J09J11j82J21kQ4k49O5K3r8l1L30p3M9
7342A31k27J9K66j50J61j68O2L0j83lK7J35m98L33J40R0k31q4K36L2j60J26j37
7365e3O4M6N9l55K31R9M2j12Q4j05p4P5n1j06L7M7k15L75K1k33K35j52RK39k82
7390g5P0l6K15p8j5m3J61j52n8r6J51j23J76j6q1j59J79j44J43R3k44Q6j45q2
7414b73K91k05J64J47k28j17K96J77k26k10J93k7Kn4j5n2N0J50j36J91k71K87
7436A34k09Q7j50R2O8r0J50P1j51l9R5J1k25L05k21J3J9k5n0K03L3j17Q4J15Q2
7461B85k82K13l23n9L12k22J81J00j53l9j89K71lJ35l74N5j70K31J27j60K07j75
$$ plain form
7483 -32 8 119 7 9 -27 -201 6 44 -168 134 -2 -55 50 17 126 -95 45 18 194 5 -183 82 -79
7506 -79 -95 78 -144 44 -58 207 -24 -65 311 15 -125 59 -25 -244 -30 143 208 222 72 164 -66 53
7528 53 -318 40 205 -55 -33 105 143 263 230 7 18 159 183 131 120 59 -238 -138 76 2 -68 127 16 259
7552 259 169 12 -84 29 -117 -187 185 262 -108 12 112 -66 40 21 -2 -17 -143 -114 -65 200 -56 28 71 -185
7576 -185 -224 -4 71 -209 -14 -5 90 -119 -96 26 -193 117 -38 107 138 64 -122 -3 159 -243 208 110 -186
7599 -186 -314 -43 47 -174 -89 -211 67 253 50 -276 92 144 -114 118 61 -113 82 -81 12 -40 -119 -101 -15
7622 -15 249 -84 -151 144 -30 -247 110 -128 161 84 94 -181 -167 38 239 11 9 21 -81 284 168 -154 -99
7645 -99 215 -63 -258 127 -38 -52 96 -223 -62 148 130 -201 79 -55 -108 -194 193 -278 164 107 1 64
$$ packed form
7483c2M0J11j12Kl6j74K07L8k12L02j36n3J05l3J09k21J40k7J76j89j88K65j61
7506g9j6J73k22J88j02K65k31m1L76k96j40J84q4k19K14J73O5J4j50R2k30J19
7528E3l71L58J65k60K2J38L8J20l3k23J1J41K4n2j1o1k97J00K14p4p0J95j11K43
7552B59r0j57r6J13j46p0L72P7l70J20J00j78J06j9k3j5j26K9M9K65k56Q4M3k56
7576a85l9K20P5k80J95RR5k09K3J22k19L10j55J45L1p4j86J19J62m02M51r8k96
7599a86j28K71R0k21Q5j22K78J86k03l26L68N2k58K32n7j74J95j63R3n2p9J8Q6
7622a5K64l33o7K95j74k17L57k38K89p7J0k75J4K05K01k28kJ2j02L65j16l22N5
7645i9L14k78j95L85j65j4J48l19J61K10j8l31K80j34n3q6L87m71M42n7j06O3
$$ plain form
7667 64 40 126 -173 72 74 -33 206 102 56 -101 -373 -107 -239 -32 -196 -119 67 -112 19 29 58 -40 -95 -107
7691 -107 -71 89 107 8 -88 -89 142 -175 44 -389 -82 221 73 -91 244 -160 -127 -10 -128 -82 65 23 128
7714 128 76 228 -98 -208 135 108 71 -29 104 -84 60 20 28 -13 60 -206 -233 -48 39 -110 48 -22 -122 71
7738 71 21 -86 89 163 41 -34 4 -7 -48 -123 -235 14 -4 20 -201 68 6 -109 78 137 -130 145 216 -212
7762 -212 150 -59 -108 -147 -145 -128 75 89 37 34 -196 -98 76 -72 -45 -46 69 -296 95 46 -34 18 -70 0 201 8
7788 8 -119 84 -278 -79 189 68 220 -34 -115 110 183 137 200 20 -16 -74 172 128 -164 -137 22 1 -7 135
7812 135 181 -174 -199 95 267 104 -43 27 -68 174 -26 48 73 -144 -245 47 -10 -44 -65 -127 -121 -158 219 -42
7836 -42 108 79 -215 -8 37 -77 -96 -229 -107 -43 61 -40 224 6 -192 99 -164 21 72 -41 58 131 49
$$ packed form
7667F4k4Q6k99K45Kj07K39j04m6j57k72K66j32K07j64P7J86j79J31J0K9r8n5j2
7691a07L6J60J8r9r6jK31l17K19m33L07L03j48j64L35m04L3J17j18M6J47m2J05
7714A28n2J52l26j10L43k7l7j00J33j88J44m0Qm1P3k66k7J85Q7j49J58p0j00J93
7738G1n0j07J75P4j22p5L8j1m1p5j12K49j8K4k21K69o2j15J87N9k67K75P1m28
7762b12L62k09m9l9KJ7K03J4n2lk30R8J74j48K7jJ15l65L91m9q0N2q8P0K01j93
7788Hj27K03l62J99K68j21J52k54q1K25P3m6O3j80l6n8K46m4k92K7J59k1qJ42
7812A35M6l55k5K94J72j63j47P0r5K42k00P4K5k17j01K92n7l4k1o2Ol7L77k61
7836d2J50k9k94K07M5j14j9j33J22O4J04j01K64k18j98K91k63J85N1j13R9P3q2
$$ plain form
7859 49 -39 -205 -119 69 -185 22 -225 -123 161 -95 83 -9 -124 93 -1 211 -66 145 199 -116 -42 -208
7881 -208 40 18 -131 77 3 -132 103 261 -154 -20 -32 -208 -145 42 40 -181 -20 149 -123 67 -79 99
7903 99 -72 47 -150 -185 -8 -147 -4 265 268 12 134 49 198 -52 58 -81 139 49 48 -118 72 -191 257
7926 257 8 -56 132 70 75 119 87 -53 -129 185 147 199 -125 -68 -156 -139 -2 11 -94 -33 -73 -44 53 134 111 -70
7952 -70 79 139 5 77 186 43 169 -117 68 255 -237 -24 90 -12 -44 26 -2 123 -32 69 -78 -33
7974 -33 157 -39 21 51 27 173 102 158 -61 274 4 32 -8 13 9 -82 10 -200 31 -201 -109 -38 341 -18 163
7999 163 -46 111 59 61 95 -203 -43 68 117 -77 49 -9 81 5 182 13 124 -158 -148 197 67 -126 59
8022 59 58 -74 9 83 -154 -89 259 -18 162 14 -40 -276 193 156 -206 -141 184 -105 -97 130 257 -58 -71 -197
$$ packed form
7859D9q8j66Q6J88k54K07k47J02K84k56J78r2j15K17r4K12k77K11N4l15P4j66
7881b08K48k2j49K08p4j35K35J58m15J34j2j76O3J87kk21J61J69k72J90j46J78
7903I9j71J19j97l5J77j39J43K69Lk56J22q5J49k50J10j39K20r0jj66J90k63M48
7926B57k49o4J88o2NM4l2j40p6L14l8N2l24N7q8J7J37J3j05O1m0K9R7Q1k3j81
7952g0J49O0j34P2J09j43J26k86J85J87m92K13J14j02l2P0k8J25j55J01j47M5
7974c3J90j96O0L0k4J46p1N6k19L35k70K8m0K1mr1R2k10K31k32R2P1L79l59J81
7999A63k09J57n2KL4k98J60J11M9j94J26n8R0p6J77j69J11k82J0L45j30j93J85
8022E9jj32Q3P4k37O5L48k77J80j48n4k36M69l7l62O5L25k89QK27J27l15j3j26
$$ plain form
8046 -197 -8 -23 6 132 -16 -131 -144 -224 -126 205 -90 65 -34 -154 -4 206 -278 142 -132 -3 45 -110
8068 -110 -70 -194 69 -158 85 137 105 37 -198 -42 -50 12 -21 2 68 72 -22 114 191 71 32 177 71 189 153
8093 153 -127 -19 -60 41 8 -42 106 93 72 -20 -76 -117 261 19 -35 208 78 -91 57 202 -121 -152 -112 127
8117 127 -31 -38 95 229 244 7 -148 -75 5 24 320 64 -189 -258 143 75 47 -34 99 -313 153 57 64 -104
8141 -104 106 -37 4 -93 -170 -24 91 -181 -132 204 -84 83 109 -73 -148 19 -81 -41 171 61 -19 -49 -110
8164 -110 -132 -30 -94 85 12 76 -28 -140 -66 -223 -31 21 -117 -306 -44 -6 -164 172 140 -211 -180 14 106
8187 106 100 122 -279 131
$$ packed form
8046a97J89j5K9J26j48j15j3q0R8L31k95J55r9j20J50K10m84M20k74J29M8j55
8068a10M0j24K63k27K43N2l2o8k35J56qO2l3K3O6Mr4J36P7j20l9J45j06J18l6
8093A53k80J08m1J01l3n0J48j3k1r2n6m1L78k42n4K43j30j69J48J45l23l1M0K39
8117A27j58pJ33J34J5k37j55P3Q0J9K96k56k53o9M01o8k8q1J33m12M66r6Pj68
8141a04K10j43M1r7p7J46J15k72M9L36k88J67K6j82p5J67j00M0K12j10q0l0o1
8164a10k2J02o4J79p3O4j04j12P4j57J92N2j38j89K62L8j58L36l2l51L1J94R2
8187A06oK2m01M10
8191A31
$$ Imaginary data points
##PAGE= N=2
##DATA TABLE= (X++(I..I)), XYDATA
$$ plain form
0 0 0 0 0 0 0 0 0 0 0 0 0 -8 8 -8 8 -8 16 -19 24 -24 32 -40 45 -52 61 -70 80 -94 108 -122 139 -157 179 -202
34 -202 226 -254 284 -316 354 -393 435 -481 536 -591 652 -720 794 -873 961 -1060 1169 -1287
52 -1287 1419 -1570 1738 -1929 2148 -2406 2710 -3074 3521 -4082 4809 -5795 7200 -9357 13024
67 13024 -20396 40561 -201862 -525926 311243 242600 -303154 26336 119487 -191619 204326
78 204326 222703 -383180 -17298 510218 -129280 -357238 251856 170217 -159629 55780
88 55780 -28189 -136153 260544 109612 -378742 9544 340393 -124623 -216411 92637 245
99 245 -16393 73322 -182016 -93600 296771 2013 -306842 100046 216517 -103351 -45250
110 -45250 15077 -87583 137848 113287 -286194 -50916 326130 -59196 -239698 135619
$$ packed form
0@%%%%%%%%%%%qJ6j6J6j6K4l5M3m8N6p2Q5r7J13j31J50j74K02k30K61k96L36l81
34b02M28m80N38o00O70p47Q28r16J017j127J243j372J514j667J834k021K229k456
52a287K706k989L308l667M077m554N116n784O595p603Q891j0604J2995j6557K2381
67A3024l3420O0957k42423l24064Q37169o8643n45754L29490R3151l11106L95945
78B04326J8377o05883L65882N27516o39498k27958O09094q1639l29846K15409
88E5780q3969j07964L96697j50932m88354L88286L30849m65016r1788L09048r2392
99B45j6638Q9715k55338Q8416L90371k94758l08855M06888J16471l19868N8101
110d5250O0327j02660K25431k4561l99481K35278L77046l85326j80502L75317
$$ plain form
120 135619 87215 -89934 79592 -42088 -156900 205057 114605 -321394 -11979 303592
130 303592 -94346 -169405 128576 -4008 -45102 148650 -93971 -176691 232850 102835
140 102835 -285288 21234 230892 -98772 -76494 105638 -66046 -505 159494 -136115
150 -136115 -159831 218805 56809 -243426 24305 137718 -86749 -7949 54507 -105151
160 -105151 40383 148906 -138893 -110294 185627 24245 -160136 39423 67288 -44788
170 -44788 48504 8307 -99013 84603 115200 -125632 -54914 127330 -8091 -73570 29081
181 29081 -15207 -11175 74128 -46641 -85551 101091 52086 -111601 -2871 63523 -40235
192 -40235 -3865 15767 -73000 23013 91714 -79017 -62323 112301 14500 -82734 41852
$$ packed form
120A35619m8404j77149J69526j21680j14812L61957r0452m35999L09415L15571
130C03592l97938p5059K97981j32584m1094J93752k42621q2720M09541j30015
140A02835l88123L06522K09658l29664K2278J82132j71684O5541J59999k95609
150a36115k3716L78636j61996l00235K67731J13413k24467P8800O2456j59658
160a05151J45534J08523k87799K8599K95921j61382j84381J99559K7865j12076
170d4788R3292m0197j07320J83616L0597k40832P0718J82244j35421o5479J02651
181B9081m4288M032Q5303j20769l8910J86642m9005j63687J08730O6394j03758
192d0235L6370J9632q8767R6013O8701j70731J6694J74624r7801r7234J24586
$$ plain form
203 41852 26994 -52200 42347 17351 -90566 38054 90861 -82917 -43961 101876 -3402
214 -3402 -60746 48743 3235 -51018 50745 12048 -84889 29380 69596 -65248 -29686
225 -29686 69689 -8737 -35003 36248 -8335 -32864 39826 518 -58239 22262 39352 -38941
237 -38941 -11353 34589 -7032 -5590 19181 -15819 -9809 25094 -12901 -29013 17149 8816 -18960
250 -18960 4976 8315 -4967 15061 7214 -17962 8434 16955 -18701 -8489 14181 -7849 -6841
263 -6841 13727 -4220 -4365 21502 1281 -16104 12367 7778 -19982 -1336 7421 -15834 -4163
276 -4163 11963 -10130 -5225 18677 -365 -11598 12365 5107 -15444 1594 6800 -13310 -3132
289 -3132 10443 -5855 -4225 14932 2945 -7496 8620 7264 -9809 -1678 6856 -6876 -7446
$$ packed form
203D1852j4858p9194R4547k4996j07917J28620N2807j73778L8956J45837j05278
214c402n7344J09489m5508n4253J01763l8697r6937J14269M0216j34844L5562
225b9686R9375p8426k6266P1251m4583k4529P2690l9308n8757Q0501J7090p8293
237c8941K7588M5942m1621J442K4771l5000O010L4903l7995j6112M6162q333k7776
250a8960K3936L339j3282K0028p847k5176K6396Q521l5656J0212K2670k2030J008
263f841K0568j7947j45K5867k0221j7385K8471m589k7760J8646Q757k3255J1671
276d163J6126k2093M905K3902j9042j1233K3963p258k0551J7038N206k0110J0178
289c132J3575j6298J630J9157j1987j0441J6116j356j7073Q131Q534j3732n70
$$ plain form
302 -7446 6676 1335 -5961 6516 8269 -4711 -561 7806 -3742 -9173 2915 -399 -11609 -1404
316 -1404 6519 -4948 -2936 10602 2133 -6718 5240 5391 -9119 -2956 6660 -5953 -7432 8573
330 8573 4774 -6102 6672 11796 -4049 -1550 10801 -1938 -11552 4646 2787 -13974 -1128
343 -1128 11663 -5932 -5819 13891 2456 -11034 7522 5502 -15805 -2984 8682 -13501 -10411
356 -10411 12930 -1597 -12169 11983 9754 -10376 4030 11152 -8610 -2856 9153 -7281 -6622
369 -6622 11289 1743 -7031 8206 7324 -1739 3523 949 -3447 3911 -2403 -11636 1235 3011 -7152
384 -7152 1051 2589 -6313 8077 8059 -16480 -693 18795 -12870 -17260 15592 -327 -14477 14505
398 14505 1684 -18020 21762 16161 -32934 2970 33793 -22367 -21576 26040 -6038 -17809 25969
$$ packed form
302g446J4122n341p296J2477J753j2980M150Q367j1548n431J2088l314j1210J0205
316a404P923j1467K012J3538q469q851J1958J51j4510O163R616j2613j479J6005
330H573l799j0876J2774N124j5845K499J2351j2739r614J6198j859j6761J2846
343a128J2791j7595J13J9710j1435j3490J8556k020k1307J2821J1666k2183L090
356a0411K3341j4527j0572K4152k229k0130J4406P122j9762N754J2009j6434O59
369f622J7911r546q774J5237q82r063N262k574m396P358o314r233J2871J776j0163
384g152Q203J538q902J4390j8k4539J5787J9488l1665m390L2852j5919j4150K8982
398A4505j2821j9704L9782n601m9095L5904L0823n6160P91M7616l2078j1771M3778
$$ plain form
411 25969 -4972 -26992 36521 18781 -45983 9512 41440 -29597 -17913 27827 -17717 -12225
423 -12225 34318 -20968 -31424 51301 13521 -54767 17168 38315 -32465 -6689 20849 -29961
435 -29961 3762 39553 -40888 -28723 62770 3793 -54089 23116 25409 -27815 10353 3443
447 3443 -41382 27089 38710 -60063 -17237 67693 -7644 -38992 28248 4041 -11116 35375
459 35375 -21928 -47959 57978 30817 -75339 1763 60329 -24500 -14567 24395 -32405 7615
471 7615 57896 -56698 -55450 83503 15174 -84923 20314 43504 -35058 18193 17070 -64621
483 -64621 32316 77251 -82950 -54086 99799 3793 -78782 31888 20364 -32487 48776
494 48776 1837 -83759 56481 83615 -96418 -44321 96275 -6475 -54874 31956 -12411
$$ packed form
411B5969l0941k2020O3513j7740o4764N5495L1928p1037J1684M5740m5544N492
423a2225M6543n5286j0456Q2725l7780o8288P1935K1147p0780K5776K7538n0810
435b9961L3723L5791q0441J2165R1493n8977n7882P7205K293n3224L8168o910
447C443m4825O8471J1621r8773M2826Q4930p5337l1348O7240k4207j5157M6491
459C5375n7303k6031J05937k7161j06156P7102N8566q4829R933L8962n6800M0020
471G615N0281j14594J248J38953o8329j00097J05237K3190p8562N3251j123q1691
483f4621R6937M4935j60201K8864J53885r6006q2575J10670j1524n2851Q1263
494D8776m6939q5596J40240K7134j80033N2097J40596j02750m8399Q6830m4367
$$ plain form
505 -12411 -17265 74592 -23851 -91914 77093 72191 -98235 -25629 71820 -19223 -16209 23021
517 23021 -54079 7293 95455 -55078 -88326 92752 48313 -86319 889 34079 -29633
528 -29633 32150 9423 -93373 34986 106720 -81317 -73358 97067 20338 -61659 23611
539 23611 -7792 -29283 77790 -7167 -115196 61410 105316 -91927 -49529 85584 -3519
550 -3519 -26156 34421 -50441 -20745 107031 -29290 -123065 75238 85498 -89582 -24150
561 -24150 55361 -25111 14642 34103 -88827 -6148 122089 -49210 -112151 80551 56911
572 56911 -70413 6145 19061 -36557 58216 28654 -112070 14891 121316 -61413 -85134
583 -85134 73141 23107 -39507 29745 -22015 -37718 90186 12301 -119608 33282 100720
$$ packed form
505a2411m854R1857r8443o8063J69007m902j70426P2606R7449r1043L014L9230
517B3021p7100O1372Q8162j50533l3248J81078m4439j34632Q7208L3190o3712
528b9633O1783k2727j02796J28359P1734j88037P959J70425p6729q1997Q5270
539B3611l1403k1491J07073q4957j08029J76606M3906j97243M2398J35113q9103
550c519k2637O0577q4862K9696J27776j36321r3775J98303J0260j75080O5432
561b4150P9511q0472L9753J9461j22930Q2679J28237j71299o2941J92702k3640
572E6911j27324P6558J2916n5618R4773k9562j40724J26961J06425j82729k3721
583h5134J58275n0034o2614O9252n1760j5703J27904p7885j31909J52890O7438
$$ plain form
594 100720 -64908 -50514 50811 -9586 -2384 39645 -61152 -27522 108596 -9101 -109962
605 -109962 46615 68903 -56986 -12997 21957 -33832 35084 42197 -89365 -13491 113222
616 113222 -26005 -89031 52157 34979 -42043 18594 -6254 -49361 63247 39274 -101648
627 -101648 -32 102803 -35291 -60694 47619 3219 -22975 39885 -29780 -52192 77188
638 77188 28492 -95456 12167 78628 -35656 -28885 32118 -20801 1405 45547 -49793 -41951
650 -41951 77914 9883 -76756 20128 45129 -28490 1637 10121 -36111 26028 40971 -62125
662 -62125 -24001 70535 -6907 -51063 26207 13826 -17678 27162 -8018 -42672 43162 33038
674 33038 -64476 -8049 56373 -19045 -26650 26652 -11186 -8556 40307 -20885 -41663 48541
$$ packed form
594A00720j65628J4394J01325o0397P202M2029j00797L3630J36118j17697j00861
605a09962J56577K2288j25889M3989L4954n5789O8916P113j31562P5874J26713
616A13222j39227o3026J41188j7178p7022O0637k4848m3107J12608k3973j40922
627a01648J01616J02835j38094k5403J08313m4400k6194O2860o9665k2412J29380
638G7188m8696j23948J07623O6461j14284O771O1003n2919K2206M4142r5340P842
650d1951J19865o8031q6639R6884K5001p3619L0127Q484m6232O2139J4943j03096
662f2125L8124R4536p7442m4156P7270j2381l1504M4840l5180l4654Q5834j0124
674C3038r7514N6427O4422p5418p605N3302l7838K630M8863o1192k0778R0204
$$ plain form
686 48541 22062 -57408 3676 38151 -24220 -6635 21062 -25108 1582 41062 -27379 -32491
698 -32491 45167 9946 -42817 10916 18823 -21120 8405 11140 -28674 11209 33709 -28259
710 -28259 -19066 35412 -229 -24985 12227 2590 -14012 16304 822 -25428 15853 21776 -24170
723 -24170 -6544 22672 -6051 -9796 9886 -8193 -6306 17453 -6295 -18082 16794 10507 -17055
736 -17055 2488 10774 -9015 1793 6246 -13326 381 14636 -11465 -9633 15872 1026 -10510
749 -10510 8648 2610 -8757 8561 2927 -15431 4682 11613 -13259 -4518 13777 -4037 -6861
762 -6861 10781 -1307 -8614 9878 2449 -13451 3987 8883 -10686 -3343 10325 -3364 -5192
775 -5192 8438 327 -6726 6147 3167 -8353 316 5938 -5299 -3949 5523 302 -3786 3050
$$ packed form
686D8541k6479p9470O1084L4475o2371J7585K7697m6170K6690L9480o8441n112
698c2491P7658l5221n2763N3733P907l9943K9525K735l9814L9883K2500o1968
710b8259R193N4478l5641k4756L7212r637j6602L0316j5482k6250M1281N923m5946
723b4170J7626K9216k8723l745J9682j8079J887K3759k3748j1787L4876o287k7562
736a7055J9543Q286j9789J0808M453j9572J3707J4255k6101J832K5505j4846j1536
749a0510J9158o038j1367J7318n634j8358K0113O931k4872Q741J8295j7814k824
762f861J7642j2088p307J8492p429j5900J7438M896j9569P343J3668j3689j828
775e192J3630q111p053J2873k980j1520Q669N622j1237J350R472n221m088O836
$$ plain form
789 3050 2948 -2650 586 2746 -1917 -2448 2318 576 -3072 313 3017 -549 -1584 2828 1495 -2804
805 -2804 197 1938 -3198 -2264 2406 -1110 -3491 2418 2294 -2790 798 4014 -1428 -1957 3232 -755
821 -755 -4347 1459 1850 -3797 53 3957 -1390 -980 4434 1039 -2986 2252 2005 -4008 -925 2863
837 2863 -2310 -2033 3518 28 -2484 3267 2001 -3373 651 2848 -3466 -2219 1894 -1834 -2698 2352
853 2352 195 -1862 2394 1322 -1881 1266 2161 -2073 -963 1060 -1080 -393 1124 -1322 502 2129
869 2129 -532 -289 1683 -687 -444 840 -2691 -574 3798 -2023 -3543 4546 1542 -4018 2960 2137
885 2137 -4805 3241 3528 -8839 -20 9306 -6672 -6639 9799 66 -7721 7283 1394 -10132 7750
900 7750 5838 -15530 1271 14988 -10736 -8678 14284 -1781 -9097 11418 -717 -12732 13172
$$ packed form
789C050j02n598L236K160m663n31M766j742l648L385K704l566j035M412j333m299
805b804L001J741n136R34M670l516k381N909j24n084L588L216n442n29N189l987
821g55l592N806L91n647L850L904n347M10N414l395m025N238k47o013L083L788
837B863n173K77N551l490k512N751j266n374M024K197o314J247M113l728q64N050
853B352k157k057M256j072l203L147Q95m234J110K023k140O87J517k446J824J627
869B129k661K43J972k370K43J284l531K117M372n821j520Q089l004n560O978q23
885B137o942Q046K87j2367Q819R326j5978L3J6438r733p787J5004n889j1526J7882
900G750j912k1368J6801J3717k5724K058K2962j6065p316K0515j2135j2015K5904
$$ plain form
913 13172 6774 -20052 3326 17374 -12699 -7547 14036 -4331 -5202 13402 -6504 -11312 18925
926 18925 3185 -21774 7103 14377 -13112 -2362 7770 -9440 4186 12674 -17148 -6210
938 -6210 23485 -4731 -19654 12137 5621 -11286 7769 -1246 -15532 17592 11914 -28064 1359
951 1359 27745 -12845 -14038 16112 -4773 -6740 18357 -12488 -20253 30500 9348 -36427 8038
964 8038 27539 -18788 -6372 15603 -15863 1005 26368 -24598 -21956 40281 4876 -39289
976 -39289 13773 21690 -19869 4878 9259 -25813 13337 30167 -36454 -18132 44839 -2563
988 -2563 -33857 17402 8596 -15374 18135 -2650 -33265 27072 27862 -44558 -9902 42250 -9482
1001 -9482 -21176 17242 -7182 -5332 31071 -17131 -35497 39190 21759 -46430 -496 32364
$$ packed form
913A3172o398k6826K3378J4048l0073N152K1583j8367q71J8604j9906m808L0237
926A8925j5740k4959K8877P274k7489J0750J0132j7210J3626Q488k9822J0938
938f210K9695k8216j4923L1791o516j6907J9055r015j4286L3124n678l9978K9423
951A359K6386m0590j193L0150k0885j967K5097l0845p765N0753k1152m5775M4465
964H038J9501m6327J2416K1975l1466J6868K5363n0966K642O2237l5405m4165
976c9289N3062P917m1559K4747M381l5072L9150J6830o6621J8322O2971m7402
988b563l1294N1259q806k3970L3509k0785l0615O0337P90p2420L4656N2152n1732
1001i482j1694L8418k4424J850L6403m8202j8366P4687j7431o8189M5934L2860
$$ plain form
1013 32364 -14149 -3782 12221 -24440 7388 39211 -32129 -32844 46593 11711 -42031 8720
1025 8720 15966 -16395 16301 3331 -39975 21977 42756 -44568 -25591 49374 -84 -30905
1037 -30905 16912 -2984 -13967 35447 -7660 -49676 35485 41112 -50747 -14918 43425 -10144
1049 -10144 -14547 19318 -22043 -7406 47937 -18555 -51265 42238 32682 -47183 -5002 28558
1061 28558 -15623 4419 14770 -37795 3302 52528 -28178 -43948 42641 19807 -35040 5644
1073 5644 8477 -15450 24617 6059 -47847 15625 49261 -35553 -30160 38086 4127 -18942
1085 -18942 14129 -12796 -13505 41530 -4724 -52681 27098 40370 -38650 -14528 28997 -10136
1097 -10136 -908 19242 -31650 -8240 51991 -14555 -50157 33575 28603 -34785 163 15604
$$ packed form
1013C2364m6513J0367J6003l6661L1828L1823p1340p15P9437l4882n3742N0751
1025H720P246l2361L2696j2970m3306O1952K0779q7324J8977P4965m9458l0821
1037c0905M7817j9896j0983M9414m3107m2016Q5161N627r1859L5829N8343n3569
1049a0144m403L3865m1361J4637N5343o6492l2710R3503r556p9865M2181L3560
1061B8558m4181K0042J0351n2565M1097M9226q0706j5770Q6589k2834n4847M0684
1073E644K833k3927M0067j8558n3906O3472L3636q4814N393O8246l3959k3069
1085a8942L3071k6925p09N5035m6254m7957P9779J3272p9020K4122M3525l9133
1097a0136R228K0150n0892K3410O0231o6546l5602Q3732m972o3388L4948J5441
$$ plain form
1109 15604 -18835 16315 18560 -43425 -906 52872 -21404 -40535 32269 13797 -24124 11004
1121 11004 -417 -21104 29356 12871 -47133 6481 45354 -23646 -25511 25811 -1 -10429
1133 -10429 17651 -14667 -18337 37688 4895 -44089 13331 33027 -23009 -10257 16577 -11545
1145 -11545 3386 19404 -26519 -12491 39859 -4129 -36284 18002 18364 -19083 3661 5293
1157 5293 -17908 15743 17432 -32941 -4421 36466 -10982 -24350 18489 3861 -11829 13629
1169 13629 -5322 -19807 24296 12318 -33429 2850 28462 -14555 -11820 15349 -7201 -4354
1181 -4354 18715 -13086 -17771 26570 6245 -28943 7244 18868 -14522 -2205 10687 -12994
1193 -12994 1857 18246 -16685 -13007 24474 1280 -21378 8574 9727 -10936 4630 4627 -13246
$$ packed form
1109A5604l4439L5150K245o1985M2519N3778p4276j9131P2804j8472l7921L5128
1121A1004j1421k0687N0460j6485o0004N3614L8873o9000j865N1322k5812j0428
1133a0429K8080l2318l670N6025l2793m8984N7420J9696n6036J2752K6834k8122
1145a1545J4931J6018m5923J4028N2350m3988l2155N4286L62l7447K2744J632
1157E293k3201L3651J689n0373K8520M0887m7448j3368M2839j4628j5690K5458
1169A3629j8951j4485M4103j1978m5747L6279K5612m3017K735K7169k2550K847
1181d354K3069l1801m685M4341k0325l5188L6187J1624l3390J2317J2892k3681
1193a2994J4851J6389l4931L678L7481k3194k2658K9952J153k0663J5566lj7873
$$ plain form
1206 -13246 7128 14037 -16627 -6516 18491 -2814 -11902 8061 916 -5923 8550 -2247 -11615
1219 -11615 10570 7205 -14358 -15 11144 -5961 -2788 6334 -5598 -1238 10326 -6545 -8592
1232 -8592 11379 2253 -11321 4412 5475 -7179 2544 4619 -8459 1598 9699 -7921 -5715
1245 -5715 10557 -522 -8364 5534 2528 -6271 4143 2934 -8034 2214 7041 -6965 -3457
1258 -3457 7655 -1637 -4913 4547 615 -4133 3917 1644 -5144 2198 4173 -4440 -1131 4169 -1556
1273 -1556 -1960 2923 -873 -2074 2558 146 -3073 1243 1287 -2349 -237 1444 -1179 -332 599 -989
1289 -989 83 1354 -731 -167 1075 140 -627 577 -142 -342 683 -536 -477 1027 557 -1160 628
1306 628 963 -1133 -30 731 -1465 -660 1113 -932 -1335 1248 176 -1533 944 794 -1615 -132
$$ packed form
1206a3246K0374O909l0664J0111K5007k1305r088J9963p145o839J4473j0797r368
1219a1615K2185l365k1563J4343J1159j7105L173R122j1932M360J1564j6871k047
1232h592J9971r126j3574J5733J063j2654R723K075j3078J0057Q101j7620K206
1245e715J6272j1079p842J3898l006q799J0414j209j0968J0248M827j4006L508
1258c457J1112r292l276R460l932m748Q050k273o788P342J975q613L309N300n725
1273a556m04M883l796j201M632k412l219M316M4l636K112J681k623Q47R31j588
1289i89J072J271k085N64J242r35p67J204p19k00J025j219N9J504m70j717J788
1306F28L35k096J103P61k196Q05J773k045m03K583j072j709K477j50k409J483
$$ plain form
1322 -132 1642 -1202 -858 1603 52 -1330 1111 1397 -1462 654 1623 -1239 -341 1705 -594 -1571
1338 -1571 1249 306 -1672 670 1169 -1411 -354 1903 -718 -1101 881 -70 -1232 193 469 -556
1354 -556 -52 606 -61 -74 493 268 -8 -200 351 554 -938 -881 1516 -296 -1703 1090 955 -1912 680
1373 680 1729 -2598 -485 3423 -2198 -3085 3694 608 -4109 2312 2387 -3692 1408 3492 -4089 -528
1389 -528 5794 -2740 -4194 5512 949 -5020 3167 2135 -4494 2560 3420 -6219 161 6393 -4416
1404 -4416 -4130 5677 -767 -4422 3832 -209 -4367 4960 1663 -7540 3364 6011 -5986 -2035 5410
1419 5410 -2958 -1490 5031 -4635 -2757 8780 -1459 -8528 6552 4191 -7330 1307 3153 -6257
1433 -6257 3585 4939 -9997 -190 12044 -5440 -8521 9067 941 -6960 5448 -948 -8390 9344
$$ packed form
1322a32J774k844L44K461j551j382K441K86k859K116R69k862Q98K046k299r77
1338a571K820r43j978K342M99k580J057K257k621l83J982r51j162J425K76j025
1354e56N04O58o67j3N67k25k76j92N51K03j492N7K397j812j407K793j35k867K592
1373F80J049m327K113L908n621q87O779l086m717O421P5o079N100K084p581L561
1389e28O322q534j454R706m563n969Q187j032o629P054Q60r639O380O232j0809
1404d416K86R807o444l655Q254m041m158R327l297r203J0904K647j1997L951P445
1419E410q368J468O521r666J878J1537j0239p069J5080k361j1521Q637J846r410
1433f257R842J354j4936R807J2234j7484l081J7588q126p901J2408o396p442J7734
$$ plain form
1447 9344 3911 -14929 3400 13822 -9361 -5723 10441 -3497 -4052 9649 -6483 -8793 15563
1460 15563 1719 -18368 7056 13250 -11736 -2015 9309 -7864 548 11938 -12408 -8031 19866
1473 19866 -1383 -18915 9708 9869 -11466 2652 4839 -11152 7249 11557 -18464 -4598 21361
1486 21361 -5310 -15588 10749 3226 -7512 8821 -2619 -13177 15235 8708 -22379 603
1498 603 19475 -9213 -8636 9788 -5530 -1308 14416 -11867 -13242 22816 4308 -24180 6585
1511 6585 14657 -11652 213 6951 -13412 6202 18124 -19963 -11186 27394 -453 -22531 10365
1524 10365 7800 -11767 8600 1501 -19370 13890 18732 -25472 -7875 27362 -4781 -17017
1536 -17017 11525 -965 -7833 15910 -5457 -21820 20027 15721 -27330 -2735 22792 -8108
$$ packed form
1447I344n433j8840J8329J0422k3183L638J6164j3938n55J3701j6132k310K4356
1460A5563j3844k0087K5424O194k4986R721J1324j7173Q412J1390k4346M377K7897
1473A9866k1249j7532K8623J61k1335J4118K187j5991J8401M308l0021J3866K5959
1486B1361k6671j0278K6337p523j0738J6333j1440j0558K8412o527l1087K2982
1498F03J8872k8688N77J8424j5318M222J5724k6283j375L6058j8508k8488L0765
1511F585Q072k6309J1865O738k0363J9614J1922l8087Q777L8580k7847k2078L2896
1524A0365k565j9567K0367p099k0871L3260M842m4204J7597L5237l2143j2236
1536a7017K8542j2490o868K3743k1367j6363M1847m306m3051K4595K5527l0900
$$ plain form
1548 -8108 -7577 10034 -10165 -962 20919 -13598 -20490 24606 10080 -24983 3274 14000 -9728
1561 -9728 3441 5945 -18621 6643 22922 -20444 -16620 25575 3310 -19216 7730 3563 -8844
1574 -8844 13657 -454 -23610 14117 21060 -24154 -10179 23049 -3036 -10771 10125 -6535
1586 -6535 -5401 21120 -6805 -24778 19143 16923 -24365 -3235 17108 -8003 -1157 9519 -15669
1599 -15669 -891 25432 -12201 -22703 21684 10268 -21343 2999 8827 -10409 8555 7402
$$ packed form
1548h108N31J7611k0199R203K1881l4517o892M5096j4526l5063K8257J0726k3728
1561i728J3169K504k4566K5264J6279m3366L824M2195k2265k2526K6946m167j2407
1574h844K2501j4111k3156L7727O943m5214J3975L3228k6085p735K0896j6660
1586f535J134K6521k7925j7973M3921k220m1288K1130K0343k5111O846J0676k5188
1599a5669J4778K6323l7633j0502M4387j1416l1611K4342N828j9236J8964j153
$$ [...]
8191c3
##END NTUPLES=NMR FID
##END=
