##TITLE=1H_UK_24_6
 CD2Cl2
 48 sc, 
 20.4.2023
##JCAMPDX= 6.0         $$ Bruker NMR JCAMP-DX V2.0
##DATA TYPE= NMR FID
##DATA CLASS= NTUPLES
##ORIGIN= UXNMR, Bruker Analytische Messtechnik GmbH
##OWNER= root
$$ XWIN-NMR		Version 3.5
$$ Thu Apr 20 14:04:12 2023 Russian Standard Time (UT+4h)  she@DPX200
##.OBSERVE FREQUENCY= 200.1316
##.OBSERVE NUCLEUS= ^1H
##.DELAY= (6, 6)
##.ACQUISITION MODE= SIMULTANEOUS
##.ACQUISITION SCHEME= undefined
##.AVERAGES= 48
##.DIGITISER RES= 18
##SPECTROMETER/DATA SYSTEM= spect
##.PULSE SEQUENCE= zg30
##.SOLVENT NAME= CD2Cl2
##.SHIFT REFERENCE= (INTERNAL, CD2Cl2, 0, 15.7039)
##AUDIT TRAIL= $$ (NUMBER, WHEN, WHO, WHERE, WHAT)
$$ ##TITLE= Audit trail, XWIN-NMR		Version 3.5
$$ ##JCAMPDX= 5.01
$$ ##ORIGIN= Bruker BioSpin GmbH
$$ ##OWNER= she
$$ F:/spectra/data/she/nmr/H-F/1/audita.txt
$$ ##AUDIT TRAIL=  $$ (NUMBER, WHEN, WHO, WHERE, WHAT)
(   1,<2023-04-20 14:03:02.62 +0400>,<she>,<DPX200>,
      <continue with go, POWCHK disabled, PULCHK disabled
       configuration hash MD5:
       00 E9 B6 7A A2 85 ED C7 34 08 36 98 17 FE 4E 26
       data hash MD5: 16K
       14 7D 27 1F 3E 8F 4F F3 80 2F B8 70 67 40 47 A1>)
$$ ##END=
$$ 
$$ hash MD5
$$ 4D 55 8F F4 11 B1 05 3A 48 FF 5B C8 5C 15 03 48
##$RELAX= 
##$RELAX= 
##$RELAX= 
##$RELAX= 
##$RELAX= 
##$RELAX= 
$$ Bruker specific parameters
$$ --------------------------
##$DU= <F:/spectra>
##$EXPNO= 1
##$NAME= <H-F>
##$PROCNO= 1
##$TYPE= <nmr>
##$USER= <she>
##$AMP= (0..31)
100 100 100 100 100 100 100 100 100 100 100 100 100 100 100 100 100 100 
100 100 100 100 100 100 100 100 100 100 100 100 100 100 
##$AQSEQ= 0
##$AQ_mod= 1
##$AUNM= <au_zg>
##$AUTOPOS= <>
##$BF1= 200.13
##$BF2= 200.13
##$BF3= 200.13
##$BF4= 200.13
##$BF5= 200.13
##$BF6= 200.13
##$BF7= 200.13
##$BF8= 200.13
##$BYTORDA= 1
##$CFDGTYP= 0
##$CFRGTYP= 5
##$CHEMSTR= <none>
##$CNST= (0..31)
1 1 145 1 1 1 1 1 1 1 1 1 1 1 1 1 1 1 1 1 1 1 1 1 1 1 1 1 1 1 1 1 
##$CPDPRG= <>
##$CPDPRG1= <>
##$CPDPRG2= <>
##$CPDPRG3= <>
##$CPDPRG4= <mlev>
##$CPDPRG5= <mlev>
##$CPDPRG6= <mlev>
##$CPDPRG7= <mlev>
##$CPDPRG8= <mlev>
##$CPDPRGB= <>
##$CPDPRGT= <>
##$D= (0..31)
0 1.2 0 0 0 0 0 0 0 0.06 0 0.03 0 0 0 0 0.0002 0 0 0 0 0 0 0 0 0 0 0 0 
0 0 0 
##$DATE= 1681984774
##$DBL= (0..7)
120 120 120 120 120 120 120 120 
##$DBP= (0..7)
150 150 150 150 150 150 150 150 
##$DBP07= 0
##$DBPNAM0= <>
##$DBPNAM1= <>
##$DBPNAM2= <>
##$DBPNAM3= <>
##$DBPNAM4= <>
##$DBPNAM5= <>
##$DBPNAM6= <>
##$DBPNAM7= <>
##$DBPOAL= (0..7)
0.5 0.5 0.5 0.5 0.5 0.5 0.5 0.5 
##$DBPOFFS= (0..7)
0 0 0 0 0 0 0 0 
##$DE= 6
##$DECBNUC= <off>
##$DECIM= 32
##$DECNUC= <off>
##$DECSTAT= 4
##$DIGMOD= 1
##$DIGTYP= 9
##$DL= (0..7)
0 120 120 120 120 120 120 120 
##$DP= (0..7)
150 150 150 150 150 150 150 150 
##$DP07= 0
##$DPNAME0= <>
##$DPNAME1= <>
##$DPNAME2= <>
##$DPNAME3= <>
##$DPNAME4= <>
##$DPNAME5= <>
##$DPNAME6= <>
##$DPNAME7= <>
##$DPOAL= (0..7)
0.5 0.5 0.5 0.5 0.5 0.5 0.5 0.5 
##$DPOFFS= (0..7)
0 0 0 0 0 0 0 0 
##$DQDMODE= 0
##$DR= 18
##$DS= 0
##$DSLIST= <SSSSSSSSSSSSSSS>
$$ [...]
##$SUBNAM2= <"">
##$SUBNAM3= <"">
##$SUBNAM4= <"">
##$SUBNAM5= <"">
##$SUBNAM6= <"">
##$SUBNAM7= <"">
##$SUBNAM8= <"">
##$SUBNAM9= <"">
##$SW= 18.0517057926174
##$SWIBOX= (0..15)
0 0 2 0 0 0 0 0 0 0 0 0 0 0 0 0 
##$SW_h= 3612.71676300578
##$TD= 16384
##$TD0= 1
##$TE= 0
##$TE2= 300
##$TE3= 300
##$TEG= 300
##$TL= (0..7)
0 120 120 120 120 120 120 120 
##$TP= (0..7)
150 150 150 150 150 150 150 150 
##$TP07= 0
##$TPNAME0= <>
##$TPNAME1= <>
##$TPNAME2= <>
##$TPNAME3= <>
##$TPNAME4= <>
##$TPNAME5= <>
##$TPNAME6= <>
##$TPNAME7= <>
##$TPOAL= (0..7)
0.5 0.5 0.5 0.5 0.5 0.5 0.5 0.5 
##$TPOFFS= (0..7)
0 0 0 0 0 0 0 0 
##$TUNHIN= 0
##$TUNHOUT= 0
##$TUNXOUT= 0
##$USERA1= <user>
##$USERA2= <user>
##$USERA3= <user>
##$USERA4= <user>
##$USERA5= <user>
##$V9= 5
##$VALIST= <valist>
##$VCLIST= <CCCCCCCCCCCCCCC>
##$VD= 0
##$VDLIST= <DDDDDDDDDDDDDDD>
##$VPLIST= <PPPPPPPPPPPPPPP>
##$VTLIST= <TTTTTTTTTTTTTTT>
##$WBST= 1024
##$WBSW= 4
##$XGAIN= (0..3)
0 0 0 0 
##$XL= 0
##$YL= 0
##$YMAX_a= 264937
##$YMIN_a= -373411
##$ZGOPTNS= <>
##$ZL1= 120
##$ZL2= 120
##$ZL3= 120
##$ZL4= 120
##$ABSF1= 10
##$ABSF2= 0
##$ABSG= 5
##$ABSL= 3
##$ALPHA= 0
##$AQORDER= 0
##$ASSFAC= 0
##$ASSFACI= 0
##$ASSFACX= 0
##$ASSWID= 0
##$AUNMP= <proc_1d>
##$AZFE= 0.1
##$AZFW= 0.1
##$BCFW= 1
##$BC_mod= 2
##$BYTORDP= 1
##$COROFFS= 0
##$CY= 11.3945322036743
##$DATMOD= 1
##$DC= 2
##$DFILT= <>
##$DTYPP= 0
##$F1P= 15.7292609196834
##$F2P= 12.9074282941183
##$FCOR= 0.5
##$FTSIZE= 0
##$FT_mod= 4
##$GAMMA= 1
##$GB= 0.15
##$INTBC= 1
##$INTSCL= 1
##$ISEN= 128
##$LB= 0.24
##$LEV0= 0
##$LPBIN= 0
##$MAXI= 10000
##$MC2= 0
##$MEAN= 0
##$ME_mod= 0
##$MI= 1.114404
##$NCOEF= 0
##$NC_proc= 0
##$NLEV= 6
##$NOISF1= 3.799351
##$NOISF2= 2.8
##$NSP= 1
##$NTH_PI= 0
##$NZP= 0
##$OFFSET= 15.70392
##$PC= 1
##$PHC0= -19830.62
##$PHC1= 12.40081
##$PH_mod= 1
##$PKNL= yes
##$PPARMOD= 0
##$PSCAL= 0
##$PSIGN= 0
##$REVERSE= no
##$SF= 200.130013532006
##$SI= 16384
##$SIGF1= 3
##$SIGF2= 2
##$SINO= 400
##$SIOLD= 16384
##$SREGLST= <1H.CDCl3>
##$SSB= 0
##$STSI= 0
##$STSR= 0
##$SW_p= 3612.71676300578
##$SYMM= 0
##$S_DEV= 0
##$TDeff= 0
##$TDoff= 0
##$TI= <>
##$TILT= no
##$TM1= 0
##$TM2= 0
##$TOPLEV= 0
##$USERP1= <user>
##$USERP2= <user>
##$USERP3= <user>
##$USERP4= <user>
##$USERP5= <user>
##$WDW= 1
##$XDIM= 8192
##$YMAX_p= 0
##$YMIN_p= 0
$$ End of Bruker specific parameters
$$ ---------------------------------
##NTUPLES= NMR FID
##VAR_NAME=  TIME,          FID/REAL,        FID/IMAG
##SYMBOL=    X,             R,               I
##VAR_TYPE=  INDEPENDENT,   DEPENDENT,       DEPENDENT
##VAR_FORM=  AFFN,          ASDF,            ASDF
##VAR_DIM=   8192,          8192,            8192
##UNITS=     SECONDS,       ARBITRARY UNITS, ARBITRARY UNITS
##FACTOR=    0.0002768,     1,               1
##FIRST=     0,             0,               0
##LAST=      2.2672688,     0,               0
##MIN=       0,             -373411,         0
##MAX=       2.2672688,     264937,          0
$$ Real data points
##PAGE= N=1
##DATA TABLE= (X++(R..R)), XYDATA
0@%%%%%%%%%%%%%%jM9r6R6r6R6j44J92j93K41k89L37m07M55n28O24p20Q17r21
33d88J055j197J348j523J709j915K135k377K646k938L253l603L987m404M857n353
49b808N899o495P154p884Q694r592J0601j1739J3031j4528J6266j8315K0786k3831
63a2761K7687l2749L9737n0108O7320j03140L28951l18438P8896J94177n65139
74c45567O00654j72536k79835M19793m40030l9504L95659m09028L09234R5589
84A34429m09157L32693r8356j89172M43558k42023k1025K61651l71109J47434
94a1077J81572k86991L03160n2438k53086K77831j90684m4088K75107k47862P3602
105B5046Q0529k67189J69961J5873j15798J89408j05943q1521J13208j07602K8820
$$ plain form
0 0 0 0 0 0 0 0 0 0 0 0 0 0 0 0 -1 48 -48 48 -48 48 -96 96 -97 144 -145 192 -215 240 -288 336 -384 433 -488
33 -488 567 -630 718 -805 904 -1011 1124 -1253 1393 -1545 1708 -1895 2092 -2312 2545 -2808
49 -2808 3091 -3404 3750 -4134 4560 -5032 5569 -6170 6861 -7667 8599 -9716 11070 -12761
63 -12761 14926 -17823 21914 -28194 39126 -64014 264937 -53501 25395 219572 -345567
74 -345567 255087 82551 -197284 222509 -217521 -257025 138634 -270394 38840 134429
84 134429 -274728 57965 -40391 -229563 213995 -28028 -49053 212598 -158511 -11077
94 -11077 170495 -116496 186664 134226 -118860 158971 -31713 -75801 199306 -48556 25046
105 25046 105575 -161614 8347 24220 -91578 97830 -8113 -89634 23574 -84028 -55208
116e5208J15865q5023J7905K8028j09681N3832P4863p0337Q1669R501j25023R2907
128B9298j8242o0656J61331p7379n8775J03493j50095L6189J19303j43609J02162
139D3020J9067j83952J45405l6671q6540K19557j34345n1092J62901k17270R2527
150b7393J40844k17468J90750k3548k18150K46667j29926n2353K61031k55124
160h4670N5007J28348k82243K27081K0312j94119K78412j72725r8669K57758k37449
171a02957J00155J71620k86715J84230l660k25763K83276j08496r2989K46137
181A64838k57277K0703J72856k49130J88539M8112k29682K23545j13101j09161
191a39758K59289j74176L1427J53177k50607J25397N5590j72751K15674o0284
$$ plain form
116 -55208 60657 -24366 -6461 21567 -88114 -34282 40581 -29756 51913 61414 -63609 29298
128 29298 11056 -49600 111731 34352 -24423 79070 -71025 -34836 84467 -59142 43020
139 43020 62087 -121865 23540 -13131 -99671 119886 -14459 -65551 97350 -119920 -27393
150 -27393 113451 -104017 86733 63185 -154965 91702 -38224 -90577 170454 -84670
160 -84670 -29663 98685 -183558 43523 63835 -130284 148128 -24597 -123266 134492 -102957
171 -102957 -2802 168818 -117897 66333 62673 -163090 120186 11690 -81299 164838
181 164838 -92439 -71736 101120 -148010 40529 88641 -141041 82504 -30597 -139758
191 -139758 119531 -54645 -23218 129959 -120648 4749 60339 -112412 103262 42978
201D2978j15709J72291j57527J816J56973j52452Q1753M3220j70042J19629j2822
212A0108q2076J55137p8190n2297J00166j21407L0931R9689j05341O7611J4885
223C9216j20661R0467p074n1467J17399n5194m8244P4087q2448K0026Q9345p9207
235a3755L7376K3604j07371O7635J3180n8776J04092m8100o5376Q5132q4277J0962
247c5674J04893j04457M5539L4039j33132J01750P909p7929J39604p7341o2493
258e7292J17693j16281L7201J09137j36854P9754J0749j39064J38031l2060o0226
269d9212J49647j25972j7488J06731j46165R4177O5152j43719J26059m7861j07755
280i6406J66809r0496r826J37852j66287M3967O8970j49973J40927P849j17769
$$ plain form
201 42978 -72731 99560 -57967 -56151 100822 -51630 30123 73343 -96699 22930 10108
212 10108 -71968 83169 4979 -47318 52848 -68559 -37628 62061 -43280 24331 39216
223 39216 -81445 9022 1948 -49519 67880 12686 -35558 38529 -43919 -23893 65452 -13755
235 -13755 23621 47225 -60146 7489 20669 -38107 65985 17885 -47491 37641 -46636 -35674
247 -35674 69219 -35238 10301 44340 -88792 12958 20867 -57062 82542 5201 -57292
258 -57292 60401 -55880 -18679 90458 -46396 33358 44107 -94957 43074 11014 -49212
269 -49212 100435 -25537 -43025 63706 -82459 11718 76870 -66849 59210 11349 -96406
280 -96406 70403 -20093 -29919 107933 -58354 -14387 54583 -95390 45537 53386 -64383
291f4383J40936r9007n1294J50841j21116M6812Q7372j64334R0271J1064j13050
302h5888J58068m9472o7443J25985j30897P316J11874j22616Q2443L4930j37543
313g3243J01551k7860o7330J39455p3250k5897Q6865j21137M0322O9778r6381
324d7127R0398m427j00313R6399m7302k9764J15708q2220k049O1220j11446N4751
336f172M5803q0917Q6148k2352q0598Q5168n0417j0544R5335p7401Q030M1436
348C3519r4690O2879L0025o4941Q1098l5773o2397Q0484n3409K950Q4453q4585
360b0387J7336L2227r1071P0130K0681o2200P9852m4811n2690P9628n5672J1102
372a5875P4190q5272K6418K1394q2828P8005O759n5166Q1099n8637l8597Q2003
$$ plain form
291 -64383 76553 -22454 -73748 77093 -44023 2789 90161 -74173 16098 27162 -85888
302 -85888 72180 22708 -44735 81250 -49647 -42331 69543 -53073 29370 64300 -73243
313 -73243 28308 448 -66882 72573 -677 -26574 60291 -60846 -20524 49254 -47127
324 -47127 43271 38844 -61469 34930 -12372 -42136 73572 -8648 -10697 50523 -60923 -6172
336 -6172 39631 -41286 44862 22510 -58088 27080 -23337 -33881 61454 -15947 -7917 33519
348 33519 -61171 1708 31733 -33208 47890 12117 -50280 30204 -23205 -20255 64198 -20387
360 -20387 -3051 29176 -61895 8235 28916 -33284 46568 1757 -50933 28695 -26977 -15875
372 -15875 58315 -26957 -539 20855 -61973 16032 22791 -32375 48724 -9913 -48510 33493
384C3493o6406K6032O5388r3270M0309J2680q1413R2336r415m9663Q5034p4975
396a9870k2700Q0174p8379M4847M8816r9988O0742r202p0465J06889l6381l2717
408b8234Q6560r6210P118P2601r0013P1300K6019j01155Q1557l3503n3998J13121
420E5163o4453p876P2981j11104L9867M6304q5556R3800j2909p8567R1393o4648
432b5605j5257J02146q4649K7699M5702j10024O8826J3592o8387J00545m6807
443G781m9277Q0347q1058J8481P4177q5722N1945Q998q7986Q2601j7898l4844
455c2455R0865o7881j2066N7114q0719M9097L7966p0794O0727k2109n7892P3592
467B5445l2842p793O3613o5906M896L1327n9164M8765J8758m6698M4468k6682
$$ plain form
384 33493 -32913 -6881 58507 -34763 5546 18226 -63187 29149 19734 -29929 55105 -19870
396 -19870 -42570 37604 -40775 4072 52888 -47100 13642 4440 -66025 40864 4483 -28234
408 -28234 58326 -37884 -30766 41835 -48178 23122 49141 -52014 29543 -3960 -57958 55163
420 55163 -9290 -17166 55815 -55289 -15422 30882 -54674 39126 26217 -52350 39043 -25605
432 -25605 -40862 61284 -23365 4334 50036 -59988 8838 22430 -45957 54588 7781
443 7781 -41496 38851 -42207 -23726 50451 -35271 16674 25672 -62314 20287 2389 -32455
455 -32455 58410 -9471 -21537 35577 -45142 3955 41921 -28873 31854 9745 -48147 25445
467 25445 -7397 -15190 48423 -17483 -12587 18740 -40424 8341 27099 -19599 24869 -1813
479a813l5013N5504k5957K305M3923n4476N197K3071m4567M1504J7233m1101L4858
492B0668j9194l3731N1236j6190p766M3293m7580m490L0624m4018L4319K3777
504C0948n1180L5463j5265m2052O3188k3566j1045N5806o5508P140M0158o1746
516c7659N8020J6081o6317O3169l4836l8619Q4297n4418N399N6736r1710L5686
528d171K5818p1382Q3802j6729n5666P7506o6929n727Q0190p6750M3686K9277
540D2925r5402P3687j1608n2475J00706o0144j9639P1111r4529L6707N0356q1657
552c9962P2918j2923p2141Q2758m6970j1071Q0933p6990K0805L3130q1416O5321
564A4392N939n0905P4435m8517k7330O3390n9896K5148M4645o6518L7132j013
$$ plain form
479 -1813 -36826 18678 -7279 -4974 38949 -15527 -10330 12741 -31826 9678 26911 -14190 20668
492 20668 1474 -32257 18979 2789 -4977 38316 -9264 -13754 16870 -27148 7171 30948
504 30948 -20232 15231 -34 -42086 21102 -2464 -13509 42297 -23211 -16071 24087 -37659
516 -37659 20361 36442 -29875 33294 -1542 -40161 44136 -10282 -4883 51853 -39857 -4171
528 -4171 21647 -49735 34067 17338 -38328 39178 -27751 -33478 46712 -30038 13648 42925
540 42925 -52477 21210 9602 -42873 57833 -2311 -21950 49161 -45368 -8661 41695 -39962
552 -39962 32956 20033 -52108 30650 -16320 -27391 53542 -23448 -2643 30487 -50929 14392
564 14392 20331 -30574 43861 -4656 -31986 31404 -28492 -3344 41301 -25217 11915 10902
576A0902n1944O2003j6066j9305M9716n0079j659L2782m2023L3019J6567m1994
588a8081K7700j5044k3632M0978j1745m614K3752l0944k703J9728j7007J6217
600D605J6301k5584M626L546k1966K4426Q825k1405K0834j5853k3518L3456j7114
613h821J411L2283m2316Q672J6874m0536M2161N879l5748M6055l3624k1322N5597
626B6565m2162J5127L9174o7054L2329Q620n3462O7749j8660l2839O0423o2535
638b6725K171N4744o4877M8325J5366p1778O5954k8833l2781Q3292n8328L163
650a0307N0656q4873M5349K3591o3641P5133k6657m5542P0242n8649N798O1317
662D2417p0560L8056J2988o8914O4891j5036l1950P0520n4092p112M7380o4884
$$ plain form
576 10902 -41042 20961 4895 -14410 35306 -14773 -16432 16350 -25673 7346 23913 -18081
588 -18081 9619 -5425 -29057 11921 176 -4438 19314 -11630 -14333 5395 -11612 4605
600 4605 20906 -4678 -52 3494 -18472 5954 14779 -6626 14208 -1645 -25163 8293 -8821
613 -8821 -7410 24873 -17443 -8771 8103 -32433 9728 15607 -20141 25914 -7710 -29032 26565
626 26565 -15597 -470 38704 -28350 3979 12599 -40863 26886 8226 -24613 35810 -26725
638 -26725 -24554 30190 -34687 13638 29004 -42774 23180 -5653 -38434 44858 -13470 -10307
650 -10307 40349 -44524 825 24416 -39225 35908 9251 -36291 33951 -24698 -18900 42417
662 42417 -28143 9913 22901 -46013 18878 3842 -28108 42412 -11680 -18792 28588 -36296
674c6296L7980K7430n7299N1799k0133l8102N9113l4757J672M3272n3004J7323
686a002J2993m1256M4704l122k5668L5298l0469q623L1257k5745J4759J6913l3916
699a3877J3228K319j9725K7304K61j5065J5736j3822j0096K0975o377R43J3807
712A5611j9385l377J1170j3046J2440J1982k1020R339j626k0351K6299k964j2325
725g253K7025k7006o433K8380l0804J9931J9549m1074K9323o815l2210M9525k1175
738I63j0998M0313m9625J1887K7285m6646M3488L36m1645M7587l1623j4967N4671
751C1026m5667J5583K8116o0982L9938L512m0809O0797k8039k3955N1239n4305
763b3546J3499M0983n5209L9519K467n1660N2972k3730j6359N6412m8794P090
$$ plain form
674 -36296 1684 29114 -28185 23614 3481 -34621 24492 -10265 -8593 34679 -18325 -1002
686 -1002 11991 -29265 15439 12317 -13351 21947 -8522 -17145 14112 -11633 3126 20039 -13877
699 -13877 -649 1670 -18055 9249 9510 -5555 10181 -3641 -13737 7238 861 1804 15611
712 15611 -3774 -7151 4019 -9027 3413 15395 -5625 3714 2088 -18263 8036 5072 -7253
725 -7253 19772 -7234 -13667 14713 -16091 3840 23389 -17685 11638 4823 -27387 22138 963
738 963 -10035 30278 -19347 -7460 19825 -26821 16667 17003 -24642 22945 -8678 -23645 31026
751 31026 -14641 942 29058 -31924 8014 11526 -29283 31514 3475 -20480 30759 -23546
763 -23546 -10047 30936 -24273 15246 17713 -33947 19025 -4705 -21064 35348 -13446 -6356
775f356L0140n5790L9086J0235m0371M8863k4565k5010M6467l6666Q621L4200
787B8854m6595K2635O714l8038L9478q463j8639L6617l2030l818K6923l0260K0688
800D066J3334l2160K2568o211k0244L1917j2235n401K1084k5672J359J4641j7806
813a0760J4603P375k0050J1104l002j2288J9208k949p254J3378j4424n415J6061
826E587j1281N782J2981k1564P024M692j8638K1667M70j6288K0900j6491r135
839a4294K6141j9630P190J7538l1072J5456M172k5002L2254p842j7115K8625k7941
852a1520j145K7958l1117J9532J1267l7127K9874p711k0423M1171k4051o363L0792
865B1137l9947J5282K0314l6162L3013l900l1152L6680k3439o068L6971l6242
$$ plain form
775 -6356 23784 -32006 7080 17315 -23056 25807 1242 -23768 22699 -13967 -5346 28854
787 28854 -17741 4894 11608 -26430 13048 4585 -14054 22563 -9467 -13285 13638 -16622 4066
800 4066 17400 -14760 7808 1597 -18647 13270 1035 -4366 16718 -8954 -7595 7046 -10760
813 -10760 3843 11218 -8832 2272 -730 -13018 6190 3241 -4013 9365 -5059 -10474 5587
826 5587 -5694 88 13069 -8495 -1471 3221 -15417 6250 6720 -9568 11332 -5159 -14294
839 -14294 11847 -7783 -593 16945 -14127 1329 5501 -19501 12753 4911 -12204 16421 -11520
852 -11520 -12665 15293 -15824 3708 14975 -22152 7722 11 -20412 20759 -3292 -9655 21137
865 21137 -18810 -3528 16786 -19376 13637 9737 -21415 15265 -8174 -14242 22729 -13513
877a3513J0862J7292m0157L0244K839k7316L9856k1403j5105L5010l3130J0488
889d033K6309l7140K2255L804l3121L3384j0140j4597L3396k8630p55K2341l0811
902a7738K0203J0252k7638K5605r630j8107L0659j7821k99K3054k9184P909J2950
915A0215k4507K1441J869j9484K0452j2550r113K2499j5174L294J3531k2103R051
928e79O157j5854J8223j572j3844J6974j2801n288J8505j4086M007J0572j9327
941h913P899O080j4510J6366m38j3283J4548q920o534J8533j2598R75J2532j9373
955g636O981O871j6010J7975l582j4292J8029j2602n139K1031j7232M042J3046
968A1482k3054J3369N994j8126K1742o006j5081K1790j6983j682K0927k2091R845
$$ plain form
877 -13513 -2651 14641 -25516 4728 7567 -19749 20107 -1296 -16401 18609 -14521 -4033
889 -4033 22276 -14864 7391 11195 -21926 11458 1318 -13279 20117 -8513 -9268 13073 -17738
902 -17738 2465 12717 -14921 10684 1054 -17053 13606 -4215 -4514 18540 -10644 -2735 10215
915 10215 -14292 7149 9018 -10466 9986 -2564 -11677 10822 -4352 -1058 12473 -9630 -579
928 -579 5578 -10276 7947 6375 -7469 9505 -3296 -8584 9921 -4165 -158 10414 -8913
941 -8913 -1014 5066 -9444 6922 6484 -6799 7749 -1171 -7705 10828 -1770 -795 11737 -7636
955 -7636 -655 6216 -9794 8181 4599 -9693 8336 -4266 -9405 11626 -5606 -1564 11482
968 11482 -11572 1797 7791 -10335 11407 5401 -9680 12110 -4873 -6555 14372 -7719 2126
981B126Q026k5340K0221k085j6823K8286j6061p746K3644k5539Q604J8052k7526
994a2161K0414Q29k4912K7300j1200j0271K7829k4370J132J7973k7467J7260P828
1007A0184k3246K3796r784j5025K7855k0227J178K1556k7947J2851Q623k5246
1019a5432K4022l597j6969K5786j8707m588K2303k3429J0604J1405k3679J7820
1031E539k076j6171K3899j1211o669J9203k1210N407J2712k0662J5278K394j7069
1044a0636J6557p529p703J7836j2199o9J1232j5323P041N873j1883J2502j980
1057C719j0545J1621o381m050J2797j0561J451O642j2047O197M270r914Q783O87
1071B669r746R546k071n883J0941n975l590J0738j0865J419Q883j1091O140M162
$$ plain form
981 2126 10152 -15188 5033 2948 -13875 14411 -1650 -9396 14248 -11291 -2687 15365 -12161
994 -12161 8253 9082 -15830 11470 270 -10001 17828 -6542 -5410 12563 -14904 2356 10184
1007 10184 -13062 10734 950 -14075 13780 -6447 -5269 16287 -11660 1191 9814 -15432
1019 -15432 8590 4993 -11976 13810 -4897 -9485 12818 -10611 -7 11398 -12281 5539
1031 5539 3463 -12708 11191 -20 -6689 12514 -8696 -3289 9423 -11239 4039 6433 -10636
1044 -10636 5921 -1608 -9311 8525 -3674 -3743 7489 -7834 -793 5080 -6803 5699 3719
1057 3719 -6826 4795 -1586 -5636 7161 -3400 -1949 4693 -7354 -1157 3113 -6801 1982 2669
1071 2669 -7077 2469 398 -5485 5456 -519 -4109 6629 -4236 -2817 6066 -5025 1115 5277
1085E277j2928J0685k392q911J5778r648k948J2783j6616O308J0581j8115J5270
1098E124n76j5886K0073r943p518K1344j8801K668J5112k3504J4694L867j9246
1111a2592K1280q034j1992K3447j8957J262J8461k4889J4601N646k3540K4493
1123I186p550j2991K5718k0161M17J9083k5601J4029P062k2055K1762p793j1869
1136a0763K3452j7447o00J7556k3042J1973O652k0678K1160n539j3403K1395j4836
1149d120j746J7396j9561P986Q168j7284J4727k397j0786J5863r897k116J1371
1162G604j2329M786N663j1609R326o69q125J0052n528k227Q890p476R12N584p451
1177b597K538M154o144L215K054n822L684J418n692N741n01n051O466k570m069
$$ plain form
1085 5277 -7651 3034 642 -8269 7509 -2139 -5087 7696 -8920 -2612 7969 -10146 5124
1098 5124 4548 -11338 8735 -1208 -8726 12618 -6183 -3515 11597 -11907 2787 6654 -12592
1111 -12592 8688 654 -11338 12109 -6848 -5586 12875 -12014 2587 8233 -15307 9186
1123 9186 1636 -11355 14363 -5798 -5381 13702 -11899 2130 9192 -12863 8899 1106 -10763
1136 -10763 12689 -4758 -5358 12198 -10844 1129 7781 -12897 8263 2724 -10679 10716 -4120
1149 -4120 -5866 11530 -8031 -45 8123 -9161 5566 3169 -7617 8246 -1651 -3767 7604
1162 7604 -4725 61 5724 -5885 3441 2772 -5353 4699 -829 -3056 5834 -1642 -730 4854 -2597
1177 -2597 -59 4095 -2049 1166 3220 -2602 1082 2500 -3192 2549 2048 -3003 3463 893 -3176
1192c176P897o054r63P248q862M108M586j0267R121j153p836J2454p982l701J3676
1207I096j3376L114R888j7007J3195L57j4321J8544r552o498J7994j8007M092
1220b481J1885k0727J4220K341j6510K0921j0484p974K0593j9006N138J3271k1513
1233a0326J5287J883j7849K0996j0261p359K0161j9438M360J2528k1650J5447
1245C779J590j7008J9834r796q001K0156j7104L713J2519j9149J2760J701j4212
1258i218J7697p473p500J5463j3931K538R885j4803R047K377j1909J1994n056
1271h89m248J0625q608P51P225j0568O044K335p291P250j850m549O248l182j471
1286b178M885l822o96L118l876K056K164k897J011J098k927P73K242k814K653
$$ plain form
1192 -3176 4721 -1333 -2296 4952 -3910 198 4784 -5483 3638 2485 -5351 7103 -879 -4580 9096
1207 9096 -4280 -1166 8722 -8285 4910 5267 -9054 9490 -62 -6560 11434 -6573 -2481
1220 -2481 9404 -11323 2897 5238 -11272 9649 -835 -8809 11784 -7222 -2084 11187 -10326
1233 -10326 4961 6844 -11005 9991 -270 -7629 12532 -6906 -2546 9982 -11668 3779
1245 3779 5369 -11639 8195 -1601 -9602 10554 -6550 -2837 9682 -9467 3293 4994 -9218
1258 -9218 8479 1006 -6494 8969 -4962 -2424 7461 -7342 1705 4082 -7827 4167 -889
1271 -889 -5137 5488 -3120 -2369 4856 -5712 332 2667 -4624 2626 776 -3773 2475 -707 -2178
1286 -2178 2707 -1115 -1811 1307 -2569 -513 1651 -1246 -235 863 -2064 -1291 951 -1863 790
1301G90Q30n474N086k616k495P171o107O0O844r719N002M221r402J0419k187q389
1317e966J2374q063j952J2101j2501M497N125j4000J1951j929r685J5520j0945
1330c473l077J3393j5269O941Q554j6175J4134k084j2422J8578j0326l539J5715
1343A0950j7018N294Q493j7298J4392m96j3015J6722j1123l531J4813j5726O870
1356f73P456j5760J2599j260j1155J6851q583m406J3574j4009L722Q826j2843
1369e661J0030l6j1036J2099o976k624J1685j0372K327M923j0461P622J235o965
1383d210R360m542m134O867o784K137N688o636L160J314o272N390q2k830M719
1398C145k560k008L008j620J6L385k507l05J192l641J467L028l308J858L07n593
$$ plain form
1301 790 1620 -3854 1232 -1384 -3879 3292 -2815 -2755 4089 -5630 -628 3593 -5809 4610 2423 -5966
1317 -5966 6408 -1655 -3607 8494 -4007 490 5615 -8385 3566 1637 -8048 7472 -3473
1330 -3473 -6550 6843 -8426 -1485 7069 -9106 5028 2944 -9478 9100 -1226 -4765 10950
1343 10950 -6068 -774 7719 -9579 4813 4317 -8698 8024 -3099 -6630 8183 -7543 -673
1356 -673 6783 -8977 3622 2362 -8793 8058 -525 -4931 8643 -5366 -1644 7182 -5661
1369 -5661 4369 4333 -6703 5396 -1580 -4204 7481 -2891 -564 4359 -6102 1520 2755 -4210
1383 -4210 5150 608 -3526 3341 -3443 -1306 4382 -2254 906 2220 -4052 1338 1256 -1574 3145
1398 3145 585 -1423 1585 -35 -19 3366 859 554 1746 -1895 -428 2600 -708 1150 1457 -4136
1414d136M511p77k362O349l206k459N597o258J941O139o954N075M26q244P888
1429C530l046l635R871q387Q9O159j0633O722L381r509J0361m163o634J1198p827
1444b523J174Q985j1725N210L238j1106J1003j763p301J2132r597j334Q978j1135
1458e764P435L604j1566R379k859o806J2614p119j680R590j1911L882N865j0580
1472e916J0774k043q028J0597p923j585J0922j0235L418M850j1750Q549m2o690
1486e102R903m422l721O740p878K905N518p574N035L95o968O927k216l198P978
1501D322n982Q7L820o057K839L131m100L961j331m399M597j299r66M503m032k83
1517a189K129l683K302K444l538J888j67l585K964P99k012M157k239k447L091
$$ plain form
1414 -4136 375 -402 -2764 3585 379 -2080 3517 -2741 -800 5339 -1615 3460 3886 -4358 3530
1429 3530 484 -3151 6720 -1667 -1578 4581 -6052 670 4051 -5458 4903 740 -5894 5304 -2523
1444 -2523 -1349 7636 -4089 1121 4359 -6747 4256 2493 -4808 7324 -2273 -3607 5371 -5764
1458 -5764 1671 5275 -6291 3088 229 -6577 6037 -1082 -2762 6828 -5083 -1201 4664 -5916
1472 -5916 4858 2815 -5213 5384 -2539 -4124 6798 -3437 -19 4831 -6919 1630 1588 -5102
1486 -5102 4801 379 -3342 3398 -4480 -1575 3943 -3631 1404 1799 -5169 1758 -458 -3656 4322
1501 4322 -1660 -1573 2247 -3810 -971 2160 -1940 2021 690 -3709 888 -411 -1377 3126 -906 -1189
1517 -1189 940 -2743 -441 2003 -1535 353 186 -3399 -435 364 -1648 2509 270 -2177 914
1532I14l747J760M291m082R03J347n694N156l50k817O039m240k395M909n357K786
1548e77M508o654L999j79o610Q072j814l313P539p154l75N819p308N329K785q321
1564d254O527k772m921R866o245P0O909r308L199L679q540Q818o46o209Q220o507
1580b114j366Q745q204L926L726j0318P227p55n769R373m579k004O805r587L593
1595a301N250q120P296j144o931Q168m449j632Q553p447J910L056p604N749Q80
1610B234m571O392m111l040N065m733K175M615n800L194p1n160N005l5j918L739
1626B980l408j383M146l829K125K787m252Q14Qk347L423l85p10K061j845j549
1642a364J443j139J873J774l118K49K31j720K522O29j742K572j459k817L240j093
$$ plain form
1532 914 -2833 -1073 3218 -864 39 1386 -4308 848 498 -2319 3720 -520 -2915 1994 -3363 -577
1548 -577 3931 -2723 1276 1097 -5513 2559 745 -2568 4971 -2183 -2558 3261 -4047 1282 4067 -4254
1564 -4254 2273 -499 -5420 4446 -1799 -1729 5180 -4128 -929 2750 -5790 3028 2382 -3827 4393 -2114
1580 -2114 -3480 5265 -2939 987 4713 -5605 1622 867 -4902 4471 -108 -2112 4693 -4894 -1301
1595 -1301 3949 -4171 3125 1981 -4950 3218 -1231 -2863 5690 -1757 153 3209 -4395 1354 2234
1610 2234 -2337 4055 -56 -3096 1969 -2764 -589 4026 -1774 1420 1349 -3811 1194 1159 -759 2980
1626 2980 -428 -1811 2335 -1494 631 3418 -834 -20 -12 -2359 1064 679 -31 2030 185 -1364
1642 -1364 79 -1060 813 2587 -531 -282 -51 -1771 751 1380 -362 2210 751 -2066 1174 81
1658H1n96L958l708o32K257l582L044J941m144M171k978k913N389l926J132M548
1674D042o773K506J205n583P578j259l990O627o204j010O991o133M074K576p817
1689c170M994j535m917R140n291p36N570q595L159M163o883P062j556o320P995
1704C080n810j70Q034p095L482K377q630N993O81m611O838m130k090M954p646
1719d743L911L982o022M648j941n072O895k823l41N478n497R33K191m943M349
1734A005J73l330M492k564k631M065k978J882K290l884K047j094j439L633q69
1749G98p90J636k198n00J058o06O94N87j424p69O01m62P58J690j430M90j114j78
1767a159R80J046q85J832j745j743K678j951P73K768l799Q29L42m534M719l32
$$ plain form
1658 81 -515 3443 -265 -897 1360 -2222 822 2763 -1381 2790 -188 -3101 2288 -1638 -506 4042
1674 4042 -2731 -225 980 -4603 2975 1716 -2274 4353 -1851 -2861 4130 -2003 2071 4647 -3170
1689 -3170 1824 289 -4628 4512 -779 -1515 4055 -4540 -1381 2782 -4101 2961 1405 -4915 3080
1704 3080 -2730 -2900 5134 -1961 1521 3898 -4732 1261 1942 -2669 4169 39 -2051 2903 -4743
1719 -4743 -832 3150 -2872 1776 -165 -5237 1658 -1165 -1506 3972 -1525 -592 1599 -3344 1005
1734 1005 1178 -2152 2340 -224 -2855 1210 -1768 114 2404 -1480 567 -527 -1966 1667 798
1749 798 8 1644 -554 -1054 4 -602 92 679 -745 -1514 -913 -1375 -617 1073 -357 133 -981 -1159
1767 -1159 -179 867 -18 1814 69 -1674 1004 -947 -174 2594 -1205 -376 -34 -4568 151 -181
1783a81j891M960m854r95N054n241L772L005o036M593j193m244O983l802n42M824
1799D212o674K003K317n193N841j804m330O380n625m55O899o732M000K059p436
1814d538N758p64m089Q535n340r68N172o913L165L021o186N761k175m214O002
1829B227m554J147N046n800K948R94n828N945j723j931N196n287J62L143m140
1844b455K935J853l704K992j550k083M361k231O29K077m066J846j52q44K144p59
1860I93j428J246k215Q28P28j05M89n41n57m00K03J183j25R82k74p74l10m4N08
1879C87J856j703L19k07k134K094l81o44K835k825q82J822k730K768J103l372
1895a694L061j292k857N458k927J083K471n353K428M93l574N393j526j775L558
$$ plain form
1783 -181 -2072 2888 -1966 -2961 2093 -3148 624 3629 -2407 2186 993 -3251 3732 -70 -612 4212
1799 4212 -2462 -459 1858 -3335 2506 702 -3628 2752 -2873 -3328 3571 -3161 839 2898 -4538
1814 -4538 1220 456 -3633 4902 -438 -1406 3766 -3147 18 3039 -3147 2614 439 -3775 2227
1829 2227 -2327 -1180 3866 -1934 1014 2008 -3820 2125 402 -1529 3667 -1620 -1458 1685 -2455
1844 -2455 480 2333 -1371 1621 71 -2012 2349 118 747 2824 -1242 604 452 -392 1752 993
1860 993 -435 811 -1404 -576 152 47 536 -5 -562 -962 -759 424 299 1281 1007 233 -77 -121 387
1879 387 2243 540 859 652 -1482 612 231 -413 2422 -403 -1285 537 -2193 575 1678 -1694
1895 -1694 1367 75 -2782 2676 -251 832 3303 -2050 378 871 -2703 2690 1164 -611 2947
1910B947n536M26M662n344M324K70n490N485j854k640O201l922N89K812o442L378
1926a34J683l931N722l110k606N004m536J295M418n645K598L43m725N079j833
1941c78r69M421n089Q38K529m459L627k1k694L744k468k013L908k311J616K348
1957B629n021L095p36k050L296j190j18J595k555K08J764j900J444M48j916N35
1973d72j51r3J391n30j7n51o31N56K19M1Q94p4j071n88N30k05O64R07j178l52
1993g11O36j614K115J34r94J301j260j037K089j593N92K115l249J906k13k168
2009a951L781j263j434K934m182P50L084m029L318N21m357L960j380j584L802
2024A970l032N22K794m793L172O03l495M783j731k195M008m911J423K943l946
$$ plain form
1910 2947 -2589 -2163 2499 -2845 1479 1749 -3741 1744 -110 -2750 3451 -471 118 2930 -3512 -134
1926 -134 1549 -2382 3340 230 -2376 2628 -1908 -613 3805 -1840 758 1101 -3624 1455 -378
1941 -378 -1347 3074 -2015 -1177 1352 -3107 520 499 -2195 1549 -919 -2932 976 -1335 281 2629
1957 2629 -2392 703 -33 -2083 1213 23 -95 1500 -1055 -847 917 -983 461 909 -1007 -472
1973 -472 -623 -716 675 145 128 -423 -1054 -498 -279 -238 656 582 -489 -1077 -547 -752 -88 819 -359 -711
1993 -711 -75 -1689 426 560 -434 867 -393 -1430 659 -934 -342 1773 -1476 430 217 -1951
2009 -1951 1830 567 -867 2067 -2115 -1365 1719 -2310 1008 1529 -2828 1132 -248 -1832 1970
2024 1970 -1062 -540 2254 -2539 633 1236 -2259 2524 793 -1402 2606 -2305 -882 2061 -1885
2039a885L219K34l938L512j404r29M213m212N96K130l894L039R36l606M377k109
2055B79k326L719k674J449J696l304J808O8k449M063k526m84K555l161N92J746
2071A051k132J864O70k383J998j238j067K559j345M26J236k512J024j73j56J183
2087A005q72m17J358k186J058P59r75P40j72p33R91o06j42R00L61q36r54R13r10
2106g18J330M3m72J57j50j228J780k1r17J340j453J53O98j348J601M85k104K382
2124A558j963j144K256j764R41J162l335K607R59k896L342j790q81K627k092r6
2140e09K347l249K803j96k443K555j819r49M022l396j56J986l293L010l79k053
2156a719L938k547j366L231k780J114J906k619J186L05k460L093k026m99L210
$$ plain form
2039 -1885 1334 1568 -2370 1142 -262 -1191 3022 -1190 -594 1536 -2358 681 1617 -1989 2388 279
2055 279 -2047 1672 -1002 447 2143 -1161 647 715 -1734 2329 -197 -681 1874 -1287 -695 1051
2071 1051 -1081 783 1453 -930 1068 -170 -1237 1322 -23 403 1639 -873 151 -22 -178 1005
2087 1005 133 -284 1074 -1112 -54 705 -270 470 298 -435 556 -50 -192 708 1069 233 -721 192 -718
2106 -718 612 655 183 340 190 -1038 742 721 -196 1144 -309 -156 542 -806 795 1280 -824 1558
2124 1558 -405 -1549 707 -1057 -116 1046 -2289 318 1277 -1619 1723 -67 -948 1679 -413 -509
2140 -509 1838 -1411 1392 1196 -1247 1308 -511 -1460 2562 -834 -990 996 -2297 713 334 -1719
2156 -1719 2219 -328 -1694 1537 -1243 -129 1777 -842 344 649 -1811 1282 -744 -1243 1967
2171A967l102L18J818l292K688L08k331L444j833j810K697k121N27J956k677J867
2187D24L13k563K812j528K7J016j653R09P79j470R60O16j305J426j387J52Q05
2204C33o68J07L97p64j02P33n94P21m78j9j17j36O87K0J06l37K77q1k37N12M35
2225G95q05K34j71l60J156j950P29K98q89O37O98j573J471n09q85J612j878J065
2243c25J287j097K49P84k193K124r47o81K100k486J107J415l311K083m9j625K540
2260I75j273j275K800k521N57K457k616K039p01j955K868j687l70K684k924J463
2276E21L44k467J871P73k640K787j370j255L320l261J098J982l429L088r65j880
2292a483K732j860n25K408j734K89P38j789J956m43p95J507o10l49J391k456J113
$$ plain form
2171 1967 -1135 -817 1001 -2291 397 705 -1626 1818 -15 -1825 872 -1249 -722 1234 -1443 424
2187 424 737 -1826 986 -542 -515 501 -1152 -243 536 -934 26 642 -663 763 -624 -472 333
2204 333 -335 -228 169 -595 -697 36 -558 163 -315 -334 -451 -587 100 120 226 -111 166 85 -152 360 795
2225 795 -10 224 53 -307 849 -1101 -372 -74 -963 -326 372 -1201 270 -239 -1124 488 -1390 -325
2243 -325 962 -135 114 898 -1295 829 -118 -799 1301 -1185 -78 1337 -1974 109 60 -1565 975
2260 975 -298 -1573 1227 -1294 -737 1720 -896 1143 442 -1513 1355 -332 -702 1982 -942 521
2276 521 865 -1602 269 1042 -1598 1189 -181 -1436 1884 -1377 -279 1703 -1726 1362 397 -1483
2292 -1483 1249 -611 -1136 1272 -462 -173 565 -1224 732 289 -506 1001 391 42 1433 -1023 90
2309I0Q30j128P30j04j532J514o77K94K94m10N54r13N27M80r97M60Q51j200M02
2328F5M93r25J058K33r13L1l79M63M77j112P30J25q41N73j257J648p85L82K82
2347C48o20L79O39j593J579R1j128J266j605M07J134k060J813K00j738J506j699
2364a081M31K292k417K02J942k636J499P77k393K465r40j283J727j524O32J246
2380I39k312K248j32k172K702j516n25K210k512L08J809l334L315o06j474K270
2396A218k061k20K645k621Q07J607k888K893q71k004L187k149Q20J192k469R93
2412G9N98j914K015p7j662J354r66M73Q55j039P08l39j153Q85k00P4P72o56M63
2431B70l9n76Q12q40q5J525j489P1Q10q97J170l48o14O24j218M63L46m03O33m39
$$ plain form
2309 90 920 -208 522 418 -1114 400 -277 17 311 -99 455 -458 69 549 -448 12 863 -337 65
2328 65 558 -367 691 924 11 42 -337 126 603 -509 221 346 -495 78 -1179 469 -316 66 348
2347 348 -272 107 746 -847 732 823 -305 961 -644 -237 897 -1163 650 850 -888 618 -1081
2364 -1081 -650 1642 -775 -573 1369 -1267 232 1009 -1384 1081 141 -1142 585 -939 -307 939
2380 939 -1373 875 743 -1429 1273 -243 -768 1442 -1070 -762 1047 -2287 1028 422 -1052 1218
2396 1218 -843 -1063 1582 -1039 -232 1375 -1513 1380 509 -1495 1692 -457 363 1555 -914 79
2412 79 677 -1237 778 701 -961 393 -573 -100 755 -284 424 85 -1068 -183 -383 -309 463 -193 270
2431 270 231 -345 467 -373 -458 1067 -422 -351 459 -438 732 384 -230 394 -824 -361 -15 -418 215 -224
2451b24j4M90r32M59Q76n64N04j149j94N45L17M76K69j260P49o11n18J668j124
2470b37M99L24j490O00O88r62J531o70r69J426k318J241J022j427J637o25j627
2487a357K312j747L79J752k069P70Q29k819K407L96k040K102j678n49K563k489
2503a238J788J028k760J891j164q91K429r91M7J279k295P36L81j739L014q55r21
2520b61P35r69j6J519j500J273J84k105J620n90l42K360k301N03P57j748J510
2537F29k48n57J215q90q29L35L40M57L62j039J291j685O78k11M00J41O7o48O2
2556a30km84J526j280M38j93k3L6j43J120K80j427Qj20k21J271l38O37j65j026
2576b36m7Q9j12J454j078r39J201j158K19J630j547R20m55j018J304r55K29J762
$$ plain form
2451 -224 -238 252 -680 -221 655 91 595 -554 -748 -203 114 590 859 -401 348 -263 -781 887 -237
2470 -237 262 586 -904 -304 384 -578 953 283 -686 740 -1578 -337 685 -742 895 270 -1357
2487 -1357 955 -792 -413 1339 -730 40 869 -1950 457 853 -1187 915 -763 -1312 1251 -1238
2503 -1238 550 1578 -1182 709 -455 -1346 1083 92 139 1418 -877 -141 240 -1499 1515 660 -261
2520 -261 474 -495 -511 1008 -492 781 965 -1140 480 -110 -452 1908 -393 110 867 -881 629
2537 629 381 -176 1039 149 -680 -345 -5 452 814 -225 1066 -619 59 -152 248 389 456 -192 -130
2556 -130 -132 -616 910 -370 68 -125 -148 -112 -255 865 1145 -282 -274 -394 -615 656 318 955 790 -236
2576 -236 -283 -194 -306 1148 70 -869 332 -826 -607 1023 -524 396 -59 -1077 227 -728 -499 1263
2594A263j491P67mk028J305Q87j138J525j279j209J340m49N15J274k379J801j008
2611c08j247K613j208J36Q77j315O5M87j220K245m7j904J723j990Q90J135j383
2628d51Q11N18k229J258n20o30K680j779K46K51j162N61P25o79J564j329j326
2645a491J644j371J245P50j143Q72p12r50J001N8K08Q03j061l24M56q61J397J05
2663F26q04J49j114P74Q90n10N70K01j127L25p29L85R13n81R62p23o57J17N87
2682B54M46l0p79K26p94M68M09Q4O31k38j291M01k56M1J153l08k92M53j631M92
2702e61R95p03J281j678k91J268r06l5J277p97O12n03j303J990l33p22P67p09
2720c51L83P2j434J807L73o60O77j642l16J681j153J170L81j991J765j400o60
$$ plain form
2594 1263 -228 539 535 -1493 -188 699 -439 1086 -193 -1402 -62 -511 4 1278 -1101 700 -308
2611 -308 -1555 1058 -150 -14 863 -452 -387 100 -1120 1125 1078 -826 897 -1093 -203 932 -451
2628 -451 360 878 -1351 -93 -613 -1243 1437 -342 -96 155 -1007 -446 279 -400 1164 -165 -1491
2645 -1491 153 -1218 27 777 -366 506 -206 -1156 -155 -97 111 914 -147 -471 -15 -876 521 626
2663 626 -178 -29 -1143 -369 521 11 581 782 -345 -20 -749 -364 549 -32 930 207 -450 -333 254
2682 254 700 670 -109 117 -677 -209 200 284 915 677 -614 -213 -469 -428 725 417 125 578 -1053 -561
2702 -561 434 -269 1012 -666 -957 311 -595 -630 647 -150 462 -41 -1344 646 313 -409 358 -351
2720 -351 32 104 -1330 477 850 190 867 -775 -1091 590 -563 607 988 -1003 762 -638 -1298
2737a298K728q05j179P18r10P11j10q4J063k51q49J068j861J074O33j325J180
2754E03m29j471J956k11l44J654j447m16M34j674J987M28q46O40j033n14R67n5
2772A29P41J46k220J186p02L22J438q77N52k22j026o4j43Q46L48m29L89J16j057
2791e27J72R15q18R58r73q33J409q61J522k29j96j34j403N76N18k01O82L87j174
2810b10M14j049L22J388r54K42Q7j586J318MN26L32j179L12Q3j239Q27Q63l6r6
2830C69q17j053J435n96J371L05j523O33n10l50J687j386O56K95j997J150j53
2847d84k85K089o36j294J179j503O99P90j134J673n61j935J839j157M71J275q62
2864A64l54Q3j259Q28R82p14N78j67j183J467j105J226N79j834J436j505m69J654
$$ plain form
2737 -1298 1430 625 -554 164 -746 -35 -145 -229 834 583 -266 802 -1059 15 648 -677 503
2754 503 74 -1397 559 348 4 1658 211 -205 229 -1445 542 970 124 764 -269 -783 184 129
2772 129 870 1016 -1204 -18 -720 -398 1040 163 715 493 -533 -597 -740 106 454 25 414 530 -527
2791 -527 -355 560 -258 700 -273 -1106 303 -558 964 735 539 405 -998 -422 96 -105 577 964 -210
2810 -210 204 -845 -523 865 -89 153 240 -1346 -28 -24 502 834 -345 -33 50 -1189 -362 501 465 369
2830 369 -448 -1501 -66 -662 709 1014 -509 124 -386 -736 951 -435 221 516 -1481 -331 -484
2847 -484 -769 1320 684 -610 569 -934 -235 555 -579 1094 533 -1402 437 -720 -249 1026 164
2864 164 -190 -107 -1366 -538 444 -270 308 141 -1042 425 -680 546 1125 -709 727 -778 -1247 407
2882D07k05J33O82k047N64l0j98J887q03j241J136j345Q6R50L82K95n58p53L21
2901c37n61L39J369r87J052r05j017J119KR42j92j079Q27r53l98R94L83K3p01
2920h0j170L86M70J33P34M7j100O19j136O26R07l48J262r96l22J84m92M58J403
2939A585j663K97n1k391K202k26K87Q87j574J93No0Q50K29l86K20j561N78Q36
2958B57k31P52L68k681J612p3p71J948m19n47K01j274J338jp34J236j396n78J285
2977B92j692J644P88p63N19n18j030J381K5l91J404k193P07o31q79K364p32q7
2995B08O29j656K89J528j400O92P03j396K73o98O75L98L39k54m16m64P15m63Q6
3014b12J332k66q83p29l54J208P42m86N15j603j9L51j77J400M21j007K30j257
$$ plain form
2882 407 202 335 1017 -1030 -466 -496 -694 1193 390 -851 285 -1060 -974 -24 358 653 95 -658 -337
2901 -337 -898 -559 810 -177 875 -30 -1047 72 74 1016 824 -255 572 -381 -779 215 598 621 -80
2920 -80 -1250 -864 -394 -261 473 520 -580 39 -1097 -471 436 88 1350 354 32 216 -276 182 1585
2939 1585 -78 219 168 -2223 -21 -247 40 927 -647 -454 -449 -509 341 570 184 404 -1157 -579 257
2958 257 26 778 1146 -1535 77 4 -767 1181 762 215 416 -858 480 479 -255 981 -415 -993 292
2977 292 -1400 244 1032 269 788 270 -760 621 646 255 1659 -534 173 -458 -1337 1027 295 208
2995 208 837 -819 -530 998 -402 290 993 -403 -130 -828 -153 245 584 330 -86 -550 165 -298 -212
3014 -212 1120 854 -29 -758 -1112 96 838 352 867 -736 -755 -404 -581 819 1240 233 463 -794
3032g94Q02P73n52J99J40q84k11O28l11J244k96q18J69j504P81P66O40N07j514
3051b35j05J33l38J003L64p64L03n35j178Q80M77R93j69j321N27k28J92N13k70
3070B42k6m00q42J84O99k72J440q96o08K42m98L51R87m31K46n07l15L35O3L53
3090C47R16j197l88L40j365J567l35J027k14j197p41J535n96Q82J10q09N34j248
3108h32l7J043j92Q37n37j577P62l8M57J136q60k6M9m31m34N70lR52m89j570J405
3129A85o57O78L96n86j7n49p77J513K91L15j26j815J234p34N38J022o69m9M25
3148F18j942N21Q80j29J258j364m5Qn41R67J58m43k15n86J91L60nR02J99q54m38
3169e00J0n45J717p46J668j100j828J133M1k99J585p52j196J366j769O71J094
$$ plain form
3032 -794 8 781 229 428 568 -316 -527 101 -210 1034 738 -80 89 -1415 -634 132 772 1279 -235
3051 -235 -340 -207 -545 458 822 58 361 -174 -1352 -472 5 998 829 -492 35 -193 -1 512 242
3070 242 216 -184 -1026 -842 -143 -415 1025 129 -479 -237 -735 -384 603 172 418 -89 -404 -69 -6 347
3090 347 1263 66 -322 18 -1347 220 -115 912 698 -499 -1240 295 -301 581 691 -118 416 -832
3108 -832 -869 174 -18 819 282 -1295 -533 -571 -114 1022 162 136 185 -246 -680 -110 -113 839 350 -1220 185
3129 185 -472 206 602 16 -1 -550 -1327 186 477 792 666 -1149 85 -649 -111 911 242 193 618
3148 618 -1324 -803 77 -52 1206 -158 -203 -195 -736 231 389 -54 -269 -855 -664 -304 -309 593 792 -62 -500
3169 -500 -490 -1035 682 -64 1604 504 -1324 -191 -150 -449 1136 384 -812 554 -1215 -544 550
3186E50K74p09Q58j899O72K85l0Q98n35n6o65p92K137k97q04J079q69n72N24r03
3206h54J422N6j145O85p87l83J076L13M64lj043m8j21j70J475m27o07J32p19N46
3226a38k30N9J108K05j735J008j420J311J894j832j13l76l3n82P03K97L87j050
3244e37l73N39N2N10N25J6k16r66L88o86P28P63J13j310M25n35K60P10N21k23
3264G04o19j196J354k7K59J23o24o35n81P96N51K54k5M80p94p67M66J99K30K95
3284D43r56P1n11l41J556q4P8K70r36k67P38k9M10N9n12Q2j719J709L11j85K92
3305D79K2r53Q27j184N23J443j516P49j046j06O28O75K7M87j417m4p00l1J133
3324dR77r28L90o45j53J93NN00N26j461R95j188n4J785p30O43r49j819J421J33
$$ plain form
3186 550 824 115 973 -926 -254 31 1 899 364 308 -357 -1149 988 691 -113 966 97 -475 49 -854
3206 -854 568 624 -521 164 -623 -1006 70 383 847 844 -199 -247 -368 -538 937 510 -97 35 -684 -138
3226 -138 -368 -309 799 1004 -731 277 -1143 168 2062 230 117 -259 -292 -874 -171 126 513 -537
3244 -537 -910 -371 -319 191 716 732 516 -450 -62 -748 -20 743 856 -454 -29 -564 -304 406 927 704
3264 704 85 -1111 243 216 475 598 -26 -661 -1242 -446 105 359 334 814 20 -747 -281 -82 148 443
3284 443 -513 -442 -953 -1294 262 178 256 526 -410 -677 61 32 442 501 -11 71 -1648 61 372 187 479
3305 479 501 -452 375 -809 -286 1157 -359 390 -656 -762 -134 541 568 1055 -362 -406 -1106 -1137 -4
3324 -4 973 45 435 -210 -363 -170 -165 335 861 -600 395 -793 -847 938 208 851 -98 -1917 -496 -363
3344c63M78O21q71r6r31J180L83J22nj72p22r2Q0j53Q77Q07j658N9l8J73J061
3365G40j00k50k8j092L42j47L73j91O58j97K40r14M75K30M96K00j012n45K16P80
3385B74l12N51l73L98j58r76J290l91l97Q78j148j90O6L39P31K7l66k62r44O88
3405b75N21J9N13J84j277N24j114L71J038l38M66n58j127J105j5L3P12j094J22
3424a90m3n30J577m68n2q3l53q94J050l53J318k46j176R23r48m1O79q2L16O4j716
3445a248J635l56j49J090p38n18m7q19J147J46O0J34q7k88m28J32J003k15p60
3464c06M95l15n62L10Q50l95P12j403J42K59n70J603m22l97K50o81R1M38K25N23
3484H47q02n60M05r94M63J215rJ4r50j43m1Q01j61O20j012n32M02l52Q82J06M4
$$ plain form
3344 -363 115 736 -135 -231 -1162 18 401 523 518 346 -376 -468 -388 -541 336 1143 -515 -456 -494 -321 740
3365 740 640 390 362 -730 -388 -535 -162 -353 305 108 348 -566 -91 139 635 835 -177 -722 -506 274
3385 274 -38 513 140 538 380 -596 694 303 -94 784 -364 -554 -488 -149 582 609 243 -19 -963 -275
3405 -275 246 265 778 962 -315 209 -905 -534 504 166 632 74 -1053 52 37 70 782 -312 -190
3424 -190 -233 -763 814 346 294 211 -142 -1036 14 -339 979 733 -443 480 -468 -509 170 88 404 468 -1248
3445 -1248 387 31 -118 972 234 -284 -331 -1150 -3 143 203 337 250 -38 -466 -334 669 454 -306
3464 -306 189 -126 -688 -378 472 77 789 -614 -472 -213 -783 820 398 1 251 -430 -339 99 324 847
3484 847 45 -515 -110 -1104 -641 574 565 579 -371 -514 -555 246 85 705 -307 -839 -437 -789 93 199 243
3505B43R3o38j5K62o67P63N05j28p41q9J40P35K50j79o69m44M98p5L91O35r21
3526e1L06m82m44L84R89q75Q21j365K14O94n58Q97K94l59k99l60p38J372m44r7
3546a01L29j230Q14K41k79R42l44m7r39N25P1J87j81O32j22o89M03r48K21J081
3566E66m37K23n54m55J007J34m12P72r22j26J23l29Q35l76J31L82j271N71M17
3585B79m34Q19o80J7k5j122L14J200K24l56j45n47L21R7K70Q48r38k64r1j0P50
3606E27M36l58J43j005n5l99K55R19l13n54P62j184j83J335k03L8L3j113O80K71
3626C2j58L99l81J17l40n67P94Q68m53K72l50r11Q03n98P96j25k60nK07n21j51
3647e32R91k88L39p10N2m80L98Q77P8l00L22j635L1J212p45J195k75j200M99j
$$ plain form
3505 243 336 -302 -317 -55 -722 41 546 418 -323 -412 -272 463 713 534 -135 -579 -81 -156 235 870 -51
3526 -51 255 -227 -671 -287 702 -173 648 -717 -503 191 -367 530 824 465 166 -194 -932 440 -4 -101
3546 -101 228 -1002 -188 53 -226 716 372 325 -614 -89 -18 169 -12 620 498 -191 212 -736 -515 566
3566 566 129 352 -202 -657 350 484 72 844 -78 -204 -81 -410 425 49 180 562 -709 -138 279
3585 279 -155 664 -16 1 -24 -1146 -832 368 592 236 91 -456 -135 -38 232 1080 142 -122 -213 -223 527
3606 527 963 605 748 -257 -312 -711 -456 463 150 -404 358 -826 -1009 326 123 161 194 -919 -239 32
3626 32 -126 273 -108 9 -331 -898 -104 764 311 583 233 -678 125 -473 323 198 -62 -67 140 -381 -532
3647 -532 459 171 510 -200 -148 -628 -230 647 725 425 747 -888 -857 355 -390 805 530 -670 -171 -172
3667a72j77J067o76N42k32o07J85M01K10K96p38r1K79r97P22K70j13J23l61o99
3687g68N72K44p2P36r42o7J81m19R18n21N40P1j073R28o60K29K31m59J63k4n55
3708g47K93O51N2L65p14n81P87l91k43Q49n95K80m68K6P38P3l11Q98r66J46k54
3729a12m05J130l01l52q69M97mQ06p61O08j09n80J14P4j39J117m12l38N66q84
3749c54O10j95N2M72l18J56o37n31P55O26q95K64j4l89k50K18M99K39n04l2M77
3770B49j292J736n06j37J081j628p4O92n54J147l04k14p1n16Q9N73k87R30j264
3789c50j2L91k26J98J95m66J02O2n32J134l93j43M85r41k06J017k04j00k64K67
3809A4l85l06J82O54j3l80Q66j159O68m3o80J152j60o57P60r82j50J054m51M08
$$ plain form
3667 -172 -349 718 42 584 352 -255 -70 331 541 837 99 8 287 -710 12 282 169 292 -69 -768
3687 -768 -196 48 -24 712 -230 -297 -116 -535 383 -138 402 473 -600 328 -332 -103 128 -331 -168 -192 -747
3708 -747 -454 197 249 614 -100 -681 106 -285 -528 321 -274 6 -462 -436 302 375 64 962 -4 142 -112
3729 -112 -517 613 312 -40 -909 -412 -416 390 -371 237 128 -452 -338 -264 -403 714 302 -36 530 -354
3749 -354 256 61 113 585 267 423 -214 -745 10 636 -259 5 -9 -398 -648 -430 69 308 -196 -228 249
3770 249 -1043 693 187 50 1131 -497 -571 121 -433 714 410 196 125 -391 -302 271 -16 914 -350
3789 -350 -362 29 -197 1 196 -270 -168 -106 -638 496 103 -40 445 -496 -702 315 111 11 -253 14
3809 14 -371 -677 -495 159 146 -234 632 -527 141 98 -582 570 410 -247 513 -469 -619 435 -16 392
3829C92l67n33J066j005K87N80j154J457j066p71J118O6J101j003pp26L26PN66
3848C34k03K81l52n55K86M29l88Q46j90q68J58l44L61K73K60J80m71q34K38K75
3868b84N00N14j256J100r03l79J254n4q60J139o98o11N29k00N91n56O16R9n49
3887hj59R6J48K59q40J60O54k40l16M21k90L59l86k17P46l24N00k27k01n34J34
3908b65q7Q81L7n93K0j33q99J038K45k70O50j307j17O25m0R9M40n13M23o5m12
3929b43M22q4J91J38n26L42j50p00O22O49J66m03j086M01P77k60R49j805O69M5
3949A14n97P74Q7J23j86k59n51O43m03O07l46l52R14p74J68L28j12o5N19j327
3969f95L69N62l72P51J50n84m13M17K54j20n45O34l37l39J61l79P19P0j42p40
$$ plain form
3829 392 25 -508 558 -447 -160 420 -734 723 -343 -1114 4 70 1171 168 161 -565 -239 -232 334
3848 334 131 412 60 -495 -209 220 -168 678 488 -380 -222 -566 -205 68 328 508 37 -797 -559 -284
3868 -284 216 730 -526 574 -329 -708 546 492 -368 771 73 -538 -9 -209 382 -174 442 541 -8
3887 -8 -167 -71 77 336 -504 -344 310 70 -246 175 -115 244 -142 -359 387 63 563 336 135 -399 -265
3908 -265 -352 529 566 -27 -7 -140 -1039 -1 244 -26 624 -683 -800 -175 -215 -116 324 -189 234 169 -243
3929 -243 179 95 286 424 -102 240 90 -610 12 661 827 424 -662 -261 516 256 1205 -600 69 114
3949 114 -483 291 378 501 315 56 -495 148 -255 352 6 -346 568 -206 -38 290 178 113 632 -695
3969 -695 -326 236 -136 615 765 181 -232 185 439 319 -226 408 71 -268 -107 -486 233 303 161 -579
3989e79N09n74J082p66O54Q6q23L01L24m65M90L51o41N45q35M73o43O12o6N40
4009E75q22R6J78K58M88r44N76m3r31O60l78K15R17j740Q50j07J20J64K83L1m99
4030e3J58o17J81l25J469o30o87J59l54M94j43J61m65R06k56m52K77r2N34L67
4050F32j165J070r26PL88j65Q19o48o00O85p39J137o3l28N2r2j36l0O55o46P56
4071F63j394L59O68k31P34p11j73N57p79J52R19j036P92n60j09J12l00N66L21
4090E50p67P16n35p18O04k29K60N77n50L13p77N27j46M59m63m2l5M16l22P39l14
4111B63k14Q5l21M1L98j1j95Q8L60o73k80N18l4K77j67n92M66J1M1n5J07n3P9
4134A39k93k9r0O92j51p76J88O63o05P36j43m26O40r00K92j63L1O63j5m79L91
$$ plain form
3989 -579 -70 -644 438 -328 326 412 -411 -110 214 -251 239 590 -51 494 -341 132 -511 101 35 575
4009 575 -247 -151 27 285 773 -171 405 362 -569 91 -287 -72 845 -895 -45 -152 -32 132 415 446 -53
4030 -53 105 -512 -331 -656 813 183 -504 -345 -699 -205 -348 -187 -652 254 -2 -454 -177 -269 265 632
4050 632 -533 537 -389 -382 6 -159 660 12 -588 97 -642 495 432 104 156 64 -72 -102 553 -93 663
4071 663 -731 -372 296 65 799 88 -85 472 -307 -155 764 -272 520 -40 -149 -37 -337 229 550
4090 550 -217 499 -36 -754 -150 -379 -119 458 -92 221 -556 -29 -175 284 -179 -221 -256 160 -162 577 263
4111 263 49 134 -187 -146 252 241 46 134 494 -179 -459 59 25 302 135 -457 9 20 61 6 113 60 139
4134 139 -154 -183 -273 419 268 -508 -320 343 -262 474 331 -95 545 -355 -63 -226 -195 468 453 -26 365
4155C65j027M74K17l03M39l87j6O97j61L44m36J5j81N02p46p6P64r80Q59j115
4175g52P46K6k29J17O69j363P20k44M4N68p47Q23r59P21n47j96O39j38J46k80
4195b36N2l10L36k54M42J0k70K72L53oj72k15l6P53q20j92P94q35M30k7j001Q53
4217g9o46J84L00k93L36L37r33J031n03q6K86k27O3M20o82J81M09m43P45n12j83
4238b95J62R61p19J39j27j01k42K00R1j9l9Q5m14L24l30r1L74l12J99M5L45K57
4260D93l88l94P60o18j63J30j44K55M31l83l41K92J21j61M51n52M79r1j75K01
4280B03p35O90Q6o10M30l36m2R6q0L45j55k80J0M22r7N89m22Q1j35k63O23k50
4302A70j086J498n68m58J84M26K40J43j246M58O3K16k36R5m43N80k47M48K12q07
$$ plain form
4155 365 -662 -188 29 -274 165 -222 -238 459 298 642 206 221 40 542 -204 -280 484 -496 363 -752
4175 -752 -6 20 -209 -92 577 -786 -66 -310 -266 302 -445 378 -581 140 -407 -603 36 -102 44 -236
4195 -236 -184 -494 -158 -412 30 40 -230 42 395 389 217 2 -34 719 -101 -293 501 -334 96 69 -932 -79
4217 -79 -725 -541 -241 -534 -198 139 -794 237 -266 -352 -66 -293 -230 190 -492 -311 98 -345 400 -112 -295
4238 -295 -133 828 109 248 121 20 -222 -22 69 50 11 96 -318 6 -324 -415 -41 -353 -154 -109 236 493
4260 493 105 -289 471 -147 -310 -180 -324 -69 362 -21 -362 -70 51 -110 341 -211 268 177 2 203
4280 203 -532 158 244 -366 64 -272 -314 -218 -298 47 -108 -388 -378 44 -53 536 114 195 60 -203 420 170
4302 170 -916 582 14 -444 -260 166 406 549 -697 -239 -176 40 -196 -101 -544 36 -211 237 449 -358
4322c58J075m91m60O09p31K47J01q64J058k51O8j3n56L99O31j189P46P19p01J
4342D0K57m14N67n44r0N11m80M3k44M37N55o50j02L79o42P67m14M79j30l79J16
4363F2Q4l35M16K50j231P80o84K85l6N74k12k63O37m81k0l9j44L48Lj92j57M06
4385E1n43O31k6M7O7k10n44R32m49l11M42j25k55N16k0m57P23m80L22R5m86K78
4407A98l57l78M05O29p31J031n30p66L01m4N98l22k77M68q02K81K85p32J287m97
4427D7n52O09l08K32O24l45k94n25N61oQ12p96J04p62Q01L65n50K20pq21N38l92
4449d45J305p59K54q75L71k89N68k06o1K82k17j49K68j56J27J96r4O7j08l42l02
4470e65J99L26j06K87n28K53J52Q2m10J055j287L78J17P8j68L21l56j39O46J9
$$ plain form
4322 -358 717 226 -234 375 -356 -109 -8 -872 186 -65 3 -10 -566 -167 464 -725 21 740 39 40
4342 40 297 -117 450 -94 -184 327 -153 -110 -354 83 638 -12 -114 265 -377 390 -24 455 325 -54 62
4363 62 146 -189 227 477 -754 26 -658 -373 -409 165 -47 -310 327 -154 -174 -213 -357 -9 -6 -198 -355 51
4385 51 -492 139 113 160 227 17 -527 405 -44 -355 87 -38 -293 223 203 -254 469 -11 311 406 -80 198
4407 198 -159 -537 -132 497 -234 797 267 -499 -198 -242 356 34 -243 225 -577 -296 -11 -743 544 47
4427 47 -505 104 -204 28 652 307 13 -512 49 43 855 59 163 -599 202 567 17 237 230 -591 -53 -445
4449 -445 860 101 355 -520 -149 -438 130 -76 -137 145 -72 -221 47 -109 18 214 120 187 79 -263 -565
4470 -565 -366 -40 -146 141 -387 -134 18 100 -310 745 -542 -164 -47 31 -137 184 -172 -311 335 354
4490C54J34m22Kj58o28O91Q16j275J15k09K02J20K12k31L5m63O25M38q02P92l83
4511c5J10K98n36L0O28m32l01L37j90k7k53p9O02M8n02J49j37L23k7m2J64l6L31
4534D23k08p11K90M4k46N60m85N66K41o00j90L76k70J29k72O23J31o50J14J83
4554D8M78j84o11k1K57n47J21K57P3O74j10qK6j36k05N78n20J86n62K06k94K17
4576g7m25J078j028N37J86o76O19j43j52q7O40o15O04m58l6Lp2L06q2q38N91n7
4598a82J88m5J36J31m24j16N39j23m01O71o67l52R67p09N25l73L6P39m28K09Q6
4619D07p04K53n3m47L23K51l32O09r00O61L74l00k81j12Q38m28k71k56Q23l07
4639A48K96l75J72k17k64R0N54j77p7l25O46l94k57k40J37k76L42K98j55L67n31
$$ plain form
4490 354 488 66 68 -90 -718 -27 789 -486 -371 -580 -378 -258 -46 -277 -242 -705 -80 358 -444 348 -35
4511 -35 75 373 -163 -133 495 63 -238 99 -91 -118 -371 -450 152 200 -302 -153 -290 33 6 -36 128 92 423
4534 423 215 -496 -206 -162 -408 152 -333 233 474 -126 -316 60 -210 -81 -353 270 401 -249 -135 48
4554 48 526 342 -269 -290 -33 -580 -459 -202 -129 545 435 427 453 317 112 690 170 356 -206 0 -294 -77
4576 -77 -502 576 -452 85 271 -405 214 71 -81 -168 472 -143 461 3 -33 -30 -102 204 122 -716 -125 -182
4598 -182 6 -39 97 228 -196 -312 227 104 -297 374 -293 -645 322 -387 138 -235 -199 540 112 321 407
4619 407 -297 -44 -97 -544 -221 30 -302 307 -593 68 442 142 -139 -251 587 159 -112 -368 455 148
4639 148 444 69 241 24 -240 -150 404 227 150 -175 471 77 -180 -420 -283 -559 -217 81 -74 293 -238
4660b38L2l4N97j038O81m57O57j88r36R46P5l00M22Om97N21N9p84L39J37K39m57
4682b18N06q42O52K01jk86m63j30J26K67M13l63K92o53K70K37Q73j066L33p76
4702f28M36L58k45N79o04k26k84L01j28L79ok29k5M06N14n25L07k96m69J174r18
4723a29m1Q7K22l32K08J29l36K04K36K71o83l0L42r16K95K73K74K19p59m2Q57
4744C49j05j17o23N27J25K23r35J016o92l07N44k15L35n15j6M09K81l49J85l3
4764H7K42K22j095Q60m62L44P5k52j71n8L85J07l85n68M91M11k25R52q97k14k37
4785c88L96l44O17r72O17J36J27k32k46L69j18K48j49l65k74M55k70j84P34k99
4805a42j4J36l82k98Q42J61M51q05k1k00O3j85K09N33n3n98O54l29k70L22K88
$$ plain form
4660 -238 -206 -240 357 -681 0 -457 200 12 -924 22 97 -203 219 225 -272 249 308 -476 -137 0 239 -218
4682 -218 288 -554 98 299 298 12 -451 -581 -455 -188 225 -138 154 -499 -229 8 881 -185 148 -628
4702 -628 -192 166 -79 500 -104 -330 -614 -313 -441 -62 -68 -297 -322 84 598 73 380 84 -385 789 -129
4723 -129 -170 -83 139 -193 15 144 -192 12 248 519 -164 -194 148 -768 -473 -200 74 293 -466 -508 349
4744 349 244 127 -496 31 156 379 -556 460 -232 -539 5 -210 125 -390 -406 3 284 -65 120 87
4764 87 329 551 -544 316 -146 198 273 21 -150 -208 177 284 -101 -669 -178 233 8 960 63 -151 -388
4785 -388 8 -336 281 -691 -74 62 189 -43 -289 80 -38 210 61 -304 -578 -123 -393 -577 157 -142
4805 -142 -156 -20 -402 -700 142 303 754 -51 -72 -272 -209 -394 -185 348 295 -303 351 22 -248 74 362
4826C62p37R8l3M22K60j49jm23J85P1q46J109K83o98j27M96l28k15K89K06Q8j043
4848g31R62R4l26j03K82k76N37q15L46j59k86J72L1N74o69k05K88N37k72M28p75
4869c66m3Q80n62kM08m48m61O82k74J56L49n39k59J93M02j07k05J42P11j006M07
4890E8n2K27j32J64m31P15p01l19J28N12m44M55j13j6o49O71l10N64O1j00n60
4911b72J46k0P8n8J7l43L42M56m20k25M22M1n13J85M83n36J69K46j22N7m62L41
4933A2k6K49l95j47J80M35k29Q6l2l86J37j09P8J77N5n30J20P30m74j38k11M93
4955G5o15L10N89n10j55j0P44K01l13j90m84P23m88K29K11n24R5j42J04K95k07
4976f2L53j45n74R34j192J137l56l52K68M46m72J26m22L20O0n2k3k92J5J60L70
$$ plain form
4826 362 -375 -277 -310 112 372 223 222 -201 -16 55 -791 318 601 -97 -224 272 -56 -271 18 224 312 -731
4848 -731 231 325 -1 -104 178 -98 439 -376 -30 -189 -475 -303 -272 302 -367 -572 -284 253 -19 409 -366
4869 -366 -409 471 -91 -93 315 -133 -594 88 -186 -30 319 -220 -479 -286 116 9 -196 -54 657 -349 58
4890 58 6 233 101 265 -166 549 -152 -471 -343 169 -275 180 67 51 -598 73 -237 327 388 288 -272
4911 -272 -126 -146 -68 -126 -109 -452 -110 346 -74 -299 123 164 -349 -164 319 -217 -48 198 76 133 -329 12
4933 12 -14 235 -160 -307 -127 308 79 165 133 -253 -116 -225 -147 30 85 -445 -325 405 -69 -207 -418 75
4955 75 -540 -230 359 -151 -306 -316 428 629 316 126 -358 365 -123 106 317 -207 -112 -254 -150 145 -62
4976 -62 291 146 -428 506 -686 451 95 -257 11 457 -15 111 -311 9 69 17 -6 -298 -283 -123 247
4997B47K13K52n21n0n86Q23p47O48J16p23N93k37Q83n98n82J100o64R8k20m18
5017c73N35Nm38K23K89q24O83N23p30J84M79o48N83k18n13k05P59j018P50j67
5037a21N43m3l89o20M92P2p91O22k91N12j57L29j99L56R5P5m6p43O77m86M88k63
5059A12k17M97o28K35L97K05j235N84N92l54J21k9J10K48j168N86q0L2m1k20J49
5080a04L94o78N04q1O76p9p00N10o48J75L60k90k01L1M57p49K88J4j63J153m04
5101D65j32m71n85Q42j36M46l23m33k35O41L8m24O62n66k4K8K57L95j284P07M36
5122C04m24J64k86J50M39m22j43m1O3M55o81M61K31m27p22P26k5K97m54M6K42
5143d7k02L71J60k12J27n48L30N92q65J34O5Q7K8J19k02K47J86n19P89n33N6m34
$$ plain form
4997 247 460 712 191 141 -445 378 -369 279 395 -328 265 28 911 313 -269 831 167 265 45 -373
5017 -373 162 167 -271 -48 241 -583 100 623 -107 77 556 -92 491 273 -240 -445 314 -704 46 -121
5037 -121 422 379 -10 -630 -138 -66 -857 -235 -526 -14 -171 158 -41 315 410 485 439 -304 373 -113 375 112
5059 112 -105 392 -236 -1 396 601 -634 -50 542 188 309 280 390 638 -530 56 -24 8 -33 -253 -104
5080 -104 290 -388 116 35 711 632 -68 442 -206 -31 329 39 -162 -131 326 -423 -135 -121 -284 869 465
5101 465 333 -138 -723 119 -17 429 106 -327 -562 79 117 -307 355 -211 -235 -207 50 445 -839 -132 304
5122 304 -120 44 -242 -92 347 -75 -218 -259 -196 259 -422 39 270 -157 -879 -153 -178 119 -335 -289 -47
5143 -47 -249 122 282 70 197 -351 -21 571 -294 -160 -95 -8 20 139 -63 184 370 -149 640 107 163 -271
5165b71m09P92k06l50P62l28k77N80n11K01K01L50j70l79K40r04M86N82l20m95
5185d26N51k2j36J51l30R84m96n80rN25q8j91k34O44j92l95N84L3L4k32l80L91
5207A86l90J53j07L11j10M21k22R9m01M10n17J077q50m00N94m7M06q7m35K32p46
5228d23L26L00o16j0O65m79L41n5J90k9j74K43J36l29M07m15o12M13J05n08K90
5249b34k9J02K64J78l49K91%R0N8J00k44k28Q2M87l27j58R8m72M99k88Q3o48l5
5272f80J99Q39n65P86j106O22j50l6k9L24j58K81j56l07m44M71NP9K28m33M68
5293B38p22N13m39J46n1J20j0p4K35o7k19O65k20n83K42j39M42L46p25O17j34
5314A81m81O52k97k97k48P31N0J49n48j2k56J04P14n67L12r2k22j28K87J67N8
$$ plain form
5165 -271 -680 112 -94 -444 318 -10 -287 293 -218 -17 184 534 364 -15 225 -679 -193 389 69 -426
5185 -426 125 103 -33 118 -212 772 276 -304 -313 212 124 -67 -301 343 151 -244 340 373 407 175 -205 186
5207 186 -204 -51 -158 153 43 464 242 341 -60 350 -167 910 60 -340 254 207 613 526 91 323 -423
5228 -423 -97 203 -413 -423 242 -237 104 49 239 210 36 279 415 86 493 78 -534 -121 -16 -524 -234
5249 -234 -263 -161 103 281 -68 223 223 313 371 471 227 -1 81 568 241 83 181 -291 208 -80 3 -645 -680
5272 -680 -481 358 -207 579 -527 95 -55 -91 -120 204 46 327 171 -136 -580 -109 -104 -25 203 -230 238
5293 238 -484 29 -410 -264 -315 -195 -205 -279 -44 -111 -330 335 115 -468 -226 -365 77 423 -302 315 181
5314 181 -300 352 55 -242 -490 241 291 440 -108 -120 -376 -272 442 -125 187 95 -127 -255 32 199 257
5335B57R0m5P5o82k95Q29J33N7r27J012j29m14L25m35P60m58L9n90L65j65J64
5356c4J93k20N7m02R24k72K01m40M53j35r50R55J72n62l96R8j94J063m7n58J79
5377H5P6Q1n15O90j07j193J552n47j91lJ01n91O95j5qj15j25J26L91k58j24M77
5399D82r20K07J98K4o9J65l34l3m1J221j261M61N28p33K80j20j022N74N31l33
5419a95J74J20j71J06m9K60j75J7J54n81K93J33k85M65m63l94P28l15M01K40l80
5440H3O04r88J74j11M87l1K40j96k93p9m10J143p36L64m07L2M73j013P30J13k84
5461a05L82q2k0l18L64m77m72Q38L03k65N36q83PK79J50n72N76j97N6r2l40N65
5483B33l25q94J016j09n99P23j68O4k02k3N50K76l02m9N4n77M93K88q59M13J09
$$ plain form
5335 257 347 302 377 -305 -600 229 362 419 -508 504 375 -39 286 -149 611 153 192 -398 -33 -198 -34
5356 -34 159 -61 -4 -406 518 246 447 7 460 325 -625 330 502 -60 -456 -358 -552 511 464 -94 85
5377 85 161 242 -273 417 310 -883 669 122 -69 -72 29 -562 133 118 110 -5 -130 -4 387 129 5 482
5399 482 -438 -231 -33 -9 -78 87 -247 -280 -321 900 -361 100 628 -105 175 55 -967 -393 138 -195
5419 -195 -21 99 -72 34 -15 245 70 87 241 -340 -47 86 -199 266 -197 -591 137 -178 223 463 83
5440 83 687 -301 -127 -238 249 218 458 262 -31 -110 -520 623 -113 251 -156 -124 349 -664 66 179 -105
5461 -105 277 195 175 -143 221 -256 -728 110 413 148 684 -199 -192 87 237 -335 241 44 100 8 -332 233
5483 233 -92 -986 30 -79 -678 45 -123 -59 -261 -284 266 542 240 191 245 -332 161 449 -410 3 112
5504A12l21J85l94P30p91M88k32M9J55q7M8p2Ql72O76K18q44O96n69N1J021j305
5526e50M16K97m71J17N67n41O81L3r52K03P50n82J89m96K10n54j35J143Po98N40
5547A74n73M11n2j08M63n86k13J361j138O0K51J00j29J6o25M47J79k39M89n46
5567b58N9M68m8j36o41O49k28j70J28Q8m1L56j00o13M64j34L38l55K67m96N48
5588A45m84M65j86p7j00J90L92l92J59l08J28N13m4m46K18J11r7j09j87J2P40
5609F43m40j65k30J03J46r9M46q44k51P51K51m66l88O94n05K67L25n93j50L75
5629a30k61L3M1O38j15j48K87k20L7o04M36N23n13j181J386K4q13N50m84J23J082
5650F91o26p3mk71K81P94n36k74K74m6N1j36l61R34q04k17J325j141l7O34p95
$$ plain form
5504 112 -209 -24 -418 312 -479 9 -223 -174 -19 -106 -58 -130 -122 -494 182 400 -444 252 -317 -266 755 -550
5526 -550 -134 163 -308 -191 376 -165 516 549 -403 -200 550 -32 157 -339 -129 -683 -818 325 332 -366 174
5547 174 -399 12 -40 -148 315 -271 -484 877 -261 -201 50 150 21 37 -588 -141 38 -201 288 -258
5567 -258 -199 269 221 85 -556 93 -135 -305 -177 -89 -130 226 126 -487 -23 -157 181 -174 93 -403 145
5588 145 -339 126 -60 -137 -237 -47 345 -47 112 -196 -68 445 401 -45 173 284 187 78 -109 -97 643
5609 643 203 38 -192 -89 57 -42 404 -440 -691 60 311 -155 -543 151 -354 -87 238 -355 -505 -130
5629 -130 -391 -358 -317 321 206 58 345 125 162 -442 -6 517 4 -1177 209 233 -580 -30 -514 -391 691
5650 691 65 -8 -12 -283 -2 792 256 -18 256 210 261 125 -236 698 -106 -323 1002 -139 -176 458 -337
5671c37L55K0J40n91K77P8O57p10Q16m60J86j7j083J42L06m96P09N69j016P68
5691C13o10J71M88k61l12N05k25k95O02J88q61J45r6R4Q1N36o95L91j05K1m40
5712c65O55L38q1o47J40L6j03m89N89J35j109M72K14j07O30j56m63l90Q60L8o38
5733d41O76M2j90rQL11o58r8L04K06m37M39n82J87P64o90J02P72q70L32k77J46
5755C7k77J98l68L29J01n6L1n04J41N01L47l8k75k14k43N73l13L40m78N25m95
5776a38K1O20o51J5M38p39%l2L11L29m5J60o38M48n0L19m9n86j09J38K20m1rL73
5800C05n26L60m69L96K8o48R50l69m90N47n7R7R9k10L46r24K24j68K5M57O18n95
5822dN91m30n37Q4O4L40L48l60l24O36p76L36j09M6o9n58R36j63m22K33M60J36
$$ plain form
5671 -337 18 38 178 -413 -136 -58 599 -111 705 245 431 414 -669 -527 -221 -717 -8 561 -455 313
5691 313 -297 -126 362 101 -211 294 69 -226 376 564 -297 -152 -248 -154 -73 463 -232 159 54 75 -365
5712 -365 290 628 547 -100 40 76 -27 -516 73 208 -901 -429 -215 -322 308 152 -311 -701 159 197 -441
5733 -441 235 277 87 78 86 397 -261 -359 -55 151 -286 153 -429 -242 522 -168 -66 706 -164 168 -109 37
5755 37 -240 -42 -410 -81 20 -36 -5 -509 -368 133 480 442 167 -47 -290 283 -30 310 -168 357 -138
5776 -138 -117 503 -148 -133 305 -434 -434 -466 -155 174 129 289 -349 99 49 368 319 -267 -376 -238 -18 -59 -68 305
5800 305 -221 139 -330 66 94 -554 396 27 -463 84 27 124 223 13 359 -565 -341 -509 -484 -27 591 -4
5822 -4 587 157 -380 -296 -232 108 456 96 -228 408 -368 -32 -141 -95 -164 -722 214 51 -371 -138 322 458
5844D58p53k20J10R61j57n12j29K03k91K4J59J03l5J8K96n79L25N97q44O56q34
5865d44J24R26j025N53J02o39N72M93p46l11L71l67M40m3n14L56L80m53l0O03
5885C48l92N6m6j40N79n79n9L17o44N68k7N79q84o64R34J86n24L36K33k78O14
5906E13j34J36m81J07N4N17j26p06o6K93J1j87l84M78k02J48k02K59L07k47L98
5927D86p21M10j68q6J43J40m33R8l65J106K7m03m60P52o61j95K91J68k10L08l58
5948a31L23k66O9J29j42J2n28J07Q31m29M56q7l88N36j22k87J4k40L05J82m88
5969a44J64L83j06m54O46q14k01N30m43Q46l15j34P7o26O67J33k22L30q08N7L99
5990c5j93J92N57n12L61l87k62j42J67j51m0R14m96J27o25J10J13Q60o32J36K61
$$ plain form
5844 458 -295 -515 -405 556 399 -113 -242 -39 -330 -306 -147 -44 -79 -61 235 -344 -19 578 -266 390 -444
5865 -444 -320 606 -419 134 236 -403 169 662 -84 -395 -24 -391 49 6 -508 -152 228 -225 -255 348
5885 348 -44 12 -34 -174 405 -174 -233 84 -560 8 -19 560 -324 -988 -54 132 -392 -56 177 -101 513
5906 513 379 515 34 141 195 712 586 -120 -186 107 118 -69 -453 25 -177 -29 -231 28 335 88 486
5927 486 -235 175 7 -79 64 204 -229 -131 -496 610 637 234 -226 526 -135 -330 -39 129 -81 227 -131
5948 -131 192 -74 -5 124 -18 -6 -534 -427 404 -25 431 344 -44 492 370 83 97 -143 162 344 -144
5969 -144 20 403 297 -157 489 -325 -526 4 -439 407 92 -42 35 -591 76 209 -13 317 -491 -434 -35
5990 -35 -228 -36 521 9 370 -17 -279 -421 -254 -405 -445 469 -27 100 -525 -415 -302 558 -74 62 323
6011C23j082O38N5q1K81m30l35N12M93j087M50M1M33j73j04n64J267p22m85P59
6031A89j77J25j71k28M60k00k34p6K79k0j66M57j27k54m83O05J02M77k85m39J65
6052aj01k3M49J56k84k64L0K45k41j18N93Q6p15l41N85K43r71J086r6l21m07N27
6074A17q21P79K46q03M97K10l42o42J229o80N5K98K59q1m12K33R1K47j48j01m34
6095b03M16k84M27k41l31M63P4l24N59r82L94k43J35L44k60Q60q24O56p08J44
6115G2o40R55n80N00l92l88L87M70n43K67k04J32N46r30l24J155J27r22J39K98
6135A25jp96P68N48q03L22m71J90O88o50P37o68l45p4O1O81k31R44j035J03l82
6156b89j6K18M74k55l96k16L06M89J59k91l83N18k06j3L69o41M66k33l72n13N18
$$ plain form
6011 323 -759 -121 -66 -147 134 -296 -631 -119 374 -713 -263 -222 211 38 -66 -630 637 -85 -570 189
6031 189 12 137 -34 -262 198 -2 -236 -312 -33 -53 -219 238 111 -143 -626 -21 81 558 273 -166 -1
6052 -1 -102 -125 324 480 196 -68 -38 207 -34 -152 441 527 -188 -529 56 299 -672 414 318 -3 -410 117
6074 117 -704 75 321 -482 15 225 -117 -759 470 -210 -155 143 402 321 -91 142 233 480 332 231 -203
6095 -203 213 -71 356 115 -216 247 321 -3 556 -426 -32 -275 -140 204 -56 804 -20 636 -72 72
6115 72 -568 387 -193 307 -85 -473 -86 384 -159 108 -96 36 582 -348 -672 483 610 -312 -173 125
6135 125 124 -672 96 644 -159 163 -308 -118 570 -80 657 -11 -356 -430 -369 312 81 1025 -10 93 -289
6156 -289 -305 -87 387 132 -264 -480 -174 315 474 183 -200 318 112 99 468 -173 293 60 -312 -825 -307
6177c07L27m01O74l41J56j22m05o1Q96j18j32M31k64m28j48l28N43m17J88j18
6197c75l80O17k29j02R43l04l38j48K16L51q5m66K52J44K51m66L55K44l07n24
6217c51j6M35l91L12L10k86n95j19J332r53R91q35j49N43k61k49K76N77o65l76
6237d70L52P5m56P61P18j501N84m86%J83K64j43j55P00p28%M40M1L8o53P03l26
6259e9k59N49R7l92J08n22N34m46l3J303j131M5p8j20K01K68M22j378J078k01
6279a4o51K99O04J14j67q6l51O6J16L91k61J60p0l76L80j54K70J2o41Q03j26o61
6301c43J55P17o13L54j61J56m02O4N33k91l49N79l41k81J45Q47j031k1K65l7L51
6322B96N0l3m03P99j014L83m16l19J56O7N19l70K60m04N55m82p5Q09l13m69N43
$$ plain form
6177 -307 20 -381 293 -48 108 -14 -419 -480 416 298 166 597 333 -95 -243 -571 -28 -445 -257 -375
6197 -375 -755 -138 -367 -469 474 170 -168 -316 -100 251 166 -300 -48 96 347 -119 236 480 173 -351
6217 -351 -367 68 -323 -11 299 13 -582 -701 631 -322 669 -166 -315 228 -33 -282 -6 571 -94 -470
6237 -470 -118 -43 -499 262 980 -521 63 -423 -423 -240 24 -119 -274 426 -302 -302 138 179 217 -436 267 -59
6259 -59 -318 231 328 -64 44 -478 56 -390 -423 880 -251 -206 -284 -404 -203 65 487 -891 187 -14
6279 -14 -665 -366 238 352 185 99 -252 -186 -70 321 60 220 150 -226 154 0 270 282 -359 444 318 -343
6301 -343 -188 529 -84 270 109 265 -137 -73 460 169 -180 399 58 -223 -78 769 -262 -283 -18 -55 296
6322 296 346 313 -90 709 -305 78 -338 -657 -501 -434 85 -285 -25 -429 126 -356 -431 378 65 -404 139
6343A39m27O05J20n81J083j399K85O95j18k24J01k57R5o12OM77Q14n75n44M57
6363A40m78Q7N23j67j07k30o50R98m2j86L67j08L19Mn47J55p2r1j2L6k97N02n8
6386H6N44J25q52J17K37j16l19M93K28m71K91j298R78j81j92M31j53K40J54m78
6406a36P6j25N04r6N4P7k22P9l23J17M22k96k70R6L4J13j106Q91K4J07QQ3M80
6429E91p80K72n02J19O50J0p34M27J34m47j26R53k47r3p0q09J1O51KM34k55o04
6451d13L39j86j41O29J22j19l27j20J66L06j77q3j69r2j92L29L78J20J51o70j84
6472c33P38m07J71J12l37M33k74o49N41O11k22j03J27q04l5Q89r8l03M12q82J85
6493b28j30Q6k61L93O19n35l6j16j82L06L83l84j84M15K3l12R6N98n20L72p69
$$ plain form
6343 139 -288 317 437 -144 939 -460 -175 520 402 178 279 22 117 -495 -489 -12 802 227 -317 140
6363 140 -338 -251 272 105 -2 -232 -882 116 74 -112 255 147 466 470 -77 78 6 -85 -97 -61 -358 144 86
6386 86 630 755 -97 20 257 141 -178 315 543 72 363 -935 43 -138 -330 101 -52 188 342 -136
6406 -136 -60 -185 319 223 277 354 132 211 -112 5 427 131 -139 -43 -9 104 -1002 -111 -87 20 28 111 591
6429 591 -189 83 -419 -300 350 360 -374 53 187 -260 -386 567 320 227 157 -652 -641 10 12 446 191 -413
6451 -413 -74 -260 -401 228 350 231 -96 -216 -50 256 79 -4 -173 -265 -457 -128 250 370 521 -149 -333
6472 -333 405 -2 169 281 -56 377 103 -546 -5 606 384 281 408 -396 -431 458 360 57 469 -413 -228
6493 -228 -358 -272 -533 -140 479 -56 -92 -208 -390 -84 299 -85 -269 146 169 -143 -47 551 31 403 -366
6514c66O81j22l66O2K53j02j95J72J48k64L76l75N24o60J63o3J20K11J87p07Q8
6535b35k15L33K52M92k13o13n8L58l7m01P39m10p54K51O87N3j2m92Q12r05M04
6556C6L4r7N03p63J77k38J40k45M01K64L01m52K88m18p66J022J6q0O6l02l06M42
6578B3M4L1k67J81N12p36L09k36P05j39o66q9M60n75P19J06o85N36m64k12Q47
6599D04l44l86L15P52r81o1L03k52o7O30p11K95n40Q12m75P82o26p7L16k85K55
6620E9m7J19R3Lo40L76O78q8l77o20n77J423p78L69n0k65Ro6L01K12L68j07q45
6643d50L66k75M05n38J80N88M0k04L09r88O31K4k99K23L50k19j65K57K42p29j99
6664d51J42O01n52OP84j27m59J3k86m92J190m04N0L18n17J43m37N23o7o67L21
$$ plain form
6514 -366 315 193 -173 -111 142 40 -155 17 165 -99 277 -98 426 -234 -71 -134 -14 197 384 -323 -235
6535 -235 -450 -117 135 627 414 -199 -257 101 64 -337 402 -8 -762 -511 176 229 217 -275 537 -368 36
6556 36 70 -27 476 -287 -110 -348 -208 -453 -52 212 513 61 349 -69 -835 187 203 123 189 -113 -419 23
6578 23 67 98 -169 12 524 -212 97 -139 566 427 -239 -328 132 -443 276 382 -303 233 -231 -443 404
6599 404 60 -326 -11 741 -240 -301 2 -250 -317 313 -398 -103 -643 169 -306 476 -150 -227 89 -196 59
6620 59 12 131 224 227 -413 -37 641 553 176 -444 -1021 402 -376 -7 -57 -322 -313 -379 -78 134 502 395 -450
6643 -450 -84 -359 46 -492 -312 276 316 112 421 -567 64 88 -211 12 362 143 -22 235 477 -252 -451
6664 -451 -309 292 -260 -254 530 403 -56 -43 -329 -821 369 -35 15 333 -184 -41 -478 45 -22 -689 -368
6685c68O69m35JM1R83j236K76L33k12O40n36k7j78L51j98j56j24j7M72J56n93
6706a58R39r88l17M95L40L45r66OK98j45n3j10m4N41l55K92k50j23L44n35M45
6727Am54P4Rq1M64k81O29n83P94p54q2J033p46k71q7l7O93k12M68m52k64N85p55
6750c09N16J11J76p6j37Q0n37m04M51Q19r31M31m01M37M94m50k76L67l32j11m59
6771e41Q43J5j02o83J49j87J44P89j300R39K46q20n7j01J071o8r81J013k45N49
6791F73k17oj43m5k32j70N58p60N22OnJ96j92n56L81M7r5L58j41j58j85j65Q6
6814b43M83l49P9l66O49k21j76K90N2k20P6Lm38R56o42j9k79K16M18k21k13L23
6836A58J75o72K66k04K68M87o46l15L97n20J150j216J147p97n30Q60o26Q98k77
$$ plain form
6685 -368 301 -134 -133 -92 891 -345 -69 264 52 692 156 129 -49 302 104 -52 -176 -193 279 435 -158
6706 -158 781 -207 -524 -29 311 656 -310 -304 -6 -151 -204 -314 -358 183 -172 120 -130 -253 91 -444 1
6727 1 -453 -379 -370 -451 13 -268 361 -222 572 -182 -264 769 23 -248 -335 -372 321 109 577 125 -139 446 -309
6750 -309 207 318 494 418 281 361 -176 -580 -129 690 -241 190 -211 226 720 270 -6 361 29 -82 -541
6771 -541 302 317 215 -468 -319 -506 -362 427 -873 66 312 -508 -565 -666 405 337 -644 369 124 673
6791 673 456 450 307 262 30 -140 418 -342 180 186 181 377 185 -371 10 57 -38 320 179 21 -164 -329 -243
6814 -243 240 -109 -30 -396 253 32 -144 146 198 -22 54 57 -381 575 -67 -86 -365 -149 269 48 -165 158
6836 158 333 -339 -73 -277 -9 478 -168 -483 -86 -606 544 -672 475 -322 -852 8 -618 280 3
6855CJ28l9l48L00r5L74q26O11O2k20l12M81k34j22P66j202J231m11l23P01j002
6876d77Q53n84L81l07j96j16Q08o48K71n03O84l47L54k03M10o52j57O32RlJ10
6897C19q5m13pj70K83l11K25j06P36k98m92O04j17J2l87p69M88L43n9J73L77l96
6919e0m50L85L13j94o25P27L6r9m1n32K63N08j60p6K40J60n27M86m52K75N6o95
6941d52N10L42p37R99l30K56o72K63j38l65L58K29k93j29m9j79N67J45n32M38
6961B31m01K14N1o08P44N52p57J9N9K04n84O37l08j41P92j183J164n03R5q0p97
6982f00l01J329o8k24j45M59n37r6Q6n21M83K74p94P53j23J00K00j05l21j1k9
7003a91O38o82j96O12k45j14J32k91R84o39k72O76l66N19l20m61L92l97j24J050
$$ plain form
6855 3 131 92 -256 44 -51 323 -503 108 170 -50 -362 119 -115 -237 529 -673 558 147 -176 525 -477
6876 -477 376 -208 173 -134 -330 -446 362 -286 -15 -518 166 -181 173 -30 380 -272 -429 203 212 209 319
6897 319 234 -179 -186 -356 -73 -384 -159 -265 471 173 -319 285 168 180 -207 -976 -488 -145 -204 -31 346 -50
6919 -50 -500 -115 198 4 -621 106 142 43 2 -530 -267 241 81 5 245 405 -122 364 -88 187 243 -452
6941 -452 58 400 -337 662 332 588 -84 179 41 -324 34 263 -30 -159 -208 -387 180 325 -207 231
6961 231 -170 44 95 -513 231 783 26 45 104 308 -276 361 53 -88 704 -479 685 182 277 197 -600
6982 -600 -901 428 360 136 -9 450 -87 -183 -97 -618 -135 139 -655 98 -25 75 275 170 -151 -162 -191
7003 -191 447 -235 -431 181 -64 -178 -46 -337 647 8 -264 412 46 565 245 -216 176 -221 -345 705
7023G05j061L89j82L35m04%O29p03q1K55N19l87l16K06N2K86l52k08K0P58k42
7044B18l04j27o0K46j90J07K05Q5k17k61O22j23o16O2M77m56K32K83J3n05M29
7065A20m89l1j00N55L6J69M81n25o44P03J23l16J03j83j7j09L78J67j62o07P3
7086b75j93K51R7j67J04m0N00j17j43J37M27L70p64l73JO9r5J16M50o12L55m56
7108c58K13rJ01K88l50P2o84M47L06M90k37k2l39l9K17l04N20M1K31q53P75L3
7130E39j015J202r63k27M99l26N7N66k54K03j31k82q4L50R3L28j206JR32p3j44
7151F5N91m03r2p63R31m02m08J045n31l8J03o68P94m87K66M03o6m12j95J03N2
7172a12K52K98l53o15M3J00m6N59Oo17k2N14j70K8j26M93k29m20L62l67N66l25
$$ plain form
7023 705 -356 33 -149 186 -218 -218 411 -292 -373 -118 401 14 -302 -96 -44 242 -110 -318 -298 460 218
7044 218 -86 -213 -273 -27 -217 -110 95 180 -37 -298 324 201 -415 -353 124 -332 -100 183 196 -309 120
7065 120 -369 -400 -500 55 91 260 741 216 -428 275 398 82 185 2 -15 -124 254 421 259 -348 -275
7086 -275 -468 -217 -120 -287 -183 -223 277 160 17 154 581 951 187 -186 -185 -116 -211 -95 355 -257 98 -358
7108 -358 -145 -154 -53 235 -115 -43 -727 -280 26 516 279 257 -82 -121 96 -208 312 353 584 -269 506 539
7130 539 -476 726 -237 -464 35 -291 -234 332 78 281 150 -132 -216 134 227 555 -651 -650 282 209 65
7151 65 656 253 161 -602 329 -73 -481 564 33 -5 98 -570 224 -263 3 406 340 -72 -267 -164 -112
7172 -112 140 438 85 -530 -487 -387 -433 126 132 -485 -507 7 -163 -135 -261 232 3 -417 -55 -422 144 -181
7194a81P2J10q3J82l95N37L82m93P2l17K9J81K84j19n37N60j44K40J89o04J33
7215I8k80L37l67m69M03L84K02k37j08K36m10J26l34N54J71n66N59j98O9m17J12
7236a35J85R9l56N50l61k3L07J45r01L44K58p40M33J21l76P00k87pj34K93k64
7257a49K7N32l31o02N04P73q57K80k33l56J60P6MOJ4j6L03n13K82M40Nq05O3N20
7281A27o51J69J34J7k50l5q2O73O00p95P86m96m78L48k74L33N3j81n93L89j0J59
7303e7M89J7p12N92J22l74l07L8K98j65M60k25p71K12J058j079L41L37m94M64
7323B44k19jo1m49K92m37Q52p75O36M39n80N19q34K80M0k92O85n82N87l58l75
7344c89Q81q09N61m04m8L32r23Q68m42N69q43P18q52P71J9K45l38r6Q28r50M93
$$ plain form
7194 -181 -109 1 -82 100 -295 242 624 131 203 -114 -85 96 380 261 -276 284 140 380 569 -35 98
7215 98 -182 155 -212 -681 -278 106 308 71 -37 199 -211 -85 -419 135 306 -260 299 101 170 -247 -135
7236 -135 50 149 -207 343 -18 -41 266 411 -490 -146 112 -628 -195 -74 -450 250 -37 -44 -178 115 -149
7257 -149 -122 410 79 -523 -19 754 -103 177 -56 -412 -252 -176 -172 -166 -152 -168 135 -378 -96 344 349 -456 -393 127
7281 127 -524 -355 -221 -204 -454 -489 -571 102 702 -93 693 197 -281 67 -207 126 179 -2 -595 -206 -216 -57
7303 -57 432 449 -263 329 451 77 -230 -192 106 -59 401 176 -595 -383 675 -404 -63 274 -220 244
7323 244 25 24 -37 -486 -194 -631 221 -554 82 521 -59 460 -374 -94 -54 -346 339 -243 344 -14 -389
7344 -389 492 -317 244 -160 -208 124 -799 69 -373 196 -647 71 -781 -10 9 254 -84 -180 648 -302 191
7365A91n42J02l15P75p29N27o4p4R4o1m03K61L65p6J1l87M37J02l3m96n60Q44
7387c1j04r1K47l64M4j96J60L35n96O50j65j54Q37l91o5L0r31N81L73p32P72j8
7409A91KK47m47j17J76O33j471Q21l04O23L4k79J025q32l44ok23K77l61N17k53
7430i1m24m05J245k69j59L95R7m76J21k34m8L62L19J0m85K74k25L74n28R0l65
7451d22N61j9l97K18K07k03lr2Q24m22m63K63m44k1J27L02L28l67j30L07l9j4
7473A01K30m12q82J245k47l22J31K3N24k74o5n6N42p83L57j88j82P68q12O33r12
7494e81Q29L41k27N21j237O11p11kQ37j006K14O09j95L61k22j43K33q4p61N05
7514a08j39J48K45M50j202M27O3J90j14j32M00j93q2O22p17j25J47Q75r00M8l02
$$ plain form
7365 191 -351 -249 -564 211 -518 9 -55 -129 -35 -96 -499 -238 127 51 62 -325 112 214 181 -315 -875 -31
7387 -31 -135 -226 21 -343 -299 -495 -335 0 -596 54 -111 -265 572 181 116 146 -785 -204 169 -563 209 191
7409 191 193 440 -7 -124 52 685 -786 35 -269 354 388 109 1134 302 -42 -48 -271 6 -355 162 -91
7430 -91 -515 -920 325 56 -103 292 389 -87 34 -200 -248 114 433 443 -42 232 7 381 -147 -57 -422
7451 -422 139 120 -277 -59 148 -55 -58 -150 674 252 -211 52 -392 -413 -286 16 344 -23 -153 154 115 101
7473 101 331 -81 -963 282 35 -287 -156 -133 391 117 52 -4 538 -245 112 -76 -258 510 -302 331 -581
7494 -581 248 589 362 883 -354 257 -454 -456 381 -625 -411 198 3 364 142 -1 232 148 -613 -108
7514 -108 -247 -99 146 596 -606 -179 -116 74 -40 -172 228 35 -47 575 -142 -267 -120 755 -145 -97 -399
7535c99K10L61l83K23K01m37O44p92K00M0P8p0M56j91J8l11K47n5K29P3m92O50
7557E00p12k07p8L19P9M12m75lJ97K90o39j12Q83o53M60k31K0O30p46k1J09J0
7579C2K83j28p43J058l93o5L3m71O66n56L12k33J06K46o5r11N09M10J93j08p28
7600e53q2M31k03O40l12j02k65%M78k99Q71j178Q24o41Q13q34N92l50J07m56Q90
7621C71j96l30N6J84k06J82k76K02J97j62j83k90K08O13n67n2L85n6J39l03Q3
7642aK44r04Q46l73J30k59Q46k91o14L00j02M93l48J31J87n23K6L32L46m35o7
7663c6K6j9J25K38n79Q36K12q8n36oR3k76l02p3M52J86o95L96l91M47j47P0R1
7686B4M19o95Q18p35j16J23m82P09J80r80Q2O12M12No63J75j25N29m65Q35k61
$$ plain form
7535 -399 -189 172 -211 12 213 -224 420 -372 -172 -132 -54 -124 332 141 159 -152 95 40 269 342 -150 500
7557 500 -212 -419 -497 -178 -99 313 -162 -165 32 322 -317 -429 454 -199 261 30 50 680 -66 -87 22 32
7579 32 315 187 -556 502 109 44 77 -394 272 -284 28 -205 -99 147 82 -829 -320 90 283 175 -553
7600 -553 -635 -204 -407 233 -79 -181 -446 -446 32 -267 604 -574 250 -391 422 -412 180 -170 -63 -519 371
7621 371 175 -155 -99 85 -121 61 -215 -13 184 22 -161 -451 -243 370 -197 -249 136 80 219 -84 -1
7642 -1 243 -661 185 -188 -58 -317 529 238 -376 -76 -178 315 -33 98 285 -238 -212 120 466 31 -36
7663 -36 -10 -29 96 334 -245 591 803 715 179 173 266 -10 -312 -385 67 253 -442 -46 -437 10 -137 -67 24
7686 24 443 -252 566 -169 -285 -162 -644 65 245 -735 -653 -41 371 376 -287 -112 -237 292 -173 662 401
7707D01k53Q7o40R56n73M99p51L34k27L1L4RK9k4L7l10L68m4k67L84m0K40j71
7730A09o60Q81r2n55J18J75P44j086J64L08J47K50r76L79M52n70L34M4n7p59O75
7751B5M00k20j03m61P19k44l20N01j37o2n73P96n63LQ96n19q3j21J19P0j1j87
7773g5N57q49J59L05N71j007N90k44P6k25o0j46O50K55n35K34L92q20M25m24K84
7794A13k13%N8J30l78j83J72j56K85N79p81N94m4r8K07l65pN62o79J85j24j52
7816b95K26o6M71n61N55r14J75M57p1k9l95M84K55k86j4q2N95p78k75J083j129
7837e94K20K41J99L8J72k37M94l29j27N7m76N36q47Q93m77J30L80q9j00J29m24
7858b11K84kk80r0M77m35J04K69p6L7R3k97n58J081j32k82k42P87q83L77n27N48
$$ plain form
7707 401 148 235 -405 551 -22 477 -274 60 -167 -136 -102 -93 -64 -88 -51 -361 7 -37 -304 80 40 280 109
7730 109 -551 330 238 -317 -199 -24 720 -366 -202 106 253 503 -473 -94 358 -212 122 166 109 -650 25
7751 25 425 205 102 -359 360 116 -204 297 160 98 -475 321 -242 -239 657 138 55 -66 53 123 112 -75
7773 -75 482 -367 -208 97 668 -339 251 7 83 -142 -202 -348 302 557 22 256 648 -172 253 -171 113
7794 113 -100 -100 -42 88 -290 -473 -301 -457 -172 407 -374 220 176 78 285 -80 -87 475 -204 -19 -143 -295
7816 -295 -69 -135 336 -225 330 -584 -409 48 -23 -52 -447 37 292 6 -8 -90 505 -273 -548 535 -594
7837 -594 -374 -133 66 104 276 39 533 204 77 134 -342 194 -653 240 -237 -107 273 184 84 213 -211
7858 -211 73 71 -209 -299 178 -257 -153 116 40 77 170 -127 -685 396 264 -18 -260 527 -356 21 -506 42
7880D2l17Q00j0o28J58N44o35k23L29N0m07O2L36J65j85M21j98j33r55J614q10
7901B0K93P1m99j09O03q19J58q4P0Q20j149R28p2P8j84J40N12p49P40k50p8q61
7923d21O71L19j22n30N45l37p69J25j16L66k56P74l21k38p85P75M65n30J15P41
7943D71j15j61p04K55J96J54l91K56o7rk43M51nn27Q22n98N93k32k65O18m49J03
7965A53K17q20J077l0n65m12O21j54k7k34N48p04P09m96l30M93L01k27j42o8q9
7986a79j51M18k87K81n77O80k0Nl0q07M64P90o39L36m13J46K73j26m06L6M34R6
8008C24r61O85l76L32m8K06j95L47k41l52K10k80r5J1J067l43k48K23m75m1M36
8029A86l96Q5L37k80k85M9M64j04j24n02P69n84j03N86j76l3o5P83o68n27P16
$$ plain form
7880 42 -275 525 515 -113 45 589 -46 -269 60 110 -297 -235 101 266 81 502 304 171 -784 830 20
7901 20 313 384 -115 -224 379 -440 -282 -366 -296 524 -625 303 231 309 125 265 777 28 768 518 440 -421
7923 -421 250 569 447 -83 462 125 -644 -519 -635 -269 -525 249 -72 -310 -1095 -320 145 -385 -270 471
7943 471 356 195 -509 -254 -58 96 -295 -39 -106 -115 -358 93 88 -439 383 -215 378 146 -119 499 50 153
7965 153 370 -450 627 597 32 -380 241 87 60 -174 374 -330 379 -117 -447 46 347 120 -22 -90 -179
7986 -179 -330 88 -199 82 -495 185 165 170 140 -667 -203 587 -52 284 -129 17 290 164 -242 -206 228 324
8008 324 -637 48 -328 4 -44 162 -33 314 73 -279 -69 -349 -444 -433 634 291 43 266 -209 -250 186
8029 186 -210 -125 212 -68 -353 -304 160 56 -68 -570 199 -385 -488 98 -78 -111 -176 607 -61 -588 128
8050A28p92P96m6J27k76j19M26k70r7O39q32j40K14M41P4m43O02j13n29J11p8
8071a77K23J83J09j81m31O19l13m43L69M47n71p3M78m11J30k87L84l52K12j67
8091b52K07j69jL01m85K90Q44p67n79N23L78l89o66P19m80M90MJ042j200K02J3
8112B5L26m10K0j53L91p47M48K30l17J15l5j60o77J426m07N55k91J98j020L14
8132a69M9L34r43J095p96O00k77l27j67R34j22o96J74N30j99J47N82k98m57j97
8152b03K40K71l3n28k76J048l65k87m13J101j102P71k98K72N01j045J46J56j70
8171b14J56j59L40m54K64L23k12l05m11J021k58P9n53K95K55j56J04N2m95K03
$$ plain form
8050 128 -664 132 86 213 -63 -182 244 -26 -123 516 -316 -456 -242 199 273 -170 432 319 -210 -99 -177
8071 -177 46 229 338 157 -274 345 32 -411 -42 405 -166 -239 239 -172 -42 -329 55 -297 -85 -252
8091 -252 -45 -214 -215 86 -399 -109 735 -32 -611 -88 290 -99 -765 -46 -526 -36 -32 1010 -190 12 25
8112 25 351 -59 -39 -192 199 -548 -100 130 -187 -72 -107 -267 -944 482 75 630 339 537 -483 -169
8132 -169 -120 214 -729 366 -430 170 -107 -434 -601 333 211 -485 -311 219 20 167 749 451 -6 -203
8152 -203 37 308 275 -253 -529 519 154 -133 -546 555 -547 224 -74 198 699 -346 -200 -44 -214
8171 -214 -58 -217 123 -331 -67 256 44 -261 -672 349 91 170 -383 -88 167 11 115 167 -328 -125
8191a25
$$ Imaginary data points
##PAGE= N=2
##DATA TABLE= (X++(I..I)), XYDATA
0@%%%%%%%%%%%%%%%%%jM9r6R6r6R6r7J32j79J92j94K42k89L22l70M11m59N28n95
36c08O50p26Q16r12J012j120J238j369J512j671J842k023K228k456K706k980L284
53A723l626M008m443M949n533O210p019Q002r223J0791j2867J5733j9957K6735
67A5483l9205O8719k42514j58844N37921m97954L09210K29605n66342L86145j10937
78f8713l04698N63723k56549k5663L39524m52828J74146K11360l31914L69275
88B17663l9215k94589L22700k37080q1234L49704k98330P8989J42080l67869K15506
99H325L2044k11468L08680j43726j24043K12304k30660O8248J74150j87990J24447
110C0311j388j66064J46982k1350m0011J43209p1190n1520O8320p4305J6935J12636
$$ plain form
0 0 0 0 0 0 0 0 0 0 0 0 0 0 0 0 0 0 0 -1 48 -48 48 -48 48 -49 83 -96 96 -98 144 -145 177 -193 218 -241 287 -308
36 -308 342 -384 432 -480 532 -588 650 -719 793 -878 964 -1059 1169 -1287 1419 -1561 1723
53 1723 -1903 2105 -2338 2611 -2922 3288 -3731 4271 -4952 5839 -7028 8705 -11252 15483
67 15483 -23722 44997 -197517 -356361 181560 -316394 -7184 222421 -343921 42224 -68713
78 -68713 -373411 190312 -66237 -91900 247624 -205204 -31058 180302 -151612 217663
88 217663 178448 -116141 206559 -30521 -111755 237949 -60381 18608 160688 -207181 8325
99 8325 40369 -171099 137581 -6145 -130188 82116 -148544 -80296 93854 -94136 30311
110 30311 28923 -137141 9841 -11509 -51520 91689 20499 -31021 37299 -37006 -20071 92565
122I2565p2913p14N0827j31284M5657O9985r9786J09519j0447j43463J13210n9219
134c6063m8160J72734j14339j4411J06398j81016P8984J00417j49427J62229k1662
145E5684j75758J92901j02169n2458K35191k00012K6372J30614k69045J73714
155A5034N9862k01284K58532j30032j36850K56855k22695O4498K03302k77577
165a10355J71928J5997k48228K83365r3537j04307K67773k56077P604J83301k71464
176a54000J87036P3678k48284K33053j08006j45608K81385j78814J5283J96625
186A52348k74739J20618P7884k17096K47586m5162j46419K17411j87470j5140
196g0179J96874j97582J07973O8738k16940J53623l1958j09940K03608j05396
$$ plain form
122 92565 19652 18938 69765 -61519 -15862 54123 -45663 63856 53409 -90054 23156 -36063
134 -36063 -84223 88511 -25828 -40239 66159 -114857 -35873 64544 -84883 77346 55684
145 55684 -120074 72827 -29342 -81800 153391 -46621 -20249 110365 -158680 15034
155 15034 74896 -126388 132144 2112 -134738 122117 -100578 -36080 167222 -110355
165 -110355 61573 77570 -170658 112707 19170 -85137 182636 -73441 -65837 117464 -154000
176 -154000 33036 106714 -141570 91483 -16523 -162131 119254 -59560 -44277 152348
186 152348 -122391 -1773 76111 -140985 106601 61439 -84980 132431 -55039 -70179
196 -70179 126695 -70887 37086 105824 -111116 42507 10549 -99391 104217 -1179
206a179m4937J25960j65544N1573R9501j30147J10607M30j31574J15508m6364
217a6166m1383J42810q8846j6985P6109j19698N0528P1061q8371Q0275m043j03362
229e8071Q2183k3123l4191J08025o3966l3409O3261r2210K6630P5960q1721N6887
241B6255P503j09001Q5353j0195m8871J21638p1102m0268R0531j12572M2500R2967
253G4738j16340Q4174J954j30003J25303l4549n3542J45863j13225k0101R6602
264F0874j43274Q1396P0541j30838J18215m2016j09421J52968q5217q586J38995
275A03637j55081L9934O3459j53360J39177J1873j16562J49652j00747o1797J53610
286G3795j27109M6464J01910j68557Q8724J2917j26456J63423m6644o8503J37975
$$ plain form
206 -1179 -46116 79844 -85700 -34127 65374 -64773 45834 46264 -85310 30198 -16166
217 -16166 -57549 85261 -3585 -20570 55539 -64159 -13631 57430 -30941 49334 45291 -58071
229 -58071 24112 989 -33202 74823 10857 -22552 40709 -51501 -24871 51089 -30632 26255
241 26255 33758 -75243 10110 -85 -48956 72682 1580 -38688 51843 -60729 -18229 74738
253 74738 -41602 42572 44526 -85477 39826 5277 -48265 97598 -15627 -35728 60874
264 60874 -82400 -1004 69537 -61301 56914 14898 -94523 58445 -26772 -35358 103637
275 103637 -51444 -11510 51949 -101411 37766 49639 -66923 82729 -18018 -79815 73795
286 73795 -53314 -6850 95060 -73497 15227 28144 -98312 65111 18467 -50036 87939
297H7939j38861L123J13985j34295R6862M0359j47372J15875m2701p6977J57622
308G5559q4857j9234J01612j42904M5320P0312j09997J09195m661j06212J05419
319C9552o2398l0118J23873q8755J4287N9497j24068O5531L3541q2122J06113
330E4933l4839p5055R2357p2701l644J00190q7397K7181L6820j07253P0778J8875
342B0245o1113R3485m2847n4589P7445o6486J3584P9334q1501L3232J8433r2552
354f3330P5167N363n1295Q8120n4777m2744P3909o9900K4182P1804q4731L8612
366A0380J0888q4783P9829j793m4457Q4134o2276l0444O8840p0183L6395N7357
378E3887q5844M8051j061p6783R0115j7683l5917Q5509p7812j6398O9281p9829
$$ plain form
297 87939 -50922 -47799 66186 -68109 28753 69112 -78260 37615 -5086 -82063 75559
308 75559 -9298 -28532 73080 -69824 -24504 45808 -64189 45006 40345 -65867 39552
319 39552 -22846 -52964 70909 -17846 -3559 55938 -68130 -2599 30942 -51180 54933
330 54933 20094 -54961 37396 -35305 -38949 61241 -26156 1025 37845 -69408 1370 20245
342 20245 -40868 52617 9770 -44819 32626 -33860 -20276 59058 -22443 10789 29222 -63330
354 -63330 11837 17200 -34095 54025 -752 -43496 30413 -39487 -15305 56499 -28232 10380
366 10380 21268 -63515 16314 14521 -29936 54198 -8078 -38522 30318 -39865 -3470 53887
378 53887 -31957 16094 15033 -61750 28365 10682 -25235 60274 -17538 -33936 35345 -44484
390d4484N1169M6978r2935O1772j6449o9473R9777l6288k2819Q2596r3778Q476
402b5458N9834q5160P5076K2073r0078Q0687m1099n1960J09943o3943j235P6210
414F4890j12818L6707M2873q9240R5094o824p7930Q9533o6295k2207J02282q1219
426b5154L2243M8257j12665O8562R401o9626J08467m5978m8669Q4949r0302J5074
438b5441P9064r1046N8385J3906r8145Q3680k0368m0834J01443o7593j3230O2316
450D2137r0269M8048M4522p5947P1566k3204o4873Q1779m6963n600P6210p8297
462b0891J5640L1570p7700O2584J4494n2234O3260l8261l7372O2571m0403J1333
474e409M9242o1811J8437J2639n1460N3229M477l3441M4835l5931k3587M7889
$$ plain form
390 -44484 6685 53663 -39272 22500 6051 -63422 36355 67 -22752 59844 -33934 -25458
402 -25458 34376 -50784 24292 46365 -43713 36974 -4125 -56085 53858 -10085 -11320 64890
414 64890 -47928 -11221 31652 -57588 37506 30682 -47248 42285 -24010 -46217 56065 -25154
426 -25154 7089 55346 -57319 11243 20644 -48982 59485 13507 -35162 49787 -40515 -25441
438 -25441 53623 -37423 20962 34868 -63277 20403 35 -40799 60644 -6949 -20179 42137
450 42137 -48132 -84 44438 -31509 40057 16853 -48020 33759 -13204 -18804 57406 -20891
462 -20891 -5251 26319 -51381 11203 25697 -26537 36723 -1538 -38910 23661 -16742 -5409
474 -5409 43833 -17978 459 13098 -38362 14867 19344 -14097 30738 -5193 -28780 19109
486A9109l1308J1980L9221n2352J0825J4071m3460M3881J0847l7132L6700k5620
498c238l0879M9348k4281M97M3689n4783P221K4545m9301M9315J3522m7917N2690
511C0428l4306l2901P0025m3891R433N0752q0259K9820K0255o7730P6469j0425
523A7670n2187P2874o4124j3704P6833p0114L8087L6291r0933O2841o510n5212
535d8188R6036m5025k3867P0323r1156K8099N4685q3878P3566m774q0066Q5824
547C1579m8848k2945R4140p8061J6230M4870r4492O4045J5282o1956Q5695m4089
559A450l8408P1872o8819K3223N7185p7154M5702O64o6308P2896k0943k4914O7277
572D3723o0020k464M0990n8756M3491K1212n1622M2493k1294l2356N3590k6755
$$ plain form
486 19109 -12199 -219 39002 -13350 -2525 11546 -31914 11967 22814 -14318 22382 -3238
498 -3238 -34117 15231 -9050 -8553 35136 -19647 -12426 12119 -37182 12133 25655 -22262 30428
511 30428 -3878 -36779 33246 -10645 -1212 49540 -30719 -899 19356 -48374 28095 17670
523 17670 -34517 38357 -25767 -39471 37362 -32752 5335 41626 -49307 13534 7024 -48188
535 -48188 47848 2823 -21044 49279 -41877 -13778 40907 -42971 30595 25821 -54245 31579
547 31579 -17269 -40214 53926 -24135 -7905 36965 -57527 6518 21800 -40156 45539 1450
559 1450 -36958 34914 -33905 -10682 46503 -30651 15051 15715 -50593 22303 1360 -23554 43723
572 43723 -16297 -18761 22229 -36527 6964 28176 -23446 19047 -2247 -34603 18987 -7768
584g768J217L6642m8279R201J5661l2416L7068N148k6913K3889j7680j5612L1025
597A1183q003j938J9388k6587p095J7971j6484J1817J9342k8595O604M430k9540
610b7507L1258N535k1445L3507k7182j6060L8330l0242J5571L1170n1435K6236
622G736L447m4297N6152j2569k7775N2027n2950n216N0113n6414L7755K2541o6192
635c5642N2751j7834l9734P8133m3915n875N4756p9198L3683K9629o5978P3498
647C4274j6034n3449P2052n7977k870P0237p2270L4853K3210p8765O4370r501
659H130m1858P8655n0232j4772N4335p0257L4304L5239o4062N6382j4054n1253
671c9443O6976l7894n559O0316o3921J6972K4151n8581N2325K694l8698N1814
$$ plain form
584 -7768 -6551 30091 -18188 -8987 6674 -25742 11326 16474 -10439 13450 -4230 -19842 11183
597 11183 3180 1242 20630 -5957 -13052 4919 -11565 252 19594 -9001 -2397 2033 -27507
610 -27507 3751 9286 -12159 21348 -5834 -21894 16436 -13806 1765 32935 -18500 7736
622 7736 11183 -33114 23038 10469 -17306 34721 -18229 -23445 26668 -29746 8009 30550 -35642
635 -35642 17109 -725 -40459 37674 -6241 -12116 42640 -36558 -2875 26754 -39224 34274
647 34274 18240 -35209 36843 -21134 -24004 46233 -26037 8816 32026 -46739 17631 8130
659 8130 -33728 44927 -5305 -20077 34258 -35999 -1695 33544 -30518 25864 11810 -39443
671 -39443 27533 -10361 -15920 44396 -19525 -2553 21598 -36983 15342 18036 -20662 31152
683C1152l7113j5721M3501l9597K0782K3861m5376K5984m501k8072M1199j2800
695C299r560K6946l1491p83K2047k0353J6632J0924k5804J0030J76j5340K1437
708H160J276j1854J2570j2608j1428J9221n663l21J6235k1128j853J2506j9105
721a3992J7495J2376k5532J8821p663k3017L6207j5364o348L2981l9191M721K3908
734A5402m0594L6621P106l9938M1603k6618j8793N0545l8433J0372L1448n6423
746b7702L1277O494m1314N7841k1855k5067M9604n1131Q165M2049n2916L7525
758A2970Q752n6803N1699j9309k5084O2260m5528J68L7177n9421L3670J8482m6929
771b7896N3451k1391l2447N2046m1247O452M3552n3174K6566R430m8642M6817
$$ plain form
683 31152 -5961 -21682 21819 -17778 3004 26865 -18511 7473 2972 -25100 16099 3299
695 3299 -6261 20685 -10806 -11589 10458 -9895 6737 17661 -8143 1887 2063 -13277 8160
708 8160 9436 -2418 10152 -2456 -13884 5337 -326 -647 15588 -5540 -7393 5113 -13992
721 -13992 3503 15879 -9653 9168 1505 -21512 14695 -669 -7017 25964 -13227 -8506 15402
734 15402 -25192 11429 18535 -21403 20200 -6418 -25211 25334 -13099 -2727 28721 -27702
746 -27702 3575 10069 -31245 26596 4741 -20326 29278 -21853 -13688 28361 -24555 12970
758 12970 21722 -35081 16618 -2691 -27775 34485 -11043 -10875 26302 -33119 551 19033 -27896
771 -27896 25555 4164 -28283 23763 -17484 -11032 32520 -20654 5912 15342 -33300 13517
783A3517r022k4211M6284l6351o616L2996l9652K3787J8310l8112L0118r766k4845
796b3563L8702j8396l703K8472l4413P321J5240k7397K5727K429k2324K1492j3667
809d080j2029K5943j2955K04J5243k1554K882J0014j3900J4484M677j5989J0253
822C193l998j1794J9592m205o838J5071j6743l856J6873j5748J0153J2181k4730
835a0849J3304Q11k0095K7422n966j3195K4459k4366k346K4264k6104J6345J1119
848A4803l1917K3846n972j9826L6073j9058n652K8068l6358J2025J9179l3821
860a8610L2726j469l1732L5788k1481j0759L9404l4163Q423K0044m2294K8076
872C953M945k9362L9992j8884j6577L5123l4298R151K8119l7353K4723L625l5795
$$ plain form
783 13517 4495 -19716 26568 -9783 -16399 16597 -23055 732 19042 -19070 11048 1282 -23563
796 -23563 15139 -3257 -6960 21512 -12901 -5580 9660 -17737 7990 10419 -11905 9587 -4080
809 -4080 -16109 9834 -3121 -2917 12326 -9228 -6346 3668 -10232 4252 8929 -7060 3193
822 3193 -805 -12599 6993 2788 -4050 11021 -5722 -9578 7295 -8453 1700 13881 -10849
835 -10849 2455 3266 -16829 10593 4627 -8568 15891 -8475 -10821 13443 -12661 3684 14803
848 14803 -17114 6732 760 -19066 17007 -2051 -7703 20365 -15993 -3968 15211 -18610
860 -18610 14116 12647 -19085 16703 -4778 -15537 23867 -10296 -1873 18171 -24123 3953
872 3953 8898 -20464 19528 644 -15933 19190 -15108 -5957 22162 -15191 9532 13157 -22638
885b2638L7347j1445j7030L8768l0892k428K5234l5468K0486J3003l1044K7769
897A1662q915k1380L3512k0574l58K6843l1500J0506J1846k8087K6836j393k0050
910a1052K6959j8717r540K6560k1988O779J6343k6840J3611L439j9163K2240l695
923D936j2130J9022j6353l080J7668j6045Q510Q555k0407J1836Q3j3303J9662
936H954n426r866J5492j4220j804J6574j4248O709Q498j9057J0254K684j3555
949i011J7056m108j1080J5018j2969l421J7101j4690O398Q938j9824J1988K693
962D089j5183K1333p351j0452J9571j8188m69J9854k1026J0530P946k4253J7739
975D140j935j5171K4755j3800p063K0010k2476O619J6404k3920J8672M38k2589
$$ plain form
885 -22638 14709 3264 -13766 25002 -5890 -8318 16916 -18552 1934 14937 -16107 11662
897 11662 2747 -18633 14879 -5695 -6053 20790 -10710 -204 11642 -16445 10391 8998 -11052
910 -11052 15907 -2810 -12350 14210 -7778 -999 15344 -11496 2115 5554 -13609 8631 4936
923 4936 -7194 11828 -4525 -7605 10063 -5982 2528 11083 -9324 2512 2595 -10708 8954
936 8954 3528 -6338 9154 -5066 -6870 9704 -4544 2165 10663 -8394 1860 4544 -9011
949 -9011 8045 3937 -7143 7875 -5094 -8515 8586 -6104 294 9232 -10592 1396 4089
962 4089 -11094 10239 2888 -7564 12007 -6181 -6650 13204 -7822 2708 10654 -13599 4140
975 4140 2205 -12966 11789 -2011 -9074 10936 -11540 -4921 11483 -12437 6235 6673 -15916
988a5916K6203j1365r540K7967k3243J268J8363k8634J6750Q252k5722K6204q605
1001A982j7986K8222k0297k62K3537k6401J1260Q891k6288K4649k620j7279K7227
1014A4635j8676o640K3306k4478J0436J4230k7081J8919k71k0727K6713j1858
1026a492p897K3041k2916M812J5199k3975J7750L091k0123K0830j0342r665K2672
1039A0985j6461J147J4672k1113J0831N651j6254J6531l113j1290J5906j0530
1051c038k548J3911j2394L793O879j4620Q777J573r712J2476m049p758J1415p837
1065c132j330J0375r370K712O529j1042N382M484r783R095L30r867R731l705n592
1080e183J1908q262j866J0597j3448M099Q608j3762J0675J55j1711J4951p778
$$ plain form
988 -15916 10287 -1078 -10618 17349 -5894 -4626 13737 -14897 1853 10105 -15617 10587 1982
1001 1982 -16004 12218 -8079 -8341 15196 -11205 55 8946 -17342 7307 4687 -12592 14635
1014 14635 -4041 -10681 12625 -11853 -1417 12813 -14268 4651 4380 -16347 10366 -1492
1026 -1492 -9389 13652 -9264 -4452 10747 -13228 4522 7613 -12510 8320 -2022 -11687 10985
1039 10985 -5476 -4329 10343 -10770 61 5712 -10542 5989 2876 -8414 7492 -3038
1051 -3038 -5586 8325 -4069 -276 6603 -8017 760 2333 -7379 5097 1048 -6710 4705 -3132
1065 -3132 -4462 5913 -3457 -745 5784 -5258 124 4608 -5175 3920 4250 -5617 4114 409 -5183
1080 -5183 6725 -1537 -3403 7194 -6254 -2155 6453 -7309 3366 3521 -8190 6761 -1017
1093a017n540J7879j5598K533J2304k0330J2860M202j7869K0028p760j2008K2301
1106A1985j7337L2J8656k3023J1341P558k1901K0680m976j4247K5285j7742k499
1119f188K0269k4450J2090J0118k4849K2372n161j6782K6043j7379k854K1267
1131A4496k4189R275J0774k3701K0977l135j5495K3490j5490l630J9452k1684
1143h860R997R954k2161J7379j604j4777K0445j2110m729J7947j8043N218J0068
1156H724j6360J1830j43j1928J4188o910m371J2263j1440L705N976j1039Q465
1169B960N18q271Q857l566m050P608m787j416O149n501R9M694n107K56N252n586
1185a891O54M905o991M158J506o531O321o37o043Q203m841k970J0208j0371K408
$$ plain form
1093 -1017 -6557 11322 -4276 -1743 10561 -9769 3091 7293 -10576 9452 1692 -10316 11985
1106 11985 -5352 -5320 13336 -9687 1654 9212 -12689 7991 3015 -11232 14053 -3689 -6188
1119 -6188 14081 -10369 1721 11839 -13010 9362 4201 -12581 13462 -3917 -6771 14496
1131 14496 -9693 -418 10356 -13345 7632 4497 -10998 12492 -2998 -6628 12824 -8860
1143 -8860 1137 11091 -11070 6309 4705 -10072 10373 -1737 -6466 11481 -6562 -1344 8724
1156 8724 -7636 4194 4051 -7877 6311 -599 -4970 7293 -4147 -442 5534 -5505 2960
1169 2960 3478 -4793 4064 498 -3552 4056 -731 -2147 4002 -1499 -1400 3294 -1813 -1557 3695 -1891
1185 -1891 -1237 3668 -3323 835 2341 -4190 2131 1494 -4549 3654 -1187 -4157 6051 -4320 -1912
1200a912Q186j2655R238J343j1956J3925o287o521J5925j3831J159J2519j8319
1213i186J0459M377j6713J8038p632r285J9855j6373J612J5518k0906J2188M150
1226F102j8331K1037p510j0556K1287j7247O97J5844k2110J2281N215j9722K0258
1239G245p229j0719K0604j6546K286J4906k1559J2755M865j8772K0608o839j0716
1252i111J9776j6274J124J4396j8151R492N026j6333J5089m903q845J5697j0988
1265d005R2J0034j3816P194M075j0143J0857l937o297J0642p487M38P569q746
1279c530L770L294q490N820J45m483O288k137l787M749k172l49L720k931j238
1294a331J770j692l03L444l499L24L516n886L037K666o602O761j077n622Q846
$$ plain form
1200 -1912 6274 -6381 2857 4200 -7756 6169 -118 -6639 9286 -4545 -3386 9133 -9186
1213 -9186 1273 5650 -11063 6975 -657 -9942 9913 -6460 -4848 10670 -10236 1952 6102
1226 6102 -12229 8808 1298 -9258 12029 -5218 -4521 11323 -10787 1494 6709 -13013 7245
1239 7245 16 -10703 9901 -6645 -4359 10547 -11012 1743 6608 -12164 8444 1605 -9111
1252 -9111 10665 -5609 -4485 9911 -8240 1252 6278 -10055 5034 131 -8714 6983 -4005
1265 -4005 -3913 6121 -7695 -501 3574 -6569 4288 351 -5946 4696 -2791 -2353 5216 -3530
1279 -3530 240 3534 -4956 864 1009 -3474 2814 677 -3110 1639 -533 -882 2838 -93 -1331
1294 -1331 439 -1253 -1556 1888 -1611 -1287 2229 -3657 -620 2046 -4556 2205 1128 -4494 4352
1309D352n398j898R613r164L382N121j1479Q429N35r928J3043p203m395J1375
1323F385j2240M089P915j4202J0993n9j2169J6376p728m344J5803j4854L329J0228
1337I522j7705J3488R09j4157J6445q953o895J6285j4333L153J1069j7531J1206
1350B503J273j3527J7183p103n590J4876j4296K752R892j4968J2910K42j3532
1363g385J4530p482n214J4272j2725K514Q773j4579Q719J974r914J1940l911n830
1377d318R890r180K062P314r291N413J034p988P879j966m184Q221n273j539N388
1392C462o491K948L723m637L702q75l891L378p17r55L327j954k769K171k038R2
1408a524L452k440n76L660n771K251L314m591M814p6n433N594k225l086P287n270
$$ plain form
1309 4352 -1046 -2944 6669 -2495 887 6008 -5471 2958 3493 -6435 6608 -595 -4990 6385
1323 6385 -5855 -1766 6149 -8053 2940 2881 -9288 7088 -640 -4984 10819 -4035 -706 9522
1337 9522 -8183 5305 6214 -7943 8502 -451 -7346 8939 -5394 -2241 8828 -8703 2503
1350 2503 3776 -9751 7432 329 -5261 9615 -4681 -1929 7963 -7005 5905 6147 -7385
1363 -7385 7145 -337 -5551 8721 -4004 -1490 7283 -7296 1423 3397 -6517 5423 1512 -4318
1377 -4318 5572 -3608 -1546 5768 -3523 1890 2924 -5064 2815 849 -3335 4886 -387 -1926 3462
1392 3462 -3029 -81 3642 -995 2707 1832 -2059 1319 602 -353 2974 1020 -1749 422 -1616 -1524
1408 -1524 1928 -512 -1088 2572 -3199 -948 2366 -2225 2589 2513 -2920 2674 449 -2637 4650 -620
1424f20m78M375p783M000M148q821Q319k669o376R629o894J84R104r898L830L548
1440C598j0562J0259j185o968J2330r054l079R958j0340M616O789j2446Q947j818
1454A045r173J2498o115j972J0913j3079M058O111j1393J0813Nr756J1277p434
1468b202l315J1800j0137L345O216j2961P740J408q869J1437m309m466Q866r328
1482d775K895O616r554P280J03q183P960l313l477R519p040M6N322q631M606L402
1498B776n880O130k637m880O816m350K34M998m475J228J099m758L820J450l219
1513a648M534l320l187M338k558O89M261l301r25K114m302L156K420k535J242
1528I78n24l610L563J78j569M100l669j148L395m643K340L872n214M110j501m664
$$ plain form
1424 -620 -1098 3277 -4506 -506 3642 -5179 3140 471 -5905 3724 -3170 -2986 6118 -3780 50 3598
1440 3598 -6964 3295 2110 -4858 7472 -1582 -4661 5297 -5043 -427 6362 -6084 2863 1045
1454 1045 -8128 4370 -1745 -3717 7196 -5883 -1825 4286 -7107 3706 3711 -6045 5232 -2202
1468 -2202 -5517 6283 -3854 -509 5707 -7254 486 1894 -6975 4462 153 -4313 4553 -4775
1482 -4775 -1880 4736 -4818 2462 2565 -5618 2342 -971 -4448 5071 -1969 -1923 3399 -5232 -626 2776
1498 2776 -3104 3026 389 -4491 2325 -2025 -1791 3207 -1268 -40 1059 -3699 121 1571 -1648
1513 -1648 2886 -434 -3621 717 -1841 -1152 3109 -192 -1117 997 -3305 -149 2271 -264 978
1528 978 454 -3156 407 585 -984 3116 -553 -1701 1694 -2949 -609 3263 -1951 2159 658 -4006
1544d006N706j538j326O234n633j107M733p024M900K936o253N179k053n999Q346
1559C095l728m87O573q712K578L137p741P976m79n827R106p329k135R097q061
1574b937L832N164j0603O474J61p439J0861m752l347P857q981J563O192p876O618
1589B787P34q531Q027l531l117R441o944J989M322r570N341K153n712P551l603
1604A337n023O664n410R75O048p463M183L7n612N771r38k618O849n458o86L543
1620B199n285L984K848n377L852j643l854M451j335q71M048l640j031K403k627
1635a878J954J695k692J616r72j392K179k34k72J697k226r62K000j979J804J660
1651A998k651P35O01l329L024J250l253L916k198l285M975l171J177L074m614
$$ plain form
1544 -4006 1700 162 -1164 5070 -563 -1670 3063 -3961 939 3875 -2378 2801 748 -5251 3095
1559 3095 -633 -1120 5453 -3259 -681 2456 -5285 2691 2212 -3615 5491 -1838 -3973 5124 -2937
1574 -2937 895 6059 -4544 1930 2091 -5348 5513 761 -2586 5271 -3710 -2147 4045 -3831 2787
1589 2787 3521 -5010 3017 -514 -3631 5810 -1134 855 5177 -4393 948 3101 -2611 4940 1337
1604 1337 -3686 2978 -2432 -1457 4591 -2872 1311 1348 -4264 1507 569 -2049 4800 -658 -1344 2199
1620 2199 -3086 898 3746 -1631 2221 578 -3276 1175 -160 -1031 3017 -623 -1654 749 -1878
1635 -1878 76 1771 -921 695 -277 -1669 510 276 4 1701 -525 -1487 513 -1466 338 1998
1651 1998 -653 82 683 -2646 378 1628 -1625 2291 93 -3192 1783 -1388 -211 2863 -1751
1666a751J185J536n599N233L88l391N039m391j097N862n410L154L450o881M052
1681A379p13m268O902k487k842O595p632J202M868q082O708M34o621O704m255
$$ plain form
1666 -1751 -566 970 -4629 604 992 -2399 2640 -1751 -2848 3014 -2396 758 4208 -2673 1379
1681 1379 666 -3602 3300 813 -2029 4566 -3066 -1864 3004 -5078 1630 2064 -4557 2147 -2108
$$ [...]
8191b73
##END NTUPLES=NMR FID
##END=
