##TITLE=1H_UK_23_9-B 
 CD2Cl2
 148 sc, 
 13.12.2022
##JCAMPDX= 6.0         $$ Bruker NMR JCAMP-DX V2.0
##DATA TYPE= NMR FID
##DATA CLASS= NTUPLES
##ORIGIN= UXNMR, Bruker Analytische Messtechnik GmbH
##OWNER= root
$$ XWIN-NMR		Version 3.5
$$ Tue Dec 13 14:34:12 2022 Russian Standard Time (UT+4h)  she@DPX200
##.OBSERVE FREQUENCY= 200.13135
##.OBSERVE NUCLEUS= ^1H
##.DELAY= (6, 6)
##.ACQUISITION MODE= SIMULTANEOUS
##.ACQUISITION SCHEME= undefined
##.AVERAGES= 148
##.DIGITISER RES= 18
##SPECTROMETER/DATA SYSTEM= spect
##.PULSE SEQUENCE= zg30
##.SOLVENT NAME= CD2Cl2
##.SHIFT REFERENCE= (INTERNAL, CD2Cl2, 0, 15.7039)
##AUDIT TRAIL= $$ (NUMBER, WHEN, WHO, WHERE, WHAT)
$$ ##TITLE= Audit trail, XWIN-NMR		Version 3.5
$$ ##JCAMPDX= 5.01
$$ ##ORIGIN= Bruker BioSpin GmbH
$$ ##OWNER= she
$$ F:/spectra/data/she/nmr/H-F/1/audita.txt
$$ ##AUDIT TRAIL=  $$ (NUMBER, WHEN, WHO, WHERE, WHAT)
(   1,<2022-12-13 14:32:56.70 +0400>,<she>,<DPX200>,
      <continue with go, POWCHK disabled, PULCHK disabled
       configuration hash MD5:
       00 E9 B6 7A A2 85 ED C7 34 08 36 98 17 FE 4E 26
       data hash MD5: 16K
       8A 20 86 59 8E 80 49 59 6E F0 CC 9F C0 D2 9A 72>)
$$ ##END=
$$ 
$$ hash MD5
$$ 02 89 B6 AD 55 E6 12 39 A4 16 AB 28 0F 91 AB F6
##$RELAX= 
##$RELAX= 
##$RELAX= 
##$RELAX= 
##$RELAX= 
##$RELAX= 
$$ Bruker specific parameters
$$ --------------------------
##$DU= <F:/spectra>
##$EXPNO= 1
##$NAME= <H-F>
##$PROCNO= 1
##$TYPE= <nmr>
##$USER= <she>
##$AMP= (0..31)
100 100 100 100 100 100 100 100 100 100 100 100 100 100 100 100 100 100 
100 100 100 100 100 100 100 100 100 100 100 100 100 100 
##$AQSEQ= 0
##$AQ_mod= 1
##$AUNM= <au_zg>
##$AUTOPOS= <>
##$BF1= 200.13
##$BF2= 200.13
##$BF3= 200.13
##$BF4= 200.13
##$BF5= 200.13
##$BF6= 200.13
##$BF7= 200.13
##$BF8= 200.13
##$BYTORDA= 1
##$CFDGTYP= 0
##$CFRGTYP= 5
##$CHEMSTR= <none>
##$CNST= (0..31)
1 1 145 1 1 1 1 1 1 1 1 1 1 1 1 1 1 1 1 1 1 1 1 1 1 1 1 1 1 1 1 1 
##$CPDPRG= <>
##$CPDPRG1= <>
##$CPDPRG2= <>
##$CPDPRG3= <>
##$CPDPRG4= <mlev>
##$CPDPRG5= <mlev>
##$CPDPRG6= <mlev>
##$CPDPRG7= <mlev>
##$CPDPRG8= <mlev>
##$CPDPRGB= <>
##$CPDPRGT= <>
##$D= (0..31)
0 1.2 0 0 0 0 0 0 0 0.06 0 0.03 0 0 0 0 0.0002 0 0 0 0 0 0 0 0 0 0 0 0 
0 0 0 
##$DATE= 1670927062
##$DBL= (0..7)
120 120 120 120 120 120 120 120 
##$DBP= (0..7)
150 150 150 150 150 150 150 150 
##$DBP07= 0
##$DBPNAM0= <>
##$DBPNAM1= <>
##$DBPNAM2= <>
##$DBPNAM3= <>
##$DBPNAM4= <>
##$DBPNAM5= <>
##$DBPNAM6= <>
##$DBPNAM7= <>
##$DBPOAL= (0..7)
0.5 0.5 0.5 0.5 0.5 0.5 0.5 0.5 
##$DBPOFFS= (0..7)
0 0 0 0 0 0 0 0 
##$DE= 6
##$DECBNUC= <off>
##$DECIM= 32
##$DECNUC= <off>
##$DECSTAT= 4
##$DIGMOD= 1
##$DIGTYP= 9
##$DL= (0..7)
0 120 120 120 120 120 120 120 
##$DP= (0..7)
150 150 150 150 150 150 150 150 
##$DP07= 0
##$DPNAME0= <>
##$DPNAME1= <>
##$DPNAME2= <>
##$DPNAME3= <>
##$DPNAME4= <>
##$DPNAME5= <>
##$DPNAME6= <>
##$DPNAME7= <>
##$DPOAL= (0..7)
0.5 0.5 0.5 0.5 0.5 0.5 0.5 0.5 
##$DPOFFS= (0..7)
0 0 0 0 0 0 0 0 
##$DQDMODE= 0
##$DR= 18
##$DS= 0
$$ [...]
##$SUBNAM2= <"">
##$SUBNAM3= <"">
##$SUBNAM4= <"">
##$SUBNAM5= <"">
##$SUBNAM6= <"">
##$SUBNAM7= <"">
##$SUBNAM8= <"">
##$SUBNAM9= <"">
##$SW= 18.05172834244
##$SWIBOX= (0..15)
0 0 2 0 0 0 0 0 0 0 0 0 0 0 0 0 
##$SW_h= 3612.71676300578
##$TD= 16384
##$TD0= 1
##$TE= 0
##$TE2= 300
##$TE3= 300
##$TEG= 300
##$TL= (0..7)
0 120 120 120 120 120 120 120 
##$TP= (0..7)
150 150 150 150 150 150 150 150 
##$TP07= 0
##$TPNAME0= <>
##$TPNAME1= <>
##$TPNAME2= <>
##$TPNAME3= <>
##$TPNAME4= <>
##$TPNAME5= <>
##$TPNAME6= <>
##$TPNAME7= <>
##$TPOAL= (0..7)
0.5 0.5 0.5 0.5 0.5 0.5 0.5 0.5 
##$TPOFFS= (0..7)
0 0 0 0 0 0 0 0 
##$TUNHIN= 0
##$TUNHOUT= 0
##$TUNXOUT= 0
##$USERA1= <user>
##$USERA2= <user>
##$USERA3= <user>
##$USERA4= <user>
##$USERA5= <user>
##$V9= 5
##$VALIST= <valist>
##$VCLIST= <CCCCCCCCCCCCCCC>
##$VD= 0
##$VDLIST= <DDDDDDDDDDDDDDD>
##$VPLIST= <PPPPPPPPPPPPPPP>
##$VTLIST= <TTTTTTTTTTTTTTT>
##$WBST= 1024
##$WBSW= 4
##$XGAIN= (0..3)
0 0 0 0 
##$XL= 0
##$YL= 0
##$YMAX_a= 2294991
##$YMIN_a= -1813601
##$ZGOPTNS= <>
##$ZL1= 120
##$ZL2= 120
##$ZL3= 120
##$ZL4= 120
##$ABSF1= 10
##$ABSF2= 0
##$ABSG= 5
##$ABSL= 3
##$ALPHA= 0
##$AQORDER= 0
##$ASSFAC= 0
##$ASSFACI= 0
##$ASSFACX= 0
##$ASSWID= 0
##$AUNMP= <proc_1d>
##$AZFE= 0.1
##$AZFW= 0.1
##$BCFW= 1
##$BC_mod= 2
##$BYTORDP= 1
##$COROFFS= 0
##$CY= 11.3945322036743
##$DATMOD= 1
##$DC= 2
##$DFILT= <>
##$DTYPP= 0
##$F1P= 2.36226072786647
##$F2P= -0.459571619588291
##$FCOR= 0.5
##$FTSIZE= 0
##$FT_mod= 4
##$GAMMA= 1
##$GB= 0.15
##$INTBC= 1
##$INTSCL= 1
##$ISEN= 128
##$LB= 0.24
##$LEV0= 0
##$LPBIN= 0
##$MAXI= 10000
##$MC2= 0
##$MEAN= 0
##$ME_mod= 0
##$MI= 1.114404
##$NCOEF= 0
##$NC_proc= 0
##$NLEV= 6
##$NOISF1= 3.799351
##$NOISF2= 2.8
##$NSP= 1
##$NTH_PI= 0
##$NZP= 0
##$OFFSET= 15.70392
##$PC= 1
##$PHC0= -19111.41
##$PHC1= 8.00072
##$PH_mod= 1
##$PKNL= yes
##$PPARMOD= 0
##$PSCAL= 0
##$PSIGN= 0
##$REVERSE= no
##$SF= 200.130013532006
##$SI= 16384
##$SIGF1= 3
##$SIGF2= 2
##$SINO= 400
##$SIOLD= 16384
##$SREGLST= <1H.CDCl3>
##$SSB= 0
##$STSI= 0
##$STSR= 0
##$SW_p= 3612.71676300578
##$SYMM= 0
##$S_DEV= 0
##$TDeff= 0
##$TDoff= 0
##$TI= <>
##$TILT= no
##$TM1= 0
##$TM2= 0
##$TOPLEV= 0
##$USERP1= <user>
##$USERP2= <user>
##$USERP3= <user>
##$USERP4= <user>
##$USERP5= <user>
##$WDW= 1
##$XDIM= 8192
##$YMAX_p= 0
##$YMIN_p= 0
$$ End of Bruker specific parameters
$$ ---------------------------------
##NTUPLES= NMR FID
##VAR_NAME=  TIME,          FID/REAL,        FID/IMAG
##SYMBOL=    X,             R,               I
##VAR_TYPE=  INDEPENDENT,   DEPENDENT,       DEPENDENT
##VAR_FORM=  AFFN,          ASDF,            ASDF
##VAR_DIM=   8192,          8192,            8192
##UNITS=     SECONDS,       ARBITRARY UNITS, ARBITRARY UNITS
##FACTOR=    0.0002768,     1,               1
##FIRST=     0,             0,               0
##LAST=      2.2672688,     0,               0
##MIN=       0,             -1813601,        0
##MAX=       2.2672688,     2294991,         0
$$ Real data points
##PAGE= N=1
##DATA TABLE= (X++(R..R)), XYDATA
$$ [...]
2772A44R07N40J487j770M61k17k352q51J970j862n84K616N85q92J363J282q06
2789B021n87j29k127j770K47J320j812J263K025j10N71J712n3k850Q55l54k161
2806a939l87K047j921J525J075O98n65N60J756k551N86L28j719j960Q96r10o99
2823c180K253K803j430N31J435l98j892mm55k347Q77j5l94J61K613P17m67K270
2841C078J15l666J090j137j334L2m63N99m35J998J253j45J152K39j986j054K00
2858d64r41L3j73J547j291J519J820m88p36J242m13o78j217N46k705O49N48Q76
2876c26r15J817J330j321J830q6l138j64J178j863r28J948L70j842J715K024o68
2893I61J053K80q05k226o9q74j548J715J057k82J06J797O57n84L29J424l158o55
$$ plain form
2772 144 1051 1591 3078 1308 1769 1552 -800 -1651 319 -1543 -2127 489 1074 182 1545 2827 2021
2789 2021 1434 1305 -822 -2592 -2345 -1025 -2837 -1574 451 341 912 2624 2571 -279 576 222 -1939
2806 -1939 -2326 -279 -2200 -675 400 1098 533 1093 2849 298 884 1212 -507 -2467 -1571 -2481 -3180
2823 -3180 -927 1876 446 977 2412 2014 122 118 -337 -2684 -1807 -1822 -2216 -2055 558 1275 808 3078
2841 3078 3193 -473 617 -520 -1854 -1822 -2285 -1686 -2121 -123 1130 985 2137 2376 390 -664 -464
2858 -464 -1405 -1372 -1545 2 -1289 230 2050 1562 826 2068 1655 977 -240 306 -2399 -1750 -1202 -326
2876 -326 -1241 576 1906 585 2415 2329 -809 -973 205 -1658 -2586 -638 -268 -2110 -395 1629 961
2893 961 2014 2294 1489 -737 -806 -1680 -3228 -1513 -456 -738 -632 1165 1822 1238 1567 2991 -167 -822
2911h22j06p26q09J565n75J039J769K03n04O59N65k078k459J006j001n5K96R30
2929a103O87N68J126O37n61Q27q85k677j17N67k401J192P10O93O0K047J827j439
2947A758J10n61j870L01n70j622M70K274j34j77J899J126j500R0J5j318k015m94
2965b218N12o93M35R47J028j54K666l69j341J150j62l189q35J618j046j286K448
2982d89J138q15K348N52j087N0M17k413k707J191m33j040K399K237j380J758J168
2999B894O43k949M54n49k524J015p4r78J520Q44QJ176J116q65J22o13K45j677
3017a92k017J105k28j087J559J494J0P74J265j841k04M8k332m55J115p66j3J007
3035g58J918p50K062p1j02j566K01j465j864P0N71Q33j47Q47K183j267K622r14
$$ plain form
2911 -822 -928 -1654 -2463 -898 -1473 -434 1335 1538 1034 1693 2258 180 -2279 -1273 -2274 -2329 -2033 -1103
2929 -1103 -416 152 1278 1915 1354 2181 1296 -1381 -1498 -931 -3332 -2140 -1430 -737 -677 1370 3197 1758
2947 1758 1868 1307 -563 -262 -832 -2454 -1984 290 156 -21 1878 3004 1504 1594 1609 291 -1724 -2218
2965 -2218 -1706 -2399 -1964 -1017 11 -143 2523 2154 813 1963 1801 -1388 -2223 -605 -1651 -2937 -489
2982 -489 649 -166 2182 2734 1647 1697 2114 -299 -3006 -1815 -2248 -3288 -889 1348 -32 1726 2894
2999 2894 3537 588 1042 493 -2031 -1016 -1090 -2068 -548 296 304 1480 2596 1731 1853 1240 1485 -192
3017 -192 -2209 -1104 -1332 -2419 -860 634 644 1418 2683 842 638 686 -1646 -2101 -986 -1752 -1765 -758
3035 -758 1160 410 2472 2401 2299 733 934 -531 -2395 -2325 -1754 -921 -1068 -221 1962 695 3317 2403
3053B403j808m22N77k131p12J322k79k052L324M42P95j86N82N8j984R52j226j959
3071b304N56J14o8O69K033J66m02J647o65j351n42j143j510R03l17J68N55J550
3089E9J268n20J889M03k736m99K90q32j011l4M98k61J206J329P41j118K54j085
3107a59j77j64j125j744J022J506j53Q73M57J531k79L32m85k014O2j6o26p56K63
3126a652P36K22K076M22o40l84Q16l55k092m5j110n73j11K519j698J733J786R69
3144B619j535J227j156j229l84l79r93q61K195K7R38P77J703k329J652q72j063
3161C37j704M93j736o88J485J796j70K24J366n47J05N37p63j064l89j478J10J083
3179a003Q12m60J174K616j036J34l96r41j933m05j2r29J87K141o65J788R28m61
$$ plain form
3053 2403 595 173 750 -1381 -2093 -771 -1050 -3102 222 664 1459 1273 1855 1913 -71 881 -345 -2304
3071 -2304 -1748 -1634 -1702 -1033 1000 1166 764 2411 1746 395 -147 -1290 -2800 -1897 -2214 -2046 -1491 59
3089 59 1327 807 2696 3099 363 -136 154 -678 -1689 -1723 -1225 -1486 -280 1049 1790 672 926 -159
3107 -159 -336 -500 -1625 -3369 -2347 -841 -994 -121 336 1867 1588 1920 1435 -579 -517 -533 -1159 -1915 -1652
3126 -1652 -916 -694 1382 1804 1164 780 1596 1241 -851 -896 -2006 -2579 -2690 -171 -1869 -136 1650 2619
3144 2619 1084 2311 1155 -74 -458 -837 -1830 -2691 -496 -469 469 1246 2949 620 2272 1400 337
3161 337 -1367 -874 -2610 -3298 -1813 -17 -187 37 1403 856 961 1498 735 -329 -718 -2196 -2086 -1003
3179 -1003 -191 -651 523 3139 2103 2237 1841 900 -1033 -1438 -1450 -2379 -2192 -51 -716 1072 2000 1539
3197A539M57n80j129P12k218k64P3k61J209k21J449o50K717j283o50M50n06k626
3215a782M58j053m79J040J448M97R17J449M1j987p93M55j481j00o6J3r23J607
3233g39K331q92L32J305J35j256k88j093k542J333j125N6J769J563k17M07J783
3250B862q37j722j498M16j97r72M90J41R0R24J216o02J865o90j139o7P38j357
3268c39j859J192K94k24N14J387m4P12M60o09j53j724k96j548J60J297j318J525
3286e73J018k78J009K210n88j791n04l18j054j663K020j190N2K522N59K45L44
3303B020L03r71p00r10k04j249j234J629m64K112K158j015N75M28j472j191K31
3320D6r24j255J16J190o93J812J385k05m57O54L41r91k157L81j142l05m38J313
$$ plain form
3197 1539 1996 1416 287 999 -1219 -1483 -1410 -1671 -462 -683 766 116 2833 1550 900 1350 844 -1782
3215 -1782 -1324 -2377 -2856 -1816 -368 129 1046 2495 2536 549 -244 211 -1270 -1370 -1436 -1423 -2346 -739
3233 -739 1592 700 1032 2337 2472 1216 928 -165 -2707 -1374 -2499 -2443 -674 889 672 1079 2862
3250 2862 2025 303 -1195 -779 -976 -1948 -1458 -1317 -1227 -303 913 311 2176 1486 347 280 1018 -339
3268 -339 -2198 -1006 -712 -936 -422 965 921 1633 2093 1484 1331 -393 -689 -2237 -2077 -780 -2098 -573
3286 -573 445 167 1176 3386 2798 1007 503 185 -869 -2532 -512 -1702 -1650 872 1431 1676 2020
3303 2020 2323 1352 652 -258 -462 -1711 -2945 -1316 -1780 332 2490 1475 2050 2478 1006 -185 46
3320 46 -878 -2133 -2017 -827 -1520 292 1677 1472 1015 1669 2010 1019 -1138 -757 -1899 -2204 -2642 -1329
3338a329K81J963O11L63k31P88j479k321j54J67J73K88l09k97N59K737J172j652
3356A330M65J43j530o83n87j408p82K420J00L86J002J031j445K37J025j818o54
3373g68L9K6j451J080Q60l91K61K050m4j18n05j015j160J22J59j427L92J079J234
3392D23l71J296K91j16L24j45k409q28K47q71J39O24J578j552L317j72l43k51
3410A181M98j711j194O97r94o66J348J084o43Q22K055k218O67o26K04k135j57
3427a788J360k241M53J933J224p27J315K13n13p9n05j707N25j027J228j573K336
3444D27N85k093L797n24r33j350j9m59j528J611o52M44m94J963l8o45K088o68
3462A512j150K8k22n93o73q9K17j497L198N35p05M15J191k289J487p22k535M24
$$ plain form
3338 -1329 -1048 915 1526 1889 1658 2446 967 -1354 -1508 -1341 -1168 -880 -1189 -1486 -927 1810 2982 1330
3356 1330 1795 1938 408 -275 -862 -2270 -3052 -632 -532 -146 856 1887 442 679 1704 -114 -768
3373 -768 -729 -703 -2154 -1074 -214 -605 -344 1706 1662 1544 1039 24 -1136 -1014 -855 -2282 -1890 -811 423
3392 423 52 1348 1639 1523 1847 1702 -707 -1535 -1288 -2159 -2020 -1396 182 -1370 1947 1775 1432 1181
3410 1181 1679 -32 -1226 -529 -1523 -2189 -841 243 -400 422 2477 259 926 300 504 -1631 -1788
3427 -1788 -428 -2669 -2216 -283 941 214 1529 1742 1229 1150 645 -1062 -537 -1564 -336 -1909 427
3444 427 1012 -1081 2716 2192 1259 -91 -110 -569 -2097 -486 -1138 -694 -1188 775 737 92 2180 1512
3462 1512 362 390 168 -425 -1098 -1187 -970 -2467 731 1266 561 976 2167 -122 1365 643 -1892 -1468
3480a468J001j77j483J328M77J161QJ759j786p38J10k57q54l67M31r49J468J688
3498A352q63K97J017p23j568J330p24j640l98J950p51K16R49J61m85Q32J187j332
3516H07O66k669P93j496Q83R43k41rJ012J585k58m98m45o59M88j446q14o0J433
3535A5r70R84J044j024M15Q76q02j404P11J42j614O08R25m77j04R99J946k038
3553B32Q77J160k644j102J145r18j044J94J224j413J233L406k210J96J674p02
3569A308q98n17l54j381L07J199l60L34K130r8o97J126j43j838j851J239k96r31
3587a721K141l45j814K305N78q91J254m63j504M4N9M8j512O91N9Q57Q87L0K349
3606C052k199J073j718j487P98r2j593R11K025r47n43J524p9n07l78J600j853
$$ plain form
3480 -1468 -467 -644 -2127 -799 -322 839 847 2606 820 82 192 -65 -919 -1286 -855 -1804 -336 1352
3498 1352 489 786 1803 1080 -488 842 118 -1522 -1920 30 -721 -505 444 605 120 952 2139 807
3516 807 1473 -1196 -403 -1899 -1016 -73 -314 -323 689 2274 2016 1518 1073 414 902 -544 -1358 -1418 15
3535 15 -955 29 1073 49 464 1340 538 -866 -155 -13 -1627 -1019 -94 -571 -675 324 2270 232
3553 232 1109 2269 -375 -1477 -332 -1250 -2294 -2100 -876 -2289 -1056 2350 140 336 2010 1308
3569 1308 410 -107 -461 -1842 -1535 -336 -696 -362 1768 1670 973 2099 1956 118 -1733 -494 -790 -1721
3587 -1721 420 75 -1739 566 1144 253 1507 1044 -460 -416 -357 -309 -1821 -1130 -1071 -214 673 703 3052
3606 3052 853 1926 208 -1279 -481 -573 -2166 -1255 770 -177 -720 804 725 218 -160 1440 -413
3623d13j149J794k660N99J332k88N96K52J618o46m36M03j342m31K79j364J07J338
3641d11L27n4O84J672m95l07r44J36k044Q21l95j0j19O44M20Q55j1J028j705J555
3661A647k97l57k387M76o6n7M57J401j215J057J302q79l76j43N4k492J030J37
3679g08j195J512J81J93K3M86J839j608L18m23k001M23J52K68k65P49L76o44J654
3698A330m80o19j78J228j333k491K136P72j434R13N00l39O7K135j50j777N11p09
3716H2l58M1j53P48j492K564q48l04P85P47k350Q41r73j53k32J05j84k13J573
3735B26O50j04K05L78j135j077J163j52j884J633L30j459J421K099k716J180K14
3752I72p98M42m81o23n8k36J200k139J022K099p65J73N72N97j663j3L61j915n57
$$ plain form
3623 -413 -1562 232 -2428 -1829 -497 -785 -189 63 1681 1035 599 1002 -340 -771 -492 -1856 -1749 -411
3641 -411 -84 -138 546 2218 1723 1416 472 608 -1436 -615 -1010 -1020 -1139 -495 -75 780 769 1797 92 1647
3661 1647 1350 993 -1394 -918 -984 -1041 -584 817 -398 659 1961 1082 706 563 617 -1875 -845 -708
3679 -708 -1903 -391 -210 -17 6 492 2331 723 1041 618 -1383 -960 -808 -540 -805 -56 320 -324 1330
3698 1330 850 231 53 1281 -52 -2543 -407 365 -1069 -156 344 5 72 2207 2057 280 791 82
3716 82 -276 -235 -388 360 -1132 1432 584 280 1065 1812 -538 303 -670 -823 -1055 -950 -1134 -1347 226
3735 226 876 772 977 1355 220 -857 306 154 -1730 -97 233 -1226 195 2294 -422 758 972
3752 972 174 616 135 -488 -546 -782 418 -1721 -699 1400 635 808 1380 1977 314 301 662 -1253 -1810
3771a810K23R65k37L73R06J000n77J029j150p30m39M53q60l14K77P41j82N72N2
3790B92O41N81j318j362k6J434j727Q03N64M46p97J761p04j121K645p25q96l63
3808A28L46j73p25k64J56j052K631j74n03K02N23l61j692m27J343o65o56J350
3826a3n5L32J75Q02j392J89O01l03n10N79j448j73J071l38M27J888j403j31J231
3845A529j544J89j199l51J540j595J090r1N94l83J570j586M71l94Q62j669QL63
3863e96k46l7J563p84J028k70J87l74l98Q47j451q82P69R7j42r12J744n97R53
3882D99N07r45Q19L80k30k033P3Q41J60M7P70j905J027R72J2j160P18n70j475
3901a493N74N68k371J648Q18o45J620n0j069j92K003p97r91o0K05K40j072J975
$$ plain form
3771 -1810 -1587 -622 -859 -486 420 1420 843 1872 722 -8 -447 6 -854 -1168 -891 -150 -332 240 292
3790 292 933 1514 196 -1166 -1192 242 -1485 -682 -118 328 -469 1292 588 -533 2112 1387 491 128
3808 128 474 301 -424 -688 -532 -1584 1047 873 370 572 1095 734 -958 -1385 -42 -707 -1363 -13
3826 -13 -68 264 439 1241 -151 38 639 336 -174 405 -1043 -1216 -145 -483 -56 1832 429 298 1529
3845 1529 -15 174 -1025 -1376 164 -1431 -341 -432 162 -221 1349 -237 234 -160 702 -967 -959 -596
3863 -596 -842 -879 684 -100 928 658 845 471 73 920 -531 -1413 -644 -547 -689 -1601 143 -454 499
3882 499 1006 61 880 1260 1030 -1003 -930 -89 71 118 888 -1017 10 982 994 -166 552 -18 -1493
3901 -1493 -919 -351 -2722 -1074 -256 -901 719 669 -400 -592 1411 614 -377 -437 -232 8 -1064 911
3919I11Nl93p42R33j20q94K61L02p43j022J680p67J209j414J282l58J250o48j07
3938F25j085M14q09K59l1m90J566o76R2J93K72N77m79j591K130j312p62R92j89
3957c04m67J621m26N61m29M60r89p59J26p75o86K116p81k48j17J203n65J076J85
3976H02J279k115o05M57n69j82P92L3p05Q49M28K35k162L206k347M72R81j404
3994e55o76Q36K88P2N96K98j499J76K119m64n81k07l18q99l06J423n46K25L01
4013B83M13j277M12Q48o33O48K01j162k68J070j704J35Q99N98p75O27J417j280
4031D52j177O08j1O47j154P28j23m88N28J54K85j76L06m92N50j490r6J081r41
4050h09L11k73P48L43r15J377op70r57M85J7N49n32P45o72R63K65M62j322j28
$$ plain form
3919 911 916 523 -219 714 594 -300 -39 263 -480 -1502 178 -589 620 -794 488 130 1380 732 625
3938 625 -460 -46 -855 -596 -627 -1117 449 -227 -135 58 330 907 428 -1163 967 -345 -1107 -115 -304
3957 -304 -771 850 424 985 556 1016 27 -732 -606 -1381 -2067 49 -732 -980 -1097 106 -459 617 802
3976 802 2081 -34 -639 -182 -751 -933 -141 -108 -813 36 464 699 -1463 1743 -604 -132 849 -555
3994 -555 -1231 -395 -107 -35 561 859 -640 -464 1655 1191 610 403 85 -814 -1120 303 -243 -18 283
4013 283 696 -581 -169 679 46 694 895 -267 -535 535 -1169 -1034 -135 463 -312 315 1732 452
4031 452 -725 -117 -128 519 -635 93 -30 -518 10 164 449 273 579 87 637 -853 -949 132 -809
4050 -809 -498 -771 -23 320 -595 782 776 6 -951 -466 -449 100 -432 313 -359 604 869 1331 9 -119
4070a19m17J7K73k83n64K73p29J611M7m01k36K33J218r95j111O21Q87q70j104
4089a649K516j449k47J468O03j466R42p5q45n38Q83q71m31J683K52o94JJ43l63
4108a37J35q4m2m50L70n42M40P7O3M52j613J415Q3l30J584j924Q44r51J65j40
4128e85q95K767j386q34J032j74n53L13L73k1J78r5p89j97J783K38j555N75M80
4147F55j494N77J323j416Q1r08K073j433j101J730p10n50J018P52m55O94M01j303
4165f6n4k11m19j92J003o4o29J012O00K3j518K96k81k9Q32J12m11l8R92p54J091
4186A295j618Q53p64p8P01l70K14J04o5j470J701o19P8K08K36q08N16M79q91J64
4206a34J097j73q78j004K235n13N50j26p99j482P92N73j996J417n2J91Q05p4N67
$$ plain form
4070 -119 -536 -519 -246 -529 -1093 -820 -1549 62 109 -292 -528 -295 923 -72 -1183 -562 325 -545 -1649
4089 -1649 867 -582 -829 639 1242 -224 718 643 -202 -740 143 -728 -1159 524 776 82 83 226 -137
4108 -137 -2 -86 -128 -578 -208 -750 -310 -233 -170 282 -1331 84 167 -163 1421 -503 341 -610 -445 -585
4128 -585 -1480 1287 -99 -933 99 -75 -628 -315 58 37 215 120 -669 -866 917 1155 -400 175 655
4147 655 -839 -262 1061 -355 -274 -1182 891 -542 -1643 87 -623 -1173 -155 597 142 836 1237 -66
4165 -66 -120 -331 -750 -942 61 -3 -632 380 980 1003 -515 -219 -500 -529 303 415 4 -34 958 204 1295
4186 1295 -323 530 -234 -312 389 19 233 337 272 -1198 503 -116 -38 170 406 -402 114 593 -298 -134
4206 -134 963 790 -88 -1092 1143 630 1180 1054 255 -1227 -435 138 -1858 -441 -493 -302 503 429 996
4225I96j106J161j571L76%O57j618R24J155m35j691J297O42p39l03Q06k12j164
4243h25J422p85p24J851p92j00L69j079J61J076P9o74o43J300q94n3m4P73q66
4262d48Q21L83o10K94j33l18r62J832q82k5j075J651j385M87R23k21K89p13K52
4281A60r3j41m00l86M32N20J091r78n36J181p63o42O92N68j093l90J093k09k79
4300a73M70j78J69j67P95k105J464K45l89M50M21r14P05r46j81m03N28M73j410
4319a146J750j60k86q1j87L61O15p86P67j89m92J096p93o07l79M98j539O21L10
4338f27J57n3L00r35J540q4O33l31j101K48p42R04j09O88k97n8M94j147J340n39
4358B81q70r8M93M40j365R82j07k55J416P6o47j73j85n7K68k81q90N27j335J569
$$ plain form
4225 996 -110 1051 -520 -144 -144 513 -1105 -181 974 539 -1152 145 787 48 -255 551 339 -825
4243 -825 597 -188 -912 939 147 47 416 -663 -502 574 653 -21 -664 636 -258 -311 -355 418 -448
4262 -448 373 756 146 440 307 -11 -973 859 -23 -48 -1123 528 -857 -370 553 332 621 -92 160
4281 160 67 -74 -474 -860 -428 92 1183 205 -331 850 87 -555 137 705 -388 -778 315 106 -173
4300 -173 297 119 288 121 916 -1189 275 520 131 581 1002 88 793 -153 -334 -737 -209 264 -1146
4319 -1146 604 444 158 77 -110 251 866 80 847 658 166 1262 469 -138 -517 -19 -1558 -937 -627
4338 -627 -470 -523 -223 -1158 382 298 931 600 -501 -253 -995 -91 -200 488 191 133 627 -520 820 281
4358 281 -589 -687 -194 246 -1119 -137 -244 -499 917 993 346 173 -12 -69 199 -82 -972 -445 -1780 -211
4378b11N83j060J580j509L71J510j187p91Q98J252j445L25n98N76J49q1M86k58
4396E90k65N45m64l96k75O3L86K67n70r77J494R7m44o34J076r86P75J27k1j030
4416f42N34J66m56K35Q93J009k030M34O69o96q5L11l39r65O20Q6k04n22O40o84
4436a026J481p63r40J704l61l45O4L33j82o94J25J497o99l07P43r61j29o5J071
4455E46o92k08N65p46J303j59o87K68K74k05n11l24J014M68j889J740k5l08p34
4474c10l21l20J327m72j00J314j224K75m10K56L61p8k9l87j136J037j90L22J233
4493A148j309q63J262p48J485o53m69R2K68p22Q17K3m01q2k91O27K31j135P28
4512Hm86J144j045J01J11P59n24p59J635j707R87j148J924j09q35j048J459k251
$$ plain form
4378 -211 372 -688 892 -617 -246 1264 77 -714 184 1436 -9 316 -282 294 443 362 848 590
4396 590 325 870 406 10 -265 -202 184 451 -119 -1096 398 495 51 -583 493 -493 282 409 388 -642
4416 -642 -108 58 -398 -163 730 1739 -291 143 812 116 31 342 3 -962 -342 -256 -460 -982 -342 -1026
4436 -1026 455 -308 -1248 456 95 -250 -186 147 -35 -729 -604 893 194 -113 630 -331 -460 -525 546
4455 546 -146 -354 211 -535 768 609 -78 190 464 259 -252 -576 438 906 -983 757 732 424 -310
4474 -310 -631 -951 376 -96 -196 1118 -106 169 -241 15 376 298 269 -118 -1254 -217 -407 -85 1148
4493 1148 -161 -1024 238 -510 975 322 -147 -55 213 -509 308 331 -70 -152 -443 184 415 -720 8
4512 8 -478 666 -379 -278 -167 592 68 -691 944 -763 224 -924 1000 891 56 -992 467 -1784
4530a784J375m84J578n66m86l1jj72J163p73J10k93r1N1L72N75j650J992qp07
4550A70k53K22K53n14P80p37j06O41j269P69M01M62j114J603n83q43J05q63J406
4569E30m26j89N28J36r90R86l07j048O02J554l68n08n4j47n39j27j44m6Q7J133
4589F63o09n78M80r22J817p92m04P9J324r18K8k40O25j05M1n58Q17j797J034R75
4609I60j322L52J78K85m46l14N92J29o58O5m94N40j00j0l14j21J158j438J494
4628E36j0o51M75j36l76M15l45P4J46N1O41j62R9j561j87J602r9l40j331J959
4648H00j031m18N41K43K04o04J58q1j7o34Q1M56J24p7m09J212j81k79q40K92P6
4669c84J422M3j419K00r12K37M75J80K99M62n47o85J217q75K45K5J45j33L05m22
$$ plain form
4530 -1784 -409 -893 685 119 -367 -398 -399 -571 592 -181 -71 -364 -455 -404 -32 543 -1107 885 877 170
4550 170 -83 139 392 -122 658 -79 -185 456 -813 -44 357 819 -295 1308 725 -118 -13 -876 530
4569 530 104 -85 443 579 -411 575 268 -780 -178 1376 1008 500 446 299 -240 -367 -511 -557 -470 663
4589 663 54 -524 -44 -966 851 59 -345 -266 1058 140 168 -72 553 448 489 -69 748 -1049 -15 960
4609 960 -362 -10 168 453 7 -307 285 414 -244 -179 -673 -133 -233 -243 -557 -678 480 -958 536
4628 536 526 -125 350 214 -162 253 -92 -18 128 179 820 658 757 -804 -991 611 512 172 -1159 800
4648 800 -231 -649 -108 135 339 -265 -107 -188 -205 -839 -758 -302 -178 -255 -664 548 367 88 -752 -460 -384
4669 -384 1038 1081 -338 -138 -1050 -813 -338 -158 141 603 56 -629 588 -287 -42 -17 128 -5 300 -122
4689a22k6o22J644L39j865J042j108J480j034R33j242O06O73p24P0J223j276N2
4707D3l07K023j556j900J393J065j319J93P9P63j089L39J154k051N41J316r67
4724b80Q87m72r88J385N63j216M49k20M29p12p59N46O87k89O6j21q9O70l71m85
4744c20O60k44j077Q96K16k45k17q03P85M42q94N74J73j65J162q07q5R56j331
4763c24N07k6J561j600N6k18J19j07k96J223m06K55j224L8j61jQ36k95N09q04
4783c58K12N94J67j19j394J139q16J396j076p0J88l45P62k87Q9r61J063r8Q51
4802I37l81k20N6n71o97J656j268N6J61M37P65n49j131P25n92r4q2r1O52J110
4822H79p09K66k78J34p15P06K78j88k73J20o37N10O32q61O7k96O72k32k73R14
$$ plain form
4689 -122 -148 -770 874 1213 -652 390 -718 762 -272 661 -581 25 698 -26 44 1267 -9 43
4707 43 -264 1759 203 -1697 -304 761 -558 -365 -286 477 -612 -273 881 -1170 -629 687 -280
4724 -280 607 135 -853 532 1095 -121 328 108 537 -175 -934 -388 299 10 76 -45 -134 536 165 -320
4744 -320 340 96 -981 -85 131 -114 -331 -1134 -349 93 -801 -227 -54 -219 943 136 51 1007 -324
4763 -324 183 157 1718 118 174 -44 75 -32 -328 895 489 744 -480 -442 -603 -604 232 -63 446 -358
4783 -358 -146 448 615 496 -898 241 -575 821 -255 -325 -137 -482 280 -7 82 -879 184 86 937
4802 937 556 336 392 -179 -876 780 -488 -432 -271 166 931 382 -749 -24 -616 -710 -792 -883 -231 879
4822 879 170 436 158 292 -423 283 561 373 100 220 -417 93 725 -136 -69 -365 307 75 -198 716
4842G16j34N9j175J12M58j156K55J593m68l57j16n7K04N41j462J140n4j092M07
4861e86P08R41l75p87j61R51L6j026K74m46o92P81N28J90N24R4q01r64L33J220
4881G42n49o74R18j136o30J291M30k14q2p65J190r59J250o86n55J5l2K68j2L98
4901B08j70K50L80j78j0j468M64J77j99N31Jm11M86r86Q35R30J56l74o17m20O11
4922A96r91P79p79J047n83L47n26J432r59J6M98L56j761R78k106J316k11o14J674
4941A09o54J249o35j99k16O12N00m75K14k40k06q74J310q61%P97m53Q1j346Q19
4961d68O87K80n49ML13p64J03Q22J57q07L09L13o15k41P35j074K9J048j553J029
4981b42K47L04q49J292Q58k157J44J58K74k46P73j882N77J441o76q32J83k23P46
$$ plain form
4842 716 582 641 -534 -422 36 -1120 -865 728 260 -97 -213 -270 -66 475 -987 153 99 -993 -586
4861 -586 122 1063 688 -99 -260 691 727 -299 -25 -471 -1163 -382 146 336 860 954 153 -811 -478 742
4881 742 193 -481 437 -699 -1329 -38 392 178 96 -669 521 -438 812 126 -429 -414 -446 -178 -190 208
4901 208 38 288 668 490 480 -988 -524 -347 -546 -15 -14 -425 61 -925 -90 840 996 622 5 -415 196
4922 196 -795 -16 -795 252 -331 16 -510 922 -37 -21 477 833 -928 50 -2056 -740 -951 -1565 109
4941 109 -545 704 69 -130 -346 266 766 291 505 265 59 -815 495 -366 -366 431 -22 59 -1287 -468
4961 -468 219 499 -50 -46 267 -497 -394 428 585 -222 87 400 -215 -456 279 -795 -766 282 -1271 -242
4981 -242 5 309 -540 752 1610 -547 -403 -245 29 -217 556 -1326 -749 692 16 -816 -633 -856 -110
5000a10N51r97O85o56J127j18m7j255J328n24M84K96j085J050R2k062o5K097j242
5019d51Q16M20q36P64q80O96L94j586N78l17L96K90j515Q63J83J023p96J80q02
5038e80J298j317M73J09RR48j253K87J00L38p13N88J34m97M20j97j012L10n33
5057a088J29N69J75M9N51j418M60k98J249j428J433l95J73j303R43O56K15o9j163
5076e60K078j234k23m70N12q19J78N46K0l06N84r62L33N38l91J418k68q58k30
5095a14j16O06m47M90K22j56J17n88L38l44O02j525L56O92n29O44o52J393j405
5114d16Q89o52K02J130q36m57j046N97J624j28j172j01R70n65k18k45J410J1J56
5133A153k145L00L98J135r77N93j452P05Qr29K07P92R9P46j365J970j360K14J001
$$ plain form
5000 -110 441 -556 129 -527 600 482 435 -820 508 -16 468 764 -321 729 821 -1241 -1306 791 -451
5019 -451 365 785 -51 713 -167 529 923 -663 -85 -402 -6 284 -1231 -368 -185 838 42 222 -580
5038 -580 718 -599 -126 -17 -8 940 -313 -26 74 412 -301 287 421 -76 344 147 -865 -555 -1088
5057 -1088 -959 -390 -215 -166 385 -1033 -573 -871 378 -1050 383 -12 161 -1142 -199 457 672 603 -560
5076 -560 1518 284 61 -409 103 -716 -538 8 28 -278 306 -656 -323 215 -176 1242 974 116 -114
5095 -114 -230 376 -71 419 641 485 602 14 352 8 610 -915 -559 133 -396 248 -404 989 -416
5114 -416 473 -179 23 1153 317 -140 -1186 -589 1035 907 -265 -366 604 39 -179 -424 986 997 1153
5133 1153 -992 -692 -294 841 -136 457 -995 -290 -282 -1211 -1004 -212 -113 633 -732 1238 -122 92 1093
5152A093j668J006j372J419M62k82r44j00j30j80M81L48j28R63j614J109p03J38
5170a02j049N23J094j05k03o08J0J442p78n70O50o56L15m5J20L95j08O96j368
5189c47M51N12q23M87pl47o30R93P61k66m49k91o5j50J240o63j366Q64p24K51
5209e69R25L5N09j065N47K97p53M69j269J364j061J324n6j111N92p08Q72o22L69
5228H9O67m65L01p60p29k57J961j264J767j620l3q13Q68R59q30N65l9j422J609
5247E54m17j33k6n20M1l30J022m33j30J56r14P39K34P73p87K36O16j444J276L23
5267H36p56J18j14N0O0l70N66m86K69p2p4o29J243r83J28m27k00N21n1n7L37R40
5289H49o57m50k26N4K82K07K9Q36J53q45p73M12k23j66Q55l90M88j018P79k65
$$ plain form
5152 1093 -575 431 -941 478 940 658 -286 -386 -516 -696 -215 133 5 968 -646 463 -240 -102
5170 -102 -1151 -628 466 361 158 -450 -440 1002 224 -346 304 -352 -37 -82 38 433 325 1021 -347
5189 -347 104 616 -207 280 273 -74 -704 289 1050 784 335 44 -21 -171 1069 406 -960 -96 -820 -569
5209 -569 356 391 900 -165 382 679 -74 395 -874 490 -571 753 697 -414 178 -530 342 -280 89
5228 89 756 291 592 -168 -897 -1154 807 -457 1310 -310 -343 -1156 -288 671 -159 406 367 -1055 554
5247 554 137 4 -22 -542 -501 -831 191 -242 -372 -216 -1130 -391 -157 616 -171 65 681 -763 513 836
5267 836 80 198 84 134 194 -176 390 -96 173 101 27 -602 641 -342 -214 -641 -841 -320 -371 -428 -91 849
5289 849 192 -258 -484 -430 -148 59 88 924 1077 232 -541 -129 -352 -518 337 -53 435 -583 196 -69
5309f9l30R61o75J17k96R08J00l35J224k283J238M35j751N80j7M32K87j86o17
5328b77J50M40J56O5m56k44n41l74N70J00J142j549K050k230O64K08m21J290j001
5347b58O0P16j675K347j597J524k38k73k91Qj29l70l1k3L4O09n35L86j004J241
5367E01q23M20l42K26k56Q12p1p80J004j413J000n10P90j082L16j548K133n65
5385a88M53k76q53J0J659p10K08Q64j125j89J294n92P9j134L57K88l79K33M68
5404D67p04QQ31o41J073m46J85j322J134L12p00L80p0j060M15L44l19P96q26K50
5424A07M89Mr54Q83j584J038N99j013J437r36J76L3o87L04J42j82O70M61l92p74
5444a79R5n39Q2J60O38P10j580J289l82M39j501L95j36k50P83l34K12m99Q90j80
$$ plain form
5309 -69 -399 562 -113 4 -292 616 716 381 1605 -678 560 995 -756 -176 -193 239 526 340 -277
5328 -277 -127 313 469 534 78 -166 -707 -1081 -511 -411 731 -818 1232 -998 -334 -126 -547 743 -258
5347 -258 -198 518 -1157 1190 -407 1117 879 606 315 323 194 -176 -207 -230 -196 413 -122 264 -740 501
5367 501 -322 98 -244 -18 -274 538 467 -313 691 -722 278 -232 558 -524 -208 -1756 377 -188
5385 -188 265 -11 -864 -854 805 95 303 1167 42 -147 1147 555 634 -500 -143 145 -234 -1 467
5404 467 -237 -229 602 -39 1034 588 773 -549 585 897 197 577 507 -553 -138 206 -113 683 -143 107
5424 107 596 600 -354 529 -1055 -17 582 -431 1006 70 246 279 -408 -104 38 -144 526 987 595 -179
5444 -179 -84 -623 -541 -381 257 967 -613 676 294 733 -768 -373 -509 -759 24 -310 -98 -597 293 113
5464A13j60K67o20l02Q34l87L05r3J26m33k01n62O62M61J09L48q9P12j642P90
5484B38O2R9L13p65k93j152J578j07O8N74M24p3o71k43q88P08N64P0k50p28l11
5505g83K58P11j87q0O46j050j56J143n90J349n12n78P78j411n5R90o66J012l81
5524D38m39O70j458J113O67n63n6N01q75J51l21k10N79N26n42O2o69p44J416K64
5544E10N64j116n15j054J864L81j412l8P84m10L12k69J213j275j45R04m5Q67o96
5563D24p07O26O0k06l54K30o34L13n06P37J22L44j286Q01L56k07J61J23o08O63
5583D52m48O16m13n55l22M52J263j176j61r9O66N1P1j32J81j371q1J589j496P47
5603a66K02j25J334j377K52J23l41l12J074q73J57K28N93j339L66l88N00K77j97
$$ plain form
5464 113 -47 220 -400 -702 132 -255 50 -43 83 -350 -551 -1113 -451 10 119 467 378 1090 -552 238
5484 238 300 399 712 -53 -346 -1498 80 -27 41 615 1039 966 295 52 -836 -128 436 506 256 -472 -783
5505 -783 -525 186 -1 -81 565 -485 -641 502 -88 1261 749 171 949 -462 -517 473 -193 819 438
5524 438 -1 669 -789 324 991 428 372 873 -2 149 -172 -382 197 723 181 243 -426 -1170 246 510
5544 510 1074 -42 -557 -1611 253 634 -778 -816 -32 -442 -130 -399 814 -461 -606 298 253 1120 424
5563 424 -283 343 403 197 -157 73 -561 -248 -754 -17 105 449 -837 -36 320 113 274 397 -211 452
5583 452 4 620 207 -348 -670 -218 1045 -131 -292 -391 275 326 397 265 446 -925 -1006 583 -913 -166
5603 -166 36 -89 1245 -132 120 243 -98 -410 664 -209 -52 176 769 -570 -204 -592 -92 185 -12
5622a2L52j320R93l53J126j112N9K97k7m05r8P11K9k04M65p83L82j263o1Q05p66
5643a185J176J162j931J143k31K1K24j3N44j168j99J102k38r22J00R12K41P25
5661A463j936N95J72j488J211o65O30L13n92j68R88j556N53j39J679J65k02n89
5679D34P05p99j044Q07r63P09m36l88J299J63L48j250j60L42J82m0Q78j684k46
5698a143R61J524j419o15O30n24Q8j60J118m15Q30j001L48j129R72m89J370m08
5716E38m25J073k283J407q50k48J199j29p66R30j022M12R54o53p39l2P90L64n33
5735a3J295m48r28J232q78m91M72P57n33j221J102q3r17M51N60k86j69R92k47
5754F47k68j210J209j224J648p72k00R6J8j098K81J496n06j77K76K42J89q62J54
$$ plain form
5622 -12 340 -980 13 -340 786 -326 -267 30 3 -402 -500 211 240 36 501 -282 100 -1163 -1224 -419 -1185
5643 -1185 -9 1153 -778 365 134 155 379 366 910 -258 -457 645 407 -515 -415 497 738 1463
5661 1463 -473 122 294 -1194 17 -648 -18 295 -297 -465 523 -1033 -480 -619 1060 1225 1023 434
5679 434 1139 340 -704 103 -860 -151 -587 -975 324 487 835 -415 -575 -233 -51 -91 787 -897 -1143
5698 -1143 -182 1342 -77 -692 -62 -586 -498 -658 460 45 875 -126 222 -907 65 -424 946 538
5716 538 113 1186 -1097 310 -540 -788 411 282 -484 446 -576 -164 790 137 -602 -634 156 520 -13
5735 -13 1282 834 -94 1138 260 -231 241 998 465 -756 346 263 -654 -203 357 71 -98 894 647
5754 647 379 -831 378 -846 802 30 -170 -74 -56 -1154 -873 623 117 -60 216 458 647 -215 -61
5773f1p36P17r9j42j14O93j254N93N53q04J945q85o7J31r40M59N94OQ00j423K37
5794B03J83m63P86k95j292J166k48K17j241J136m92q0L79j22r59K022q17O7j190
5813a040J185k15k06r2P14j288J225J29k55J19j023q52P58M2J9O63J09j33M21
5832B80K82o18N04k64q71O06n3r94j5J695j118R87q84N25J605p83o66n22J089
5851G85p69m74K06n23m03K107q44K84K85j202J067q47P23%r37o41Q40j72J002
5870D87q73J248o01j147N17p14P70J250j382M34Q33r65J192j481P82q45m97J438
5888D46j319K94J48J250j619l06J081j03K62J15j31p40K81O75p99J08k17l14J388
5907E00j384J050l73L01j713J291m9R51j363O53o64O65q2L41P37j279OK72M49
$$ plain form
5773 -61 -797 -80 -179 -321 -435 258 -996 -403 150 -654 1291 406 339 470 -470 -11 583 589 1389 -34 203
5794 203 386 -77 709 414 -878 288 40 257 -984 152 -340 -420 -41 -163 -1122 900 83 150 -1040
5813 -1040 145 -70 -276 -368 346 -942 283 412 157 276 -747 -1599 -841 -799 -780 -117 -8 -141 280
5832 280 562 -56 448 184 -687 -81 -134 -1128 -1143 552 -566 421 -463 62 1667 884 218 -304 785
5851 785 16 -458 -252 -775 -1178 929 85 369 654 -548 519 -328 395 395 -542 -1183 -343 -515 487
5870 487 -386 862 261 -886 -369 -1083 -313 937 -445 -11 822 -143 1049 -432 350 -495 -992 446
5888 446 -873 -579 -431 819 -800 -1106 -25 -128 134 249 118 -622 -341 334 -465 -357 -574 -888 500
5907 500 -884 166 -207 94 -1619 -328 -377 574 -789 -136 -800 -135 -217 124 861 -418 -412 -140 309
5926C09p58N91K56n39k62l08K94Q85n32l12Q88k44l07Q58o77q51J108j017o6q14
5946a498N39J308l38M05o59Q79k50K52m64m25R14o27K10P56j458n77K45J256K54
5965G22m29R6k3k68L92q61N37k9J026j660J69P17j348R49n67N00m07j40J269o48
5985cM93q45q84J027K1pK68J03j86Q00m61L5j152O86K80M92j407J801r96j02R02
6006H65o66m13k56O36N7n14R31m31M00m52j83J087m25P12j363J12j259R29j98
6025d31O36j017N54N22j0m95M8O01M31l3j891J346k82j54J48k67J375j399J225
6044I07r7p25l47L95m05j076R26K35r14J062p33O53P98l10K56o10K42M9l92Q0
6064fJ24k83j97L29o38N01q0j81M11J089M36k136qK57N59j427J234l69J637p12
$$ plain form
5926 309 -449 142 398 -141 -403 -711 -417 468 -64 -376 512 268 -39 819 142 -709 399 -618 -684 -1498
5946 -1498 -959 349 11 416 -243 636 386 638 174 -251 663 36 246 1002 -456 -1033 -788 468 722
5965 722 293 389 366 98 490 -371 166 137 1163 -497 -328 389 -959 -10 -577 -77 -484 -624 645 -3
5985 -3 490 -355 -1239 -212 -191 -198 70 173 -13 787 326 361 -791 -105 175 667 -740 1061 65 -37 865
6006 865 199 -214 -470 166 223 -291 640 209 609 157 -26 1061 636 1348 -15 97 -1162 -233 -431
6025 -431 205 -812 -258 264 254 -241 -193 408 839 806 -1085 261 -21 -175 -27 -294 1081 -318 907
6044 907 810 85 -262 133 -272 -1348 -422 -187 -1101 -39 -772 -119 679 369 625 15 257 306 -86 -6
6064 -6 118 -165 -362 -33 -671 -170 -250 -431 -20 1069 1505 -631 -639 -382 177 -1250 -16 -385 1252 540
6084E40K96j635Q62lk00N0%L31m03J31Q14j74o15O03L55l77m75Pn00J161j343
6105e75j36Q75n07L75L24L02o21q62Q03R23j721M54M43P19j220O6J583j767R98
6124D56N77J93k481J574p15Q0r02J73L76Q99K58o18J374j145j46j50M49m80n72
6143h00L26K96k4j32n5J017q62L43M69n79M62k51k25lL56n49P32j356J270J018
6163A453j159%n84K91O3k02L30J36l91K42j67l6L28j190J122L48j61p04K16k47
6183c12m87N41j90j57L14J318n73K86j375J95k13J54L55q92J331r68P2O15N35
6202E49m54J4j79l38q95K056j135MM93n96n96R96N19p03J047n35L76j167K13R93
6222F62q10j458J885r25j94J478N54j153Q71L16k107Q19k60P6K20l95M85n75J08
$$ plain form
6084 540 836 -799 63 60 -140 -90 -90 241 -162 -31 783 609 -6 597 952 575 100 107 -393 768 -575
6105 -575 -711 164 -343 32 356 658 37 -825 -22 901 -820 -366 77 796 -424 -358 1225 -542 456
6124 456 1033 1226 -1255 319 -396 -316 -1218 -1045 -669 230 488 -130 1244 99 -47 -197 252 -228 -800
6143 -800 -474 -178 -202 -334 -389 628 -234 109 578 -1 461 210 -15 -18 338 -211 521 -835 435 1453
6163 1453 294 294 -290 1 64 -138 192 328 -63 179 12 -24 304 -886 236 584 423 -281 -65 -312
6183 -312 -799 -258 -448 -605 -291 1027 454 740 -635 -440 -653 -499 -144 -1036 295 -673 -601 14 549
6202 549 95 109 -70 -408 -1303 753 -382 -378 115 -481 -1077 -81 438 -265 782 247 623 -544 -331 662
6222 662 -148 -1606 279 -646 -840 638 1192 39 910 1226 -881 -62 -322 -246 -26 -421 64 -511 -403
6241d03j1J20L13Q46n71j86l18l24j37p28Q03O55J38p14Q40j58j69M63j008%K93
6262b56M72r48J137o10Q39m11M93l88j422J093m27k25l1J626j931J183n68K68
6280a06Q43p82j60m31N02L96j99K53l65n14n51J055m1l80J493L23j422P42P1j843
6300a116M34N53N8n85J145J05J77p80J127j639K62O44J14q8p57K33j538Q44J839
6319A032m65p89J094n81n07M75l64L70j289L89j87P40J44k14m55R14M64p93J8
6338dM85l80q53J317l61L95j694J092j16J47O9Q66n4o46q30M49K81l55m03P11
6358A16R75j091J68J105o28J73l05j110L06o40K61Q12L77o90K3M11Q0q58R47j30
6378C02r6j65q4o06O95k97r78Q17R25J72j58R72j187j081R24m32K57J22j10J31
$$ plain form
6241 -403 -414 -294 19 865 294 108 -210 -534 -671 -1399 -596 59 197 -517 323 165 -4 459 -549 -549 -256
6262 -256 216 -732 405 -205 634 223 716 328 -1094 -1 -428 -653 -684 942 -989 194 -374 -106
6280 -106 737 -45 -205 -636 -134 262 63 316 -49 -563 -1114 -59 -100 -480 1013 1336 -86 656 727 -1116
6300 -1116 -682 -129 -71 -656 489 594 771 -9 1118 -521 -259 385 499 411 -346 -113 -1651 -807 1032
6319 1032 567 -222 872 291 -216 259 -105 265 -1024 -635 -822 -82 62 -152 -607 307 771 -22 -4
6338 -4 481 101 -752 565 204 599 -1095 -3 -119 28 97 963 909 263 -567 -118 163 -192 -595 116
6358 116 1091 0 168 1273 645 818 513 -597 -291 -931 -670 142 519 -171 -148 263 343 -515 432 302
6378 302 206 41 -43 -649 46 -251 -1229 -412 513 685 527 1499 312 -769 155 -277 -20 102 -8 123
6398A23K52R81j295M54l28N07j308O75o77J291l17k70m20M96k5l68L42J56Q90
6417A159j643k47K60J86N14o65M13l87L93j0k21Q16r75Q49r84L59L93P09j192
6436b73K72o81R2o1M84L75O2n34K43J42l48Kp8O11j123O09P09p5j154Q80l5j274
6458a155M99Q68j519L37l88J374j81o95K185p86l64J12k69r5k79j3q11J814j286
6477f52K31R90L76o26j5q13J532p66q66n82J713q09K16m57L86P22Q21j114j181
6496h94N85m49L6N87l71O32K05j636J346K88j27P91j179M65j249N51O64j168Q76
6515d7l32Q18L27l83M78r3p03j26j51j36n8o63J23P62J00n96J456j332J741K95
6535A480j679O4j94P89r17p77J442k70j38J029m15N34l9l10P8j574J560r68P22
$$ plain form
6398 123 375 1356 61 515 187 694 -614 61 -616 675 358 88 -332 164 139 -229 113 269 1159
6417 1159 -484 -731 -471 -285 229 -436 -23 -410 -17 -27 -248 568 -407 442 -542 -183 210 919 -273
6436 -273 -1 -682 -590 -651 -167 208 270 -264 -21 121 -227 -225 -303 308 -815 -206 503 428 -726 154 119 -1155
6458 -1155 -656 212 -1307 -970 -1358 16 -165 -860 1325 539 175 287 18 -77 -356 -369 -1180 634 -652
6477 -652 -421 569 945 319 304 -509 1023 257 -609 -1191 522 -287 -71 -528 -142 580 1401 287 -894
6496 -894 -309 -758 -722 -135 -506 126 331 -1305 41 329 202 993 -186 279 -970 -419 245 -923 -47
6515 -47 -379 439 766 383 861 768 65 -61 -212 -348 -406 -1069 -946 -184 -84 -680 776 -556 1185 1480
6535 1480 -199 -135 -329 460 -457 -1234 208 -62 -200 829 414 948 909 599 677 -897 663 -305 417
6554D17j442N61J087k59J08j634J558j340J045R58J24j484l56R8M94m01O19O6
6572B19m86m8QR59o60J23m48j19p02J512k96M72p50M82K07r04M31j065O96L35
6592c4j344J76J277m16J01k84P17J028j89j526j61l54P93j54k06O48M7O53J08
6611H80k71j310J049Jl45q1m65J076j263J233m12L40Q6n63J479j492N46o81j87
6630c80P70k42MO13J41r38K62q86M46m55J789o98q83J545j549M29M26o44J272
6649A022j13k06p89Q1r42J451k44n94P47j272J526o73j94m84J289j50q6l51k76
6668b58J56Qq68N17K95l3J18j25M94K07n99M4l00N18o11L57j6o80O39L00N83n85
6690A61N22n14N95m89J24p65M0j30l50R71p20k55Q21L98j184J446j230J60L60
$$ plain form
6554 417 -1025 -464 623 364 472 -1162 396 -944 101 1059 1183 -301 -657 -559 -65 -466 153 219
6572 219 -267 -315 -307 652 -8 115 -333 -452 -1154 358 62 534 -216 266 473 -431 0 -1065 -369 -34
6592 -34 -1378 -1202 75 -341 -240 -524 193 1221 1032 -494 -655 -1009 -216 -370 -576 72 119 772 880
6611 880 609 -701 348 349 4 -77 -542 534 -729 504 92 432 518 -45 1434 -58 488 -193 -380
6630 -380 390 148 152 765 906 -32 230 -656 -210 -665 1124 426 -457 1088 -461 -32 394 -250 1022
6649 1022 909 703 -86 -5 -947 504 260 -334 413 -859 667 -6 -200 -684 605 455 369 18 -258
6668 -258 -102 -94 -962 -445 -150 -183 -65 -190 304 511 -88 -44 -344 174 -437 -80 -96 -776 -137 163 746 161
6690 161 683 169 764 275 399 -366 -326 -456 -806 165 -555 -810 11 409 -775 671 -559 -399 -39
6709c9m74k0k17k70K309l66j177Q23l58j084J885j039j46l95r85J909k76K54q06
6728d72L95m16J687p52m17p83J134j20L71j34n11j029J190J084k93m45r85O23
6746A27L10l74k8k27L8L28k51j396J524Q82r42N05J64p66k70J30N83l51L65N46
6766H97o48p31M8O39L85K65j476J37O82q25j33Q57O07r90Q68m52K31O35O0j683
6786f27J026R8m49p74R81m25J23J007r45N16m18j33K1L66n80L34j310J108j830
6805a911K378L43j030K67j09L4r0j48O27o15j67M11j233J794q93M00J142o75p4
6824D51k3K57r88O75p78k65M34K09L81j28J9l9r50J034L70j215Q8P1M86n63l79
6845h53M74J38K97k99L90J49o01J53j73O98m18j007J901j090J8R08l07J26o41
$$ plain form
6709 -39 -513 -533 -750 -1020 1289 923 -254 569 211 -873 1012 -27 -173 -568 -1553 356 80 334 -472
6728 -472 -77 -493 1194 442 25 -758 376 256 627 493 -18 -1047 143 1227 934 489 -496 127
6746 127 437 63 35 -192 -154 174 -77 -1473 51 933 -9 496 660 -106 -376 -246 337 -14 351 897
6766 897 249 -482 -434 205 590 855 -621 -484 198 -627 -760 97 704 -286 582 130 361 996 1056 -627
6786 -627 399 497 48 -726 255 -170 -47 960 15 531 113 -20 1 367 -213 121 -1189 -81 -1911
6805 -1911 467 810 -220 47 -62 -28 -118 -266 361 -254 -421 -10 -1243 551 -342 58 1200 525 451
6824 451 428 685 -303 372 -406 -671 -237 -28 353 225 244 205 -745 289 659 -556 -468 -397 89 -474 -853
6845 -853 -379 -241 56 -243 147 296 -305 -152 -325 373 -45 -1052 849 -241 -223 685 378 504 -137
6864a37J11o10P20p0L12k38Q2n44N72R0n05P10l65R04k50j288L14j370J162M18
6884A8N97j387J220l62j76J277j28q38K67j366O32N37M31r31N03l63P03N47m09
6903G72o98N32k57l85p16M90J512j637j79r12J843q6l66l01J280j286k54j44J334
6922E42n47m94J492p36Q9r9k53R85q4j060j57L7P77p25n80J172J2O1r05Q45J50
6943E22L01j129K59n13r40Q79N91o8J103r56R90R09j229o62Q5J32j160L58K86
6962b42J8R19j495J265q88J134J54j506P20r77O49l04o01K102r47P75L32k32m15
6981D61j38j26k10Q6N53K2j709J101J50j043R59M49j082P44N64J9r37l16M41k58
7001b70o70j07K04J233P31p57o89m66J096n4m01j02r91J823n55l25m21n60J392
$$ plain form
6864 -137 -26 -636 84 14 326 88 170 -374 198 288 -217 493 128 1032 782 -506 -192 -1562 -400 18
6884 18 615 -772 448 86 -90 1187 1059 221 488 -878 -246 291 722 -209 294 -69 634 1181 772
6903 772 74 606 349 -36 -752 -262 1250 -387 -566 -1478 365 279 -87 -388 892 -394 -648 -792 542
6922 542 -5 -499 993 257 346 247 -6 979 895 -165 -322 -285 492 -233 -813 359 371 432 -473 372 522
6943 522 823 -306 -47 -560 -1500 -621 -30 -98 1005 49 1039 1948 719 57 142 274 -886 -528 -242
6962 -242 -224 695 -800 465 -423 711 865 -641 79 -898 -249 -553 -1154 948 1 776 1108 876 461
6981 461 323 197 -13 73 626 648 -1061 40 190 -853 106 555 -527 217 781 800 -137 -453 -12 -270
7001 -270 -940 -1047 -843 390 1121 364 -325 -791 305 251 -150 -252 -1243 580 25 -300 -721 -1281 111
7020A11P8j11K43j168J016j117J298l62k19J59m19Q31M8J044j827L76k24M96q87
7039f34P52q45K37Q03Q3n97K60N70q26O8N21j038N74p81Q18P2j84M65l96Q54j126
7060c50M89m23K35m4p31R69n17K74j69m61Q77k21N50j121J092p36N24j326P86
7079c03j53n88J486p81Q47j00m03K84J34m56l70k21K55K17jJ43K50J18l35p73
7099g50N94J68m12J206p80l02P74JJ25q18P69q83L54J55K54k55P44j087r27J232
7119A62r77k5j20R29J98J12K82j29j040R37M16q60l78Q68k10p55J509j370Q70
7138D19q30K4o3K92j04m21K01P26K32r61N66N36M42j116J393m71j63j685J210
7157B27r57O43L26j524J606L00r42M80q45L69J032q65P91j078J47P7P31m59l64
$$ plain form
7020 111 189 78 321 -847 169 -948 350 -12 -231 -72 -491 340 388 1432 -395 -19 -243 253 -634
7039 -634 118 -727 -490 313 396 -201 59 629 -197 -129 392 -646 -72 -853 -35 37 -147 318 -78 776 -350
7060 -350 139 -284 -49 -93 -824 145 -372 -98 -267 -728 149 -72 478 -643 449 -287 237 -1089 -303
7079 -303 -456 -1044 442 -339 508 408 5 289 423 -33 -403 -624 -369 -152 -153 -10 240 358 23 -750
7099 -750 -156 12 -400 806 26 -276 498 499 624 -194 575 -308 46 201 455 200 944 -143 -1070 162
7119 162 -815 -840 -960 -31 167 279 561 432 -608 329 745 -115 -493 375 165 -590 919 -451 419
7138 419 -411 -387 -450 -158 -262 -683 -482 244 476 -485 81 617 1059 -57 1336 865 702 -983 227
7157 227 -730 -87 239 -1285 321 621 -321 159 -686 -317 715 -150 641 -437 -290 -213 518 59 -305
7176c05j27Q31p47j1J103j160P13j528J414j20J10o25j27n7k47J467k59l97M5
7195b7J053k322J292o83P58r60J056K35o14K71J57k34R3L20j93m72l12J073j078
7214e87J171q77q8R4N80m94N51q08M94j067R91q2R21p17m41J32L10l98J171o00
7234B56o30Q79q65O8R78l43j1k22p17J632m75K2m98n99J078o36r74O56M42k93
7254b52J11M20J91j795J567k1r23J68M6P37n22r4p26R08J03J38L85k44m51K68
7274A4j47J062p30r95L36M62r9k48R15p82J378j099k93J636j192J4m92j66K65
7293a61J486j101L56Nl67K87p26Q55n80M62j210Q59p89O1J341j65j038P55m47
7312a17q98J474j230J865K42j646J70M45L04j147j04Q48k44P5n48K44N96l35j298
$$ plain form
7176 -305 -432 399 -348 -359 744 -416 297 -1231 183 63 173 -452 -579 -636 -883 584 325 -72 -27
7195 -27 1026 -1296 -4 -687 71 -889 167 402 -212 59 216 -18 75 395 202 -270 -582 491 -587
7214 -587 584 -293 -381 -287 293 -201 350 -458 36 -1031 -40 -122 799 82 -359 -227 83 -315 856 256
7234 256 -374 505 -360 -292 686 343 332 110 -607 1025 550 572 74 -525 553 -83 -1057 -401 41 -252
7254 -252 -141 279 470 -1325 242 221 -702 -534 -488 249 -273 -367 -1093 -185 -82 56 441 197 -254 14
7274 14 -133 929 199 -796 -460 2 -97 -345 570 -212 1166 67 -226 1410 218 232 -260 -426 -161
7293 -161 1325 224 580 585 218 505 -221 634 54 516 -694 165 -624 -563 778 613 -425 330 -117
7312 -117 -1015 459 -771 1094 1336 -310 -140 305 609 -538 -642 206 -38 37 -511 -267 329 -6 -1304
7331a304J305o02K31r61J205J50k43K77P4N8j157J457r65p5l39J36M49m87J563
7350G72j078N0J536j484J93l22P2j70k02J06J67P48j22j070J345n88r6k78J151
7369G30r65l33l63J244R5p42M13J097m11n4j240M96j267R09m50O43o48K34J222
7388F10j427J355m3q75O87p67k8L48K39q51K10P85l58O5Q10p89p68Q71p24J305
7408F55P4l72L52j519M64N75l80M83P67n14o94M3m76k7N43l92J97Q96M40j767
7428f52Q70n01K55M80K69O4j64q78L8l02m87J114K92J083k436J62M62m59J59M19
7448b12M30p22K4L19K04k53J05p1N25L36q37O62l5q46K72l78L45L85k91q80J747
7469H29m93Q56r65k84l65M60m63J58J149j094K01k85L94n55J35N00j57q14N46
$$ plain form
7331 -1304 1 -601 -370 -1331 -126 24 -219 58 132 190 -967 490 -475 -550 -889 -753 -304 -791 772
7350 772 -306 -256 1280 -204 -11 -333 -261 -431 -633 -527 -360 388 266 -804 541 -47 -143 -421 730
7369 730 -235 -568 -931 313 408 -334 79 1176 765 711 -529 -33 -1300 -391 -841 -198 -846 -612 610
7388 610 -817 538 495 -380 307 -460 -488 -140 99 -752 -542 243 -115 -50 760 -29 -797 74 -650 655
7408 655 729 357 709 -810 -346 229 -151 332 1099 585 -109 -66 -542 -569 -26 -418 -221 675 1115 -652
7428 -652 218 -283 -28 452 721 785 621 -257 -219 -521 -1008 106 398 1481 -955 -793 -331 -790 -631 -212
7448 -212 218 -504 -480 -161 43 -210 -105 -176 349 685 -152 510 475 -371 -99 -477 -132 253 -38 -918 829
7469 829 336 1192 227 -57 -422 38 -425 -267 882 -212 -11 -296 98 -457 -322 178 21 -793 -247
7488b47L45p75o30J188j034J478n79J20K70J47j187P11J27l8P9j267J660o98K26
7507a04K61M89N58p57m07j18l33P03j006N60n7J360j462k30L07j157J959o2L03
7526H07j040R04j777Q15K65o32K72N70KK74j086Q08o26L12J585k104P06j18P66
7545G03l67J646j545K19l19p47j0l3P01l14j39N45j30N9N7n00l06P94J32o95q94
7566a143J135o83K66Q00q19J76K48Q88j023O70j171J114K29r19L82N76n36o67
7584d77Q84n29R16m45j09kK50j47p10J27n00M26R00j264P06K5P91J99q91m47j8
7605c15K44r89J001j66Q02j234J679j057j443P39Q17k87N65J224k037N58l90n54
7623h43J558J60k33p17J09P85j044R24o95p32J473j460N40l26K6Q33Q72j493L97
$$ plain form
7488 -247 98 -677 -1307 -119 -1153 325 -254 -134 136 283 -904 -193 -66 -104 -25 -1292 368 -330 -104
7507 -104 157 646 1204 447 40 -78 -411 292 -714 -154 -211 1149 -313 -543 -236 -1393 566 504 807
7526 807 -233 671 -1106 -291 -26 -658 -386 184 186 460 -626 182 -444 -132 1453 -651 55 -63 703
7545 703 336 1982 437 656 337 -410 -420 -453 248 -66 -205 340 210 269 326 -174 -480 314 446 -249 -1143
7566 -1143 -8 -691 -425 375 -444 -268 -20 868 -155 515 -656 458 687 -232 150 726 190 -477
7584 -477 407 -122 794 349 240 238 488 341 -369 -242 -742 -316 584 -680 26 51 842 1041 150 -297 -315
7605 -315 -71 -1060 -59 -225 577 -657 1022 -35 -1478 -739 78 -209 356 1580 -457 101 -289 -843
7623 -843 715 875 642 -75 34 819 -225 699 4 -728 745 -715 -175 -501 -475 358 1230 -263 134
7642A34J45J7N82j502Q43N59j191N44m51Q53o69Mj30K20j271J138r1J030J88j647
7662f95j32K178p77Q43j613Q21n66O58J50K22j156k07N1R5J421j408n58P77o08
7681e04O27R12r96o00L61N1M51M6K78K12k47l00K30j088J025j13q7o74M90P57
7701H31j744P13m52P71K04l88k68L93Q47n27L13m01n85O56q33n57J291j4j158
7720i08R50M69k88n8O31r88o69O69N03K36l50o17J25j1j06J054j635J593j292
7739f92Q43p15j56P51j33k62l29n89J819R0r9o74J165n57m23l71l33J961r14J5
7759C97q27P60k21l78J04R1K9qj075J3j56J714j135K73L80q19n88J155j97P17
7779B29J78p57O25k1N51o13j142J918j363m90J506j40m80o00k19J236o88M97p
$$ plain form
7642 134 279 296 878 -624 219 778 -413 131 -320 533 -136 -132 -262 -42 -1313 -175 -266 764 952 -695
7662 -695 -827 1351 574 1417 -196 625 59 717 867 1089 -67 -274 -223 -128 1293 -115 -673 104 -504
7681 -504 123 1035 39 -561 -200 -149 302 348 626 838 591 291 521 -567 458 345 258 -416 74 831
7701 831 -913 -200 -652 119 323 -65 -333 60 907 380 693 292 -293 363 -470 -1027 264 250 -908
7720 -908 42 511 223 165 796 -192 -861 -192 311 547 197 -420 -295 -306 -412 642 -993 600 -692
7739 -692 151 -564 -720 31 -102 -364 -693 -1282 537 627 528 -146 1019 462 39 -332 -665 1296 382 397
7759 397 -430 330 109 -269 -165 -74 -45 -53 -1128 -1115 -1271 443 -692 -419 -39 -858 -1446 -291 -488 229
7779 229 407 -350 275 254 805 192 -950 968 -395 -885 621 481 1 -599 -818 418 -270 227 220
7798B20L17o36K98m9J09Q86j121K64q96J195l33m24J91l33O77k9j028K17J47N4
7818b74L1K11o78j91J748q44j71j74q13R34n19j44J625l36n73j91j63J58K23l50
7838d91N9L05k53J140nm5r17k40L18p49L07J132j043L09K73l47J66L8n94J99Q97
7859D59O30j074o78M31l63Q37j42o28p53J941r73p10J713m56O25o82k56P31l98
7878B54n31J439j744K11O98J51n86R2M96r98O30M9L30k3j238J871j527N01J45
7897B20L5J96j230Q40J164j090N8J4q05P73q32J677k26j526J23Q77M81j208N93
7916A34l27l8n71J330O19j567N1J109l04Q0j12J87j247M66L84L26o95J055j674
7935g94R46K9M43l08p32Q21L73q39k96Q42l08r06P69K14K76p15Q96k39j094K081
$$ plain form
7798 220 537 -99 199 150 259 1145 24 288 -608 587 254 -170 21 -312 365 336 -692 -475 -328 -274
7818 -274 -243 -32 -710 -901 847 3 -168 -342 -1155 -221 -740 -884 741 405 -168 -359 -522 -364 -141 -491
7838 -491 -432 -127 -380 760 755 710 -207 -447 -129 -878 -571 561 -482 -173 100 -247 -81 -43 -637 -438 459
7859 459 1089 15 -663 -232 -595 242 100 -528 -1281 660 -313 -1023 690 234 859 177 -79 652 254
7878 254 -277 1162 -582 -371 327 478 -108 -16 480 -518 112 161 491 468 -770 1101 -426 75 220
7897 220 255 451 -779 61 1225 135 193 207 -598 175 -657 1020 794 -732 -609 268 749 -459 134
7916 134 -193 -231 -802 528 1147 -420 -369 740 436 516 404 591 -656 -190 194 520 -175 880 -794
7935 -794 152 181 624 316 -416 405 778 -61 -357 485 177 -729 40 254 530 -185 711 472 -622 1459
7955A459j846K66J87P38m69p94P70K4o08K32N98m15l90K62M94n22J091l85k37
7974D55j058R03L28j01K59l09n34j30M20q81O22P34j048M83l96l2K32j74N96P05
7994A074j123l57j8N53L12j82N92j117P44J87k124K500j310k5O50n90R7M39O11
8013I13n52o73J42N54j156R05L60n23O88o01J48l12K6J200p92R8k172J681m73
8032e39J189n40M57k00l66q32p9J450j373j50L30J256j408L13N8J36J088p28j51
8051h9J91O48N15m36p04R7j55P28k068R37J09M08j250J045N66m47j9K27m64k97
8071d58J03j34m2R99j062m22J171j5P4m54M9k52L7j52N40N81k34q86R64k6q06
8092d25o10J122N15n91l58J548j164N05M12k88q89m06P03K27J474k625P25O78
$$ plain form
7955 1459 -387 -121 66 804 335 -459 311 335 -273 -41 557 142 -248 14 508 -14 1077 692 455
7974 455 -603 300 628 527 786 477 -57 -187 233 -648 -26 708 -340 143 -253 -285 -53 -227 369 1074
7994 1074 -49 -406 -424 129 441 259 851 -266 478 665 -1459 1041 -269 -294 356 -234 -137 302 913
8013 913 361 -312 -170 384 -772 133 493 -30 658 57 205 -107 -81 1119 327 425 -1747 -66 -539
8032 -539 650 110 567 367 1 -831 -910 540 -833 -983 -653 603 -805 -492 -434 -298 790 62 -89
8051 -89 102 750 1265 829 125 222 67 795 -1273 -336 -227 181 -1069 -24 542 95 76 303 -161 -458
8071 -458 -355 -489 -531 468 -594 -1016 155 140 214 -240 -191 -443 -406 -558 -18 563 329 -557 407 381 -425
8092 -425 -1035 87 602 11 -347 1201 37 542 954 666 -223 -629 74 301 1775 -850 -125 553
8110E53p54Rk27K81n32kO87p47N43nP8P3M2K66k76P65j061L75n74M68M80q24M79
8133I7j179J023m82r4O23M7K73k64p48P07n35R14r76N44J75N7j68P48j709Q78
8153f9j2j275J123j159J733L20r51R41r21j61J142j517R54p9o94P8J197o82j239
8172a271O24M0L12J314q29L62M8m61R2K92j836Q55J037p79J412o86q17M93l91
$$ plain form
8110 553 -201 -192 -419 -138 -670 -672 15 -732 -189 -194 -116 -43 -1 265 -11 754 -307 68 -506 -38 442 -382 97
8133 97 -1082 -59 -541 -635 -12 35 308 44 -704 3 -532 382 -594 -50 125 182 14 762 -947 -69
8153 -69 -81 -1356 -233 -1392 341 661 -290 651 -270 -431 711 -806 148 69 -625 -547 650 -32 -1271
8172 -1271 -647 -607 -295 1019 190 552 600 139 231 523 -1313 -458 579 -200 1212 526 -291 202 -189
8191a89
$$ Imaginary data points
##PAGE= N=2
##DATA TABLE= (X++(I..I)), XYDATA
0@%%%%%%%%%%%%%%%%J47k95K96k96K96k96L93n41N92o33P81q88J035j188J337
31G40j574J740j946K226k522K830l169L539l947M395m881N416n995O628p325Q076
47D231q900R813j0814J1905j3114J4468j5970J7649j9551K1717k4200K7100l0525
60a6191L4653l9733M6159n4595O6164q3033J10070j59929K80314j058425r39055
71a813601L135992n97026k222368J908101J456325k454955R0767K330387j234014
80E99608j753003J884911M66587k216509M23972J805808j359672j064944J840909
89F27667K44491j816942P24353J434883j389416p73785J648024j59885j582997
98a043607Q68170J081750j328524l03820J487827l34339j171117Q96606O68224
$$ plain form
0 0 0 0 0 0 0 0 0 0 0 0 0 0 0 0 0 0 147 -148 148 -148 148 -148 245 -296 296 -337 444 -444 591 -597 740
31 740 -834 906 -1040 1186 -1336 1494 -1675 1864 -2083 2312 -2569 2847 -3148 3480 -3845 4231
47 4231 -4669 5144 -5670 6235 -6879 7589 -8381 9268 -10283 11434 -12766 14334 -16191
60 -16191 18462 -21271 24888 -29707 36457 -46576 63494 -96435 183879 -874546 -1813601
71 -1813601 1322391 725365 -1497003 411098 1867423 -587532 -496765 1833622 599608
80 599608 -1153395 731516 1198103 -1018406 -594434 1211374 -148298 -1213242 627667
89 627667 872158 -944784 -220431 1214452 -174964 -948749 699275 539390 -1043607
98 -1043607 -175437 906313 -422211 -726031 761796 427457 -743660 152946 821170
107H21170j185030j79806J080593l88363r14646P18146O04342q71285j48848J014778
117E51051j91283q94781N87235O25797r60440l04011J039804k50390r92258P50434
127c8842P17880j024196j25938J201214l88499r95467Q62146N30419j206449m0505
137e08237J156905n65864r04124J038412M69023j210146J83864J189128p68872
146H0089q61582J149949K00758j376826M09374J138312j012856n87384J404453
155E44287m0856j289299P95483R20507j262770k86294J339066m81627j137271
164h98774J016662N91584j265989J27982J257151o75603q26134J100951K48235
173F76065j249598K94374R77585q64449n97691J108797M1637j055559N55187Q32996
$$ plain form
107 821170 -363860 -543666 536927 148564 -766082 -47936 556406 -314879 -463727 551051
117 551051 359768 -535013 52222 678019 -282421 -586432 453372 202982 -789276 -38842
127 -38842 679038 -345158 -471096 730118 341619 -653848 208298 738717 -467732 -508237
137 -508237 648668 82804 -821320 217092 686115 -524031 -340167 848961 80089
146 80089 -781493 368456 569214 -807612 -398238 740074 -272782 -860166 544287
155 544287 503431 -785868 9615 930122 -332648 -618942 720124 238497 -898774
164 -898774 117888 709472 -556517 -428535 828616 153013 -673121 427830 676065
173 676065 -573533 -279159 698426 -166023 -763714 345083 386720 -668839 -113652 719344
183G19344q84117l26366J031721k23700r44327O04726N33559r02008r6427R24536
193D36941k99224o61221O84033L82550p75915J0046P11220l90309n83284N52955
203F7792K42154o84802O9361O66881l03232m42215N70583K33295o46988N7336
213a69835N74924l86320m67819N40321J77113o29186J49487O18512l65765l76537
223c35105O00885J22681o70391J54142N37290m91421l84419O31127O5463o54836
233d24584K97300N86328n21538k84616O98775n8596p07375L56823M70928o59300
243b45855j89469P43780j62637o13034N38527M17493o86971l6908P09459l43738
253A30647n84830N70054K31978p33213J07774O77769m08974m12300O72037J28264
$$ plain form
183 719344 -164773 -491139 540582 316882 -627445 -22719 510840 -391168 -487595 436941
193 436941 137717 -523504 160529 543079 -232836 -222790 488430 98121 -485163 67792
203 67792 309946 -374856 -305495 361386 58154 -384061 186522 419817 -227171 -169835
213 -169835 405089 18769 -449050 91271 268384 -360802 -211315 407197 41432 -335105
223 -335105 265780 388461 -281930 -127788 409502 -81919 -466338 164789 230252 -424584
233 -424584 -127284 459044 -62494 -347110 351665 293069 -414306 -57483 413445 -245855
243 -245855 -435324 308456 145819 -467215 71312 488805 -198166 -235074 474385 130647
253 130647 -454183 115871 347849 -385364 -277590 400179 -8795 -421095 250942 379206
263C79206o94201K24863N52229n46020l34301O39972l9379o39488L59530M85364
273C87775n36348j47938O64288j37495n67551M02055L24576o09762q1719N86266
283B84147k40749m66714M82753K69489n50506N9891N55091l07846m00364M68239
293A53431J18225n75278J10050M74222l50882k83906N20032Q1157m93669K04187
303d2431M16058l94654k39351M62749l7842m90989K30820L50626l88665j29391
313b63070M89754n4016m11622K81323K79266m26904j05279M24692j51811l86616
323c24283L12362K33010l96026K849M40513j67099l21301L32193J49786m29739
333a67735J6116L66668k32202k80252L57064J24382l77004J01960L69877k42210
$$ plain form
263 379206 -314995 -90132 462097 -83923 -418224 221748 182369 -457119 -97589 387775
273 387775 -148573 -296511 367777 230282 -337269 64786 389362 -220400 -302119 284147
283 284147 43398 -423316 59437 328926 -221580 -161689 393402 85556 -314808 153431
293 153431 271656 -303622 -193572 280650 -70232 -354138 165894 247051 -246618 -42431
303 -42431 373627 -21027 -260378 202371 164529 -326460 -95640 254986 -133679 -263070
313 -263070 226684 172668 -238954 42369 321635 -105269 -210548 214144 62333 -324283
323 -324283 -11921 221089 -174937 -172088 268425 101326 -219975 112218 262004 -167735
333 -167735 -151619 215049 -17153 -297405 59659 184041 -192963 -91003 278874 36664
343C6664k36378L47536M2595m09320J05671L12840k85761j83907L90446L1853
353A52239l56286J88031L08874l12781j58233L66718n6533l86787J96457K59028
363B00727l36443q8135M09522o6234l30072K68073K24795l76085n8982L69841
373B17007j68482l36532K98524J70734l83067M3460M03879j96580k66168L60276
383A43051R6130m18982Q4448L33619k98926k22491L86018K5045l77095K02065
393d7118L19370l16883j26347L94817q1610l75640K31239K12228l74417m4025
403b08386L89435j38512k78726L19733J57718l61249M3218L26428k27674k40819
413b18834L00696M5060l40204J15519K82207k23504j25395L12561l395k85874
$$ plain form
343 36664 -199714 147822 190417 -218903 -113232 199608 -86153 -270060 120386 152239
353 152239 -204047 -16016 292858 -19923 -178156 188562 132029 -254758 -58301 200727
363 200727 -135716 -223851 185671 119437 -210635 57438 282233 -93852 -152834 217007
373 217007 48525 -288007 10517 181251 -201816 -158356 245523 48943 -217225 143051
383 143051 239181 -179801 -95353 238266 -60660 -283151 102867 127912 -249183 -47118
393 -47118 272252 -44631 -170978 223839 142229 -233411 -2172 210056 -164361 -208386
403 -208386 181049 42537 -236189 83544 241262 -119987 -76769 249659 21985 -218834
413 -218834 81862 126922 -213282 -97763 184444 -39060 -164455 148106 144711 -141163
423a41163J36342J85993k53381r6337K51691n3287k21859J64729J64740j92643
433e5175k7365K31837n9994j92114J26873J00878k03724m1048J89343n0736j54638
444a35863J41805J24850j56197k5113J85344n4171j80589J02781R9761j88977
454h6369m7449K00188m1152j68374J55967J42571j96502k8972K26525r2024k18561
465a54152J69989J05236k59790M206K65932j23177j79970K56943Q6507k82543
475a10819O7039K44479k18872j70411K73116j54k96366J50061K36563k46567p4165
486a46096L23133o4468k75606K06497J53947l13323j9953K94851j51480k17283
496b09781K73564R6183k90111Q9821K62812k17269j48904K69470k4888k83796
$$ plain form
423 -141163 -4821 181172 -72209 -168546 83145 29858 -192001 -27272 137468 -55175
433 -55175 -82540 149297 89303 -102811 24062 124940 -78784 -119832 69511 18775 -135863
444 -135863 5942 130792 -25405 -50518 134826 80655 -99934 2847 102608 -86369
454 -86369 -133818 66370 25218 -143156 12811 155382 -41120 -70092 156433 64409 -154152
465 -154152 15837 121073 -138717 -134511 131421 8244 -171726 85217 171724 -110819
475 -110819 -43780 200699 -18173 -188584 84532 84378 -211988 -61927 174636 -71931 -146096
486 -146096 177037 112569 -163037 43460 197407 -115916 -135869 158982 7502 -209781
496 -209781 63783 159966 -130145 -40324 222488 5219 -143685 125785 100897 -182899
506a82899J38472J79239k38671m6840K69786o4538j96764J85729J08908k30613
516g8191l009J98036j21849j52211J73505N3429j79007N7885J71369j01440q3922
527f5405J51799J3046j57302M0270R8832j08731o6683J13705J2198r8121M8510
538a7882R9142n9726n4817Q2022J4066j06714l181Q1074n2243p8714Q4197O2803
550E0027r4273O980J29935m1810j05619R4544N0856j52347p353J38657q6073j12747
562a29223J55634N6583j66364N6290J67775j33382j07030J81238r129k09959R2856
573d4711J45774j80527m8111K27385m2275j76236J67711J09350k18585m544K06644
584A41875j31084j64026J98412M7857k24648Q2003K00086j62599q8387K23417
$$ plain form
506 -182899 -44427 134812 -103859 -150699 119087 54549 -142215 43514 152422 -78191
516 -78191 -81200 116836 -5013 -157224 16281 69710 -109297 -51412 119957 18517 -65405
527 -65405 86394 99440 -57862 -17592 81240 -27491 -94174 19531 31729 -66392 -17882
538 -17882 81260 21534 -33283 48739 62805 -43909 -47090 33984 -18259 -96973 -12776 50027
550 50027 -44246 -37266 92669 50859 -54760 39784 90640 -61707 -69060 69597 -16476 -129223
562 -129223 26411 82994 -83370 -27080 140695 7313 -99717 81521 72392 -137567 -44711
573 -44711 101063 -79464 -127575 99810 57535 -118701 49010 158360 -60225 -64769 141875
584 141875 10791 -153235 45177 93034 -131614 -49611 150475 -12124 -100511 122906
594A22906k7843k15910J18984J18516k08194l1782K04829q0252j43026J72596
604C0824P5302j76509L9373J57819j19862j02620J45146K333j56726O2172J16760
615G4012j05579l7255J44121o914j11874P0115O6182j12610l5137R3593l7279
626A375q7397O5839N5763o9908K813Q6680j6075o0145L9194K9503o7123k7897
638d7378N0818o031n5413L2076O4081l4619k8045P5663J4941q4524J4966O4013
650F0548p5441n9422Q6093N859r5911N2033R3520p7576l3297J15669j8498j15709
662f2132O2178O2831j18901k2349J24567m1798r5229J10397O8261j24508J4658
673b2025J31193q6470j00259J19235J5971j51746M9029J21716j07777n0337J53343
$$ plain form
594 122906 95063 -120847 -1863 116653 -91541 -123323 81506 1254 -141772 30824
604 30824 106126 -70383 -31010 126809 6947 -95673 49473 51806 -104920 -42748 74012
615 74012 -31567 -68822 75299 68385 -43489 26626 92808 -19802 -54939 38654 1375
626 1375 -86022 -20183 35580 -34328 -31515 55165 39090 -21055 18139 47642 -19481 -47378
638 -47378 3440 -2591 -58004 -25928 38153 3534 -24511 51152 66093 -18431 -3465 60548
650 60548 -14893 -74315 11778 17637 -78274 -26241 67279 -10297 -43594 72075 53577 -62132
662 -62132 46 62877 -56024 -78373 46194 4396 -90833 19564 87825 -36683 -22025
673 -22025 109168 22698 -77561 41674 57645 -94101 -45072 76644 -31133 -81470 71873
684G1873j0753j31879Q8730P9761j43713k1790J30938o5640j05930J14566N0697
695E6860j22026L3279J24026p5602p0356J09833N536j25408L6703Q5181r0789
706c2763m1236J11732l724r0707O6288P1180r0287k2144Q8979l8331q7123O1114
718g022L6324q0244J809Q6633k8686m7355O6441K6832o7885p95N5191l8368n2984
731e0109M5357K4449n5567P375O4292j8728l9473M9731K4946o5135n933N3361
743C4566l8981n0894N3170K0532o0976J6801O8626l3407l8195N9882J1833p1224
755b8267J0057N2968m6822m1597O3128J5299o2795K9237O4364m8313l3807O9732
767D3184o164p9164L1013M9206o8002k2921P9906j2355o4145N7271M7318p1948
$$ plain form
684 71873 61120 -70759 17971 97732 -45981 -67771 63167 -2473 -108403 6163 56860
695 56860 -65166 -31887 92139 16537 -53819 56014 61550 -63858 -27155 58026 -32763
706 -32763 -73999 37733 34009 -56698 9590 80770 -9517 -31661 57318 18987 -68136 -7022
718 -7022 29302 -50942 -49133 37500 8814 -38541 27900 54732 -13153 -13948 41243 2875 -50109
731 -50109 -4752 19697 -35870 -28495 35797 17069 -22404 27327 52273 -12862 -18795 34566
743 34566 -4415 -55309 -2139 18393 -42583 -25782 42844 9437 -28758 31124 42957 -28267
755 -28267 -18210 34758 -12064 -53661 9467 24766 -38029 -8792 55572 7259 -26548 43184
767 43184 37020 -42144 -11131 38075 -29927 -52848 27058 14703 -49442 7829 55147 -16801
779a6801p210P2343l6485o5162N5921K6969p4631J1168P4657l5968m3054O9743
791C1490J9191p5702J6583N9382n8538m4241O9705K082p2893L6871O3345n7783
803a0508k1351P9425j4971p2296M2190M0770p6050j2423P2363k5617n6227O2815
815H120L5971o4593Q974O6491m1036n0677N6196R260p1512J6949N9388m8041k8382
828d2892P0496M928o0569L1822M5937n9355k3202N7567j7654n5282L8182L4436
840B4414m8333J561N8113j7109l8793L9373J5451n1550J839L7717k7445k9417
852c4179L9749J2555l6507J2641L8244k2622k2558K7755L250l8697J996K6293
864G920j8950j7189K9248J3177k5880P188L0372j6070k5141K2597P387l5400J331
$$ plain form
779 -16801 -24011 48332 11847 -53315 2606 29575 -45056 -33888 40769 4801 -38253 31490
791 31490 50681 -25021 -8438 50944 -7594 -51835 17870 19952 -52941 -16070 47275 -10508
803 -10508 -31859 47566 32595 -39701 2489 43259 -32791 -45214 27149 1532 -54695 8120
815 8120 44091 -20502 -11528 54963 13927 -36750 19446 28706 -42806 -25857 33531 -14510 -42892
828 -42892 27604 32532 -28037 3785 49722 -9633 -32835 24732 7078 -48204 -10022 24414
840 24414 -23919 -22358 35755 18646 -20147 19226 34677 -16873 -15034 22683 -4762 -34179
852 -34179 5570 18125 -18382 -5741 32503 9881 -12677 15078 18328 -20369 -18373 7920
864 7920 -11030 -28219 1029 14206 -11674 -4486 25886 9816 -15325 7272 14659 -20741 -19410
877a9410L1939j3470k2121L2433J6957l4196M307L8081k5386l3790L4171Q017
889A7532m9011J1175M3275l0094k5138N3626O714n0540K4191L9212n1134k1634
901c1826N4039j3966n4295M3659L5068n6060K641O4451k8929m4272N3052J1997
913C5559o7831J3766N0009m7179k8654O4079l11n6745L8065M2667n4939j2093
925b3607N8711k5370n2352M7699J9716n8404J3237N4875l4268k7790N5096J828
937B9371n1404K2154L2577m3578j4198M2829j1407l5117L0050K1148l4031K633
949h973L2484j8035k1855K2386K742k6574M568J9675j2415q476J9169N875j4287
962c716N622J1270p051j0801M679L612q757n094J0700M474q298J233J4978m420
$$ plain form
877 -19410 12529 -941 -23062 9371 26328 -7868 -3561 34520 9134 -24656 9515 17532
889 17532 -31479 -20304 22971 -7123 -32261 21365 28079 -22461 1730 40942 -10192 -31826
901 -31826 22213 8247 -46048 -2389 32679 -23381 -20740 43711 14782 -29490 23562 35559
913 35559 -32272 -18506 31503 -15676 -44330 19749 19438 -37307 758 43425 -11514 -23607
925 -23607 35104 9734 -42618 5081 24797 -33607 -20370 34505 237 -27553 27543 29371
937 29371 -22033 121 32698 -10880 -25078 17751 6344 -28773 1277 22425 -11606 -8973
949 -8973 23511 5476 -16379 6007 8749 -17825 -13257 6418 -5997 -14473 4696 10571 -3716
962 -3716 1906 13176 6125 -4676 3 3615 -5142 -10236 464 4938 -3360 -2127 12851 8431
976H431j3235J1243P957k4530j778K1112j3962j8357K8653P979k9963J3778L0153
989B7481k8385j5650L6698o343m1295K3586K5804m0890j893M3877j5090l3080
1001b5180L9256J4782m7066R434M0430l6731k8213M6114o28m6151K6974L6420
1013B9441m2087p761M9588j5970l9382L5544J6036m9105M801M4691l0255k6146
1025c0605M6584L499m2036K2984L2349m0416r083L8999j6931l2707K8402J5785
1037A6824l6086O205L3333j8346j8341K9419L106k8323Q757J7477j9607j0017
1049a5599K1109m61j7652J2892J1949j4670J60J4270o481j3062P600J694r432
1062g683M15Q071p5m094L070N721M77n866J423N280q173q009R554K537j2673N819
$$ plain form
976 8431 -4804 6439 14396 -10134 -11912 9200 -4762 -23119 5534 13513 -16450 -2672 27481
989 27481 -904 -16554 20144 13801 -27494 -3908 21896 -18994 -20887 22990 7900 -25180
1001 -25180 14076 28858 -18208 -8774 31656 -5075 -33288 12826 12198 -33953 -6979 29441
1013 29441 -12646 -20407 29181 13211 -26171 9373 25409 -23696 -18895 25796 -4459 -30605
1025 -30605 15979 19478 -22558 426 32775 -7641 -16724 22275 5344 -27363 1039 16824
1037 16824 -19262 -13057 20276 1930 -16411 13008 16114 -12209 -3452 14025 -5582 -15599
1049 -15599 5510 5049 -12603 289 12238 -2432 -2272 11998 5517 -7545 55 1749 -7683
1062 -7683 -7268 803 728 -3366 -296 5425 5902 36 1459 6739 -1434 -9443 111 2648 -10025 -4206
1078d206J3000r373n360J6452j901j7012J1264Q643k1201m006K1597q648j7183
1091a7934K2310J0186k3879N320K5775j9831j7049K5626M01k9442J2754K1653
1103A5890k4443p580L2672p293k6178K3456J3660l0357j288K9197j8799k1784
1115b2847K7738O684l0424J1416K6601k3496j1668L1633m615k7464J6601J5812
1127A5971k5230l314K8097j0451j9315K1013Q627k4296M129K1603j5539j5615
1139a4320K1308R08k1427Q185J8404j7826q030K1607l250j8624J2660J0301j7188
1152g292r54J6424o291j1413J2091O892j3450K057J0914n377q445P865M711j0464
1166b732j521J1098o169p439Q466M018j0895J69R519n280n365O327L458q834J761
$$ plain form
1078 -4206 8794 -579 -5939 10513 8612 -8400 2864 11507 -9694 -13700 7897 -751 -17934
1091 -17934 4376 14562 -9317 -3997 21778 1947 -15102 10524 10925 -18517 -5763 15890
1103 15890 -8553 -16133 16539 9246 -16932 6524 20184 -10173 -11461 17736 -1063 -22847
1115 -22847 4891 11575 -18849 -7433 19168 -4328 -15996 15637 11022 -16442 159 15971
1127 15971 -9259 -12573 15524 5073 -14242 6771 15398 -8898 -4769 16834 1295 -14320
1139 -14320 6988 7896 -13531 -5346 13058 -4768 -12798 8809 5559 -13065 -405 9896 -7292
1152 -7292 -8246 8178 1887 -9526 2565 9457 -3993 -1936 8978 3601 -4844 3021 7732 -2732
1166 -2732 -4253 6845 676 -6763 1703 5721 -5174 -5005 4514 -766 -6131 196 3654 -5180 -3419
1181c419N967k457n189N019L564o205J324O505q31o991N383M746q208k290R644
1196F562l719j0948O952O189j1730j621J4558l392j0917R383O363j3149R30J3643
1210I104r135r671J2834M342j6133O029J5175j0989p968J6070M47j7899P537J2949
1224A2692j7611o606J8286l910j7912J4297J0681j9517N66K0528j0997j5380J9022
1237D139N349k2886O780J8022j5629p452K3341j555k0535J4894J1852j9837k448
1250e965J9122r388j6445J6345N271j8150M883J6867j3341r746J8087j868j8357
1263a2685J0387J0572j7160r54J6739o892j0282J3737N214j3900M495J0505j0610
1276h34m739J0975l276r096O992L341o689K202N630m055l609N695k937k223J688
$$ plain form
1181 -3419 2548 91 -5098 -79 3485 -2720 -1396 5109 4278 -2713 2670 7416 -792 -3082 6562
1196 6562 2843 -8105 -1153 5036 -6694 -8315 6243 2851 -8066 1317 7680 -5469 -4539 9104
1210 9104 -31 -9702 3132 7474 -8659 -2630 12545 1556 -6412 9658 10105 -7794 -257 12692
1224 12692 -4919 -11525 6761 2851 -15061 -764 9917 -9600 -9034 11494 497 -14883 4139
1237 4139 9488 -13398 -6618 11404 -4225 -11677 11664 10109 -10426 4468 16320 -3517 -5965
1250 -5965 13157 3769 -12676 3669 8940 -9210 -4327 12540 -801 -10547 7540 5672 -12685
1263 -12685 -2298 8274 -8886 -9840 6899 7 -10275 3462 8676 -5224 -729 9776 -834
1276 -834 -5573 5402 2126 -6970 22 3363 -3326 -1124 4506 451 -3158 2537 -400 -2623 -935
1291i35r93k269K457K019j444K534L180m244K568M012n830j89M182m933m592O400
1307A923J394q896M478R422j0430k971J2087l244j3623J0154L893j6026K720J5052
1321E933j3142n572J9688j275j5872J1959J1550j8151j148J9743j2683j4151J9977
1334F856L536k1546J0991J7295j9089n069J9859m538k1031J5704P684k2038R02
1347a0484K0715j3363j1610K2204J809k2322J2507J5746k0744m927K1372q005
1359B898j7604J7254P769j8870O491J4921j2722p070J6153m327j6852J1860N095
1372D996j6570L168J4581p788p368J4617Q71j2544Q026O228j1601k04Q712p548
1386b424l762J0356q02n693P325M812p938j35N724q534l929O776n026n782Q242
$$ plain form
1291 -935 -1928 -4197 -1740 279 -1165 1369 4549 305 2873 6885 1055 866 5048 115 -4477 1923
1307 1923 3317 -5579 -1101 8321 -2109 -5080 7007 3763 -9860 294 4187 -11839 -9119 5933
1321 5933 -7209 -12781 6907 5632 -10240 1719 13269 -4882 -6030 13713 1030 -13121 6856
1334 6856 10392 -11154 -163 17132 -1957 -7026 12833 8295 -12736 2968 10652 -11386 -10484
1347 -10484 10231 -3132 -14742 7462 9271 -13051 -544 15202 -5542 -10469 10903 2898
1359 2898 -14706 2548 10317 -8553 -2062 12859 137 -6933 9220 4893 -11959 -99 4996
1372 4996 -11574 -8406 6175 -1613 -8981 5636 6507 -6037 1989 8217 -3384 -3588 5124 -2424
1386 -2424 -6186 4170 3368 -2325 5000 9812 1874 1739 7463 -1071 -5000 1776 -3250 -9032 -790
1401g90Q89o978O953N091q322J569P546q667n322J0809k644j0917R470Q098j1197
1416d412K916J4331r380p171J4296l263j4838Q582O876j6206R85J5708r138r253
1430i967J8057J214j7608O920J2198j7072m904J7929o933j4493J5637Q853j7810
1443g979N329J7691j3975r504J7855k248j8806J1274R420j8149K692J7356q893
1456B063j1478J7419J161j9384P995J0790j6390k990J5983n230j1312J2846P520
1469H993j3771N489J1883j1159p027J2683l647j2364P868N963j1266L015J2214
1482H874q508l051R296j663j1243N766K666q972j35O934m454k275J0126j368n508
1497c515P841K228r132K617N374p905k018P903l777l223Q630L26o579N178M062
$$ plain form
1401 -790 99 -6879 74 5165 -3157 -1588 5958 -2709 -8031 2778 134 -10783 -1313 6785 -4412
1416 -4412 -1496 12835 3455 -3716 10580 7317 -7521 1061 7937 -8269 -7284 8424 -714 -9967
1430 -9967 8090 9304 -8304 -1384 10814 -6258 -11162 6767 -166 -14659 978 9831 -7979
1443 -7979 -2650 15041 1066 -8438 9417 7169 -11637 -363 9057 -9092 -6400 10956 2063
1456 2063 -9415 8004 9165 -10219 -2224 8566 -7824 -10814 5169 -61 -11373 1473 8993
1469 8993 -4778 711 12594 1435 -5592 7091 3444 -8920 -1052 4911 -6355 -3340 8874
1482 8874 366 -2685 6611 4948 -6295 -529 2137 -6835 -6970 -36 -4490 -6765 3361 1993 -3515
1497 -3515 4326 6554 -2578 39 5413 -2492 -4510 3393 -384 -3607 5023 5349 -1230 3948 8010
1512H010r510q5O405p062o862R514M5r456O696R124r381q22J2414p025r198R977
1528B784J690j1807L622J0138r713k629J5443m617j0264J0856N015j5360J156
1541c686J2540j1740p539J4113j783j2006R901R439j1861o87J4494r421j1784
1554a0020J3748o67j4541P380J1260j1976r45J5188l192j2022J1667K982j4755
1567e893J375R380q555o585J3209n44r381R100Q196j1104P5R895r324o986R776
1582B634j518j0344O861P762p684k93J1213m852n290O587L76j0033K589M634r626
1597f984K36Q480m049l490J0719L59o419L223L084p360k989P359l648o341R199
1612A379k30n175P518M998p623P71O076p597m631O787k817p883Q273L471q217
$$ plain form
1512 8010 -1500 -1585 4820 -2242 -9104 410 455 -9001 -2305 6819 -2562 -3384 9030 2005 -7193 2784
1528 2784 4474 -7333 -3711 6427 -3286 -5915 9528 4911 -5353 5503 10518 -4842 -3686
1541 -3686 8854 -2886 -10425 3688 1905 -10101 -200 9239 -2622 -3309 11185 1764 -10020
1554 -10020 3728 3061 -11480 -4100 7160 -4816 -5761 9427 6235 -5787 5880 8862 -5893
1567 -5893 -4518 4862 -3693 -10278 2931 2387 -6994 2106 10302 -802 -727 9168 -156 -7142 2634
1582 2634 1116 -9228 -2367 5395 -2289 -2582 8631 3779 -1511 5076 5452 -4581 -1992 2642 -6984
1597 -6984 -6748 1732 -2317 -5807 4912 5271 -1148 2075 5159 -2201 -5190 2169 -1479 -7820 1379
1612 1379 1149 -4026 3492 8490 867 1638 7714 117 -4514 2273 -544 -8427 -154 3317 -4900
1627d900K711J0622p218m636R131l086j0649N772N438j1526K008J1467n933n305
1641f104J4017k81j2119O119O312j2493k865J1007n806q062J0908O130j1947M934
1655b50J1261r712m872J0448n665j1161Q998N459j2314K353J4200p795n474J4761
1669A0237j246j3706Q088M508j3907j488J1574o575o861J2538J344r692P520O709
1683I043j0959l199R873o662p962P566J676r406P194R541o772k023J1158m206
1697D862p431O553J223r685J975P443p495r98J0079k322o150P585K649j1202J852
1712a062N881r951j392P752m116o091R992L732p987N374N675r127k388R122o632
1727a218p152P197L100j0135O480R861r116l98J0667n209r958Q579K61j2692M438
$$ plain form
1627 -4900 -2189 8433 1215 -3421 5710 2624 -8025 -2253 3185 -8341 -6333 5134 -799 -6104
1641 -6104 7913 7632 -4487 1632 7944 -4549 -7414 3593 -2213 -10275 633 6763 -5184 -250
1655 -250 11011 1299 -3573 6875 1210 -9951 -953 4506 -7808 -5455 8745 950 -4524 10237
1669 10237 8991 -4715 3373 7881 -6026 -7514 4060 -2515 -9376 3162 4506 -5186 2334 9043
1683 9043 -1916 -5115 4758 -1904 -9866 -2300 -624 -10030 -2836 6705 -67 -2090 9068 4862
1697 4862 -2569 3984 5207 -4478 -2503 4940 -2555 -3553 6526 4204 -1946 5639 8288 -2914 -1062
1712 -1062 4819 -5132 -6524 1228 -2888 -8979 1013 4745 -3242 2132 7807 -1320 -3708 5414 -1218
1727 -1218 -8370 -1173 1927 -8208 -1728 8133 -983 -1381 9286 4077 -5881 2698 2959 -9733 -5295
1742e295J0258j0330j551J4085l330q608J1235L443j2813J392Q672j0186n168
1755h196J2385k280j0881J0238Q385j1405K107J0037r344q135J1696k311j4045
1768a1749P793O057j0407K169J3561q134n295J1492P15j3772N149P833j1985l69
1782f942J1078m314o766J1363M247j2143O583P570j0941l424R828n751q419R398
1796A367K696j1873O262R345q669j458R168m080r409P798M03r394K600Q879p278
1811c643q21J1114m288o085P171J432r656K207N822q291j817R898l219n981R514
1826C357J780q912M487P298j0353l206R433n166q314R963M286r740M857J0197
1840I967r637k651J0060m316r557Q660J194j2526M810R471p942l504J2637j339
$$ plain form
1742 -5295 4963 -5367 -6918 7167 3837 -4771 6464 9907 -2906 -1514 7158 -3028 -8196
1755 -8196 4189 1909 -8972 1266 9651 -1754 353 10390 1046 -7089 4607 2296 -11749
1768 -11749 -3956 2101 -8306 -6137 7424 -710 -6005 5487 6202 -7570 -2421 5412 -6573 -6942
1782 -6942 4136 -178 -6944 4419 8666 -3477 3106 10676 -265 -3689 6139 388 -8031 1367
1796 1367 4063 -7810 -1548 7797 -872 -2330 6838 2758 -6651 1147 1550 -7844 -5244 3635 -3643
1811 -3643 -4464 6650 2362 -3723 3448 4880 -4776 -2569 3253 -5038 -6855 3043 -176 -6157 3357
1826 3357 5137 -3775 712 8010 -2343 -5549 3884 -1282 -9596 367 4653 -5087 -230 9967
1840 9967 330 -2321 7739 3423 -6134 2526 3720 -8806 -3996 5475 -2467 -5971 6666 5327
1854E327j0511P207M512j2763L65J0346q340o417J3731j960r495R343O650r309
1868a314K13J0553q545p247R556m35j1054P242P949r547n02J1358o061o002Q452
1883D616J04j2578M963N954q018p30R495k925p139J0510J055q890L721N895q665
1898b632k748P503k818o532R821K000o815K481P648q049l815R161n419p563P950
1913A73R17o199K109P446o220j521R145k567o412M896J923q764J954O879o936
1928c177j32P825k261n368P817K362j1334M922M682p662l278P964k384p015Q232
1943A193L269r416L558P676n914n333Q847k498p331N070L875p647J405J0002p018
1958b62l697J0279o43r488M429N346j0028j871J0313n340o421R512K153p667M094
$$ plain form
1854 5327 -5184 2023 6535 -6228 -5863 4483 -3857 -10274 3457 1497 -7998 1345 7995 -1314
1868 -1314 -1101 9452 907 -6340 3216 2781 -8273 -1031 6918 -2629 -3131 8227 2166 -3836 4616
1883 4616 4720 -7858 -2895 3059 -4959 -5689 3806 881 -6258 4252 5307 -3583 138 6033 -2632
1898 -2632 -5380 2123 -695 -7227 2594 4594 -2221 260 7908 -141 -3956 5205 -214 -7777 173
1913 173 1090 -5109 -3000 4446 -1774 -3295 5850 3283 -3129 1767 3690 -5074 -3120 3759 -3177
1928 -3177 -3309 4516 2255 -3113 4704 7066 -4268 654 5336 -2326 -5604 2360 -24 -7039 1193
1943 1193 4462 -4954 -1396 6280 366 -4967 3880 1382 -5949 -879 2996 -4651 -3246 6756 -262
1958 -262 -3959 6320 5677 -3811 618 5964 -4064 -5935 4378 -962 -7383 2129 4282 -3385 709
1973G09N588r420q19R150o462n711P203K115q244M581P906q349q40Q560k840q299
1989e172P097J131p967K736O407n445k385Q747j994o580N616K585q769J307N940
2004C254n780l219O880P1o629O961L281o350J078O481n797m156O873k215o259
2019e526N857K025n841K573P445o058k451O475j466p361M432J516n932o6O804
2034B426m245l106P944n96n712N429K657p796O10O014m843l567O616Q59n841M335
2050A184M964p152l46O376l626o207P082k89q864N565M643o823j33Q634l871n575
2066d438P281O27q265K833O668p114j515P616k484n055P375K512p937K185N118
2081E407p128k555P725l602o004O609K076o448L084O887o879k693O648j404p731
$$ plain form
1973 709 6297 -3123 -3942 5208 -1254 -6965 238 2353 -5891 -1310 6596 -1753 -2593 5967 3127 -5172
1989 -5172 1925 3056 -4911 -2175 4232 -1213 -3598 5149 3155 -3425 2191 4776 -3993 -2686 3254
2004 3254 -2526 -5745 1135 1206 -5423 1538 4819 -1531 -453 6028 231 -3925 2948 733 -5526
2019 -5526 331 2356 -3485 -912 6533 475 -1976 4499 3033 -4328 104 1620 -4312 -4378 2426
2034 2426 -1819 -4925 3019 2423 -3289 2140 4797 -2999 -2389 3625 -1218 -4785 1831 2690 -3151 1184
2050 1184 6148 -1004 -1350 5026 1400 -4807 2275 1986 -6878 -1313 3330 -3493 -3626 5008 1137 -4438
2066 -4438 2843 3470 -4795 -1962 4706 -2408 -3923 3693 1209 -3846 3529 6041 -1896 289 5407
2081 5407 -1721 -4276 3449 -153 -6157 452 2528 -3920 -836 6051 -828 -3521 3127 1723 -6008
2096f008M922K944p000J752P504m557k815Q118r40o638L994M586q561N3O342n442
2112a746m046P657O54o669N314L979o589M86O042n139m951O901p90n725K425O177
2128C980o334l98P662l199m890N536J301q009L183L635m903j161Q085m672m791
2143d975P822J68o909L258M216o227j135O238k073n369P143O04o640M163M673
2158D957n512j941P947m358m630N000J558o983L122M865n797j164O464k028o530
2173e030P176K000r532L453O538o723j678P123j425n165M850L403p066J016N461
2188D401n454l911P520l9p970O500K999p400J833O007m561l133N229O50o969M161
2204a37L686o193P35N955m895l508O738L69o276L522M414o348k90N262k722m079
$$ plain form
2096 -6008 -1086 1858 -5142 -3390 4114 -443 -3258 4860 3920 -2718 1276 5862 -2699 -2646 3696 -1746
2112 -1746 -5792 1865 2519 -4150 1164 5143 -1446 -960 5082 -57 -5008 1893 1103 -4622 -2197 3980
2128 3980 -2354 -2752 4910 1711 -3179 2357 3658 -4351 -1168 2467 -2436 -3597 4488 -184 -4975
2143 -4975 2847 3015 -3894 -636 3580 -2647 -3782 2456 383 -4986 2157 2761 -3879 284 4957
2158 4957 -555 -2496 5451 1093 -3537 1463 3021 -3962 -840 4025 -1772 -2936 3528 1500 -5030
2173 -5030 2146 4146 -5386 -1933 4605 -2118 -3796 3327 1902 -3263 1587 4990 -2076 -1060 4401
2188 4401 -1053 -4964 2556 2517 -5453 1047 4046 -3354 -1521 4486 -75 -3208 2021 2671 -4298 -137
2204 -137 3549 -2644 -1909 4046 -849 -4357 2381 2750 -3526 -4 4410 -1938 -2228 3034 312 -3767
2220c767O009K4n504L025L321m495j468O807l852m552O655l9o654L419M472o000
2236b599o02O375k677l893O053Q77o816L764L862o120K7N072k256m565M198K097
2252B797n877J961M917o267r50P085l142m504N352K35m877J693N425m502k074
2267b728O359k711k726K918K023n280P62N026n435j158N980p80o256M572K507
2282C073o138K091M805m580k579N619j255m816L684K922n588J660M827k922l977
2297c174M364N00m609K756L179n246O52N515l341l488N824n04n506M753J647m515
2313a193j070N521l907l979N763L57n672M078L589n012N66M423l300l348M687
2328A503Q62n063K095K741l722K30N121k683l831N002r07l706J601K396l614k038
$$ plain form
2220 -3767 2242 2266 -3238 -213 3108 -1387 -2855 3952 100 -4452 2203 2164 -4490 -1071 3401 -2599
2236 -2599 -3201 3174 497 -3396 2657 3534 -3282 482 4344 -1776 -1749 3323 1067 -3498 700 2797
2252 2797 -3080 -1119 3798 -2469 -3419 3666 524 -3980 1372 1607 -3270 -1577 3848 -654 -2728
2267 -2728 3631 920 -1806 1112 3135 -2145 -1383 3643 -1792 -2950 3030 2250 -4006 566 3073
2282 3073 -3065 -974 3831 -749 -3328 2291 1036 -3780 -96 2826 -2762 -1102 3725 803 -3174
2297 -3174 1190 1690 -2919 -163 3016 -2230 -1578 3937 596 -2892 2932 2428 -3078 1675 3322 -1193
2313 -1193 -2263 3258 -649 -4628 1135 1492 -4180 -102 3487 -1525 -959 3464 164 -3184 1503
2328 1503 2365 -2698 -603 2138 -1584 -1354 3767 1084 -2747 2255 1348 -2358 -757 1639 -1975 -4013
2344d013O591k344l095M165Q70m273J756M080m212j896M895k620l680M899J373
2359B496n794L003L795l724r52L855j485l959L369J487n943J740M175l307j157
2374b401N202j430l398L145J133n375K383L969l703l577M932J121n164N069J410
2389C316m705K52M363k796l140L975n17n401M036K309m499J103M840k243l192
2404b299L756q32l918K781K779m274J40M508j506k812M437J19m315K601J494m265
2420a606q03M943k512m027N303J62l027P66M313l036j071K712k093l814L368J08
2436c14k006P35M211l509j09M313j346l112J256J783l272M8L090j849k848M852
2452A923n34k891K940P14m283Q76K903k838k237L405j03k512K806J866k976J414
$$ plain form
2344 -4013 2578 234 -2861 1304 2174 -2099 -343 3737 -475 -2371 2524 -96 -3776 1123 2496
2359 2496 -3298 -295 3500 -224 -1176 2679 1194 -2765 604 2091 -3852 -2112 2063 -1244 -2401
2374 -2401 2801 1371 -2027 1118 2251 -3124 -741 3228 -475 -4052 880 2001 -3163 1906 3316
2389 3316 -1389 -1137 3226 430 -2710 1265 748 -4653 -617 1692 -2807 -1704 3136 893 -2299
2404 -2299 1457 625 -3293 -512 2267 -2007 -1867 2641 1135 -1677 2760 2879 -1436 1165 2659 -1606
2420 -1606 -2409 2534 22 -4005 1298 1460 -1567 -801 3512 476 -595 2117 24 -3790 -422 -314
2436 -314 -2320 -1585 2626 -883 -992 3321 1975 -1137 119 1902 -1370 -1322 1768 -81 -2929 1923
2452 1923 1389 -1502 1438 2152 -2131 -1255 1648 -1190 -3427 -22 -125 -2637 169 2035 -941 473
2468D73L759l770j971K794l85k892J166J778j850K93L497j965j373K153M97n057
2484b853K712J380l567j87L490j377j598L831K04l359K794M68k539OK716l054
2500i33k366K996J122k749K692K233q90k229L107j298l510J965O49m135m3L195
2516a94q91m93L212l05j860K370R54l357n57K811l778j142M712j071k022K188
2532E77J985k433K58L016k790k015J114j99j991K151J098j647K53K481j122q67
2548a31J971o16k798J040M52j955L80L174j435q83L273M96l484K581O29l871l39
2565a516K141j025j728J159J480k628J905M080l279n50J168k387k522L126O36
2580F0l230K404J977r39q15K696J33k833K579K77m087M7K483k584k54L555j692
$$ plain form
2468 473 4232 462 -1509 1285 900 -1992 -826 952 -898 -605 2892 927 -446 1707 2204 -2853
2484 -2853 -141 1239 -2328 -2515 975 -402 -2000 1831 2035 -1324 1470 1938 -601 -595 2121 -933
2500 -933 -3299 -303 819 -1930 762 2995 2105 -124 2983 1685 -1825 140 789 -3346 -3389 -194
2516 -194 -1085 -1578 1634 1329 -531 1839 2793 -564 -1121 1690 -2088 -3230 1482 411 -1611 577
2532 577 2562 129 387 3403 613 -1402 -288 -487 -2478 -327 771 -876 -623 1858 736 -131
2548 -131 1840 1224 -1574 -534 -82 -2037 -1657 1517 82 -801 2472 2968 -516 2065 2694 -1177 -1516
2565 -1516 625 -400 -2128 -969 511 -2117 -212 3868 589 39 1207 -1180 -3702 -576 60
2580 60 -3170 -766 1211 272 -543 2153 2286 -547 2032 2309 -1778 -1731 752 -1832 -2086 1469 -223
2597b23q63L392J099m157J563J664m243j199K365K01j975J696K477k478J147L173
2613C639m45l055J692k68k337j27R12l584J604L690j556o45K650M47l467J380
2629E30N81l491q04L005j699j555L234J963k188J927J467j662j785J783j282k694
2645b670J231O29r94J200K669o94j194K863j656o90j147J790l742q3J608j275
2661b155k64L248K67k97K180j316j475L96K35j849j302J260O86k171L136J423
2677B002j739J715K371m214N29O04o93l490J75J668r02J855K502m51j649J463
2693A746k58k652M83O66k732J100J438j085O80L019J19k701K004J290l947m1J104
2710B33j642j838J547J463j499J756J891o67q11L250k721k133J164k32j696n38
$$ plain form
2597 -223 -1086 2306 3405 -752 811 2475 -1768 -2967 -602 -401 -2376 -680 1797 -681 466 3639
2613 3639 3194 139 1831 1563 -774 -901 11 -3573 -1969 1721 165 -480 2170 2617 -850 530
2629 530 1111 -2380 -3184 -179 -1878 -3433 -199 1764 -424 1503 2970 1308 -477 1306 24 -2670
2645 -2670 -1439 -810 -1804 -604 2065 1371 177 3040 1384 694 -453 1337 -2405 -2488 -880 -2155
2661 -2155 -2419 829 1096 799 2979 1663 188 584 819 -1030 -2332 -1072 -386 -2557 579 2002
2677 2002 263 1978 4349 135 664 1268 575 -2915 -2740 -1072 -1974 -119 2383 1932 283 1746
2693 1746 1488 -1164 -681 -15 -2747 -1647 -209 -1294 -614 2405 2524 -177 1827 3117 -830 -871 233
2710 233 -1409 -3247 -1700 -237 -1736 20 1911 1244 433 3683 962 -1171 -7 -239 -1935 -2473
2726b473K825j801Q80J710N82j409J505J075l474K017j634k604j18K555k01l33
2742h98K290J272k853K003N24k126j857J115o29k429K897O76j195K137K357j852
2758A432j068K630j629k576P57N72k668J31K628q03L80L004j486r7j85O08j946
2775c16j917J783r95j557J885J880j721K367M31j7q57Q19j927j157J79p41j308
2792c169K396J844j239k86L213j093j92Jj066k147J94J091l680P99L763m69l17
2809c57J959J246j471k42Q59j825k055J271q64j390K346J130L7J59K134j272o89
2826I76J28j474k469J209j1l06l70K916K03k76J884j7j556L08K72k600j066J197
2844a052j323J433P04Q76O73K108j230n98j028R32k541j105J547o89j450P76K657
$$ plain form
2726 -2473 352 -1449 -569 1141 1723 314 1819 2894 -580 1437 -197 -2801 -2919 -364 -565 -898
2742 -898 1392 2664 -189 1814 2338 212 -1645 -530 -1159 -3588 -691 -15 -1210 927 3284 1432
2758 1432 364 2994 1365 -1211 -454 118 -2550 -2419 209 -594 -214 2790 1304 1207 1022 1630 -316
2775 -316 -2233 -450 -1445 -3002 -1117 763 -958 1409 1840 1823 966 1785 -142 -1299 -1120 -1861 -3169
2792 -3169 -773 1071 -168 -454 2759 1666 1474 1475 409 -1738 -1544 -453 -4133 -3334 429 -40 -357
2809 -357 1602 2848 1377 1135 1994 169 -1886 -615 -1479 -2869 -523 607 644 803 2937 1665 976
2826 976 1104 -370 -2839 -1630 -1641 -1947 -2317 599 802 526 2410 2393 837 1145 1417 -1183 -2249 -1052
2844 -1052 -2375 -942 -238 638 1311 3419 2189 1591 563 1495 -1046 -2151 -604 -1293 -2743 -1967 690
2861F90j582K495Q92o84p26K7p71j882m95R40k036K278L74K018l35J912j12k133
2879H70l7r2k696n6J554j16j177J654J638o25M21K724l150q82J472k321j497N51
2897a765K54q22J871J990R8L52J186n19l049j91J40j769P1O34l81J831M12Q73
2915A216j70P12J244k035j809J185k126p59J215P7l82J331J886o75J299L91m94
2932B106k204o42k94k030J517O65j00Q33K000L4j130J842q03j763q88O52j321
2949a526j483R53J046J34K791L41O45j36o84j333j257J084k327q66N83K013n59
2966e81P03J928k08J46K27j005j701r93L4j444M07L034k199J785K556l10j41L13
2984B551O65l486p07K81j645n25K614r25N73J040L398k771N8M46m37l204P96m08
$$ plain form
2861 690 -892 1603 2495 1811 1085 1112 341 -1541 -2036 -1096 -3132 -854 -480 1538 1203 3115 3003 870
2879 870 833 741 -1955 -2011 -457 -573 -1750 -96 1542 917 1338 4062 912 30 1502 -819 -2316 -1765
2897 -1765 -1511 -2333 -462 1528 1626 1978 3164 2645 -404 -595 -455 -2224 -2153 -1519 -1900 -69 343 1216
2915 1216 1046 1758 3002 967 -842 343 -1783 -2542 -1327 -1250 -1632 -301 1585 910 2209 2600 2106
2932 2106 -98 -740 -1034 -3064 -1547 -882 -982 -149 1851 1885 755 2597 1794 31 -857 -205 -1526
2949 -1526 -3009 -2056 -1010 -876 1915 2256 2901 2765 2081 748 -509 575 -1752 -2618 -2035 -22 -581
2966 -581 122 2050 1842 1988 2215 1210 -491 -1484 -1450 -2894 -2487 547 -1652 133 2689 2379 2238 2551
2984 2551 3216 -270 -977 -696 -2341 -2866 -252 -1177 -604 436 3834 1063 1121 1567 1130 -2074 -1278 -1686
3002a686j490O31J292J333M62J843q17J267j338L38k580j351J063j207o24J869
3018i95J241P87k47J714j128j567J148j594j252M50m72l70K11J727L71Q66K118
3035C008p62j927R47o10k541J160p23j665J893Q31N52K205P71j009L93K07j085
3052A645k438j889J944p80j320K537L21O8J237Q08P3j487J107j905k496L79O16
3069a580j256J881J345J312r12J623r80o31J75l36j243j032m02k42rK365K22M46
3087G46J619m48o94j125N52k464j192J277n18M15J172K924j490J543J486j647
3103B156l14j306j033j146m08J87J81J590J134o2Q82L43r89j149l95j66o94j343
3121b532J547n21Q08K803p86l21K511j067m92k057RM12k557L38L24n7K115K1P23
$$ plain form
3002 -1686 -3176 -2545 -1253 80 542 2385 1568 2835 1497 1835 -745 -2096 -1033 -2240 -2864 -995
3018 -995 246 1033 786 2500 1372 -195 953 -641 -1893 -1443 -1915 -2285 -2074 -347 24 890 3008
3035 3008 2246 319 1266 656 -1885 -725 -1448 -3113 -1220 -389 163 2368 3139 2130 2523 2730 1645
3052 1645 -793 -2682 -738 -1518 -2838 -301 20 88 1325 2133 2206 719 1826 -79 -2575 -2196 -1580
3069 -1580 -2836 -955 390 1702 790 2413 1433 802 977 641 -602 -1634 -2036 -2278 -2287 78 300 746
3087 746 2365 1917 1223 98 650 -1814 -3006 -1729 -2247 -1832 -660 2264 774 2317 3803 2156
3103 2156 1842 536 -497 -1643 -2051 -1864 -1683 -93 1041 979 1861 2204 1215 66 -329 -495 -1189 -2532
3121 -2532 -985 -1506 -698 2105 1319 998 3509 2442 1950 -107 -98 314 -2243 -1905 -1581 -1638 477 498 1221
3140A221K17O3J21j326n77o69j449j145K453N00K99J510O62r18J439O87k628J87
3158F47N9k772o41J966n60O95J991l38K15J91o60M45j848R14k252l23p15J261
3176a725K051p62K149L9o79J398q20k328j387J303q44p61J705n41Q51K066N95
3193B310o71M88k16j528j063n46r94N20n27J372L61O39J130J010q61j91l3j852
3211f52l12o86K92j511K415j05J035K136j08o26O72j502l013M68N76j221k72J304
3229a110P95m03K309R59l83n84K73k063k216J320r02Q30m82J330K61J623K549
3246D106j460j183n39o69j095j036J890k445L04R29J401R12J380N5k331j93J078
3263A104j619j281Q02l27m36J129J109p49Q40J610j82r95P51j810r64o03M22L65
$$ plain form
3140 1221 1438 1501 1622 296 -281 -950 -2399 -3544 -1091 -591 -292 1218 1880 962 2401 3088 460 647
3158 647 706 -2066 -2707 -741 -1301 -606 1385 1047 1262 1453 793 1238 -610 304 -1948 -2271 -2986 -1725
3176 -1725 326 -436 1713 1752 1073 2471 1651 -677 -2064 -761 -1605 -2366 -661 -1202 -351 1715 2310
3193 2310 1639 2127 1911 383 -680 -1226 -2220 -1700 -2227 -855 -494 145 1275 2285 1424 1233 1200 -652
3211 -652 -964 -1650 -1358 -2869 -454 -559 476 2612 2504 1878 2550 1048 -1965 -1497 -921 -2142 -2414 -1110
3229 -1110 -315 -718 1591 2550 2167 1583 1856 -207 -2423 -1103 -2005 -1175 -1657 -327 -66 1557 4106
3246 4106 2646 1463 924 255 -840 -1876 14 -2431 -2127 -1198 203 1115 2495 2550 219 26 1104
3263 1104 -515 -1796 -994 -1321 -1757 -628 481 -268 572 2182 2000 1005 1756 -54 -1018 -1621 -1199 -834
3281h34k31K301k07q42Q17L63o2n71p78q65j106j39O9O40J072J168R87o55J957
3300C084n85k671K46P58l268J322m8j93Q82J869o6L08K61l4j818kq46j555J054
3319a302l40p31R93K754m76m83J271M77j594L14l63j249o48O20K99r35K216L71
3337A194n91J163N42k556K26J16l30l156K002N55j110R68J899m46M41J636j867
3354F86o09k98k70n82Q28j85j371N22J860J203j761J785K23k215N6o47k21j531
3372b527N50Q61K08K054k80l32k80J468j282p18M30j119j342P6J810p00J484O14
3390I75P63n05R02n41j111K44j47k380N12O36j8o2J215O12j052J110K43m26j971
3409a001N80j340o81J724R18l46J159J980j487N0l20K28j047o56p42q09N92Q03
$$ plain form
3281 -834 -1065 1236 1029 187 1004 1367 1305 734 -44 -909 -2015 -2154 -2085 -1445 -373 795 1782 1127 3084
3300 3084 2499 -172 74 832 -2436 -1114 -1162 -1355 -473 1396 1330 1638 1899 1865 47 45 -801 -2356 -1302
3319 -1302 -1642 -2373 -1380 1374 898 415 1686 2163 569 883 520 -729 -1377 -757 -458 -1393 823 1194
3337 1194 603 1766 2308 -248 -22 94 -236 -3392 -1390 -835 -1945 -977 922 476 917 2553 686
3354 686 77 -221 -491 -1073 -245 -430 -1801 -1279 581 1784 23 1808 2031 -184 -128 -775 -996 -2527
3372 -2527 -1977 -1116 -908 1146 866 534 254 1722 440 -278 152 -967 -2309 -2233 -423 -1123 361 975
3390 975 1738 1233 2135 1594 483 727 580 -1800 -1288 -652 -670 -732 483 1095 43 1153 1396 970 -1001
3409 -1001 -421 -1761 -2442 -718 200 -146 1013 2993 1506 1556 1236 1464 417 -239 -981 -1790 -1198 -395
3427c95J359j171K344j513J07R88m95j775l67J76p00O0O57J185j526J382J214
3444A530m43l78O40j382j206N65q76k27L06P31N68j29K640r57j229Q30o33k569
3462b219J135l39j655J353P77J272o80J783N18j001m71R30k709K02j95q98N37
3479a660R19M76m18J093R29j110J060K78k026k89p01L5j438J759Q20m85J361J171
3497A774P83j761L50P2k175R57j351o97L01J896J302j201J136K47j575N5R01j588
3515e74n17l2M58n88Q95J401j258J433J508j310n62K39j948j73O8Q24n29k8J810
3534A117j874P64K004p39k080J029o05o68j13n1p61j55K328J227k252J772J071
3551B014j661j82M42q28j256Q29l53l80J568J410j386J537Q7m93j023j88n98j522
$$ plain form
3427 -395 964 -207 2137 624 731 1719 1224 -551 -918 -742 -1442 -1382 -725 460 -1066 316 1530
3444 1530 1087 709 1349 -33 -1239 -674 -1550 -1777 -1471 -740 -172 -301 2339 1382 153 983 350 -2219
3462 -2219 -1084 -1423 -3078 -1725 -948 324 -356 1427 1945 944 473 1403 -1306 -1104 -1299 -2197 -1660
3479 -1660 -741 -265 -683 410 1339 229 1289 1567 -459 -748 -1449 -1414 -2852 -1093 -273 -758 603 1774
3497 1774 2557 796 1146 1218 -957 0 -1351 -2048 -1747 149 1451 250 1386 1633 58 113 1014 -574
3515 -574 -1091 -1123 -665 -1253 -358 1043 -215 1218 2726 1416 854 1093 -855 -1028 -960 -136 -665 -693 1117
3534 1117 -757 7 2011 1272 -808 221 -384 -1052 -1165 -1216 -1977 -2132 196 1423 -829 943 2014
3551 2014 353 171 613 -215 -1471 -642 -995 -1375 193 1603 217 1754 1841 1348 325 137 -461 -1983
3569a983P72P4o29P17R98J001k83J452l43j541N19o91k497J717l34L59j10Q45
3587D3K472j546K75n7M91j546l87j048j219J880m3K90jJ429r69O17J624j300j287
3606b82K48p5k038J478K16m5k8J220L67MJ06j94j078jK00o50j276R28Q01j604
3626a703J550J651j599J772o28l91j244J070j424j174K064j6j101J273Q66j13
3642H53P10p34P99k258O82m7j676l1K948j088l85R36r5n88N29J065k734N42m44
3661a016K1r87J180R4m7J916J119j636k35M55o15j765P79J90j404J431J938k800
3679a382Q85J439m68o50J211p80q92l34P77j311NJ519n02K3J112J30O36q50P68
3698A336o74j421N00q67R46m83R70n79K40M95m33J92P99r14k73O84o85j622j18
$$ plain form
3569 -1983 -1211 -1137 -1766 -1049 -51 950 667 2119 1776 235 754 63 -2434 -717 -1051 -692 -802 43
3587 43 2515 969 1244 1187 1678 132 -255 -1303 -2522 -642 -685 -395 -396 1033 64 681 2305 1005 -282
3606 -282 -34 -109 -2147 -669 -453 -498 -526 694 1061 1065 1171 977 -101 -102 98 -552 -1828 -900 -99 -1703
3626 -1703 -153 1498 -101 1671 1043 652 -592 478 -946 -2120 -56 -72 -1173 100 966 853
3642 853 1563 829 1628 -630 52 5 -1671 -1702 1246 158 -227 709 614 26 555 1620 -1114 -572 -1016
3661 -1016 -995 -1982 -802 -708 -755 1161 2280 644 409 864 249 -1516 -737 -547 -1951 -520 1418 -1382
3679 -1382 -497 942 474 -176 1035 255 -637 -971 -194 -1505 -1500 19 -483 -460 652 782 1418 568 1336
3698 1336 662 -759 -259 -1126 -180 -663 307 -272 -32 463 30 222 1021 107 -166 518 -167 -1789 -1907
3717a907J223N35l1J097Q12p90P4p30l74n28O46j93j479J379J653j621J233r4
3735I05p76l32J001k151j57K108k681K97R6K494q50O34Q01l37l83M98j953Ok36
3754a016J414k452J995O36J35r15J451q16J285j308L03j099l13J833k201J82K33
3771f53J591j192l3J395m25m90Q55j203l35j48P47n83L08J515M60j423N70j24
3789H32j049L10j21p88J76O33p74L58O71N33k98R24k15j850J40R48k78j078m38
3808a364J449r78J16K260r87N28J461r27k858J328K85l18j185J277j637J421P37
3825F08j458R93J08m03n2K16k19j273O13J14Q5j22J674o42l75J771p69p12n24
3844c67K045j849j066N64P14l77P90O69n14J29m41N12m98o6r10j27l1R60J86M9
$$ plain form
3717 -1907 -684 -149 -180 917 1729 939 1013 283 -91 -619 27 -166 -1645 -266 1387 -234 999 905
3735 905 129 -203 798 -1353 -1510 598 -2083 -1786 -1690 804 -46 588 1389 1052 669 1167 -786 -780 -1016
3754 -1016 398 -2054 -59 577 712 -203 1248 432 1717 409 712 -387 -700 1133 -1068 -886 -653
3771 -653 938 -254 -287 1108 683 193 1048 -155 -490 -638 109 -474 -166 1349 1809 386 956 832
3789 832 -217 93 -28 -816 -640 -7 -781 -423 248 781 483 1407 1192 -658 -518 430 152 -926 -1364
3808 -1364 85 -893 -777 1483 496 1024 2485 1558 -1300 28 313 -5 -1190 87 -1550 -129 608
3825 608 -850 143 251 -152 -204 12 -207 -1480 -867 -753 -668 -790 884 242 -133 1638 869 157 -367
3844 -367 1678 -171 -1237 -673 41 -336 454 1123 609 738 297 809 311 245 -665 -792 -823 137 323 372
3864C72M88J56r23Q08P5j762Q11J085j486j117J921M26j246P10N47j21n62J178
3882A360k425J609n05r12k40J149K45r93J294n53N02j27J331p39k006J056K47
3899B93o89L08R9N6K90J076n93L15j804L36j222N19K07o2j62J99n37J515k08J148
3919A084j431R57N30k62k520J886n73o88L69J375j223M63K141j475n63l72Q30
3936E28p17k51M78j552J61J711r54P23J039M74k306J182o66j41o53Q01q34r41
3954a918R29R47n93L06K049j027j078J488j185l06M79o18p16J566j103J690j049
3971a39J022k04l84J35k73r76q10J859j552K39J737J298k071J50J507j423O10
3988G25p88o90N67N30l1q45J084l47p41J470J62r63M34L61n59p54m62M52j36O25
$$ plain form
3864 372 860 1016 93 901 976 -786 25 1110 -376 -1493 428 854 -392 318 865 744 182 1360
3882 1360 -1065 544 39 -873 -1113 36 281 -712 582 29 531 404 1735 996 -1010 46 293
3899 293 -396 -88 11 67 357 1433 840 1155 -649 -313 -1535 -1016 -809 -871 -1033 -834 -1371 144 -64 1084
3919 1084 -347 610 1140 878 -1642 244 -329 -1017 -648 727 -496 -33 2108 633 70 -302 528
3936 528 -189 -440 38 -1514 -1353 358 -596 127 1166 1640 -666 516 -150 -291 -944 -143 -977 -1918
3954 -1918 -989 -42 -635 -329 1720 693 -385 1103 -82 -388 91 -527 -1243 323 -780 910 -139
3971 -139 883 679 295 430 157 -819 -1629 230 -1322 -1083 654 1952 -119 31 1538 115 725
3988 725 -63 -753 -186 344 313 -532 552 205 -536 934 1096 133 567 928 369 -385 -847 -395 -531 94
4008I4O9q75P96K99J38n66J29J15n1J62J123j729l14J646j039J99K55j2j460O66
4028c55J91p75m78J620K87j458J169N08j306J197j55r24Q78o74o69J3M05Mo6K06
4048c82N83J16q76J064j3j118O78j28o75k95L68L92m27J190L38l47L43o49K10
4067C72M16K63j424k07J21K34o52M74J766l89j548J123l84p43O16o04p26Q85L19
4086h8n13M85R86p4q59O05p31L69O5m01j26k17J161j220p3J35J034p81J108K46
4106A111r04k98M74j079j34J040j284o7Q56K028j791L65j21k38j816O90J275n24
4124d17J98M0k42l0M62L80J315o02o23n51J65Q33J4j469l40O97k11p3J910q63
4144E93r17O78k21n50N20q01k35R86K89q98J195j060L50Q74j984J471l92J06k84
$$ plain form
4008 94 163 -712 84 383 521 -45 84 199 148 310 1433 -296 -610 1036 -3 196 451 439 -1021 -355
4028 -355 -164 -939 -1417 203 490 -968 201 709 -597 600 445 -479 399 -275 -944 -931 -526 -522 -588 -382
4048 -382 201 317 -559 505 492 -626 52 -76 -751 -1046 -678 -286 -713 477 815 468 811 162 372
4067 372 788 1051 -373 -580 -459 -225 -877 -403 1363 974 -574 549 165 -578 38 -566 -1292 -407 -88
4086 -88 -601 -116 870 796 -63 542 -189 180 245 -156 -282 -499 662 -558 -631 -496 538 -243 865 1111
4106 1111 207 -91 383 -696 -830 210 -1074 -1141 -285 1743 -48 317 196 -42 -1858 -1168 107 -417
4124 -417 -219 -179 -421 -451 11 391 1706 1104 481 -70 95 928 942 -527 -867 -170 -381 -454 1456 593
4144 593 -324 354 133 -417 103 -698 -933 53 342 -556 639 -421 -71 803 -1181 290 -102 4 -280
4163b80n67M58P12k69j35O75n6r17J107o50l75Q38q19qo07J036m72L10R44L15
4183A240j635k00J232k78o53J538r44p25K05N67K54j595J645m97M09k41r0q20
4201e88j2J548j342K02K07O68r85l34J478j145m08M73m61L62O14j285L63J418
4219G73n42m65K3Q59J53q05L02m6k244K199q8m97P21M68l0j152J918j408O74j624
4239h11J050k40om84J911j455J695j252r1k96m99O25n48j47O52q69P28O55k94
4258C24l92R95n31O52r27mp87J487j226J131p91R8N53k46m15l07k14J001P7j577
4278a099M85K93K75q79K013r41r54M88Q2Q50o9k03N09j457K20N86q34J51K70l37
4298e51o34J235J31o10J373p37m97j050K827k074N68J719j514l76P81p42N17K000
$$ plain form
4163 -280 -847 -389 323 54 -81 594 538 -379 728 78 -297 541 -278 -286 -893 143 -329 -19 925 1240
4183 1240 -395 -595 637 359 -294 1244 300 -425 -220 347 601 -994 651 154 563 322 232 -588
4201 -588 -600 948 -394 -192 15 683 -302 -636 842 -303 -711 -238 -699 -337 277 -1008 -645 773
4219 773 231 -234 -211 648 801 -4 298 252 -1992 207 119 -378 343 811 781 -371 1547 139 813 -811
4239 -811 239 -1 -7 -491 1420 -35 1660 408 317 21 -478 147 -401 -548 104 -765 -37 618 324
4258 324 -68 927 396 1048 121 117 -670 817 -409 722 -69 29 582 336 -79 -386 -600 401 478 -1099
4278 -1099 -614 -321 -46 -925 1088 147 -807 -319 -237 613 544 341 850 -607 -387 199 -635 -484 -214 -551
4298 -551 -1185 50 181 -429 944 207 -290 -1340 1487 -587 -19 1700 186 -190 591 -151 366 2366
4316B366l083P77J67m84O98j102Q80K2J044k116j92J178q69K117j000n35O56k36
$$ plain form
4316 2366 -717 60 227 -257 441 -661 219 241 1285 -831 -1023 155 -714 1403 403 -132 524 288
$$ [...]
8191h0
##END NTUPLES=NMR FID
##END=
